##TITLE=1H_Ser DNG 3
 200.13MHz,CDCl3,
 8 sc
 
 12.11.2025
##JCAMPDX= 6.0         $$ Bruker NMR JCAMP-DX V2.0
##DATA TYPE= NMR FID
##DATA CLASS= NTUPLES
##ORIGIN= UXNMR, Bruker Analytische Messtechnik GmbH
##OWNER= pz
$$ XWIN-NMR		Version 3.5
$$ Wed Nov 12 13:50:33 2025 Russian Standard Time (UT+4h)  she@DPX200
##.OBSERVE FREQUENCY= 200.1313
##.OBSERVE NUCLEUS= ^1H
##.DELAY= (6, 6)
##.ACQUISITION MODE= SIMULTANEOUS
##.ACQUISITION SCHEME= undefined
##.AVERAGES= 8
##.DIGITISER RES= 18
##SPECTROMETER/DATA SYSTEM= spect
##.PULSE SEQUENCE= zg30
##.SOLVENT NAME= CDCl3
##.SHIFT REFERENCE= (INTERNAL, CDCl3, 0, 14.3821)
##AUDIT TRAIL= $$ (NUMBER, WHEN, WHO, WHERE, WHAT)
$$ ##TITLE= Audit trail, XWIN-NMR		Version 3.5
$$ ##JCAMPDX= 5.01
$$ ##ORIGIN= Bruker BioSpin GmbH
$$ ##OWNER= she
$$ F:/spectra/data/she/nmr/H-C/1/audita.txt
$$ ##AUDIT TRAIL=  $$ (NUMBER, WHEN, WHO, WHERE, WHAT)
(   1,<2025-11-12 13:49:02.23 +0400>,<she>,<DPX200>,
      <created by zg, POWCHK disabled, PULCHK disabled
       configuration hash MD5:
       00 E9 B6 7A A2 85 ED C7 34 08 36 98 17 FE 4E 26
       data hash MD5: 16K
       41 17 47 09 39 00 27 03 92 51 2E 2E 0F BB 2C 5E>)
$$ ##END=
$$ 
$$ hash MD5
$$ 29 48 2E EA 13 4F 76 BD 6C 62 86 F0 F0 EF CC 14
##$RELAX= 
##$RELAX= 
##$RELAX= 
##$RELAX= 
##$RELAX= 
##$RELAX= 
$$ Bruker specific parameters
$$ --------------------------
##$DU= <F:/spectra>
##$EXPNO= 1
##$NAME= <H-C>
##$PROCNO= 1
##$TYPE= <nmr>
##$USER= <she>
##$AMP= (0..31)
100 100 100 100 100 100 100 100 100 100 100 100 100 100 100 100 100 100 
100 100 100 100 100 100 100 100 100 100 100 100 100 100 
##$AQSEQ= 0
##$AQ_mod= 1
##$AUNM= <au_zg>
##$AUTOPOS= <>
##$BF1= 200.13
##$BF2= 200.13
##$BF3= 200.13
##$BF4= 200.13
##$BF5= 200.13
##$BF6= 200.13
##$BF7= 200.13
##$BF8= 200.13
##$BYTORDA= 1
##$CFDGTYP= 0
##$CFRGTYP= 5
##$CHEMSTR= <none>
##$CNST= (0..31)
1 1 145 1 1 1 1 1 1 1 1 1 1 1 1 1 1 1 1 1 1 1 1 1 1 1 1 1 1 1 1 1 
##$CPDPRG= <>
##$CPDPRG1= <>
##$CPDPRG2= <>
##$CPDPRG3= <>
##$CPDPRG4= <mlev>
##$CPDPRG5= <mlev>
##$CPDPRG6= <mlev>
##$CPDPRG7= <mlev>
##$CPDPRG8= <mlev>
##$CPDPRGB= <>
##$CPDPRGT= <>
##$D= (0..31)
0 0.7 0 0 0 0 0 0 0 0 0 0.03 0 0 0 0 0 0 0 0 0 0 0 0 0 0 0 0 0 0 0 0 
##$DATE= 1762940941
##$DBL= (0..7)
120 120 120 120 120 120 120 120 
##$DBP= (0..7)
150 150 150 150 150 150 150 150 
##$DBP07= 0
##$DBPNAM0= <>
##$DBPNAM1= <>
##$DBPNAM2= <>
##$DBPNAM3= <>
##$DBPNAM4= <>
##$DBPNAM5= <>
##$DBPNAM6= <>
##$DBPNAM7= <>
##$DBPOAL= (0..7)
0.5 0.5 0.5 0.5 0.5 0.5 0.5 0.5 
##$DBPOFFS= (0..7)
0 0 0 0 0 0 0 0 
##$DE= 6
##$DECBNUC= <off>
##$DECIM= 32
##$DECNUC= <off>
##$DECSTAT= 4
##$DIGMOD= 1
##$DIGTYP= 9
##$DL= (0..7)
0 120 120 120 120 120 120 120 
##$DP= (0..7)
150 150 150 150 150 150 150 150 
##$DP07= 0
##$DPNAME0= <>
##$DPNAME1= <>
##$DPNAME2= <>
##$DPNAME3= <>
##$DPNAME4= <>
##$DPNAME5= <>
##$DPNAME6= <>
##$DPNAME7= <>
##$DPOAL= (0..7)
0.5 0.5 0.5 0.5 0.5 0.5 0.5 0.5 
##$DPOFFS= (0..7)
0 0 0 0 0 0 0 0 
##$DQDMODE= 0
##$DR= 18
##$DS= 0
##$DSLIST= <SSSSSSSSSSSSSSS>
$$ [...]
##$SUBNAM0= <"">
##$SUBNAM1= <"">
##$SUBNAM2= <"">
##$SUBNAM3= <"">
##$SUBNAM4= <"">
##$SUBNAM5= <"">
##$SUBNAM6= <"">
##$SUBNAM7= <"">
##$SUBNAM8= <"">
##$SUBNAM9= <"">
##$SW= 18.0517328524113
##$SWIBOX= (0..15)
0 0 2 0 0 0 0 0 0 0 0 0 0 0 0 0 
##$SW_h= 3612.71676300578
##$TD= 16384
##$TD0= 1
##$TE= 0
##$TE2= 300
##$TE3= 300
##$TEG= 300
##$TL= (0..7)
0 120 120 120 120 120 120 120 
##$TP= (0..7)
150 150 150 150 150 150 150 150 
##$TP07= 0
##$TPNAME0= <>
##$TPNAME1= <>
##$TPNAME2= <>
##$TPNAME3= <>
##$TPNAME4= <>
##$TPNAME5= <>
##$TPNAME6= <>
##$TPNAME7= <>
##$TPOAL= (0..7)
0.5 0.5 0.5 0.5 0.5 0.5 0.5 0.5 
##$TPOFFS= (0..7)
0 0 0 0 0 0 0 0 
##$TUNHIN= 0
##$TUNHOUT= 0
##$TUNXOUT= 0
##$USERA1= <user>
##$USERA2= <user>
##$USERA3= <user>
##$USERA4= <user>
##$USERA5= <user>
##$V9= 5
##$VALIST= <valist>
##$VCLIST= <CCCCCCCCCCCCCCC>
##$VD= 0
##$VDLIST= <DDDDDDDDDDDDDDD>
##$VPLIST= <PPPPPPPPPPPPPPP>
##$VTLIST= <TTTTTTTTTTTTTTT>
##$WBST= 1024
##$WBSW= 4
##$XGAIN= (0..3)
0 0 0 0 
##$XL= 0
##$YL= 0
##$YMAX_a= 88484
##$YMIN_a= -135727
##$ZGOPTNS= <>
##$ZL1= 120
##$ZL2= 120
##$ZL3= 120
##$ZL4= 120
##$ABSF1= 10
##$ABSF2= 0
##$ABSG= 5
##$ABSL= 3
##$ALPHA= 0
##$AQORDER= 0
##$ASSFAC= 0
##$ASSFACI= 0
##$ASSFACX= 0
##$ASSWID= 0
##$AUNMP= <proc_1d>
##$AZFE= 0.1
##$AZFW= 0.1
##$BCFW= 1
##$BC_mod= 2
##$BYTORDP= 1
##$COROFFS= 0
##$CY= -3
##$DATMOD= 1
##$DC= 2
##$DFILT= <>
##$DTYPP= 0
##$F1P= 0
##$F2P= 0
##$FCOR= 0.5
##$FTSIZE= 0
##$FT_mod= 4
##$GAMMA= 1
##$GB= 0.15
##$INTBC= 1
##$INTSCL= 1
##$ISEN= 128
##$LB= 0.25
##$LEV0= 0
##$LPBIN= 0
##$MAXI= 10000
##$MC2= 0
##$MEAN= 0
##$ME_mod= 0
##$MI= 1.114404
##$NCOEF= 0
##$NC_proc= 0
##$NLEV= 6
##$NOISF1= 3.799351
##$NOISF2= 2.8
##$NSP= 1
##$NTH_PI= 0
##$NZP= 0
##$OFFSET= 14.38212
##$PC= 1
##$PHC0= -2615.124
##$PHC1= 1.392337
##$PH_mod= 1
##$PKNL= yes
##$PPARMOD= 0
##$PSCAL= 0
##$PSIGN= 0
##$REVERSE= no
##$SF= 200.129724274929
##$SI= 16384
##$SIGF1= 3
##$SIGF2= 2
##$SINO= 400
##$SIOLD= 16384
##$SREGLST= <1H.CDCl3>
##$SSB= 0
##$STSI= 0
##$STSR= 0
##$SW_p= 3205.1282051282
##$SYMM= 0
##$S_DEV= 0
##$TDeff= 0
##$TDoff= 0
##$TI= <>
##$TILT= no
##$TM1= 0
##$TM2= 0
##$TOPLEV= 0
##$USERP1= <user>
##$USERP2= <user>
##$USERP3= <user>
##$USERP4= <user>
##$USERP5= <user>
##$WDW= 1
##$XDIM= 8192
##$YMAX_p= 0
##$YMIN_p= 0
$$ End of Bruker specific parameters
$$ ---------------------------------
##NTUPLES= NMR FID
##VAR_NAME=  TIME,          FID/REAL,        FID/IMAG
##SYMBOL=    X,             R,               I
##VAR_TYPE=  INDEPENDENT,   DEPENDENT,       DEPENDENT
##VAR_FORM=  AFFN,          ASDF,            ASDF
##VAR_DIM=   8192,          8192,            8192
##UNITS=     SECONDS,       ARBITRARY UNITS, ARBITRARY UNITS
##FACTOR=    0.0002768,     1,               1
##FIRST=     0,             0,               0
##LAST=      2.2672688,     0,               0
##MIN=       0,             -135727,         0
##MAX=       2.2672688,     88484,           0
$$ Real data points
##PAGE= N=1
##DATA TABLE= (X++(R..R)), XYDATA
0@%%%%%%%%%%%%%%%%%%%%%%%%%%Nj0J3j6J6j6J6j6J7k0K4k7L0l4L8m1M4n0N6o0
$$ 0 0 0 0 0 0 0 0 0 0 0 0 0 0 0 0 0 0 0 0 0 0 0 0 0 0 0 5 -5 8 -8 8 -8 8 -8 9 -11 13 -14 16 -18 20 -21 23 -27 29 -31
46c1O7p5Q2r0R8j08J20j33J48j64J82k05K34k67L06l57M28n23O59q80J264k070
$$ -31 36 -39 43 -47 51 -57 63 -70 78 -86 96 -109 125 -142 164 -193 235 -288 371 -509 755 -1315
68a315M413k3317j11630l878O2153M8364M7081M4272J2823r967k9295o3273n5015
$$ -1315 3098 -20219 -131849 -135727 -73574 -25210 21871 66143 78966 68999 39704 -23569 -78584
81g8584J4708M9564J9411Q706K3905N644j7856k0944l8561m1591J4752O1145L4881
$$ -78584 -63876 -14312 5099 13805 37710 43354 25498 4554 -34007 -75598 -60846 299 35180
94C5180J49J0161P389l0860m1247k2611j3883P562L8997L2226Q063J2947Q905
$$ 35180 35329 45490 52879 22019 -19228 -41839 -55722 -48160 -9163 23063 31126 44073 52978
107E2978k9347m4899k1359p512K217L5990M2541L738j1833J886j4393l4989j0032
$$ 52978 23631 -21268 -42627 -50139 -47922 -11932 30609 34347 22514 24400 10007 -24982 -35014
120c5014J7435J3157J4407K2073N013j4778j2777j9953l4528j2069K2841K5991
$$ -35014 -17579 -4422 9985 32058 37071 22293 9516 -10437 -44965 -57034 -34193 -8202
132h202K5163L2622R925k9408l3774k0374k1699q444K8747M0564J8578O098k323
$$ -8202 16961 49583 59508 30100 -3674 -24048 -45747 -54191 -25444 15120 33698 39796 37473
145C7473k2593k9157j2923o64O663K2372K3606M12j2009j0185j8361k0583M767
$$ 37473 14880 -14277 -27200 -27864 -21201 1171 24777 25189 13180 2995 -15366 -35949 -31182
158c1182K0951J2615J2144J8957L329j8295j7624j0352j2865p372Q132J3592J2803
$$ -31182 -10231 2384 14528 33485 36814 18519 895 -9457 -22322 -29694 -21562 -7970 4833
171D833J5405O061p985r314q930j6251j0013Q556J2289N272Q038J0111n217j6093
$$ 4833 20238 26299 18314 9000 70 -16181 -26194 -17638 -5349 -77 7961 18072 12855 -3238
185c238o709P59N58O899J3656R308M17q841j5565j4887p127j09M217J4000K1904
$$ -3238 -9947 -9188 -8630 -1731 11925 21233 21650 12809 -2756 -17643 -24770 -24879 -20662 -6662 15242
200A5242J1119k659n205j0487j9232j4508J343J1364J2341J1763R767j242j1186
$$ 15242 26361 23702 18497 8010 -11222 -25730 -24387 -13023 -682 11081 20848 19606 8420
213H420j3160q796L73Q273P972O582M536l250j3442j2456l680J854L794J0562
$$ 8420 -4740 -13536 -13163 -4890 3082 9664 14200 10950 -2492 -14948 -18628 -16774 -12980 -2418
227b418J5560R043j359o887r281j0447r100l412N355R217P584M399L642K12o271
$$ -2418 13142 22185 20826 13939 4658 -5789 -14889 -18301 -12946 -3729 3855 8254 11896 12108 5837
242E837q661m105K13n07J201O067N303p80m738l821j210q62K592P290Q662L956
$$ 5837 -2824 -6929 -6716 -7223 -6022 45 5348 4568 -170 -3991 -5201 -6063 -3471 3819 12481 16437
258A6437l419o806o982q294p990j463O301Q622P585O789M898j842r452r030m565
$$ 16437 13018 6212 -770 -9064 -17054 -18517 -12216 -3594 3991 10780 15678 13836 4384 -4646 -9211
273i211k048Q48O073Q189N595j276m046k396j712k501k35L894L612p37l398j958
$$ -9211 -11259 -10411 -4338 3851 9446 8170 4124 1728 16 -2485 -2720 1174 4786 4049 651 -1307
289a307l111n616l597K973P731P502N351M456P75o721r700n170j165m15R55L956
$$ -1307 -4418 -10034 -13631 -10658 -2927 4575 9926 14382 15157 8436 -1264 -6434 -7599 -8014 -7059 -3103
305c103O409K454j301n75m46k954m854k610K684M148N02Q6J096j818l936j145
$$ -3103 3306 5760 4459 3884 3438 484 -4370 -6980 -4296 -148 354 440 1536 -282 -4218 -5363
321e363N216N836K101J39L96k831n820n281k668m86l48Q12N955P281L588p77j679
$$ -5363 -147 5689 7790 7929 8325 5494 -326 -5607 -8275 -8761 -9109 -8297 -2342 4939 8527 7750 6071
338F071j863m847n634J27M874R16j013J075J862P00p40O52J379q24k355j222M28
$$ 6071 4208 -639 -6273 -6146 -1272 -356 -1369 -294 1568 2268 1528 2180 3559 2735 380 -842 -414
355d14J13k512l592J66J920M45K527O216L763j203l103r32j683m332k394R20L86
$$ -414 -301 -2813 -6405 -6239 -4319 -3874 -1347 4869 8632 7429 4326 3394 1711 -2621 -5015 -4095 -3709
372c709R3J358K925L959J407k628k624j232j991k833N84L459J276j608J361K797
$$ -3709 -3616 -2258 667 4626 6033 3405 781 -451 -2442 -5275 -4691 -1232 44 -1564 -203 2594
388B594n39j166J390J279n24j337j4k39j816l008k692p68J875K041K239N391L780
$$ 2594 2055 889 2279 3558 3034 1697 1683 1444 -372 -3380 -6072 -6840 -4965 -2924 -685 4706 8486
405H486k311m068j819j283l795j289L287K667L64J816K920j82k088k064j512p10
$$ 8486 6175 2107 288 -995 -4790 -6079 -2792 -125 239 2055 4975 4793 2705 641 -871 -1581
421a581K6m81O76J338q83l763r85L604K182J138L257L750j116m344k745j340k764
$$ -1581 -1555 -2036 -1360 -22 -905 -4668 -5653 -2049 133 1271 4528 8278 7162 2818 73 -1267 -4031
438d031k344J298L193K827J933P25n2j117l150l164O77K137r8q77J919J482j921
$$ -4031 -6375 -5077 -1884 943 2876 3601 3549 2432 -718 -3882 -3205 -1068 -1166 -2043 -124 1358 -563
455e63j197K742K344q44M3J418L38k407l721k103j437l16J71K256N126L166r92
$$ -563 -1760 982 3326 2482 2525 3943 4281 1874 -1847 -3950 -5387 -5703 -5532 -3276 1850 5016 4024
472D024j138N1j803l611q79K158J307p62Q96K288o06j993l51Q63N07k26n93J60
$$ 4024 2886 2937 1134 -2477 -3356 -1198 109 -653 243 2531 1925 -68 -419 444 951 725 132 292
490B92j57k018k167N5J616J484jK362L090J17j737j98n15k961l147l16J904Q79
$$ 292 135 -1883 -4050 -3995 -2379 -895 -896 1466 4556 4673 2936 2738 2223 -738 -3885 -4201 -2297 -1418
508a418J049K169O25p66j571j203K96M58j64k92J158K7j776j096J577J716j96
$$ -1418 -369 1800 2425 1659 88 -1115 -819 -361 -525 -817 341 368 -1408 -2504 -927 789 593
525E93O61K453O18j900j706q56j779k102l98J577J273J268J091J157N90L7j824
$$ 593 1254 3707 4325 2425 719 -137 -1916 -4018 -4416 -2839 -1566 -298 793 1950 2540 2577 753
542G53j434M16m05j551J302K418k40j587K62J403j354o54K127R82j205j419j530
$$ 753 -681 -265 -670 -2221 -919 1499 1259 -328 -66 1337 -17 -671 1456 2438 1233 -186 -1716
559a716j135o10M38O87J821K499R58n75R49O04k904k679K63M35j594M56K653J083
$$ -1716 -2851 -3461 -3023 -2336 -515 1984 2942 2367 3316 3920 1016 -1663 -1400 -965 -2559 -2103 550 1633
577A633j598j06O77j000m96L50L76O07Q34r97j361L79k68j743Q81L967J869p20
$$ 1633 35 -71 606 -394 -890 -540 -164 443 1277 280 -1081 -702 -970 -2713 -1832 2135 4004 3284
595C284R8n35l700l336L79R74Q88J664J776j03k86n55j126l35J211M59j107J195
$$ 3284 3382 2847 -853 -4189 -3810 -2836 -1948 -284 1492 1389 1103 548 -578 -913 298 757 -350 845
613H45J689j758k384M52L47j070P39K835R92j055m77l83k210q21L7n93O85K161
$$ 845 2534 776 -1608 -1156 -809 -1879 -1140 1695 2687 1632 1155 772 -1438 -2259 -2222 -2815 -2130 31
631C1R55N09J819M51k662k092L36n57r38J564K409p66j023J87j070j216K46J365
$$ 31 986 1495 3314 3765 1103 -989 -653 -1210 -2148 -584 1825 1059 36 223 -847 -2063 -1817 -452
649d52O16P17J518o60j324l22j910k191Q52K833J809J521K013o04l484k819j022
$$ -452 164 881 2399 1739 415 93 -1817 -4008 -3156 -323 1486 3007 5020 4416 932 -1887 -2909
666b909p52k36K735K529P18M53o93k594j566k69K87J512L293K038j450j944j460
$$ -2909 -3661 -3897 -1162 1367 2085 2538 1845 -749 -2315 -2584 -2297 -785 2508 4546 3096 1152 -308
683c08k571j919J706K918J986J143P45q32k682j874j192j007Q76J860J480J563
$$ -308 -2879 -4798 -3092 -174 1812 2955 3700 2868 186 -1688 -2880 -3887 -3011 -1151 329 1892
699A892J395o96k055r69m9j236l00K042J290P1k7K0j565j801n38j2R61K155J860
$$ 1892 3287 2591 536 -433 -482 -1718 -2018 24 1314 1385 1358 1378 -187 -1988 -2526 -2538 -1577 578 2438
718B438O84l22j189k955k418L28J460J002K495K488J49j776j580k065j706n76
$$ 2438 3122 2800 1611 -1344 -3762 -3434 -1974 -972 1523 4011 4160 2384 804 -1261 -2967 -3543
734c543J182J916K230J284o63j907j576j646o32J432K848J678N47n5j464k638
$$ -3543 -2361 -445 1785 3069 2406 499 -1077 -2723 -3355 -1923 925 2603 3150 3095 1631 -1007
750a007j915l22J096J326J771J774K20q54j804j761j097l7Q54J286J686Q25n73
$$ -1007 -2922 -3244 -2148 -822 949 2723 2943 2089 285 -1476 -2573 -2610 -1756 -470 1216 2041 1468
767A468q73l45n25p13J82L36O58J37O62M3n90j003o86n69M12Q04O79J253R15n63
$$ 1468 595 250 -275 -988 -806 -470 188 325 987 1030 440 -563 -1249 -1818 -1406 -602 77 1330 2245 1682
787A682j656q08n50n04J09J391J140O97M60k90r27j454q09k50K41J282J044K71
$$ 1682 26 -782 -1332 -1836 -1727 -336 804 1501 1961 1671 744 -710 -1519 -1769 -1528 -246 798 1069
805A069j9n49j297q15K93P34Q02J017M58P6j050r19o89o90O0O08J479R40J83m53
$$ 1069 1050 501 -796 -1611 -1318 -584 218 1235 1693 1769 719 -200 -889 -1579 -1519 -911 568 1508 1691 1238
825A238q94r06n49m75O70J111K16J88J99j33o22n49K17J69k09M68M36P3j40k89
$$ 1238 344 -562 -1111 -1586 -916 195 411 599 798 665 43 -506 -289 -120 -329 139 575 648 508 219
845B19o81k07j21k5K66J078N05l07j86l72l92q99j24N60M39O09M95J13N6q17o02
$$ 219 -462 -669 -790 -815 -549 529 1034 727 541 169 -223 -1122 -1246 -686 -247 362 857 970 1026 209 -393
866c93l96J93Q5K12P06J45j56n69l45k15n2K85N77O78L31j74m56l29o65n23J59
$$ -393 -789 -596 -511 -299 407 552 396 -173 -518 -733 -785 -500 77 755 1086 912 456 127 -538 -1061 -902
887i02L45P80K18K91k4m65q14j92p3K10L08N89J64K02j38m00l16J36j78J41L97
$$ -902 -557 223 441 732 708 243 -571 -763 -836 -626 -318 271 435 637 499 99 -217 -81 -259 -118 279
908B79K85n8j76j82m06m69k8R7P13n1K70L89o7n49l51k38j39L01J08M61L51K8
$$ 279 564 506 330 148 -258 -727 -755 -658 55 4 274 663 596 47 -304 -542 -681 -380 -272 189 540 568
930E68J5l83l85k32l1K14L46J00j72O0j48j84k75m9L90L73K84k6n0j78j56l43
$$ 568 583 200 -185 -417 -448 -234 112 212 40 100 -48 -232 -507 -556 -166 207 491 465 415 237 81 -262
952b62k34j65M12j46O52J85r3k78k17O3k81j90L05K41K44j6n3P3l73j21J28K33
$$ -262 -496 -661 -249 -395 257 442 349 71 -146 -83 -364 -554 -249 -8 236 220 167 240 -133 -254 -126 107
974A07M4L5l3L05m50k66j22J19j46K49P1M75j79M6o9j84M1l64n4K47K7L94o5o7
$$ 107 151 186 153 458 8 -258 -380 -261 -407 -158 -87 388 209 255 186 2 43 -321 -375 -128 -101 293 228 161
998A61n7O2m78K82k50J10R9J31J60j58r6r8Q5o6K44jJ33l03K73n08K84l9j03o
$$ 161 104 166 -312 -30 -280 -170 -71 60 220 62 -34 -132 -47 -113 131 130 263 -40 233 -275 9 -30 -133 -139
1022a39K44r8k7J93l1j93J13p0j38L6k3J32n0J7K28J6j86p0O9m0p9J17j14J68
$$ -139 105 7 -20 173 142 -51 62 -8 -146 -110 -133 -1 -51 -34 194 210 24 -46 23 -17 -96 21 -93 75
1046G5j07Mn6j68L30n6M7R3j4P1k96j61L44j61n0P4r8K6K67j18L6j01j24M0J06
$$ 75 -32 -28 -84 -252 78 22 69 162 148 219 -77 -238 106 -55 -105 -31 -129 -103 164 46 82 -19 -143 -103 3
1071Ck05K11J95j35j72K28k2o3j30J27L5l4j20K32j37k8Po6J31j34Q4o7M81o37
$$ 3 -202 9 204 69 -103 125 103 40 -90 37 72 38 -82 150 13 -15 -8 -74 57 -77 7 -60 421 -216
1095b16L24j29j19J16j3j18L3K39k07JN9J28j17J8J83l3j40P6j63L7J18q5k44
$$ -216 108 -21 -140 -24 -37 -155 -122 117 -90 -89 -30 98 -19 -1 182 149 9 85 -78 -41 77 -8 -252
1118b52J82J52p2N5j2r2OPk6J80Mj11R2j31N3pmp7QJ38j48M4L9k31R6J08l1P2
$$ -252 -70 82 10 65 53 -39 -33 -26 -52 128 132 21 113 -18 35 28 24 -53 -45 93 -55 -11 28 -203 -107 1 -30 42
1146D2p9k1Q8q8P2j95N3J34J16j35M1J6P3j05l4R6k68J41O5k42K72K2j29K34o2
$$ 42 -37 -58 30 -58 14 -181 -128 6 122 -13 28 44 117 12 -22 74 -194 -53 12 -230 42 64 -65 169 107
1171A07l79K37j05J89qp6J40r8R6k05J4%j21J29K44j25L6j76O1j12J13j35J87
$$ 107 -272 -35 -140 49 41 -35 105 7 103 -102 -88 -88 -209 -80 164 39 75 -101 -40 -152 -39 -174 13
1194A3l2K66j56K2n2J38j73j41J27RN9k44L01j07k43K01j2J13n2k0n7L49j70L9
$$ 13 -19 247 91 113 61 199 26 -115 12 21 80 -164 137 30 -213 -12 -24 89 37 17 -40 309 139 178
1218A78j86j64P1L4L30j94N7qJ19q8j23m1r7J2o6J25L53l18Q6L3j31M3j8j2qM
$$ 178 -8 -172 -101 -67 263 69 126 118 237 149 26 -15 -112 -100 -166 -41 312 -6 80 113 -18 25 7 -5 -13 -9
1244iJ60j61k0L0n9J77K40k51j9o8J89j1l85R8k66K22J53j22L11l27K44O3k13
$$ -9 151 -10 -30 0 -59 118 358 107 88 20 209 198 -187 -89 -355 -133 20 -102 209 -118 126 189 -24
1267b4K5Oq4J93L13l36k1k99L13K2j02p3J82R0m6r2l9O4j30j34p9J82J58j93K65
$$ -24 1 7 -77 116 429 93 72 -227 86 108 6 -67 115 205 159 67 28 92 -38 -172 -251 -69 89 -104 161
1292A61R2l40J24j45R7k2j41M56m91K51j48P9j77J65m2j40K67l0j67P8R4j91k73
$$ 161 253 -87 37 -108 -11 -33 -174 282 -209 42 -106 -27 -204 -39 -81 -221 46 16 -151 -73 21 -170 -443
1315d43K6J60L53J20J67j18k96l7l2m6O1QP2O0Qj99j77K27R8j58L0K21L02m38
$$ -443 -417 -257 96 216 383 265 -31 -68 -100 -146 -85 -77 -5 55 63 -136 -313 -86 12 -146 -116 105 407 -31
1339c1K27k46Jm0J72p3J57j59J80J15k54k21l20K30K11k62K78K93k49J48n2j68
$$ -31 196 -50 -49 -89 83 10 167 8 188 303 49 -172 -492 -262 -51 -313 -35 258 9 157 105 -63
1361f3o6J22j21J14K82m0K1k96l0j25KmL24p9J09p2j18O0k21O3o6J05Q9J29k5
$$ -63 -129 -7 -128 -14 268 228 249 -47 -77 -202 -200 -204 120 41 150 78 -40 20 -201 -138 -204 -99 -10 119 94
1386I4K45j28k51j3j37R9j89K00K54L4m50K03j59o1J16J98J19L2m5j44o0j68l1
$$ 94 339 211 -40 -53 -190 -91 -280 -80 174 208 -242 -39 -198 -259 -143 55 174 206 161 17 -43 -211 -242
1409b42j94M92K29l1r0J2j09k66J90k22PJ25K96M3M6j99j27R8j32%M2j9M3k1K
$$ -242 -436 56 285 254 164 176 67 -199 -9 -231 -224 -99 197 240 286 87 -40 58 -74 -74 -32 -51 -8 -29 -27
1434b7O2l24P6Q6L56l27K78j47k39K01j71j00O4j11J60L28K71n00K84M4k54o1
$$ -27 35 -289 -213 -127 229 -98 180 33 -206 -5 -176 -276 -212 -323 -163 165 436 -64 220 264 10 -51
1456e1RO4O9j61J09J53j87p9M7p5n0J41J41o0j46N8qJ82n07Q4n7K72q9L40J9P8
$$ -51 -42 22 91 -70 39 192 5 -74 -27 -102 -152 -11 130 70 -76 -18 -26 156 -351 -267 -324 -52 -141 199 218 296
1482B96l63j7p5r9K43J75j15j89K11l9j01j53l7K03K23l1o8K03k57j19j92L3J72
$$ 296 -67 -84 -159 -258 -15 160 45 -144 67 28 -73 -226 -263 -60 163 132 64 267 10 -109 -301 -268 -96
1505i6P9N2N5J0j45k9j00K7J05q6q4K70l0L07m14QJ22j49J25o0K68j80pr3n8M0
$$ -96 -17 35 90 100 -45 -74 -174 -147 -42 -128 -212 58 28 335 -79 -71 51 -98 27 -33 235 55 48 -45 -103 -63
1531f3j31O5j7J77J83j7j39j2O7l95K75j93j7L27K2nj54K62q7l36L18j75P9J09
$$ -63 -194 -129 -146 31 214 197 58 46 113 -282 -7 -200 -217 110 132 127 -27 235 148 -188 130 -45 34 143
1555A43j29Q2m8r9Q6j83J12J96j45kK00J4k5j95j02M4j55O3K49N8l6j20j95J10
$$ 143 14 96 48 -51 35 -148 -36 160 15 13 213 227 202 7 -95 -51 -206 -143 106 164 128 8 -187 -77
1579g7j76K24q0P2L20j35p9o1Kj05P5p4J48Q7o0p0r9J14k91N9r4K13J34N1j26
$$ -77 -253 -29 -109 -37 283 148 69 8 10 -95 -20 -94 54 141 81 11 -88 26 -265 -206 -300 -87 47 98 -28
1604b8K66j92l9j74J29j84K33NJ85j06j6Qrj31J52k15j07K69J82j64j16J52j74
$$ -28 238 46 7 -167 -38 -222 11 16 201 95 79 87 78 -53 99 -116 -223 46 228 64 -52 100 -74
1627g4J60k32K45O6q4J66k91J39k10j83K10j41L38j00j86K68K5j75p1j45K96j84
$$ -74 86 -146 99 165 81 247 -44 95 -115 -298 -88 -229 109 9 -177 91 116 -59 -130 -275 21 -163
1649a63k7J20J37k31J06l18M84rk18p9K42J10O0l56J91j27K0r5J76J18l04L28
$$ -163 -190 -70 67 -164 -58 -376 108 99 -119 -198 44 154 214 -142 49 -78 -58 -153 23 141 -163 165
1671A65j22k6j16J06k10K32j11J73k72K94J47j34J36r9j71q6m9J96N3m4J4n7l0
$$ 165 43 17 -99 7 -203 29 -82 91 -181 113 260 126 262 163 -8 -94 -143 53 106 62 76 19 -11
1694a1J3LJ92l07R1J78j52L4l64L18N0N2k20J29J6kR1j62N5Rk43L45l58L97j70
$$ -11 2 5 197 -110 -19 159 7 41 -323 -5 45 97 -123 6 22 20 111 -51 4 13 -230 115 -243 154 -16
1719a6j7J22N2R0l34R5p2J42o1L9j53j82K63P6q0L8L7p3l8J97q5Q1r1j19J48j16
$$ -16 -33 89 141 231 -103 -8 -80 62 1 40 -113 -295 -32 44 -36 2 39 -34 -72 125 40 121 30 -89 59 -57
1745e7J73L6r3N3J15M4n04k4P6J36k3R8J62r0J47l27P6p1J30j96R8K22k67l9K42
$$ -57 116 152 59 112 227 271 -233 -257 -181 -45 -68 30 192 102 249 -78 -2 -73 57 -139 -41 181 -86 -125 117
1770A17n1K7l53L9K37j15j23J85r4J85j4p0Rk07K08P4J5j80K59N5k38k5pQR7P5
$$ 117 66 93 -260 -221 16 -99 -222 -37 -131 54 40 -30 -21 -228 -20 54 69 -111 148 203 -35 -60 -67 -59 38 113
1796A13O9j91J42j21j29lm6K15q5J6L10j18j60j66N8L4k2J63j00J64m6k20Q5q9
$$ 113 182 -9 133 12 -117 -120 -166 49 -36 -20 290 172 12 -154 -96 -62 -84 79 -21 143 97 -123 -38 -127
1820a27P7j61K94J7k42K8K41j48n9J6J20j14q7m5j14J77J08K92l78J46K38l57
$$ -127 -50 -211 83 100 -142 -114 127 -21 -80 -64 56 -58 -145 -190 -304 -127 -19 273 -105 41 279 -78
1842g8J16M0J08k67L04l26K26k23q1J84o1m4L54j84j0j19Q1j55QK85k02K13l2
$$ -78 38 78 186 -81 223 -103 123 -100 -181 3 -58 -102 252 68 58 -61 20 -135 -127 158 -44 169 137
1865A37j03o8K28j54j98J09R1O1k90O6L03k95K0J72j24j17J84Q7k16R8O8lj42
$$ 137 34 -34 194 40 -158 -49 42 103 -187 -121 182 -113 -93 79 -45 -162 22 109 -107 -9 59 56 -86
1888h6K00l7p8K02l31J10l7J37k30J26O3k37L99j26pj27K28J2k55j33K04P0j82
$$ -86 114 77 -1 201 -130 -20 -57 80 -150 -24 39 -198 201 75 68 -59 169 181 -74 -207 -3 67 -115
1911a15j29J82K23k63M3Jl0J7L5p7J49K6J55l61J74k2M9J80j81j08P1r5j11L7
$$ -115 -244 -62 161 -102 -59 -58 -88 -71 -36 -113 36 62 217 -144 30 8 57 237 56 -52 19 -76 -187 -150
1935a50K71k03nl3K10Q1j95o9K3j68Q9Q1J8J83j91J92j9n8j88k76M89m2p3J47
$$ -150 121 -82 -87 -120 90 171 -24 -93 -70 -238 -149 -68 -50 133 -58 134 115 57 -131 -407 82 40 -33 114
1959A14P3n0k75J1P3L5J29j63J57K35k52Q6k41J95j73l0K1R7j20JJ56j17o2m3
$$ 114 187 137 -138 -127 -54 -19 110 -53 104 339 87 173 -68 127 -46 -76 -55 42 -78 -77 79 -38 -100 -143
1983a43M8Q2J85k70K08k72K10j12j50J38o4K05j12q6l7K91k3j33J88l12J39j2
$$ -143 -95 -13 172 -98 110 -162 48 -64 -214 -76 -140 65 -47 -133 -170 121 98 -35 153 -159 -20 -32
2005c2J92j37r6j21K15j64o5M3P3K00n5J18j47Q2j13lKR2j45O4J39l33J47R7l04
$$ -32 160 23 -73 -194 21 -143 -208 -165 -92 108 53 171 24 106 -7 -10 -8 84 -61 3 142 -191 -44 53 -251
2030b51J52J42j07M0J84k6m3k24j02L17k58J89n2P7O1J48k04PK3j78M3O9O8Q9
$$ -251 -99 43 -64 -24 160 134 91 -133 -235 82 -176 13 -39 38 99 247 43 50 73 -105 -62 7 75 164
2054A64j71k32K47J49k26j16R1J01j12rK3K13j06L9k04N3J49M9q9n2p2p1L23j92
$$ 164 -7 -239 8 157 -69 -185 -94 7 -105 -114 -91 122 16 55 -149 -96 53 102 13 -39 -111 -182 141 -51
2078e1K4j32K68M5om8J26j38K2j88Q6m6k48L61j42P5M4jJ22k16Q5k7m7N7N5j69
$$ -51 -27 -159 109 154 148 100 226 88 110 -78 8 -38 -286 75 -67 8 52 51 173 -43 42 15 -32 25 80 -89
2104h9J09O6r1L2j39J89j23J51j7k17J06J36j16MO8L3l40K93O4l7k89K67k9Q2
$$ -89 20 86 -5 27 -112 77 -46 105 88 -129 -23 113 -3 1 69 102 -238 55 119 82 -207 60 31 113
2128A13J17m99K32M0J04k82J26L2jm2M4K64n3j08j09R8j78L03l84J30m0K99k27
$$ 113 230 -269 -37 3 107 -175 -49 -17 -18 -60 -16 248 195 87 -22 76 -102 201 -183 -53 -93 206 -21
2151b1R0j68J10M7j68K54l50K69J25l78L62k4j33J5j64Q4Q2J90j46m1l7J75pK9
$$ -21 69 -99 11 58 -110 144 -206 63 188 -190 172 148 15 30 -134 -50 32 222 76 35 -2 173 166 195
2175A95k62r7K87o9j4j32Q1K75j55l2p2J15k17R4n4k11L32m3oj63P7J1R9q9j73
$$ 195 -67 -164 123 54 40 -92 -11 264 109 77 5 120 -97 -3 -57 -268 64 21 15 -148 -71 -60 39 -50 -223
2200b23J82o2J58j42J74k3j13K83j42j32M1L09k74M4j8mj69OJ50m4k9J8L3k08
$$ -223 -41 -103 55 -87 87 64 -49 234 92 -40 1 310 36 80 62 58 -111 -105 45 1 -28 -10 23 -185
2224a85J99r9Q4%j74J73j36K11p6O5j30J92j49Rk96N13j94k14J24R5j22J89j92
$$ -185 14 -85 -1 -1 -175 -2 -138 73 -3 62 -68 124 -25 -16 -312 201 7 -207 -83 12 -110 79 -113
2247a13J91r0l7j48J72K35k17J52k20K5l1j9J15j85OJ45po2J04K31k85kK02j43
$$ -113 78 -12 -49 -197 -25 210 -7 145 -75 -50 -81 -100 15 -170 -164 -19 -26 -88 16 247 -38 -40 162 19
2271A9J37j82J1J00j18R8j76l9K70J20k26j03K76n9m3j36o2N6j17J10J4r9Q3p0
$$ 19 156 -26 -15 85 -33 65 -111 -150 120 240 14 -89 187 128 85 -51 -113 -57 -174 -64 -50 -149 -66 -136
2295a36L00j84k6M8p4K00r4p4Kj39K27j66K03Q8j05J76k25M3j26M8m5L1N2O8j53
$$ -136 164 -20 -46 2 -72 128 34 -40 -38 -177 50 -116 87 175 70 246 21 64 -62 -14 -59 -28 24 92 -61
2320f1L9j72M7JJ07O4j29O0o1K55j17R6j36j52J68J74j42m6M3j44K30j18N1j05
$$ -61 -22 -194 -147 -146 -39 25 -104 -44 -105 150 33 129 -7 -159 9 183 41 -5 38 -106 124 6 57 -48
2344d8K28j63L8n3p0J09Q8k64J64J37k47L8J07jj58K9o9r1K14j06J44Q4oP1l40
$$ -48 180 17 55 2 -68 41 129 -135 29 166 -81 -43 64 63 -95 -66 -135 -226 -12 -118 26 110 104 175 -165
2369a65J3m2J37r8L7p1L60j42R1j04l2%N1k3J89K7o7l08Q0K6M9l0r0O2l3J24k84
$$ -165 -152 -194 -57 -155 -118 -189 171 29 120 16 -16 -16 35 12 201 228 161 -147 -67 -41 8 -22 -112 -50 -83 41 -243
2396b43L34n7j53L08j80j76J59m2J84k00P2P5m09M59o9o9J10j51P7p7k0k1J73
$$ -243 91 34 -119 189 9 -167 -8 -50 134 -66 6 81 -328 131 62 -7 103 -48 29 -48 -68 -89 84
2419H4j16j26Q6J47j26M0p3M46l94j7q4K94j72Q6r2M7L1K2j87j07R8k2L6K91k72
$$ 84 -32 -158 -72 75 -51 -11 -84 362 -32 -49 -133 161 -11 75 -17 30 61 83 -104 -211 -113 -135 -99 192 -80
2444h0O8j49K5j08L04p6%j47lJ43J2Q6n9J58j64J62rr7k27K42l17K65p4j13J62
$$ -80 -12 -161 -136 -244 60 -16 -16 -163 -166 -23 -11 75 16 174 10 172 163 66 -161 81 -236 29 -45 -158 4
2469DRR9k15j10K39J8r3n9J60j39P9J02j28k5L4J93o2j10p3M9k2J01j1J5j89J52
$$ 4 13 112 -103 -213 26 44 -49 -108 52 -87 -8 94 -34 -59 -25 168 106 -4 -77 -28 -50 51 40 55 -134 18
2495A8O2j64L68l73j10J27j30n8L57k42J61k3n4J10j1L7M4k20J68p7P0P5nq7J
$$ 18 80 -84 284 -89 -199 -72 -202 -260 97 -145 16 -7 -61 49 38 75 119 -101 67 -10 60 135 130 43 44
2520D4j7L6k36J64p6J21j49M1O4R6j71j88J28M75m37oQ2R9k63J24Q4o6Q5j17J53
$$ 44 27 63 -173 -9 -85 36 -113 -72 -8 88 -83 -271 -143 332 -105 -111 -29 70 -193 -69 15 -51 34 -83 70
2545G0n1l7J03j86kJ78q8O8lj5L8qj1l0J7oj69L4J59j84J04qP8r8q2K04j7k7j99
$$ 70 19 -18 85 -101 -103 75 -13 55 52 37 75 67 56 26 43 37 -132 -98 61 -123 -19 -27 51 -47 -129 75 58 31 -168
2574a68J1J90n5K28l01J78p5k7J16J6k13M5N4k46M72l25M5K95j08k70J60P9l07
$$ -168 -157 33 -22 206 -95 83 8 -19 97 113 -100 -55 -1 -247 225 -100 -55 240 132 -138 22 101 -206
2597b06L24k17J49k64Q8P9n1L1K59k25J04j90K04r1j29J24j82L10j12r5J52p3
$$ -206 118 -99 50 -214 -126 -47 -98 -67 192 -33 71 -119 85 -6 -135 -11 -193 117 5 -90 62 -11
2619a1j71K68l5j64O1L6j11J18M6K9j20J47k52K47k49L39j82n1J03j00J39R0j83
$$ -11 -182 86 51 -113 -52 -16 -127 -9 37 66 -54 93 -159 88 -161 178 -4 -55 48 -52 87 177 -6
2642fr1k41M29j19o6O4K44j59j67K0J30k7K4P2Qj60r6J65k1j11M8P1n5p8J25r8
$$ -6 -97 -338 91 -28 -94 -30 214 55 -112 -92 38 11 35 107 115 -45 -141 24 3 -108 -60 11 -44 -122 3 -95
2668i5K7P0q2J73l55K87j54p4K99k67L32j15o0j8j31L11J8k11K8M4pJ4J71m42
$$ -95 -68 2 -80 93 -262 25 -129 -203 96 -171 161 46 -14 -32 -163 148 166 -45 -17 27 20 34 205 -237
2692b37L16j51l9J56j81J08j6J58n8Qk57L5L60k19o0oq7J76l47L00J0J21J27k99
$$ -237 79 -72 -111 45 -136 -28 -44 114 56 64 -193 -158 202 -17 -77 -83 -170 6 -341 -41 -31 90 217 -82
2716h2J10j84J56o3J04r4P1m6R3N1j76J93j82J02k08K68l23N9K33k61Q1J27K8
$$ -82 28 -156 0 -63 41 -53 18 -28 65 116 -60 133 -49 53 -155 113 -210 -151 82 -179 -98 29 57
2739E7J5o3J29j94Q7J05l95L81l2q6o0N1J82k40K49l39j0J44R1J1Q1j90N3o3q9
$$ 57 72 9 138 -56 31 136 -259 122 90 4 -56 -5 177 -63 186 -153 -163 -19 72 83 164 -26 27 -36 -125
2764a25J10J59r5r7J59k4L7k52Q3P0J11j7j58m9M4K80j39j18l6L17k37k16L63
$$ -125 -15 144 49 -48 111 87 124 -128 -45 25 136 119 -39 -88 -44 236 97 -21 -57 260 23 -193 170
2787A70j3j02p4j03J21Q0M0k27N0K7J14k7Rk69R6N8l2J15Q2q1jL9n4j69L16j19
$$ 170 157 55 -19 -122 -1 79 119 -108 -58 -31 83 56 65 -204 -108 -50 -82 33 115 34 33 72 18 -151 165 46
2813D6O3m9M6r6oj47P8L4j77K70n1k25L33p7j05K32J5m19K18r6K74j62j31q1j6
$$ 46 109 60 106 10 4 -143 -65 -31 -208 62 11 -214 119 42 -63 169 184 -235 -17 -113 161 -1 -132 -213 -229
2838b29N1K71m3L2r2j14J29p6J78j79k4J9k1R6L4j46J85j75R2J49k04K93k65O6
$$ -229 -178 93 50 82 -10 -124 5 -71 107 -72 -96 -77 -98 -2 32 -114 71 -104 -12 137 -67 226 -39 27
2862B7J86l19p3K59O0J9k46N0j05J48p0j12J89m5L2k20K39k00L18j71J46J99l00
$$ 27 213 -106 -179 80 140 159 -87 -37 -142 6 -64 -176 13 -32 0 -220 19 -181 137 -34 112 311 11
2885A1n3N3K2j09J45q0Lm7N1m3p3K26J3p6J9j22j2J01j00J43n3r7k10L07n7J28
$$ 11 -42 11 33 -76 69 -11 -8 -55 -4 -47 -120 106 119 43 62 -60 -72 29 -71 72 19 -78 -288 19 -38 90
2911I0j68lqK47k39pL18o4k12oQ1J99k15R0n7j55O4QJ14j42M2N8oL5K4P3p0j02
$$ 90 -78 -81 -89 158 -81 -88 230 166 -46 -52 29 228 13 103 46 -109 -45 -37 77 -65 -23 35 29 64 88 161 91 -11
2939a1lJ10k01J19k7M7L2k38K45j1m3R9j77Rp4K49l23j1K0O6Q5l4R6O7qj07rl8
$$ -11 -14 96 -105 14 -13 34 66 -172 73 62 19 118 -59 -50 -124 125 -198 -209 -189 -123 -38 -72 24 91 83 -24 -33 -71
2967g1J38p0j31K91q8J03p4K8k2J2n2K0J68j67j54L4j2k0p5k4J78j29O4M2j5K
$$ -71 67 -3 -134 157 69 172 98 126 104 116 64 84 252 85 -69 -35 -47 -67 -142 -166 12 -117 -53 -11 -26 -24
2993b4Nq6J72r2J5O6k33P2J29q7J12J2Qj47K19k23J30k48J71n4J66r1l6M3J21
$$ -24 -19 -105 67 -25 -10 56 -177 -105 24 -63 49 61 69 -78 141 -82 48 -200 -29 -83 83 -8 -44 -1 120
3018A20p4q3J76P7n4l59J19j89K01Q3M3R1r9k23J21J22q9P5Mj27N3l3q8M0K90
$$ 120 46 -37 139 216 162 -197 -78 -267 -66 17 60 151 52 -171 -50 72 -17 58 62 -65 -12 -45 -133 -93 197
3043A97q5l01M6K17K9j22l5M7qR4r0rk7J2j36K77j07R4n6M4k18K13k02J46O8j20
$$ 197 112 -189 -143 74 103 -19 -54 -7 -15 79 -11 -20 -47 -35 -171 106 -1 93 37 81 -137 76 -126 20 88 -32
3069c2k0J93J1k55P2K30N2r9l4k3l8q9qJ08j27J24o1j09m9J67J61l03L4J68k35
$$ -32 -52 141 152 -103 -31 199 251 152 118 95 57 -32 -40 68 -59 65 4 -105 -154 13 174 -129 -95 73 -162
3094a62L83k12o8J20k17J36J10%J10m29J03j5Q0J81j19Q8j06K29k79N2j63N7N0
$$ -162 221 9 -59 61 -156 -20 90 90 200 -229 -126 -141 -61 120 1 89 -17 212 -67 -15 -178 -121 -71
3117g1j72M19k37J29J89k79O2m2k1R1O8l9l88J72K14m8n8J03o4j79J29J07j61
$$ -71 -243 176 -61 68 257 -22 40 -2 -23 68 136 97 -291 -119 95 47 -11 92 28 -151 -22 85 -76
3140g6OLN8l1L04k03M1j86L1j03M63l08O5M8m3p2k3L2j38K92j62l5k6J12K40k86
$$ -76 -70 -67 -9 -40 264 61 102 -84 -53 -156 307 -1 64 112 69 -3 -26 6 -132 160 -2 -37 -63 49 289 3
3166Cj5Q1k12L95l46K55k81J32R3j14J0J68k11J86j90R0o8M8k4N3l6k05R8pJ71
$$ 3 -12 69 -143 252 -94 161 -120 12 105 -9 1 169 -42 144 -46 44 -24 24 0 53 17 -188 -90 -97 74
3191G4j00L5j52N2j28L49j56L3J46j64R9j43k1O1J02j13j5O2mj04Q7j72K44N1
$$ 74 -26 9 -143 -91 -219 130 -26 7 153 -11 88 -55 -76 -15 87 -26 -41 21 17 -87 0 -172 72 123
3215A23k65L19j94J36j79J4jo4J58J18j57Pj17j13K13O0lj61J66j05LK2N2n5n2
$$ 123 -142 177 -17 119 -60 -46 -47 -111 47 165 8 15 -102 -215 -2 58 55 -106 60 -45 -42 -20 32 -23 -75
3240g5r9K45L6j70J10q2o2K58k73K6j40j25L99o8k42L88j06N7j70n0J13n9qR6
$$ -75 -174 71 107 -63 47 -35 -97 161 -112 -86 -226 -351 48 -20 -262 126 20 77 -93 -143 -30 -89 -97 -1
3264aQ4r7p0J72n8j27P4J30j78K7J26j37O4k4j14k7J43m5J19q6j13J41j7M0j98
$$ -1 83 -14 -84 88 30 -97 -23 107 -71 -44 82 -55 9 -15 -129 -156 -13 -58 61 -25 -138 3 -14 26 -172
3289a72L58k48K76k16P2N2l51J05Q2m8R0K3j38J06k15K19R0m67L70J07j81K22
$$ -172 186 -62 214 -2 70 122 -229 -124 -42 -90 0 23 -115 -9 -224 -5 85 -382 -12 95 -86 136
3311A36k30K04n7k35J87J9j7On3r9Q4J42Oj53m0R7j72K47j62N7j27L01k01J20
$$ 136 -94 110 53 -182 5 24 7 13 -40 -139 -55 87 93 -60 -100 -3 -175 72 -90 -33 -160 141 -60 60
3335F0J7L8L8m51K34L5P6O1kl57K19J6K70k12J34k8l33O0K7J3L0J22o9O0q7j2
$$ 60 77 115 153 -298 -64 -29 47 108 106 -251 -32 -16 254 42 176 148 -185 -125 -98 -85 -55 67 -2 58 -29 -41
3361d1O9lP1j85L10rj48j46N6O3R2k36q0L19p5L4Lr5j26Q4pK9R9m1l49L04p7Q7
$$ -41 28 25 96 -89 221 212 64 -82 -26 37 129 -107 -187 132 57 91 94 -1 -127 -43 -50 -21 78 37 -312 -8 -85 2
3389BJ56L1n6j83J77j03q5l0R1J55j25O3j19K12k41q6J16p2K41k29J25L0k91J56
$$ 2 158 189 133 -50 127 24 -61 -91 0 155 30 93 -26 186 -55 -141 -25 -97 144 -85 40 70 -221 -65
3413f5J56j05L9J62r7q0r5K34J6j71J33j54j34R8J38L1k58J11oP2j97K03j83L37
$$ -65 91 -14 25 187 90 10 -85 149 165 -6 127 -27 -161 -63 75 106 -152 -41 -47 25 -172 31 -152 185
3437A85l85K9J02J59j34r0K48o3n0m6K10l5j49J92k09j09M03k69p3P9R6nJ00j00
$$ 185 -200 -171 -69 90 -44 -134 114 51 1 -45 165 130 -19 173 -36 -145 258 -11 -84 -5 91 86 186 86
3461H6j05j93L22l8n3KN3j20J12J4l27K03K28k10P5O6k53M9J49k50K17J7j27N8
$$ 86 -19 -212 110 72 19 21 74 -46 66 80 -247 -44 184 -26 49 115 -138 -89 60 -190 27 44 -83 -25
3485b5j29J72J45k02J10k12L52q6j47L8k04P0J26j67P4K32l9q6k3J0j77J57N6
$$ -25 -154 18 163 -39 71 -141 211 125 -22 16 -188 -118 8 -159 -85 147 108 22 -1 9 -168 -11 45
3508D5j53k09K06N4K2P7K07l48K29l4Ql17L35rj95nj2L28k27l5m7R0O2M4j70l9
$$ 45 -108 -317 -111 -57 -35 42 249 -99 130 96 104 -213 122 113 -82 -87 -99 229 2 -33 -80 10 72 116 -54 -93
3534i3K29l48K15Ok2o9j09K15n2k25L44m2j61R5J10j93L3J09o8J15j97j04P5K23
$$ -93 136 -212 3 9 -13 -82 -191 24 -28 -253 91 49 -112 -17 93 -100 -67 42 -26 89 -108 -212 -137 86
3558H6k35lP7J26j04k0J02j46J66k34J61J91j03j03J41o6j19J47rK2j07K54o6
$$ 86 -149 -152 -75 51 -53 -73 29 -117 49 -185 -24 167 64 -39 102 36 -83 64 55 77 -30 224 158
3581A58o0j55M9p4n7K09j27K52l92O4L28l25L4K47M0r6q7L1N4j40PJ76k40M56
$$ 158 98 -57 -8 -82 -139 70 -57 195 -197 -133 195 -130 -96 151 191 95 8 39 93 -47 -40 136 -104 352
3605C52m31J84J33m14R5l1K13j24k41K12K00k40K99K1l84P8K5J45j58K15k54K18
$$ 352 -79 105 238 -176 -81 -112 101 -23 -264 -52 148 -92 207 228 -156 -78 -53 92 -66 149 -105 113
3627A13p0k37L39k38j91L17r4k56L96k37O5J23l9n2K4n8L21k15lJ3j07P5L18l46
$$ 113 43 -194 145 -93 -284 33 -61 -317 79 -158 -93 30 -9 -61 -37 -95 226 11 8 21 -86 -11 307 -39
3651c9K14j43J42k1j35k5j34j57K30P6k08N8J92K09k75k08K20P8j94J51J0j13
$$ -39 175 32 174 153 18 -7 -141 -298 -68 8 -200 -142 50 259 -16 -224 -4 74 -120 31 41 -72
3673g2J20m7j11J6q4J68M9r2%J58n5p3o3R7N3k02R7J03k1k1j04J80p1O6o0K86
$$ -72 48 1 -110 -94 -178 -10 39 -53 -53 105 50 -23 -86 11 64 -138 -41 62 41 20 -84 96 25 91 31 317
3699C17l77J67J30j70j83J82r3p7R9k22J18J73K6r7l8J70k41O9K02k73J23L6m6
$$ 317 -60 107 237 67 -116 66 -27 -104 -5 -227 -109 64 90 -7 -45 125 -116 -47 155 -118 5 41 -5
3722ej0n5J41%q3q1R7R0k40J09J77j60j67M19j78L8j52J27j98K63k40J25l5r6
$$ -5 -15 -70 71 71 -12 -93 4 94 -146 -37 140 -20 -187 232 54 92 -60 67 -131 132 -108 17 -18 -114
3746a14L13k76j64K40pk8O7j3R2k90P3J1J02J85l39K01P4l66J84L52j46n3r8J00
$$ -114 199 -77 -241 -1 -8 -36 31 18 110 -180 -107 -96 6 191 -148 53 127 -239 -55 297 151 98 0 100
3770A00k46N6J73K0l04M5K42j85P0n0J67O3j49L3J13j42m9Q3k67J46J77K3k46
$$ 100 -146 -90 83 103 -201 -156 86 -99 -29 -79 88 151 2 35 148 6 -43 40 -227 -81 96 119 -127
3793a27r3L01j46L46k71m0pM9P9O5j72j6m2K23j15j9j75J00K51k19p0J43Q3l5
$$ -127 -220 81 -65 281 10 -30 -37 12 91 156 -16 -32 -74 149 34 15 -160 -60 191 -28 -98 45 128 93
3817I3O4j41r2J03j0j05J98l08J25R7j87J97N4k60K97j20q4J0J26m3j83J77l49
$$ 93 157 16 -76 27 17 -88 110 -198 -73 24 -163 34 88 -172 125 5 -79 -69 57 14 -169 8 -341
3840c41L59j42J51m7jN7M4N4j81K38k31K56j24p4J43r3L1l8J62j88k78J18J81
$$ -341 18 -124 27 -20 -21 36 80 134 -47 191 -40 216 92 18 161 68 99 61 223 35 -243 -125 56
3863E6l4J09O3m39K86O5J1K6L1n0O4j3l36J62j8j71J14J16j67Q4j34M9K57n4m7
$$ 56 22 131 194 -245 41 106 117 143 174 124 188 175 -161 1 -17 -188 -74 42 -125 -41 -175 -126 131 77 30
3888C0r6M1J53r4r8J63o3K6L0j80L4Q5n7m3MM9J4K6j74K3J73j51j29NK93j40J73
$$ 30 -66 -25 128 34 -64 99 36 62 92 -88 -54 31 -26 -69 -65 -16 -2 24 -150 -127 46 -105 -234 -229 64 -76 97
3915I7n7J13k18J39Q7m21K94K39k80k17K24j83R6J90j08j7p4Q1nk86K57J7L5J81
$$ 97 40 153 -65 74 161 -260 34 273 -7 -224 0 -183 -87 103 -5 -22 -96 -15 -20 -306 -49 -32 3 184
3939A84k68J39q6l3p9J25L9o9k7K79j46o5p5l0M2m9M6J52j65K18k83J20K19j63
$$ 184 -84 55 -31 -64 -143 -18 21 -48 -75 204 58 -7 -82 -112 -70 -119 -73 79 -86 132 -151 -31 188 25
3963B5r8J8rM4J40l4k21J33M8L1L2J92l35P4K2k08Q2j14K37k35K36j17jk4L4O0
$$ 25 -73 -55 -64 -20 120 86 -135 -2 46 77 109 301 -34 40 62 -146 -64 -178 59 -176 60 -57 -58 -82 -48 12
3989A2j67J58oRj77R2J24o0j78K29J61k48K66k85RK5L8K9j20Q9l3m0r3k9K24K5
$$ 12 -155 3 -3 6 -171 -79 45 -15 -193 36 197 -51 215 -70 -61 -36 2 31 -89 0 -33 -73 -166 -195 29 54
4015E4J08k22p9J28j89K56j69n6J50o7%K3K35K1l25j7K08j98K94j39j91K44j70
$$ 54 162 -60 -139 -11 -200 56 -113 -169 -19 -86 -86 -63 172 193 -132 -149 59 -139 155 16 -175 69 -101
4038a01o6K15K5j25Rj10J10N5J15K6j47l07N72k28K5K28q9N9j51k9r0j7k81L78
$$ -101 -167 48 73 -52 -43 -153 -43 12 127 153 6 -301 271 43 68 296 207 266 115 86 -4 -21 -302 76
4062G6Q6k08O3m7L1j02o6L60k45N0r4j1L29l50K68l46K64J7j12P9J33m41L59o3
$$ 76 162 -46 17 -30 1 -101 -167 193 -52 -2 -96 -107 222 -128 140 -206 58 75 -37 42 175 -266 93 30
4086C0q8K27j04J6k10J42l8J97n3r5j09J05J44K7j73l1j04K94l81J35L9K18j34
$$ 30 -58 169 65 81 -129 13 -25 172 119 24 -85 20 164 191 18 -13 -117 177 -204 -69 -30 188 54
4109E4K4p2l9K2M7J34k51R6L4o8K27Ll29J47j47NM31j71%k45J08p3K22k26Kk8
$$ 54 78 6 -33 -11 36 170 -81 15 49 -19 208 211 -118 29 -118 -113 318 147 147 -98 10 -63 159 -67 -65 -93
4135i3O1O1M5j64P8Q9j72K92l31L6J15j95N1J88j71j34K88L7J27o3J01k78k9J54
$$ -93 -32 29 74 -90 -12 77 -95 197 -134 -98 17 -178 -127 61 -110 -244 44 81 208 145 246 -32 -61 93
4159I3k74J93o3J85j86lk16L34j06j89L83j59r1K4N8j17J26K6n3j10J04K4l6j53
$$ 93 -181 12 -51 134 -52 -55 -271 63 -43 -232 151 -8 -99 -75 -17 -134 -8 18 -35 -145 -41 -17 -53 -206
4183b06J14K63L3k5j93K11n9P4j77j5ql1kj22R0R5k29J06q5K13L0J40k5k96k6
$$ -206 -92 171 204 179 -14 197 138 212 35 20 12 -19 -21 -143 -53 42 -187 -81 -166 47 77 217 192 -104 -130
4208a30K08k07K37j18O7l9l6J1k88L06M1k5r9R2j07pK01k04K60l25K68q2P1m9
$$ -130 78 -129 108 -10 57 18 -18 -7 -295 11 52 27 -72 20 -87 -94 107 -97 163 -162 106 24 95 46
4232D6j05J45n1l4P0Lj26j13J84L3k53L20J05j63L4j33LK18k14J6o3O1J71Kj31
$$ 46 -59 86 35 1 71 74 -52 -165 19 52 -201 119 224 61 95 -38 -35 183 -31 -15 -78 -17 154 156 25
4257B5N2N8j70K3L0j43M48l09q4o8jJ99k06J43k7N8o9L8N9q7l3J26N6j57l0J36
$$ 25 77 135 -35 -12 18 -125 323 14 -70 -138 -139 60 -146 -3 -30 28 -41 -3 56 -31 -64 62 118 -39 -69 67
4283F7j21J6K13j15k78K91j09Q2q5P7J61l32j20K72o0o5J97r5j11J50J24r9o6
$$ 67 -54 -38 175 60 -218 73 -36 46 -39 38 199 -133 -253 19 -41 -106 91 -4 -115 35 159 60 -6
4306fl2K22L6l85P1K08J0l55K83j25J73J33k64l3N7M6L6j70K54j41M4k19J23J13
$$ -6 -38 184 220 -165 -94 114 124 -231 52 -73 100 233 -31 -64 -7 39 75 -95 159 18 62 -157 -34 79
4330G9j54J91j31j87J98p2r7K21J39k27N4R2j89K35k42J23J13K0k51J70j06J23
$$ 79 -75 116 -15 -202 -4 -76 -173 48 187 -40 14 106 -83 152 -90 33 146 166 -85 85 -21 102
4352A02k16J87M4O8k70P5j27J18J76j56q5J64l2j12M6J87p5j63J17QP4j57o8K63
$$ 102 -114 73 117 185 -85 -10 -137 -19 157 1 -84 80 48 -64 -18 169 94 -69 48 56 130 -27 -95 168
4376A68k99M9K08qk36J35o1n9J28m1R0ml58J87L19m6nl42J04K13k08k3R7o0q9
$$ 168 -131 -82 126 118 -118 17 -44 -103 25 -16 74 70 -288 -101 218 172 167 -175 -71 142 -66 -89 8 -52 -141
4401a41L72j09m3j81L0J73j80J46j18j88L59j17l5J63j56J01j55J05P6rj4K00
$$ -141 231 122 79 -102 -72 101 -79 67 -51 -239 120 3 -32 131 -25 76 -79 26 102 93 79 279
4423B79l43J73j24k0J23q7K7p8j5J64j61L5o6J27N2l5j99O0o6ML27j70R9p7p8
$$ 279 -64 109 -15 -35 88 1 28 -50 -65 99 -62 -27 -93 34 86 51 -148 -88 -154 -150 177 7 106 29 -49
4448d9J19l7j20J81J7j81J7J09j14Q3q0R6l2P5j82Kl2J45N7k47K91K9k16J80o4
$$ -49 70 33 -87 94 111 -70 -53 56 -58 25 -55 41 9 84 -98 -96 -128 17 74 -173 118 147 -69 111 47
4473D7k69M54o7k03j11J21n4K77k61J18p6K4q3K24r2J77k28M3P1j55j14o9L81
$$ 47 -222 232 165 -38 -149 -28 -82 195 -66 52 -24 0 -83 141 49 226 -2 41 112 -43 -157 -226 155
4496A55j40K19m20L86k50K67k12J54m3k54O2j3J6l7K24J28j22k9n5J12j34l03
$$ 155 15 234 -186 200 -50 217 5 159 116 -138 -76 -89 -73 -110 114 242 120 91 36 148 14 -289
4518b89J75J37j03J29p9J08j81jO2R2O6j25J42k96L54l66L06j1r5q7L2Q7q8M1
$$ -289 -114 23 -80 49 -30 78 -103 -104 -42 50 116 -9 133 -163 191 -175 131 120 25 -62 -30 57 -31 10
4542A0r8K29k72K18N4k01P6J69k06n1J02L3l2Oo2p6J60O0p7J4j64R4j1N9j4O6
$$ 10 -88 141 -131 87 141 -60 16 185 -21 -72 30 63 31 37 -25 -101 59 119 42 56 -108 -14 -25 34 20 86
4568H6k07J61o1l7p9K56m5k21J74j36J22R0k46J10N5Nj63J52j17O9pnRQ4J33k15
$$ 86 -121 40 -21 -58 -137 119 74 -147 27 -109 13 103 -143 -33 22 27 -136 16 -101 -32 -39 -44 -35 49 182 -33
4594c3K13q9k0r0J48r7j26J37r7j44J01l5j10K13j02K70j23j19J24j46M4P3M6
$$ -33 180 91 71 -19 129 32 -94 43 -54 -198 -97 -132 -242 -29 -131 139 16 -103 21 -125 -81 -8 38
4617C8J55l40Q2K75j78M5k52oL57p5j2j8o6J44P2l93J42J19m7j00K32j44Q8j76
$$ 38 193 -147 -65 210 32 77 -175 -181 176 101 89 71 5 149 221 -172 -30 89 42 -58 174 30 118 -58
4641e8k8J29j96K7J2J68l1pj59K44k00P7m8LK49k18j45P0N4Q5q8J5M4J3j29N7
$$ -58 -86 43 -153 -126 -114 54 23 16 -143 101 -99 -22 -70 -67 182 -36 -181 -111 -57 28 -60 -45 -1 12 -117 -60
4667f0J79l36L80j21n8Pm4K83j52j73J42j4o3r8m8J55n4l4Q4K2p7J14J92k83N8
$$ -60 119 -217 163 42 -16 -9 -53 230 78 -95 47 33 -30 -128 -176 -21 -75 -109 -25 -3 -80 34 226 -57 1
4692AL0j54K33o8m6o1J11Lj27L5j08J23J65j29q8J1l3O1J23j61Qj3J28M9k76J66
$$ 1 31 -123 110 42 -4 -65 46 49 -78 -43 -151 -28 137 8 -80 -69 -102 -41 82 -79 -71 -84 44 93 -183 -17
4718a7m6r4K08k07K43o5J42j25M2j37j8J43j03l07N32j22j24K02l39L64l3k18
$$ -17 -63 -157 51 -156 87 22 164 39 81 -56 -74 69 -34 -341 191 69 -55 147 -192 172 139 -79
4740g9M2oJ20k3j43J49ko2k12K58rl7J08l5r8R8r1K7J9P6k29J65lo5L8k22K63
$$ -79 -37 -43 77 54 -89 60 58 -4 -216 42 33 -4 104 69 -29 69 -22 5 24 100 -129 36 33 -32 6 -216 47
4767D7K7O7p1J7k69L18L7k83P3J35N1k23K8Q0J7p5J47m10K08L2J46j81J81M1K2
$$ 47 74 141 70 87 -182 136 173 -110 -37 98 149 -74 -46 34 51 -24 123 -287 -79 -47 99 -82 99 140 162
4792A62k33J46j19L5r8K02Qp9K9q6kJ59j59p2j14K01J4k80K13R8l4Jm2R2m2R9
$$ 162 -71 75 -44 -9 -107 95 103 24 53 -33 -35 124 -35 -107 -221 -20 -6 -286 -73 25 -9 -8 -50 42 0 99
4818I9o1j08J59l1k56Q0J87j60J84k45j35L76k02k7K28k30K90k09j5K8J05o5J1
$$ 99 38 -70 89 58 -198 -118 69 -91 93 -152 -287 89 -113 -140 88 -142 148 -61 -76 -48 57 -8 3
4841CJ36p1j41J16q0R1L6j75J35k04Q3J51J6m6N9j59K49j91j70K09J57k40N0q0
$$ 3 139 68 -73 43 -37 54 90 -85 50 -154 -71 80 96 50 109 -50 199 8 -162 47 204 -36 14 -66
4865f6N9K16j92m4J64j80J1Jl0K30j66J23k05Q5l5L3Q4l52K75J11j32J30L8J93
$$ -66 -7 209 17 -27 137 -43 -32 -31 -61 169 3 126 -79 6 -29 4 88 -264 11 122 -10 120 158 351
4889C51m03J46k96J63q6J58O5J87l29m3Q0K4j08K2J01k77L62k04k5J11p8J60J7
$$ 351 -52 94 -202 -39 -125 33 98 285 -44 -87 -7 17 -91 -69 32 -245 117 -87 -112 -1 -79 81 98
4912I8j5l1O0Nj78M9Q6L1m0j7J24r6l86L33J05q0m3r6J38j22j47R1L40k15M3K06
$$ 98 83 52 112 117 -61 -12 74 105 65 48 172 76 -310 23 128 48 5 -91 47 -75 -222 -131 209 -6 37 243
4938B43l48J38p9o8n2J75j39R1J97q5K1l2j22K01j30j12L42l13m2J16j7K28k43
$$ 243 -105 33 -46 -114 -166 9 -130 -39 158 73 94 62 -60 141 11 -101 241 -72 -114 2 -15 213 -30
4961c0l5K5K44k62j02L62l09L17l66J30O9P7r1L9j82J60l2j0n1J65K6l09K58j69
$$ -30 -65 -40 204 -58 -160 202 -107 210 -156 -26 43 120 29 68 -114 46 14 4 -47 118 144 -165 93 -76
4985g6K51l80K53k32K40j27M8j27Q7m9j5K35k48J45j37L62j10K8k12nJ6q7P0R9
$$ -76 175 -205 48 -184 56 -71 -23 -150 -63 -112 -127 108 -140 5 -132 230 120 148 -64 -69 -53 -140 -70 29
5009B9K5O1N7j04j28J04m2J35j1o1pK32k96j18J22J20j11n3P4j0N3j35J31k90
$$ 29 54 115 172 68 -60 44 2 137 126 65 58 290 -6 -124 -2 118 7 -46 28 18 71 -64 67 -223
5033b23J68J24j29K06l08L01k07J97j07mj55k9j0K01q1K09k17N1l9J32J46l08
$$ -223 -55 69 -60 146 -162 139 -68 129 22 18 -137 -166 -176 25 -56 153 -64 -13 -52 80 226 -82
5055h2J06J19k26j5J94K8k17L28k32m4J29k6Q7q0k88K79M4k51K39K5m8Rj68N2
$$ -82 24 143 -83 -98 96 124 -93 235 3 -41 88 62 149 69 -219 60 104 -147 92 117 69 78 -90 -38
5079c8K49j09l1J53l05J49n6J97k49ML00k75J83j79Q3r9R2j69M1mO5k78N5L27
$$ -38 211 102 71 224 -81 68 12 209 -40 -36 264 -11 172 -7 76 -23 69 -100 -59 -63 2 -276 -221 106
5103A06j37R8L4k32M2J98Kn8q9j51L73l08O1j7JK89l75J76j00J8lO4P8J85l10
$$ 106 -31 67 101 -131 -89 109 111 53 -36 -187 186 -122 -61 -78 -77 212 -163 13 -87 -69 -72 -8 70 255 -55
5128e5J6J23j69j08L37j88K0M7m5N5m2N6J49k41o9J22M4q0K1L7R9j64J59L2k74
$$ -55 -39 84 -85 -193 144 -44 -24 23 -22 33 -9 47 196 -45 -114 8 52 -28 -7 30 129 -35 124 156 -118
5153a18K35j2j17j16J04J6n9J93m6J60l17J59j92j7Q1O7R3J57l46O8p2J2P3m9
$$ -118 117 105 -12 -128 -24 -8 -67 126 80 240 -77 82 -110 -127 -46 21 114 271 -75 -7 -79 -67 6 -43
5177d3K36k58J18j19l0J03J62j32O5j1k2q2j68J79j31JK21o2L0j09k8m3J66j24
$$ -43 193 -65 53 -66 -96 7 169 37 102 91 69 -13 -181 -2 -133 -132 89 27 57 -52 -80 -123 43 -81
5201h1kM8j3j33K53j20R2q3K7l6j16K6J60K21k83q8J76r8l1K2k12K84j0K39k38
$$ -81 -83 -35 -48 -181 72 -48 44 -39 -12 -48 -164 -138 22 243 -40 -128 48 -50 -81 -59 -271 13 3 242 4
5226Dj03P8ln2P1r2M06m60K63k67Q7Q2k3J5Q3q6p6j6M3R3k14R2R9n6j73K99j71
$$ 4 -99 -21 -24 -76 -5 -97 309 -151 112 -155 -68 14 -9 6 89 3 -73 -89 -46 47 -167 -75 24 -32 -205 94 -77
5253g7J58k21K61P4r1M9l67M90l41r5L53P3l77K3P3p1j58J35O3K7lq6q0J45Q0
$$ -77 81 -140 121 195 104 153 -214 276 -65 -160 193 266 -111 -88 -15 -86 -244 -109 -46 -19 -22 -108 -188 -43 37
5278C7o0Q4j00M4k7q4mJ32j53K07k22K56mr7K7P8k90rJ33J8p7R9L9J00j1Q2m9
$$ 37 -23 61 -39 5 -22 -106 -110 22 -131 76 -146 110 106 9 36 114 -176 -185 -52 -34 -111 -12 27 127 116 198 149
5305A49j60J14O0q3j95k5J27q2k3L74k57j71N8J33J18O5k44M7p8K52j04k75M04
$$ 149 -11 103 163 80 -115 -140 -13 -95 -118 256 -1 -172 -114 19 137 202 -42 5 -73 179 75 -200 204
5328B04l28J15l1K0n2j34M8K89k21K20M5j81j99L45O2j71Q3j23J8M0j9J0j23M0
$$ 204 -124 -9 -40 -20 -72 -206 -158 131 -90 130 175 -6 -205 140 202 31 114 -9 9 49 30 40 -83 -43
5352d3j21K20j8j93K6L11l26N7k07K30K55l48J81j15J14k3J22j54N5l1q1l4K24
$$ -43 -164 56 38 -155 -129 182 -144 -87 -294 -64 191 -157 24 -91 23 0 122 -32 23 -8 -89 -123 101
5375A01j33M7l6J17m6j00l0K1J30j9K39j98K23l97J53j47J0K58j93j68M2Q5J71
$$ 101 -32 15 -21 96 50 -50 -80 -59 71 52 291 93 316 -81 72 -75 -65 193 0 -168 -126 -41 130
5398A30k91J45K68l40J92J3p2J04k41Pm2J94O7k3j55J26j69M3J75K7k11j86K45
$$ 130 -161 -16 252 -88 104 117 45 149 -92 -85 -127 67 134 111 -44 82 -87 -44 131 158 -53 -239 6
5421FK3m8J48j92j7J19K3Q1j09L5k00M3o1K77K4j38J11j85n8J18k74L74P5j31
$$ 6 29 -19 129 -63 -80 39 62 143 34 69 -131 -88 -149 128 152 14 125 -60 -118 0 -274 100 175 44
5445D4l7j58OJ61J20l99K60J26r3K2q0q5L7j21J05K8J69k96K45j19K77m78J84
$$ 44 7 -151 -145 16 136 -263 -3 123 30 52 -28 -113 -76 -197 -92 -64 105 -191 54 -65 212 -266 -82
5468h2j17J87j60K21K4k79K00J63k71K48k19O2J8J56j48L8J31j46n9Q4P1k28K61
$$ -82 -199 -12 -172 49 73 -206 -6 157 -114 134 -85 -23 -5 151 3 41 172 26 -33 51 122 -106 155
5491A55k44k2r0K27p1M8J37k04J42J2p9l48J84J58M8k5j64o7K31l9Q6j86L05J10
$$ 155 -89 -111 -201 26 -45 3 140 -64 78 90 11 -337 -153 5 53 28 -136 -203 28 -11 75 -111 194 304
5515C04j26k72R7m2R1m4rp8J57n2R8M0k04L1Q7o6o0j61J71J29o0o9k43L63j23
$$ 304 178 -94 3 -39 52 8 -1 -79 78 26 124 164 -40 -9 78 12 -48 -209 -38 91 31 -38 -281 82 -41
5540d1J88k69Q5j1J2qO7q0J94j98r1J82O8k0p7r0J46oJ26k24J6J31L5k27Q8J65
$$ -41 147 -122 -37 -48 -36 -44 23 -57 137 -61 -152 30 98 78 1 -89 57 51 177 -47 -31 100 135 -92 -4 161
5566A61k8j29J15k40J2K69j13m0Q4J38j68j27J00Q9k25J52j70J32j07J49j78J45
$$ 161 133 4 119 -121 -109 160 47 7 91 229 61 -66 34 123 -102 50 -120 12 -95 54 -124 21
5588B1k04J71J45j1j64qK84l47K56o6qk5p0K77l87K44j9q2Q6j11J3K3r1m6J30
$$ 21 -183 -12 133 122 -42 -50 234 -113 143 77 69 44 -26 251 -136 108 89 7 93 -18 -5 18 -73 -119 11
5613A1L4k7j2qj55q9M03q1k09Q3O0o0O3j04K23j07l7J62Nl84L12j69J91l24L05
$$ 11 45 18 6 -2 -157 -246 157 76 -133 -50 10 -50 13 -91 132 25 -12 150 155 -229 83 -86 105 -219 86
5638H6M3l25L26k49J43l0J24k7j03q6J09j89K64r0R5j84J54j20M1RJ40j32J68
$$ 86 129 -196 130 -119 24 -6 118 91 -12 -98 11 -178 86 -4 91 -93 61 -59 -18 -9 131 -1 167
5661A67j61j31J78L7n9k6Q7j13L8o2Q4K1j08P7k5J22N3l34J73m9N9Q5J54j79k1
$$ 167 6 -125 53 90 31 5 92 -21 17 -45 39 60 -48 29 4 126 179 -155 18 -31 28 113 267 88 67
5686F7J02k21m4K04on2Kk22J58J01Q5p8j43K44j35j54J72j73J51j68m0J83j50
$$ 67 169 -52 -96 108 102 50 52 -170 -12 89 174 96 -47 197 62 -92 80 -93 58 -110 -150 33 -117
5709a17J93k15M7K79l85J72l5J31l6K07k15j02J90jp9L0o5k3K4J3L65m61J19J27
$$ -117 76 -139 -92 187 -198 -26 -61 70 34 241 26 -76 114 113 34 64 -1 -24 0 13 378 -83 36 163
5733A63l1k82K18J09J17k11l13P2J94j35J33o9n2M2J01K91n81K04kr7J41j47K11
$$ 163 132 -150 68 177 294 83 -230 -158 36 -99 34 -35 -87 -45 56 347 -234 -30 -32 -129 12 -135 76
5756G6O4n7j47p5L63k74L6R7j70P2M7O3k78J74J47j25nn3J40P4j43Q2l31L86j40
$$ 76 140 83 -64 -139 224 -50 -14 83 -87 -15 32 95 -183 -9 138 13 8 -45 95 169 26 108 -223 163 23
5781B3M8N0j57J03J20j08O9j9k12J92j17J39j96j4j30L70j56k39K75M2m5L7j17
$$ 23 71 121 -36 67 187 79 148 129 -83 109 -8 131 -65 -79 -209 161 5 -234 41 83 38 75 -42
5804d2L6M6N8j22rj36J86k6J45j13N8j56J48J08m13L59j78J01p0j1j7n4K15j67
$$ -42 -6 40 98 -24 -33 -169 17 -9 136 23 81 -75 73 181 -232 127 -51 50 -20 -31 -48 -102 113 -54
5828e4J71j94Q3P6R5j36n3KJ14j59N1O5p0q0j07K01n4R4r0k16J72M7K3J05P4k10
$$ -54 117 -77 6 82 177 41 -12 -10 104 -55 -4 61 -9 -89 -196 5 -49 45 -45 -261 -89 -42 -19 86 160 -50
5854e0Q3j28L67l21Q3K37q3k4j9Lj95q2K04k09k8J97k30J68k4j37J37K01k24N8
$$ -50 33 -95 272 -49 34 271 188 164 145 148 -47 -129 75 -134 -162 35 -195 -27 -51 -188 -51 150 -74 -16
5878a6K14k15o9K30k41K43J1j37jK2j38J16O6J87j48j85J36r0J17o1p1J95l44
$$ -16 198 -17 -86 144 -97 146 157 20 19 41 -97 19 85 272 124 -61 75 -15 102 41 -30 165 -179
5901a79K15J68l36J40j13K69M7j57o4Pk75L48K0K0k73J75M5qk48K01Rr3j37K20
$$ -179 36 204 -132 8 -105 164 211 54 -10 -3 -278 70 90 110 -163 12 57 49 -199 2 11 -82 -219 1
5925AP4l04J85K86m9j07j65J33Nk25J88l6J65L4k11nk9J19j65J89k70P7J24R8
$$ 1 75 -229 -44 242 193 86 -79 54 59 -166 22 -14 151 185 -26 -31 -60 59 -106 83 -187 -110 14 112
5949A12p7Q4j66L7K14j29k42K30j73L7K17q6lr4L4j47K03m9j76K22M4j94j5n5
$$ 112 35 119 -47 -10 204 75 -167 63 -110 -73 144 58 55 -39 -5 -152 51 2 -174 48 92 -102 -117 -172
5973a72K79k89PP2L9J44p2P6M3l37J33j27J31J07j32k36L46O7J03j71K6J3j7j9
$$ -172 107 -182 -175 -103 -64 80 8 84 127 -210 -77 -204 -73 34 -98 -334 12 79 182 11 37 50 33 14
5997A4J4o6K72j41k17r9J19O0K23j86K40j99j47J49k05K87p7l3l1r2Q3R1j50J35
$$ 14 28 -38 234 93 -124 -223 -104 -44 179 -7 233 34 -113 36 -169 118 41 8 -23 -115 -32 59 -91 44
6021D4k4Q1k12J73J34p4r3j43J60r4L1j94L11qj9n6K25k50N7j37J59j63J75j39
$$ 44 20 101 -111 62 196 122 29 -114 46 -48 -17 -211 100 92 73 17 242 -8 49 -88 71 -92 83 -56
6045e6p5J72k47L64j17p1Qn7L02j08p0k3K2K7k33J73k00K84j41J43j14J58J1k36
$$ -56 -131 41 -206 158 41 -30 -22 -79 223 115 45 22 44 71 -162 11 -189 95 -46 97 -17 141 152 -84
6069h4K95l02n6K77k04J61%p7KJ34j75P7j54O0j7J33L5k6j20j9k7M3M3j48J35
$$ -84 211 -91 -147 130 -74 87 87 10 12 146 -29 48 -106 -46 -63 70 105 79 -41 -60 -87 -44 -1 -149 -14
6094a4J49j56j35K83m11K78R9j29M3r1K47k8k21K33k52J77J4k02L40j74j32q2
$$ -14 135 -21 -156 127 -284 -6 93 -36 7 -84 163 135 -86 147 -105 72 86 -116 224 50 -82 -164
6116a64J26j60L97j10o4Lk04K02j16R6L4rj00j48K44l2N0R2p4r9R9j81J18K26
$$ -164 -38 -198 199 89 25 28 -176 26 -90 6 40 31 -69 -217 27 -5 45 137 63 -36 63 -118 0 226
6140B26m81L47K3j35J74k31p9k2K88k11q1J94P3rj65J7K49j76p7J7O3J13k72P8
$$ 226 -255 92 115 -20 154 -77 -156 -178 110 -101 -182 12 85 76 -89 -72 177 1 -76 -59 4 117 -155 -77
6164g7J45j34j21J27Q9o2O7r8p3K30k59K51r9J17n4j20L1J77r0j38K54k3o7Lj74
$$ -77 68 -66 -187 -60 29 -33 34 -64 -137 93 -166 85 -14 103 49 -71 -40 137 47 -91 163 140 73 76 -98
6189i8J93j35J00j3lj37J44m5J85l79J75P9m2n2K4j99Q7J1JO5mj35J56K84j22
$$ -98 95 -40 60 47 44 -93 51 6 191 -188 -13 66 24 -28 -4 -203 -116 -105 -104 -39 -43 -178 -22 262 140
6214A40k22k87M04m7j4L2r2RoJ41r4j0m9R3P7n0j47mJ79j74J61j8PJ99l99L15
$$ 140 -82 -369 35 -12 -26 6 -86 -77 -83 58 -36 -46 -95 -2 75 25 -122 -126 53 -121 40 22 29 228 -171 144
6240A44k41J09j27J85j15o9K31%j23j14J12q6l0M38k22K2o9l3N1j06Q5L9j79N
$$ 144 -97 12 -115 70 -45 -114 117 117 -6 -120 -8 -94 -124 314 92 114 45 12 63 -43 42 81 -98 -93
6264i3J8J10l5O4M9k7m8J29j61O1n7M5N1K0j99J53o6QJ35k16K8j87J78J78j96
$$ -93 -75 35 0 64 113 86 38 167 6 67 10 55 106 126 -73 80 14 22 157 -59 -31 -218 -40 138 -58
6289e8J87k34j58K01J49o9J42o4Q1r6p4m1J71m7Mk97K06J29k39J34j74O5N6M6
$$ -58 129 -105 -263 -62 87 18 160 96 177 81 7 -34 137 90 94 -203 3 132 -107 27 -147 -82 -26 20
6313B0m5j48J24K07k87L69l13J4N4j49J62j5l3o8J58m0J8R1l50K18RR8J44k32
$$ 20 -25 -173 -49 158 -129 240 -73 -59 -5 -154 8 -7 -40 -108 50 10 28 119 -231 -13 -4 94 238 6
6337Fj28O6K70l23jK00k04j2J74P0j72k8Q5p9p2L79j71j48L52m41J65O4k26o1
$$ 6 -122 -56 214 -109 -110 90 -114 -126 48 118 -54 -82 3 -76 -148 231 60 -88 264 -177 -12 52 -174 -235
6361b35K39k18K43J06j99K10k34L41l62J59j85J49j43J51J45k47P2j70J49J91
$$ -235 4 -214 29 135 -64 146 -88 253 -109 50 -135 14 -129 22 167 -80 -8 -178 -29 162
6381A62j22j68J81r2J14r1r0j08K22Jr6j1J90j40O2P0j78m4J55R2R6k36J47M3
$$ 162 40 -128 53 -39 75 -16 -106 -214 8 9 -87 -98 92 -48 14 84 -94 -138 17 109 205 -31 116 159
6405A59j60n2J32j9R7k05R9J61l15k9K69L7j75n0J36j65O5J4J00k06J62j55L20
$$ 159 -1 -53 79 60 157 -48 51 212 -103 -132 137 174 -1 -51 85 -80 -15 -1 99 -107 55 -100 220
6428B20n8q9M2k8J6j21j69K20j26R1k4m4q9L45j42j66K72Pj69J70j2l7o0j01P
$$ 220 162 73 115 87 103 -18 -187 33 -93 -2 -26 -70 -159 186 44 -122 150 157 -12 158 146 109 49 -52 -45
6453d5J58o2Q4q6j1j6j92J81J61k36j17L8K33j63J05j19K51j56j05J23K12N9l43
$$ -45 113 51 135 49 38 22 -170 11 172 -64 -181 -143 90 -73 32 -87 164 8 -97 26 238 297 -46
6476d6j6K24o9l4K8l73L31rJ1n8j2O9q6J24j14J7o3j07K08N4M5J8l3j12N6p4O8
$$ -46 -62 162 93 59 87 -286 45 36 47 -11 -23 46 -40 84 -30 -13 -76 -183 25 79 124 142 109 -3 53 -21 47
6503D7q0j00J75L3Nm4R1k07mj48K21j2J54j41j57J82j62j4J43R4j29K24k13L9
$$ 47 -33 -133 42 75 80 36 127 -80 -84 -232 -11 -23 131 -10 -167 15 -147 -161 -18 76 -53 171 -42 -3
6527cj60K66o0J11j15P3k6j02J97o8m5k18L85l31J35k55J67M1L0O5j65o6J76J1
$$ -3 -163 103 43 154 39 112 86 -16 181 113 68 -150 235 -96 39 -216 -49 -8 22 87 -78 -144 32 43
6551D3J5L1O7m62L66jML5J2m5l34N49r5j6j87J37j50R2r5P1Q7m5j41Om3J94j46
$$ 43 58 89 156 -306 60 59 63 98 110 65 -269 280 185 169 -18 119 -31 61 -34 37 124 79 -62 -56 -99 95 -51
6578e1j13K39K2m43L59o0J3k3K38l56J55L6k2J96k70J41kj31k6K27j25r5J28R4
$$ -51 -164 75 97 -346 13 -47 -34 -57 181 -175 -20 16 -6 190 -80 61 59 -72 -98 129 4 -91 37 131
6602A31O8j45j48M4J61j80K27p5k3m9k23J49lJ18M3j69qRJ9J3Q9M5k70K45k81
$$ 131 199 54 -94 -50 111 -69 158 83 60 11 -212 -63 -66 52 95 -74 -82 -73 -54 -41 48 93 -177 68 -213
6627b13J68P1j04K80j56n4L5l0R4k30K79Kk61m9K26k06K99j68M7M7j41K57k17
$$ -213 -45 26 -78 202 46 -8 27 -3 91 -139 140 142 -119 -168 58 -148 151 -17 30 77 -64 193 -24
6650b4k12K63k11K47%m9P5j54K30r7k58j6OM30l35J62l54K73o2J31p2r1P4p9K02
$$ -24 -236 27 -184 63 63 14 89 -65 165 68 -190 -206 -200 230 -105 57 -297 -24 -86 45 -27 -118 -44 -123 79
6675G9m9J6j90K01O2k37K48J1lk47J37Q9n9o3pj19jL23j07k78J34K7j10K29j71
$$ 79 30 46 -144 57 119 -118 130 141 138 -109 28 117 58 -5 -12 -131 -132 191 84 -194 -60 -33 -143 86 -85
6700h5N2J34j16J61Kk39j53K95m6O3R6k51M1J44o4q8P9O2j04m8J88k29j01K82
$$ -85 -33 101 -15 146 148 -91 -244 51 5 68 164 -87 -46 98 34 -54 25 87 -17 -65 123 -106 -207 75
6724G5p1j71R9J72o7r7K5j73K51L2j74L6l5M0J26L2R9j37q9M6k99J67J6J18J37
$$ 75 4 -167 -68 104 37 -60 -35 -208 43 75 -99 -63 -98 -58 68 100 199 62 -27 19 -280 -113 -97 21 158
6749A58l88K36r9J35qQ6r0j70J44j46J99o0l8m5m4K03n2o9N9N2l8j46M1RK06q3
$$ 158 -230 6 -93 42 34 120 30 -140 4 -142 57 -3 -41 -86 -130 73 21 -48 11 63 25 -121 -80 -71 135 52
6775E2j0j49K31j16K7J19m29K59J98j98k9K9J21k75K56r4j10J74O3L8k7q6p2p7
$$ 52 42 -107 124 8 35 154 -275 -16 182 -16 -45 -16 105 -170 86 -8 -118 56 119 157 130 44 -28 -105
6799a05o7j09M35j40j35O1k4K24j7j60J9n5J8J76j26K86m01O3L4kp6M81n20K03
$$ -105 -172 -281 154 14 -121 -60 -84 140 123 -37 -18 -73 -55 121 -5 281 -120 -57 -23 -25 -101 380 -140 63
6823F3l12M39m1j54J09o6r4J96m3L2l21R2o1J62Q5l8k28J92O8j09J20o0j73J92
$$ 63 -249 190 149 -5 104 38 -56 140 97 129 -192 -100 -161 1 86 48 -180 12 80 -29 91 31 -142 50
6847E0j46L02j55j32o1R6l6j24K01J27n3j2j49qk8J32K51l99J10N6J40k87J33
$$ 50 -96 206 51 -81 -142 -46 -82 -206 -5 122 69 57 -92 -100 -128 4 255 -144 -34 22 162 -125 8
6870HQ1r0K02l48R7N7m9M3K20l38n3M00k06l5n6j89K59k41K14K80k29rP8j49L7
$$ 8 89 -1 201 -147 -50 7 -42 1 221 -117 -170 230 24 -11 -67 -256 3 -238 -24 256 27 18 96 -53 -16
6895a6L6m4j80L14Nk84J06r5L10k9k58L5R7J58l18K95j81J9j7J24k21K64p5r9
$$ -16 20 -24 -204 110 115 -169 -63 -158 152 123 -135 -100 -3 155 -163 132 -49 -30 -47 77 -144 120 45 -54
6919e4j0Q4LN1Nn9p7oK04j73l3n6M1q4R2j82L04N9r5L3M9r8l6Nk3J50J8j47k08
$$ -54 -64 20 23 74 79 20 -57 -63 141 -32 -65 -121 -80 -164 -72 -254 50 109 14 47 96 -2 -38 -33 -56 94 112 -35 -243
6948b43M07j36n8J84m2k03j71J70J85J03k43K61Lj26j99K88j80j0Q7j67m4R3j3
$$ -243 164 28 -30 154 112 -91 -262 -92 93 196 -47 214 217 91 -108 180 0 -10 77 -90 -134 -41 -54
6971e4P8j10P6j45K14j42oP0L2O1q4j88K00N1nm1J04j0p8R6j89K51mj53m9k36
$$ -54 24 -86 -10 -155 59 -83 -89 -19 13 74 -10 -198 2 53 48 7 111 101 23 119 -70 181 177 24 -25 -261
6997b61M59M5j50j35P6r8P2m9M9K6O1j45N1J08k9j76P5o4j58J54Jj75J50lN1J30
$$ -261 198 243 93 -42 34 -64 8 -41 8 34 95 -50 1 109 80 -96 -21 -85 -243 -89 -88 -263 -113 -116 -65 65
7023F5k19Q6J42k8q3K01o4J6j56N1k5R5Ql89L36O2j63K25k24P7j47K37l5r3R0
$$ 65 -154 -68 74 46 -37 164 100 116 -40 11 -14 81 89 -300 36 98 -65 160 -64 13 -134 103 68 -25 65
7048F5o7j18O5l0J34j81J86o6k52L17J1K0m01N24j79j12J45O1J23oj61j84J1j10
$$ 65 -2 -120 -55 -85 49 -132 54 -12 -264 53 64 84 -317 207 28 -84 61 122 245 239 78 -106 -95 -205
7072b05M41l21nP2M1j42J19J41q2K3k1oO4j30L3J94l68R8KJ3K97l34J26N7J5J04
$$ -205 236 -85 -90 -18 23 -119 0 141 59 82 61 55 119 -11 22 216 -152 -54 -52 -39 258 -76 50 107 122 226
7098B26j23j31o5j12K25qJ11n2k3kk7pO0O3k00Jq8M48j91j46oJ32j13r7K62k71
$$ 226 103 -28 -93 -205 20 12 123 71 48 46 19 12 72 135 -65 -64 -152 296 105 -41 -47 85 -28 -125 137 -134
7124a34L27m8J20j14j45j0L4P8k06J82r5J10j62Q0J30p2l7L1j51%k8p3K08k46
$$ -134 193 145 265 151 6 -4 30 108 -98 84 -11 99 -63 17 147 75 38 69 -82 -82 -110 -183 25 -221
7148b21m8L65k02n6j2N3M29l55J40o5K08r8k93K08K0K6p2L0k57J40K11R3l61J62
$$ -221 -269 96 -106 -162 -174 -121 308 -47 93 28 236 138 -155 53 73 99 27 57 -200 -60 151 244 -117 45
7172D5j15J68p5j89J38J09j66J01qq8rL7J47O6k46J65j81J90k9r8J80j50Q9j27
$$ 45 -70 98 23 -166 -28 81 -85 16 8 -80 -89 -52 95 161 -85 80 -101 89 60 -38 142 -8 81 -46
7196d6O4N2l1p0j58K71j61J28r8M0j15K33J8j34m7K0K65m06K15j80p7J97l3R7
$$ -46 18 70 39 -31 -189 82 -79 49 -49 -9 -124 109 127 -7 -54 -34 231 -175 40 -140 -217 -20 -53 44
7220D4j57K82j50o2J02p9l3j9J79j72J03m78N91n9k04Q0O2j9K07l11R1K56k70
$$ 44 -113 169 19 -43 59 -20 -53 -72 107 -65 38 -440 151 92 -112 -32 30 11 218 -93 -2 254 -16
7243a6q7Q8J7l6J36r6k2j68N0J17J8n2r4K15j14l5J09K60k66Q7n1j56J57j65R5
$$ -16 -103 -15 2 -34 102 6 -16 -184 -134 -17 1 -51 -145 70 -44 -79 30 290 24 111 60 -96 61 -104 -9
7268iM4o8J69j43n8K62J5l91L18r7J98j71j07J43p3r0K4K4mq5J47j38J15l3L5
$$ -9 35 -33 136 -7 -65 197 212 -179 139 42 240 69 -38 105 32 -58 -34 -10 -14 -99 48 -90 25 -8 27
7293B7P8j37K37k52N7j28j09M4lj30K78rL1K2L5j59L7J74R4j56Oj66O9J40k07
$$ 27 105 -32 205 -47 10 -118 -227 -183 -186 -316 -38 -47 -16 6 41 -118 -81 93 187 31 37 -129 -60 80 -127
7318a27J33j07R4p5J58n3rK2o9N3k4L0L0k37J39m9J40j06J67P8j80l00L50j08
$$ -127 6 -101 -7 -82 76 23 14 36 -33 20 -4 26 56 -181 -42 -91 49 -57 110 188 8 -292 58 -50
7342e0R4qj00q1J11N5K3J64k36P7o3l4J11j63Q2J3q4Q2M5J05k66j17K76K4q6p4
$$ -50 44 36 -64 -145 -34 21 44 208 -28 49 -14 -48 63 -100 -18 -5 -89 -7 38 143 -123 -240 36 60 -26 -100
7368a00K32m2J42l29J20J22p9O9j18KJ14r5J08p7n4j18P6l4q2kO9K6n0k6K43j68
$$ -100 132 90 232 -97 23 145 66 135 17 19 133 38 146 69 15 -103 -27 -61 -143 -145 -76 -50 -100 -126 117 -51
7394e1m4J28M5J04l88L8P6J4LLKj6J37k1j8J00O3J7k46J42N3j81l1J38J49m41
$$ -51 -95 33 78 182 -206 -168 -92 -78 -75 -72 -70 -86 51 30 12 112 175 192 -54 88 141 -40 -71 67 216 -225
7420b25K01j26K30j06L6L6n9Q0k15L01j95P3N5L9m5j76Q9J07j54j39KK89p6k8
$$ -225 -24 -150 80 -26 10 46 -13 67 -148 153 -42 31 86 125 80 -96 -7 100 -54 -193 -191 98 22 -6
7444fJ3k65K20PK29k61M1l0m5K26k11K54j64k48K03n7J1j3J66k42j3J11r9k2j8
$$ -6 7 -258 -38 -31 198 -63 -22 -52 -97 129 -82 172 8 -240 -37 -94 -83 -96 70 -172 -185 -74 -173 -195 -213
7469b13K22K03l76J06Q1j58K66M1l3j44r1J89K5l12J29j55J60J95k86q2K55j41
$$ -213 9 212 -164 -58 23 -135 131 172 139 -5 -96 93 118 -194 -65 -220 -60 135 -151 -233 22 -119
7491a19N6N0R6j88O3J0j5j06J80K4k4P5r6k13J68Nk7K33k16jn3l9J93j12O6j82
$$ -119 -63 -13 83 -105 -42 -32 -47 -153 27 51 27 102 6 -207 -39 -34 -61 172 -44 -45 -98 -137 56 -56 10 -172
7517a72J14L4m5K17j15l3RN2N2m4p0k14J79O5M5M7l91L12n6l5R0l4p1L7J47l0
$$ -172 -58 -24 -69 148 33 0 9 61 113 69 -1 -215 -36 29 74 121 -270 42 -14 -49 41 7 -64 -27 120 90
7543I0rj45J1L3L4K05k12M9o6j60J09N5M3m4k1N9J16O1k28J29j97J13j04J33M
$$ 90 81 -64 -53 -20 14 219 7 56 -10 -170 -61 -6 37 -7 -28 31 147 208 -20 109 -88 25 -79 54 58
7568E8P2k76L5J12J4n7J23m8n2p9J92J90k55k36L02o3j7K24k93k3K93k64L7m7
$$ 58 130 -146 -111 1 15 -42 81 33 -19 -98 94 284 29 -207 95 32 15 239 -54 -77 216 -48 -11 -58
7592e8J99p5L1j37K08j40j41K05k72J88k5K3k79K27l6J5j85J30j59K13J84k24
$$ -58 141 66 97 -40 168 28 -113 92 -180 8 -17 6 -273 -46 -82 -67 -252 -122 -281 -68 116 -108
7614a08j64M47j74k20K95k7k16J38J35j14P9j07r1j17K02k14L90l0k25K03J3j53
$$ -108 -272 175 1 -219 76 49 -167 -29 106 -8 71 -36 -127 -244 -42 -256 134 104 -121 82 95 -58
7636e8J91k29K9p6J34N1j93K76j99J04L6m8j10m2r0L59p1N8l00K17j82R4J42k4
$$ -58 133 -96 -67 -143 -9 42 -151 125 -74 30 66 18 -92 -134 -224 135 64 122 -178 39 -143 -49 93 69
7660F9pq1m4J31j60p0K44k08L52k79lJ1J55j75m4J46J35p7j13J23l50L15j7j36
$$ 69 62 -19 -63 68 -92 -162 82 -126 226 -53 -56 -45 110 -65 -109 37 172 95 -18 105 -245 70 53 -83
7684h3l3K04j5J71l95K61M6k07M4o1j35Q4K8MJ58k76J80l4m5J96MJ3k02j02K04
$$ -83 -116 88 73 244 -151 110 156 -51 -7 -68 -203 -119 -91 -87 71 -205 -25 -59 -104 92 96 109 -93 -195 9
7709Il39L70N9j10K28j40p9J02n3q3l3J61L0q9J17p8m8j99K0J66L2J18j40k27
$$ 9 -330 40 99 -11 217 77 -2 100 47 -36 -69 92 122 33 150 72 24 -175 -155 11 43 161 21 -206
7733b06J77pR7r9J57j46j06O3j37J42j56Q8M1K8N1J49l5N1j54R4j09J34j36N9
$$ -206 -29 -36 61 -38 119 -27 -133 -70 -207 -65 -221 -133 -92 -64 -13 136 101 152 -2 92 -17 117 -19 40
7757D0R5j88J18j26M9j58M7L3J69N3m37L69m1j94K78j78P1P7j58j07K45j32J60
$$ 40 135 -53 65 -61 -12 -170 -123 -90 79 132 -305 64 23 -171 107 -71 0 77 -81 -188 57 -75 85
7780H5k13l6r0K66Q1l41J10P2K35j70J63j36P0J6j23k4k5k1J08j87K87k99J05
$$ 85 -128 -164 -254 12 93 -248 -138 -66 169 -1 162 26 96 112 -11 -35 -60 -81 27 -160 127 -172 -67
7803f7P2L3N2J19k22j4J06m9j0K7L9l92M49j40n1N6N6j2n4j07K32m21K02L61k69
$$ -67 5 38 90 209 -13 -27 79 30 20 47 86 -306 143 3 -48 8 64 52 -2 -109 123 -298 -96 265 -4
7828dO3j80J4L89j93Rk09q6R4k0K45k66n7L17k32O4O7k48R8L06k22j99K27O6N3
$$ -4 59 -121 -107 282 89 98 -111 -197 -103 -123 122 -144 -201 116 -116 -52 15 -233 -135 171 -51 -250 -23 43 96
7853I6j51j11J50Q7j78P9j41K54l13M2K12L0kq2K7J55k77J61j77QK46pj05R5q8
$$ 96 -55 -166 -16 71 -107 -28 -169 85 -228 -186 26 56 54 -28 -1 154 -123 38 -139 -131 115 108 3 98 10
7878A0M5O5l49J15J84k1j30J33r0q3J64PJ27k59o0M1N0L0J93j13O9R1L0k21j92
$$ 10 55 120 -229 -114 70 49 -81 52 -38 -121 43 50 177 -82 -142 -101 -51 -21 172 59 128 219 249 28 -164
7903a64J06J58N7j88N8J30l5o8q6k2j31K40k90K94k33J75M0M8j33K49j34j26R1
$$ -164 -58 100 157 -31 27 157 122 54 -32 -54 -185 55 -235 59 -174 1 41 89 -44 205 71 -55 36
7926C6P4r6j19nR8J68k21J46K91k81q3o4j15J00L7j5J10j07K27L8j67r3N8o2j18
$$ 36 110 14 -105 -110 -12 156 -65 81 372 91 8 -56 -171 -71 -34 -49 61 -46 181 219 52 -41 17 -45 -163
7951a63L33k87J23lj20J65K0Q7k21K72j75K63k78l9L6J07j44J06J9m6oj06J98
$$ -163 170 -117 6 3 -117 48 68 155 -66 206 31 294 16 -23 13 120 -24 82 101 55 49 -57 141
7974A41l08L11j15O1k14J57j7j95J95q5K34M5j07p1q0Q8nj38R7L48n06K53j78
$$ 141 -167 144 29 90 -124 33 16 -179 16 -69 165 210 103 32 -48 40 35 -103 -6 342 -164 89 -89
7997h9K63j63J9J92k90J17Q4n6o5o0O6J69j14K3l5j16L0k83J77J28Q7m05J36K74
$$ -89 174 11 30 222 -68 49 133 77 12 -48 18 187 73 96 61 -55 -25 -308 -131 -3 84 -321 -185 89
8021H9n1o7k0K01k54j8K03k61K43j35J73j18k07J31J19O0L5j82n0J97j71P0j33
$$ 89 38 -29 -49 152 -102 -120 83 -178 65 -70 103 -15 -222 -91 28 88 123 -59 -109 88 -83 -13 -146
8044a46J95J32m5l00L38k24j20J98j29L19M7l57J53l67J44K43j15L28j74j24Q7
$$ -146 49 181 136 -164 174 -50 -170 28 -101 218 265 -92 61 -306 -162 81 -34 294 120 -4 83
8065H3j31j78L36m4j11M0J29j30k8l1R9k41J65j22K86q4M0j63J11n0j40J83j6
$$ 83 -48 -226 110 66 -45 -5 124 -6 -34 -65 34 -207 -42 -164 122 38 78 -85 26 -24 -164 19 3
8088CK26m65K45o4qM0L1J40k65R9m4m2M3K10l4j39k1K34J2p0k07J31k36J64m4
$$ 3 229 -236 9 -55 -63 -23 8 148 -117 -18 -62 -104 -61 149 115 -24 -45 189 201 131 -76 55 -181 -17 -61
8113f1K03j04R4k66R3J62j87K68k04m4L4M1o4K47k17j09J04p8P6j27J97J27j33
$$ -61 142 38 132 -134 -41 121 -66 202 -2 -46 -12 29 -35 212 -5 -114 -10 -88 -12 -139 58 185 52
8136E2J46l41K88m8N3K5l05J31J25j45j14J09p4K64j31j15Q9J54j60j43m3ML14
$$ 52 198 -143 145 97 150 175 -130 1 126 -19 -133 -24 -98 166 35 -80 9 163 3 -140 -183 -179 135
8159A35k61j6J1K75j18j96K20j48J07m6J89j81j10K45O7j11M8j77O1l6J76k48
$$ 135 -126 -142 -131 144 26 -170 50 -98 9 -37 152 -29 -139 106 173 62 110 -67 -6 -42 134 -114
8181a14K41j28P3j82J22r0L27j66j16J00
$$ -114 127 -1 72 -110 12 -78 249 83 -33 67
8191F7
$$ Imaginary data points
##PAGE= N=2
##DATA TABLE= (X++(I..I)), XYDATA
0@%%%%%%%%%%%%%qJ6j6J6j6K4l2L2m0M8n6O6p4Q8j04J20j37J56j79K08k35K62
$$ 0 0 0 0 0 0 0 0 0 0 0 0 0 0 -8 8 -8 8 -8 16 -16 16 -24 24 -32 34 -40 48 -56 64 -73 83 -96 112 -123 139
35A39k94L32l76M19m68N23n80O45p12P84q72R67j064J170j290J421j565J726j905
$$ 139 -155 177 -199 220 -248 275 -305 340 -372 412 -460 507 -557 613 -677 744 -821 905 -1000
54a000K104k327K580k868L203l597M066m636N347o261P490r240J1951j6771K7934
$$ -1000 1104 -1223 1357 -1511 1692 -1905 2161 -2475 2872 -3389 4101 -5139 6812 -9959 17975
69A7975j05860l8376J51579L9003K4163q696k1359n2239l4203m2715q717M6378
$$ 17975 -87885 -126261 25318 64321 88484 79788 58429 6190 -28013 -70728 -79445 -33067
81c3067P1877J1770j3954m306j0187l6175k2121j5598m475L7523O6677J7757k9814
$$ -33067 38810 50580 36626 32320 22133 -14042 -36163 -51761 -56236 -18713 47964 65721 35907
94C5907k1343q444l3899l0312N486K3884K7920M0351K0711j5042j7326j1878l5217
$$ 35907 14564 6120 -27779 -58091 -52605 -28721 -801 39550 60261 45219 27893 16015 -19202
107a9202l6924K055K5633K3208L2279K5604j7748l4843r457q080k0904O058L4359
$$ -19202 -56126 -54071 -28438 -5230 27049 52653 34905 62 -9395 -17475 -38379 -32321 2038
120B038K0402M070M822r755k7103j6657o880j0523J0562L9866K9409O259L48j8516
$$ 2038 22440 26510 31332 21577 -5526 -22183 -29063 -39586 -29024 10842 40251 46510 46858 28342
134B8342m6056l3786m1J0395J6165L8165L5160j412k1265j8984k3522j9238N518
$$ 28342 -17714 -51500 -51541 -41146 -24981 13184 48344 46932 25667 6683 -16839 -36077 -30559
147c0559J9863J7680J8007R354j5115k4907j2138p008m543J6695K8056R935k652
$$ -30559 -10696 6984 24991 34345 19230 -5677 -17815 -24823 -29366 -12671 15385 25320 22668
160B2668J019j1494k6340j6073K171M618P426J8652J8011P279J781p199j8775
$$ 22668 23687 12193 -14147 -30220 -28049 -23431 -16005 2647 20658 27937 29718 22519 3744
173C744j4418n347n539Q78J5924J4932J234j554N81j0323j6270j223J0929P652
$$ 3744 -10674 -16021 -21560 -20682 -4758 10174 11408 9854 10435 112 -16158 -17381 -6452 1200
187A200P141Q678N89r864j3623j2001m684O043J2370J1743J2726J0300m223j8444
$$ 1200 8341 17019 17608 7744 -5879 -17880 -22564 -16521 -4151 7592 20318 30618 26395 7951
201G951j5759j0340j1033j130J5305J9431J1742L467k016j0021j4287q179K118
$$ 7951 -7808 -18148 -29181 -30311 -15006 4425 16167 19634 17618 7597 -6690 -14869 -12751
214a2751R358J1626O126j053l709r322j3404p261N857J0226Q373P898P075k319
$$ -12751 -3393 8233 14359 13306 9597 275 -13129 -20390 -14533 -4307 4066 11964 19039 16720
228A6720j2320j2289q165l480J631P408J2534J1408M416k118l960n558q121p382
$$ 16720 4400 -7889 -16054 -19534 -17903 -10495 2039 13447 17863 15745 11785 6227 -1894 -9276
242i276n62M353K281K028M109J863m662o044k231K759L788M447O039L979k448
$$ -9276 -9838 -5485 -3204 -1176 2933 4796 134 -5910 -8141 -5382 -1594 2853 8892 12871 10423
257A0423q269q469m908j299J257O441J1160P801J513j949m568q774j1440o753
$$ 10423 2154 -6315 -11223 -12522 -11265 -4824 6336 14137 15650 13701 9133 359 -11081 -17834
271a7834J698N660O621P510O234M10n146n668j217Q50L0J605L710J686k830n717
$$ -17834 -16136 -10476 -3855 3655 9889 10299 5153 -515 -1732 -882 -852 753 4463 6149 3319 -2398
287b398l011r51j747R98O817P506L681o50l581n050q553p330P13O152N434M438
$$ -2398 -5409 -6360 -8107 -7109 -292 7214 10895 10245 6664 1614 -6939 -14269 -13556 -7404 -1970 2468
303B468M379M414j001m458l460k040l075l550J17M625L657j350k342m5j231j978
$$ 2468 6847 11261 10260 5802 2342 302 -2773 -6323 -6206 -1581 2076 726 -1616 -1661 -2892 -4870
319d870J761N908N110o13l385j958l778m528j385J983L777L224K316M125L460
$$ -4870 -3109 2799 7909 7296 3911 1953 -1825 -6353 -7738 -5755 -1978 1246 3562 7687 11147
334A1147j965o649n427l208k389k056L181O927K151j343J274K236P7j147l15J200
$$ 11147 9182 2533 -2894 -6102 -8491 -10547 -7366 -439 1712 369 1643 3879 3956 2809 2494 3694
350C694r92l001j136O04q1j743k172J350L530Q66J412L659j26n044m761q17M84
$$ 3694 2702 -299 -1435 -831 -912 -2655 -4827 -3477 53 919 2331 5990 5864 820 -3941 -4758 -4274
367d274j346M86M213K806J373J775J743R82k158n079l886p98p48p59J824L764
$$ -4274 -5620 -5134 -921 1885 3258 5033 6776 7758 5600 521 -3365 -4163 -4911 -5670 -3846 -82
383h2J251k147K93K531n54j508J592J102r92j401k3N8j396j923n1J701L458K345
$$ -82 1169 -978 -685 1846 1292 -216 1376 2478 1486 85 62 120 -1276 -3199 -3250 -1549 1909 4254
401D254L29J321m54n400o161q83P34o38J938N530L648n31O50J088j369l045k105
$$ 4254 4583 5904 5450 50 -6111 -6994 -6260 -6898 -4960 570 4218 3687 4337 5425 4056 1011 -1094
418a094p02N87Q73J49q3K8j130k491J17M302K756p25M93J045l349n403j348J583
$$ -1094 -1796 -1209 -336 -187 -270 -242 -1372 -3863 -3746 556 3312 2587 3080 4125 776 -4627 -5975 -4392
436d392N83J087L698M120J766o72k113k257k459l055j639K042K705J45j201R96
$$ -4392 -3809 -2722 976 5096 6862 6190 4077 1820 -639 -3694 -5333 -3291 -586 -441 -1642 -646
452f46J238j547o36L034K026r35j353P58m95k888k356j22J666J364K003K246K581
$$ -646 592 -955 -1591 1443 3469 2534 1181 1939 1444 -1444 -3800 -3922 -2256 -892 1111 3357 5938
469E938L29l956m091r84j093k066J017L847K100o16L54K025l93k167J90J010M29
$$ 5938 6267 2311 -1780 -2764 -3857 -5923 -4906 -1059 1041 425 779 2804 2411 244 434 1444 1873
486A873n00q99n08p45j878j031J576K239J004q6O26J651j680l121o64j14j056
$$ 1873 1373 474 -34 -779 -2657 -3688 -2112 127 1131 1045 1671 3322 1642 -1479 -2143 -2257 -3313
503c313q19K296L438J461N49P83p17k214k290o84J54M29l31m11M88K91j397n7
$$ -3313 -4132 -1836 1602 3063 3612 4395 3678 1464 -826 -1510 -1356 -927 -1258 -1669 -1181 -890 -2287 -2344
521b344J972K345r9k17J659m22l069j578P0k08n25J380K314R81K87q1q12j108
$$ -2344 -372 1973 1874 1657 3316 2894 -175 -1753 -1683 -1891 -2416 -1036 1278 2259 2546 2465 1653 545
539E45j007k083j074J167O28mJ359K676q0j945L48J507p59m80J226M29k476j965
$$ 545 -462 -2545 -3619 -2452 -1824 -1828 -469 2207 2127 182 530 2037 1278 798 2024 2453 -23 -1988
557a988q18Q2K84J569J335J114J340n83k076n80K16k103j598K089J866o18J161
$$ -1988 -2806 -2724 -2440 -871 464 1578 2918 2335 259 -321 -105 -2208 -3806 -1717 149 -469 692
574F92K477K06k171r99M85p26r99N92J96j39J80j103j235N73J002k4J227L437
$$ 692 3169 3375 1204 205 690 -36 -1035 -443 -247 -386 -206 -1309 -2544 -1971 -969 -993 234 3671
592C671O82k266j743m57k827j569K312L004J228L83M37j451j589q00o30j45J266
$$ 3671 4353 2087 344 -113 -2940 -4509 -2197 807 2035 2418 2855 1404 -185 -985 -1615 -1760 -494
609d94O74j292P37J407j476j889J164J776j56P63K338J6k811j302o10j512k36
$$ -494 180 -1112 -375 1032 -444 -2333 -1169 607 451 1214 3552 3568 757 -545 -1155 -2667 -2903
626b903J234P23Q11J951K01q14K44k94k836j816J559J500p5J606K064j164k470
$$ -2903 -1669 -946 -135 1816 2017 1203 1447 1153 -1683 -3499 -1940 -440 -515 1091 3155 1991 -479
643d79L26j58p64J069J073J64k94J90j565k080o1r2o39K289M028P81m82j86j903
$$ -479 -153 -311 -1075 -6 1067 1231 937 1127 -438 -2518 -2579 -2671 -3310 -1021 3007 3788 3306 3120 1217
662A217l644j839J394J377J492K379J730j234j803j578k264n69J326J756J553
$$ 1217 -2427 -4266 -2872 -1495 -3 2376 4106 2872 1069 -509 -2773 -3342 -2016 -260 1293
677A293J665K52k941k874o84N1N88L150L480M73j080j158k085k727r60J96J290
$$ 1293 2958 3210 269 -2605 -3289 -3238 -2650 500 3980 4453 3373 2215 130 -2597 -3557 -3361 -2071
694b071J778K017P50j84j75j760k291q20J265Q4Q39K249R57j229r17m56r24j256
$$ -2071 -293 1724 2474 2290 2115 355 -1936 -2756 -1491 -1407 -568 1681 2638 1409 492 36 -888 -2144
712b144N60J397J439J430K58j270j921j982j811l4K164K441J659J253P00j843
$$ -2144 -1584 -187 1252 2682 2940 1670 -251 -2233 -4044 -4078 -1914 527 2186 3439 4139 2296
728B296k984j636n88m8J342K385K006N50p99k074k176j462J61J223J979K601K15
$$ 2296 -688 -2324 -2912 -2960 -1618 767 2773 3323 2524 450 -1726 -3188 -3027 -1804 175 2776 2991
745B991j503j455j507j790M0J659K387J256J183K7j129k126j826j091J11J605
$$ 2991 1488 33 -1474 -3264 -3224 -1565 822 2078 3261 3288 2159 33 -1793 -2884 -2773 -1168
761a168J419J188N57m35j407j272j46K53K7N53J266j1p5Q6k37r97n25k10J94J188
$$ -1168 251 1439 1996 1561 154 -1118 -1264 -1011 -984 -431 835 824 749 835 598 -399 -924 -1134 -940 248
781B48P06M97n3l46j057j826l95M51M23J082J447O31J22q05p85p26j248j8R01
$$ 248 954 1451 1398 1052 -5 -1831 -2226 -1775 -1352 -270 1177 1808 1930 1125 340 -386 -1634 -1652 -751
800g51J005J100K93l92j036r45q69l00J288J165L67L10m1q78j334n84K08M05Q08
$$ -751 254 1354 1647 1255 219 -726 -1595 -1895 -607 558 925 1235 1194 316 -1018 -1602 -1394 -989 -181
819a81J147R07l7p10j085j140k68jM01Q84Q59K10o38q5m20n69k62L75P99K0K71
$$ -181 966 1873 1836 1126 41 -1099 -1367 -1368 -967 -83 776 986 348 263 -157 -726 -988 -613 186 206 477
840D77K22j02l64n77j36j09M25L81L60M51Mo87o40n05k27k81O37P74N80J49J79
$$ 477 699 597 233 -344 -480 -589 -164 217 577 1028 1032 345 -295 -800 -1027 -1308 -671 103 683 832 1011
861A011j83p43n48m21J19M27P01K04J80j32o68o33k30J93L17L39O51K25j22n34
$$ 1011 828 85 -463 -884 -765 -338 363 567 747 615 -53 -686 -916 -723 -406 -67 584 809 687 153
881A53p13p3j56K17M83R06J76j65J0o22l79o52L7L54M02M63J30J0l04o92j77N6
$$ 153 -560 -633 -789 -572 -89 817 993 828 838 216 -163 -815 -778 -424 -22 441 571 581 277 -415 -592 -536
903e36K45q8M98M07j00j01m10k78m7j60L12N11Q3L98r8m51l35l65j27kL74L42
$$ -536 -291 -379 119 526 426 325 -85 -363 -410 -570 -258 253 336 734 636 185 -150 -515 -642 -644 -270 72
925G2K58K93k41Q5l93j90k42J88J34K21J35m0M4l78j85k34j9L56K60K32mo3k22
$$ 72 330 623 382 467 74 -116 -358 -170 -36 185 320 280 324 -54 -239 -473 -492 -136 124 356 352 289 67
948F7k28m85M60k28K81R5M12J58m5p0n44j59k27L64k16M35J00J05k34j55K0k30
$$ 67 -161 -646 -186 -414 -133 -38 374 532 487 417 -127 -286 -513 -149 -365 70 170 275 41 -114 -94 -324
970c24m4K04L51j1K17j85p3q4m99J40J08K9K75M8K13j70l17J17j95l80K55J62
$$ -324 -368 -164 187 176 393 208 135 51 -448 -308 -200 -171 104 152 365 195 -122 -5 -200 -580 -325 -163
992a63N8J78J40k32K3J73k34n0J0J7P5J01m0j2q7j12r9J44J21O7Q5Rr2j95K8r
$$ -163 -105 73 213 -19 4 177 -57 -107 -97 -80 -5 96 56 44 -43 -155 -254 -110 11 78 163 172 80 -115 -87 -96
1018i6q8M0k4M46r4j06j07L37j42j87k08K35k27K97J51k33P1k2j62n2j5L31l04
$$ -96 -184 -144 -168 278 184 78 -29 308 166 -21 -229 6 -221 76 227 -6 65 43 -119 -171 -186 145 -159
1041a59J50K61n17M65k38P4k60K47R4J11n1l9q2n4l6k89L96j24KK71j35J51j59
$$ -159 -9 252 -265 200 -38 36 -224 23 117 228 177 138 56 2 -34 -323 73 -51 -49 222 87 238 79
1064G9m4p3q5n0J72j98J04K11k41N4q9kK08j4m2O5J37k01j28J18n8N1l03L23j97
$$ 79 35 -38 -123 -173 -1 -199 -95 116 -125 -71 -160 -162 46 32 -10 55 192 -9 -137 -19 -77 -26 -329 -6 -203
1089b03L25l41L85j41j66J97j20J81k80K70n4m6k61J60N9j85L21l2J00k86J65
$$ -203 122 -219 166 25 -141 56 -64 117 -163 107 53 7 -254 -94 -35 -220 101 69 169 -117 48
1110D8R3j75j47L6L0J62j09L3K27q0k62J25J02j55r9J21r9K48O2r1M2k25J42P
$$ 48 141 -34 -181 -145 -115 47 -62 -29 198 118 -144 -19 83 -72 -171 -50 -149 99 161 70 112 -113 29 36
1134C6k5K17m00J20L5l0N0j2J17K0j93Q0J40P6k30k07Q5M9J42q4j10J34q4K10
$$ 36 11 228 -172 -52 -17 -47 3 -9 108 128 -65 15 155 231 1 -206 -121 -72 70 -14 -124 10 -74 136
1158A36n9r1J2j90K05KNP6j25o5P9J38j12Q2k07o5J91o0J66K6J44m18J09q7K20
$$ 136 77 -14 -2 -192 13 15 20 96 -29 -94 -15 123 11 93 -114 -179 12 -48 118 144 288 -130 -21 -108 112
1183A12j72K41j51j29N0K5P3L5k41K39k32j5P7mR1j88O5j22J88K79j11rj63k64
$$ 112 -60 181 30 -99 -49 -24 49 84 -157 82 -150 -165 -88 -92 -1 -189 -124 -246 -58 221 110 101 -62 -326
1207c26M07k8k03K2J25J75m9j54m0J01l4p1J90m6P4R6Mk22l7M3j77O6J87J89l30
$$ -326 81 53 -150 -128 -3 172 123 -31 -71 30 -4 -75 115 69 143 239 243 21 -16 27 -150 -84 103 292 -38
1232c8J37P3M1l99J50j08pJ84o2PQ6n6pL7k53J62R7j8J56L0j42ml14J36J6J57
$$ -38 99 172 213 -186 -36 -144 -151 33 -29 -22 64 8 1 38 -215 -53 44 26 182 212 70 66 -248 -112 -96 61
1258F1j95J64o8K58n7L1n38K98o5J47k50L13J0Lkk5k52J52J8K23q6k10Q8J36j24
$$ 61 -134 30 -38 220 163 194 -344 -46 -111 36 -214 99 109 112 110 85 -167 -15 3 226 140 -70 18 154 30
1283C0k81J45L0M6j45K15J19q0m1L6l80n2K00K9K47K7P5l02O5r0K17j59k3J83
$$ 30 -251 -106 -76 -30 -175 40 159 79 38 74 -306 -358 -158 -129 118 145 220 -82 -17 -107 110 -49 -72 111
1307A11M8j02J3j92J2j24J63J02l0L3o2K07o4j10j81n1K08J4j46K17O3J0k25P3
$$ 111 159 57 70 -122 -110 -234 -71 31 1 34 -28 179 115 5 -176 -227 -19 -5 -151 66 129 139 -86 -13
1331a3N1k8l71L79K09p3n8j88Q9j54K6K3M81l32K95j74r6p9l14J43J41J46Pq8
$$ -13 38 10 -361 18 227 154 96 -92 -3 -157 -131 -108 373 41 336 162 66 -13 -327 -184 -43 103 110 22
1355B2J38n1j65o2J6J31j21J64J2K77l59j07N2nj23L47K5N4Jk10l55L19j92J12
$$ 22 160 109 -56 -118 -102 29 -92 72 84 361 2 -105 -53 -58 -181 166 191 245 246 36 -319 0 -192 -80
1379h0k11K61KJ30K27n2l94m0o8P3J01o7L78m1K78k73l80R0l0q4K21P9M8j59j88
$$ -80 -291 -30 -28 102 329 277 -117 -157 -225 -152 -51 -118 260 219 497 224 -156 -66 -96 -180 41 120 168 9 -179
1404a79K74k09j3oK05j02L05P0j80m3l92J9J3L15N2j0J62k27R0l41q4O5L40j44
$$ -179 95 -114 -127 -133 72 -30 275 345 165 122 -270 -251 -238 77 129 119 281 54 144 -197 -281 -216 124 -20
1428b0J41j02J89k87O4n4j95K06J20L94m04o2L63l99J0q0K4PP8m9j4J64o4J5n1
$$ -20 121 19 208 -79 -15 -69 -264 -58 62 456 52 -10 353 -46 -36 -116 -92 -85 -7 -56 -70 94 30 45 -6
1453fL5j59l9J41J76J07l38R0k15M2L5PJ08K07K9j68L63m85j40M9j38RM13n6Q2
$$ -6 29 -130 -169 -28 148 255 -83 7 -208 -166 -131 -124 -16 191 220 52 415 -70 -210 -161 -299 -290 123 67 149
1478A49P7L7k91j72j35L33j46J50j0k7O4q9R2j69j47R0K30%O0j47J62j46q9J7
$$ 149 226 263 -28 -200 -335 -2 -148 2 -8 -35 29 -60 32 -137 -284 -194 36 36 96 -51 111 -35 -124 -107
1502a07K23p2J05J26K3p9k08m62L00J21j58M6P0K78j70n2Q1j9J30q1k01J95J75
$$ -107 116 44 149 275 298 219 11 -451 -151 -30 -188 -142 -72 206 36 -16 65 46 176 95 -106 89 264
1525B64R2n09J64Kr9Q8k91K19J56M4J39j33J4l06P1p4Q4K6J00RK11k60j19M8J20
$$ 264 356 -153 11 13 -86 2 -289 -70 86 130 269 136 150 -156 -85 -159 -75 -49 51 60 271 11 -108 -60 60
1550F0j09J90k83R5N7j23j0j0j00J02K01J70k5j27j38J30k51j54L66j61MP0K42
$$ 60 -49 141 -142 -47 10 -113 -123 -133 -233 -131 70 240 215 88 -50 80 -171 -325 41 -120 -116 -46 196
1573A96j29J99l38n0j4M5R2o3lJ11j55J98o9n6J09l14M44l20J91J38n3l24K52
$$ 196 67 266 -72 -122 -136 -91 1 -62 -65 46 -109 89 20 -36 73 -241 203 -117 74 212 159 -165 87
1596H7l09K15o5J63j20L12j01j87R6j30j8K2O1k6K61k43QK89m16M9j38K09k54
$$ 87 -222 -7 -72 91 -29 283 182 -5 91 -39 -57 -35 26 0 261 18 26 315 -101 -52 -190 19 -235
1619b35L10J08l4j90j04j8J30j52K28p4J70L1K1j44r4p0j29K17l8k5K7K04j78
$$ -235 75 183 149 -41 -145 -163 -33 -185 43 -31 139 170 191 47 -47 -117 -246 -29 -67 -92 -65 139 -39
1642c9l3K7K3m8k14L61k7j14K24j06Kk97L97l3j1j54J78p4l3n1K72k71N1n2J64
$$ -39 -72 -45 -22 -70 -284 77 50 -64 160 54 56 -241 156 123 112 -42 136 62 29 -22 250 -21 30 -22 142
1667A42q1J16j44j41J7j60J83K57j02J12l4j19J93k56L3n8P2R4J9p7K55k73J55
$$ 142 61 177 33 -108 -91 -251 -68 189 87 199 165 46 239 -17 16 -42 30 124 143 66 321 48 203
1690B03k77k5j3J00J1q3R5N7j96J34j20N0K17L9l10K71q7j83L78l86J25pj83R7
$$ 203 -74 -99 -112 -12 -1 -84 11 68 -128 6 -114 -64 153 192 -118 153 66 -117 261 -125 0 -7 -190 -93
1714i3J42k76K89j60J29j16J74j23K5j72J04J65k05L23j29p8J19k14%J43J8L77
$$ -93 49 -227 62 -98 31 -85 89 -34 -9 -181 -77 88 -117 206 77 -1 118 -96 -96 47 65 442
1736D42m89J7J26n2j31m8PJ21K3PR8j77J09m2k18J0J74k1P3kJ70j75l11M52j87
$$ 442 -47 -30 96 44 -87 -135 -128 -7 16 23 121 -56 53 11 -207 -197 -23 -44 29 27 197 22 -289 163 -24
1761b4K19k86J13L86l30j51q6M6L2K07l49J40K23k38L81l02M54m75P1J11j96J41
$$ -24 195 -91 22 408 78 -73 -159 -113 -81 126 -223 -83 140 -98 283 -19 435 -40 31 142 -54 87
1783H7k07J55qL9p5J34j10j3J98o9l49J62q1J9K26k5l44M47k32J03J53k20r4N8
$$ 87 -120 35 27 66 -9 125 15 2 200 131 -218 -56 -137 -118 108 83 -261 186 -46 57 210 -10 -104 -46
1807d6L39j67k21K37k04n5J6J09k39K04m2R0R7kk21J38K1o9m1mJ09k5N1j33J31
$$ -46 293 126 -95 142 -62 -117 -101 8 -231 -27 -69 21 118 116 -105 33 54 -15 -56 -60 49 24 75 -58 73
1832G3l2o9N9L82n85l2J63J46J5k97K03J17m9j25P4J26j09M3Q0Qj99M1j11J85
$$ 73 41 -28 31 413 -172 -204 -41 105 120 -177 26 143 94 -31 43 169 60 103 183 191 -8 33 -78 107
1856A07o4K4j89J42j77L07m0j19J3j5K5K7j11m3L07k82L30j98Rk53L8J16q8rJ49
$$ 107 43 67 -122 20 -157 150 110 -9 4 -11 14 41 -70 -113 194 -88 242 44 53 -200 -162 -46 -134 -143 6
1881FJ24k82J78j27K16p9j12J83j15J10J25n1j9l01J10R4m7J46n0o5KK9j80q1
$$ 6 130 -152 26 -101 115 36 -76 107 -8 102 227 176 157 -144 -34 60 13 159 109 44 46 75 -105 -186
1905a86J71j38N33m19M4M8N7k21MR6m5j6N2j9j5Q2J1%j74J20j4j18L18q9k48K05
$$ -186 -15 -153 380 -39 5 53 110 -111 -107 -11 -56 -72 -20 -39 -54 28 39 39 -135 -15 -29 -147 171 82 -166 39
1931C9J7l3j01o6K06O0n2j37J52k02R9k32K46l06J94J94j2n7L2j86K5J00m9J94
$$ 39 56 23 -78 -144 62 122 70 -67 85 -117 -18 -250 -4 -310 -116 78 66 9 41 -145 -120 -20 -69 125
1955A25j20K97k53l2j33o6K66m8j34K87j47n2j42Lm8J26Q4J65j00p4r1j4mK0Q9
$$ 125 5 302 49 17 -116 -182 84 36 -98 189 42 -10 -152 -149 -197 -71 13 178 78 4 -87 -101 -105 -85 4
1980Do9O3M2K00k09N9M4k56m4K77k75PK13r3N5l6OO1p9O4l2J32m4j15J47MJ35
$$ 4 -65 -2 40 240 31 90 134 -122 -166 111 -164 -157 56 -37 18 -18 -12 49 -30 34 2 134 90 -25 122 126 261
2007B61l55j3L7j31M15k81J17J83l20J54j49J71k60J77J06j56l8O8o5j02J36P9
$$ 261 -94 -107 -70 -201 214 -67 50 233 -87 67 -82 89 -171 6 112 -44 -82 -14 -79 -181 -45 34
2029C4O1j36J90k94J91M4Kj19p4o4M03l46j35K50j41J77k0m2J97k51j9J53n0L4
$$ 34 95 -41 149 -145 46 90 92 -27 -101 -165 238 -108 -243 7 -134 43 23 -19 178 -73 -92 61 11 45
2053D5J60j87k4M3k41J23j29L12O0j61L5j5m8q3J35J10lj19L6j81q7K11j05k2
$$ 45 205 18 -6 37 -204 -81 -210 102 162 1 36 21 -27 -110 25 135 132 13 49 -132 -219 -8 -113 -135
2077a35J01Q6L8L6j69R2j52L8J8J16j73k9J16n0J29Q1J05j39J25m3k32Oj7k4P9
$$ -135 -34 52 90 126 -43 49 -103 -65 -47 69 -104 -133 -17 -67 62 143 248 109 234 191 -41 -35 -52 -76 3
2102CJ3MN5j8l25M17k5k39J04J63p7p3k6q7J45n3K42l17K12L2j66O3j66J88l5
$$ 3 16 20 75 57 -268 149 124 -115 -11 152 75 2 -24 -111 34 -19 223 -94 118 150 -16 47 -119 69 34
2127C4L9k45J55j61J37q8K54Q1j64N4K02j32l19j3L11j42m0q3J09k3k29K75k3
$$ 34 73 -172 -17 -178 -41 -129 125 206 42 96 298 166 -153 -166 145 3 -37 -120 -11 -34 -263 12 -11
2150a1P0j52k6J12L0j96J29J37K4k25o2K84p6M8k53K47k28O6K93k66R7k35J05
$$ -11 59 -93 -119 -7 23 -173 -44 93 117 -108 -170 114 38 86 -167 80 -148 -82 211 -55 42 -193 -88
2173h8P6k66M80j88J45k94M29n04P6j1K14r2L3rj55N6J12P7k7P8k94O9o7K61M2
$$ -88 -12 -278 202 14 159 -135 294 -210 -134 -145 69 -23 10 1 -154 -98 14 91 64 142 -152 -83 -150 111 153
2198A53j20n1QJ08j7k73J60J88j23j38J34l6MN6j83K55m7Q4j36j68K27o7m1J93
$$ 153 33 -18 -10 98 81 -192 -32 156 33 -105 29 -7 -3 53 -130 125 78 162 26 -142 85 18 -23 170
2222A70k21p8m9NK74k0l2K64j68j00j51p8K11k8m9R9n4K34k84lM3KJ12j21k53
$$ 170 -51 -129 -178 -173 101 81 49 313 145 45 -106 -184 27 -1 -50 49 -5 229 -55 -58 -15 -13 99 -22 -275
2247b75M61k49K09j34K9j81J46j59O5K34k64K04j62r6M40j91n1p4L3m1K6j24O2
$$ -275 186 -63 146 12 41 -140 6 -153 -88 146 -118 86 -76 -172 268 77 26 -48 -15 -56 -30 -154 -92
2270i2J77N3j18k58K29j48j6J85R1Ko9j09N8R0j05pP2j69J55J34l37K35k22J31
$$ -92 85 138 20 -238 -9 -157 -173 12 103 105 36 -73 -15 75 -30 -37 35 -134 21 155 -182 53 -169 -38
2294c8N7M1M1j08k3j45L64o6j87O1K39j54R7j69k35K16Rr4m6K6K10n2l1j8N9k15
$$ -38 19 60 101 -7 -30 -175 189 123 -64 -3 236 82 179 10 -225 -9 0 -94 -140 -114 96 44 13 -5 54 -161
2320a61M47k42k66K58j08J22j01L8M3O2J0J35l39M6J7k0j06R9lN2j69J88J47m2
$$ -161 286 44 -222 36 -72 50 -51 -13 30 92 102 237 -102 -56 -39 -59 -165 -66 -69 -17 -186 2 149 107
2344A07k42MJ98l35K37K18l71K17m2j26R5J19j41o5K63p3Qm7jj78o0J95K10l25
$$ 107 -135 -131 67 -268 -31 187 -184 33 -9 -135 -40 79 -62 -127 136 63 71 24 23 -155 -215 -20 190 -135
2368a35J02L7k5r8J30J40r9j95K61j90J6J53r8j11K72J4k48l6k01L80l3K4j73
$$ -135 -33 4 -21 -119 11 151 52 -143 118 -72 -56 97 -1 -112 160 174 -74 -110 -311 69 36 60 -113
2391a13J42j53J00j45nL98k31J08j83J99j29l7K63q0O8Nl51K52j13PQ1j29K61
$$ -113 29 -124 -24 -169 -174 224 -7 101 -82 117 -12 -49 214 134 202 207 -144 108 -5 2 83 -46 215
2414B15j96J66l48J11j45M2K44j61J5K48j30j37J3j00J12k8K57l17K5J66j96K04
$$ 215 19 185 -163 -52 -197 -155 89 -72 -57 191 61 -76 -63 -163 -51 -79 178 -139 -114 52 -144 60
2436F0k63j45L49j58L41r4o1j02P3J39l04R1J62Q4k47J0O7L6K8J99k31J1nN1Q5
$$ 60 -203 -348 1 -157 184 90 29 -73 0 139 -165 -74 88 172 -75 -65 2 38 66 265 34 45 40 91 176
2461A76k43L2o8J21j54K06j16J72j13O5l2j31J37q8L8j50K55r6M4p4j66J75o4
$$ 176 -67 -35 -103 18 -136 70 -46 126 13 78 46 -85 52 -36 2 -148 107 11 55 -19 -185 -10 -74
2484g4q8J67J84k20p1j9j5J05N4o8J54j56N7k21K13J88j68Q1k01L04l18J51J8
$$ -74 -162 5 189 -31 -102 -121 -136 -31 23 -45 109 -47 10 -211 2 190 22 103 -98 206 -112 39 57
2507E7j22M4m1M6l05J70J74j01l6j3J63m7K3pM9r1j14J71K6k6k01J25K16q6K7
$$ 57 -65 -21 -62 -16 -321 -151 23 -78 -114 -127 36 -11 12 5 54 -37 -151 20 46 20 -181 -56 160 74 101
2532A01o2p8J38J82j49k26J2JM3K64m95K53N7j51L8k7K16k60K36k47J44j37J64
$$ 101 39 -39 99 281 132 -94 -82 -81 -38 226 -269 -16 41 -110 -72 -99 117 -143 93 -154 -10 -147 17
2555A7om7K34k57L2J35L0j67O0j4k14K35j55K11j42rK43r6k7%j8r1L2O9J4p9J81
$$ 17 11 -36 198 -59 -27 108 138 -29 31 17 -197 38 -117 94 -48 -57 186 90 63 63 45 -46 -14 55 69 -10 171
2582A71l9k90P4JP9N5k34J52K95m1q0n5j02M9J73j96m6J46k02K9J17j80N1J39
$$ 171 132 -158 -84 -83 -4 51 -183 -31 264 223 143 88 -14 35 208 12 -34 112 -90 -61 56 -124 -73 66
2606F6k35j46L13j26R9J20R3ok22Q3KPj74J04J98j35p2q4K14l43K05m5j40J59
$$ 66 -169 -315 -2 -128 -29 91 184 178 -44 39 41 48 -126 -22 176 41 -31 -115 99 -244 -39 -84 -224 -65
2630f5L6o5K24q8l5QP8k36K71j68O5j32J01J67m1j91P5J35k32rk5M8P3j40r0K00
$$ -65 -29 -94 130 42 7 15 93 -143 128 -40 25 -107 -6 161 120 -71 4 139 -93 -102 -127 -79 -6 -146 -236 -36
2656c6j1PnK23k42oK0J74J0k41Q4J52j44k08J44J75j02J7j24J69p2MR9k47K43
$$ -36 -47 -40 -45 178 -64 -70 -50 124 134 -107 -23 129 -15 -223 -79 96 -6 11 -113 56 -16 -12 87 -160 83
2681H3l4k0J42j42l9J10j51O3L4j30J31r2J01k63J38l9J86P7L3j38l0j48J46j34
$$ 83 49 29 171 29 -10 100 -51 12 46 -84 47 -45 56 -207 -69 -108 78 155 188 50 20 -128 18 -116
2705a16L2J98j42Q2r6jJ09j07n8nK2J06M3r0j00L46l59p6N66l18J6j14K27k86
$$ -116 -84 114 -28 54 -42 -43 66 -41 -99 -104 -82 24 67 -23 -123 223 -136 -212 354 36 52 -62 165 -121
2729a21J89N0qk43J03J39M7k99J44j13M0K21m5j71K29k40L3P6q9M0J1K37k14K38
$$ -121 68 118 110 -133 -30 109 156 -143 1 -112 -72 149 104 -67 162 -78 -45 31 -58 -18 -7 230 16 254
2753B54l33J70j50p6o8Q6N8k5J35k29K56m7o5K7R1J07j96j90J47n1K3L44k21j19
$$ 254 -79 91 -59 -135 -203 -117 -59 -84 51 -178 78 31 -34 -7 84 191 -5 -195 -48 -99 -76 268 47 -72
2777g2J03L4J58k75j0K18j63Km4nK7J94k16K9O0O4k25K24P0k31Q6j30J77M6j46
$$ -72 31 65 223 -52 -62 156 -7 -5 -49 -54 -27 167 -49 -20 40 104 -121 103 173 -58 28 -102 75 121 -25
2802b5M5m7O2l1j12L41r9j0j59K98j74q2j11l8L38k07J14J8j53q3L47m06O6rJ9
$$ -25 20 -27 35 4 -108 233 134 124 -35 263 89 7 -104 -142 196 -11 103 121 -32 -115 232 -174 -108 -117 -98
2827i8J07p8Q4RJ02Jm8P9qJ57m84K02J41k16J03j9j24N9K66j05k83K30r5R3J33
$$ -98 9 -69 15 24 126 127 79 158 150 307 -177 25 166 -50 53 34 -90 -31 235 130 -153 77 -18 75 208
2852B08k07M0J27j41J3J22k80J18n3Q7jj12J98k08N5l4J99k14J80k57K52k22J27
$$ 208 1 41 168 27 40 162 -118 0 -53 34 33 -79 119 -89 -34 -68 131 -83 97 -160 92 -130 -3
2875cP3Q6j82K17k40L00j93k08J33J20j57q8J36j19J70j58K04j95J42j47N9L13
$$ -3 70 156 -26 191 -49 251 58 -150 -17 103 -54 -142 -6 -125 45 -113 91 -104 38 -109 -50 263
2897B63l26J15r3J14qj36m3j3K61j10j2j53L11p3j96J87o8J03R1r4j75k2m8o0
$$ 263 -63 52 -41 73 65 -71 -114 -127 134 24 12 -141 170 97 -99 88 20 123 214 120 -55 -77 -125 -185
2921a85J90m1q7pJ84j71L3Q6j42J25q5K86j55K0k23J62k08N3K1J92r8P2j00J72
$$ -185 5 -36 -123 -130 54 -117 -84 2 -140 -15 -100 186 31 51 -172 -10 -218 -165 -144 48 -50 22 -78 94
2945I4o9j1k39M00l16J89J23l21L85k87q1J29j9j25J88Q9j93M0J79l34Q1O3J36
$$ 94 25 14 -225 175 -141 48 171 -150 235 -52 -133 -4 -23 -148 40 129 -64 -24 155 -179 -98 -35 101
2968A01rj45N1q1P0L6J13r9m2r1L03k24QM2J70k54K00j2j11J61j54J32j38n1o8
$$ 101 92 -53 -2 -83 -13 23 136 37 -5 -96 207 -17 -9 33 203 -51 149 137 26 187 33 165 27 -24 -92
2993i2L01n2R9l09Q2J27n7l3Q3j59pK82m13J71m6J77k81M8K00o3O5p6N5p6k40
$$ -92 209 157 256 -53 29 156 99 66 149 -10 -17 265 -148 23 -23 154 -127 -79 121 58 123 47 102 26 -214
3018b14K76l9l4n3J40K3k25j9J86j64J77k3j65Q7l2J51j74J27j02J73j51n0L3
$$ -214 62 23 -11 -64 76 99 -126 -145 41 -123 54 31 -134 -47 -79 72 -102 25 -77 96 -55 -105 -72
3041g2J99n8k29L06k34K37j44Jk04P6L8J18r0K2j7Q1o0J06j57n7L26p6o2j34K44
$$ -72 127 69 -160 146 -88 149 5 6 -198 -122 -84 34 -56 -34 -51 30 -30 76 -81 -138 188 112 50 -84 160
3066A60k18j70J63J41r9j81J54N2o5j09J13r6J72m1l7K7J4l4j8P1K11l40J95J3
$$ 160 -58 -228 -65 76 -23 -204 -50 2 -63 -172 -59 -155 17 -24 -61 -34 -20 -54 -72 -1 210 -130 65 78
3090G8q6Q4j94L19l3K7o2j64l5M9K20k28L6o8R9p6j78J97j50J32Q9Mj3j8J54j69
$$ 78 -8 76 -118 201 168 195 133 -31 -66 -17 203 -25 11 -57 42 -34 -212 -15 -165 -33 56 60 47 29 183 14
3116A4O4J13l30J06M6J06k43J71L6mj98J4R4j93R8R4M8j9J27j23r2J35K6p1R5
$$ 14 78 191 -139 -33 13 119 -124 47 83 79 -119 -105 -11 -204 -106 -12 36 17 144 21 -71 64 90 19 114
3141A14k74J73l9q4J12r1L5n8R3J35k94K9P1L4j5K65j40j7k81K07J49m04J41J10
$$ 114 -160 13 -26 -110 2 -89 -54 -112 -19 116 -178 -149 -78 -44 -59 206 66 49 -232 -25 124 -280 -139 -29
3165b9Q6j03P2M3j70K7M9J67j69O0R7o8k66J93K9%O0mj59K20P8k63J62l09L26
$$ -29 57 -46 26 69 -101 -74 -25 142 -27 33 130 62 -204 -11 18 18 78 74 -85 135 213 -50 112 -197 129
3190A29l3k65J61oQ5K5K7k21K4J03P6r8p4P9q7J94j3k13K17j70j00K42j67j26
$$ 129 96 -169 -8 -14 71 96 123 -98 -74 29 105 7 -67 12 -75 119 106 -107 110 -60 -160 82 -85 -211
3214b11L08l1q8M3j27L6q8N3J84j86K43m5j3q1j33q4J61r6K89l1m5K04l55J30
$$ -211 97 66 -22 21 -106 -70 -158 -105 79 -107 136 91 78 -3 -136 -220 -59 -155 134 103 58 262 -93 37
3238C7o5m6L8j9J04k29J05K4J16J15j66J39k48L4J95o1Q7j73Q4K0j06J87p3j72
$$ 37 -28 -74 -36 -55 49 -180 -75 -51 65 180 14 153 -95 -61 134 73 160 -13 71 91 -15 172 99 -73
3262g3J22n2j21m3K5J02L7NL9M9j8j28J68L9r5j7k24jJ97k79K98j6j1p4j4j37
$$ -73 49 -3 -124 -167 -142 -40 -3 2 41 90 72 -56 112 151 56 39 -185 -186 11 -268 30 14 3 -71 -85 -222
3288b22K81p2p1K82j67k98M32j38j57P6L20m04K62q5r0K85j08n7j05K6NOj14l3
$$ -222 59 -13 -84 198 31 -267 165 27 -130 -54 266 -138 124 39 -51 234 126 69 -36 -10 -5 1 -113 -146
3312a46K13K7Q6j78j0M8nj4r7ML6r1j45L64j45K75j94q4J9n7J14m9K8P7r0K02
$$ -146 67 94 180 2 -8 40 35 21 -76 -72 -36 -127 -272 92 -53 222 28 -56 -37 -94 20 -29 -1 76 -14 188
3338A88j82M7j15J33j02r3Q3P5K54m11J72nk61K27l5M8j02K41J4l56K00p9n3O2
$$ 188 6 53 -62 71 -31 -124 -41 34 288 -123 49 44 -217 10 -25 23 -79 162 176 -180 20 -59 -112 -50
3362e0k5n2J56P1K24k43j96J28nj26R9J07J06l81J59m3M8J63j74r9K20j43q2J68
$$ -50 -75 -127 29 100 324 81 -115 13 8 -118 -19 88 194 -187 -28 -71 -23 140 -34 -133 87 -56 -138 30
3386C0K32k42j14J31j16Q5k5J00k88J20K37j71J13k58J26k9J55j59J35m6J0j34
$$ 30 262 20 -94 37 -79 6 -19 81 -207 -87 150 -21 92 -166 -40 -69 86 -73 62 16 26 -108
3408a08J65J0j30N0K3j31K04n7l7L0L2q8j27K61o1L5k9O3j00j40P0R6Oj8J81l05
$$ -108 57 67 -63 -13 10 -121 83 26 -11 19 51 -37 -164 97 36 71 42 105 5 -135 -65 31 37 19 200 -105
3434a05J83j39J34j02j51J11j14J00J27M3j80Q9K19k69j31K81N8k2j63J19j98
$$ -105 78 -61 73 -29 -180 -69 -183 -83 44 87 -93 -4 215 -54 -185 96 154 132 -31 88 -110
3455a10N2J17p5J12j36R4J42k86J92k6k12J07o6J74j74j36K06o8j47M03k79J01
$$ -110 -58 59 -16 96 -40 54 196 -90 102 76 -136 -29 -95 79 -95 -231 -25 -93 -240 163 -116 -15
3477a5K34l30J3r0Q5K76n8m7l09K67Q1m5J87k12j19M4p0J58k76K89K8j17J51k78
$$ -15 219 -111 -98 -188 -103 173 115 68 -241 26 107 62 249 37 -82 -38 -108 50 -226 63 91 -26 125 -153
3501a53K01J21j17P2j94R2P5q4p2qJ31l84K50J93j72N1M9k1q4R4k9N9j03J5L7
$$ -153 48 169 52 124 -70 22 97 13 -59 -67 64 -320 -70 123 -49 2 51 30 -54 40 11 70 -33 -18 19
3526A9j15j06K33j50k0J97j51J08j47J15kJ57r2q5P8j44P4J9j02J36k7K2L1m2
$$ 19 -96 -202 31 -119 -139 58 -93 15 -132 -17 -19 138 46 -39 39 -105 -31 -12 -114 22 -5 17 48 6
3550Fj76J99J2k7j88l6L68l07J92L2L5k80K53j01k7j37K20%O2j4o0k76K55J64
$$ 6 -170 29 41 14 -174 -210 158 -149 43 75 110 -170 83 -18 -45 -182 38 38 100 86 26 -250 5 169
3574A69l68L27k23J69P8j38L3R1k24QP0P0n8q2J16r8nK00j57L8l9j34J07l1l7
$$ 169 -199 128 -95 74 152 14 47 138 -86 -78 -8 62 4 -78 38 -60 -65 135 -22 16 -23 -157 -50 -81 -118
3599a18J46O6k31K27j09J37l47J32k4J03rL0J7O9k6kk42K6K0L87j86j62J37k67
$$ -118 28 94 -137 90 -19 118 -229 -97 -121 -18 -27 3 20 89 63 61 -181 -155 -135 252 66 -96 41 -226
3623b26K59P0j5j45J68m8j5J95j86j68J38j04K27k19p3L21l66Q5J92j07L8n8Q8
$$ -226 33 103 88 -57 111 63 48 243 57 -111 27 -77 150 -69 -142 179 -187 -102 90 -17 21 -37 51
3646E1K7j22N7j8P6n0j46J21m7J34p4o2K14j71j11J0K91k33K98k73J72k30j12
$$ 51 78 -44 13 -5 71 21 -125 -4 -51 83 9 -53 161 -10 -121 -111 180 -53 245 -28 144 -86 -198
3669a98J75K0o9K60k77KL7R8l1j78J06J93r2r2J07l10J79l5J9J92j83J54p5J33
$$ -198 -23 -3 -72 188 -89 -87 -50 48 17 -161 -55 138 46 -46 61 -249 -70 -105 -86 106 -77 77 2 135
3693A35o8p2qk21N32j84l17L64q8p2j69J91j41K35j94o6L33k8j12k10L00j33K37
$$ 135 67 -5 -13 -234 298 114 -203 161 73 1 -168 23 -118 117 -77 -143 190 162 50 -160 140 7 244
3716B44k72J34q8J34j50j04J41r0j07L26o5p9M2j22J02r7J03O2Rj11M1l3k88J78
$$ 244 -28 106 18 152 2 -102 39 -51 -158 168 103 24 66 -56 46 -51 52 114 123 12 53 20 -268 -90
3740i0M1P4j89K0K62j76J38j23j26K15M3l61K57J30k78J44J54l7k00J43m0J97
$$ -90 -49 25 -164 -144 118 -58 80 -43 -169 46 89 -272 -15 115 -163 -19 135 98 -102 41 1 198
3762A98m7l5L9k14R3P6lj59J58j60Q0O9o3p7n0O7O9O9m4k98M04k03%M0Q4k30M7
$$ 198 151 116 155 -59 34 110 107 -52 106 -54 26 95 32 -45 -95 -28 41 110 66 -232 172 -31 -31 9 93 -137 -90
3789i0J5j1P5J96j44J45q7l16m5J95J96j40j64R6J86m06P9L35R1j44J92k81J19
$$ -90 -75 -86 -11 185 41 186 99 -217 -262 -67 129 -11 -175 -79 107 -299 -220 115 206 62 254 -27 92
3812I2j69P9q4J50j64J43J02j77r6J67k9K0o0k5Q2l4J04j50N9k0L6k35K21j71
$$ 92 -77 2 -82 68 -96 47 149 -28 -124 43 14 34 -26 -51 31 -3 101 -49 10 -10 26 -209 12 -159
3836a59J96q4qM7K48l4k49J39k90L7J23O0N2j07j11L07j22j02L5J73j18O8L5j41
$$ -159 37 -47 -55 -8 240 206 -43 96 -194 -157 -34 26 78 -29 -140 167 45 -57 -22 151 33 101 136 -5
3860eK34j93m39L30J24pnj4o4j23K47n8n5j17n1K46oL4k44L17j02j00J20K2j78
$$ -5 229 36 -403 -73 51 44 39 25 -39 -162 85 27 -28 -145 -196 50 44 78 -166 151 49 -51 69 91 -87
3885h7J9M3j91K00p7J81m7Oj64K20j40J8m4j06K46j17N6p5QK6P9j0JN1j90J25
$$ -87 -68 -25 -216 -16 -93 88 41 47 -117 103 -37 -19 -63 -169 77 -40 16 -59 -51 -25 54 44 45 96 -94 31
3911C1M7j96J45j51kK05m6j02k7K70r4j56J91j94j4L37k34M5N5j60L2j59P7K14
$$ 31 78 -118 27 -124 -126 79 33 -69 -96 174 80 -76 115 -79 -93 244 10 55 110 -50 -18 -177 -100 114
3935A14q2n0nJ36k85O7K11o1J28j05n2j07J28k7o4K56r5n3m4n9K6j83L49j73M2
$$ 114 32 -18 -23 113 -172 -105 106 45 173 68 16 -91 37 10 -54 202 107 54 10 -49 -23 -206 143 -30 12
3960A2Om2j5N4j2k73J31q6K2K78j00o0J23j5m8m7J10M6k11K22q2N1k81J11k8K97
$$ 12 18 -24 -39 15 3 -270 -139 -225 -203 75 -25 -85 38 23 -25 -72 38 84 -127 95 13 64 -217 -106 -134 163
3986A63j41J82j09k36q7M25k27j81J19L9j12K19N2j93J81j28qJ44k10K18j05j5
$$ 163 22 204 95 -141 -228 197 -30 -211 -92 -53 -165 54 106 -87 94 -34 -42 102 -108 110 5 -10
4008a0mJ14Jj6J3j77L0K43k19j3J34Nm60L47j82J00J75k44K81j28Ro6J30L5p0
$$ -10 -14 100 101 85 98 -79 -49 194 -25 -38 96 101 -359 -12 -194 -94 81 -163 118 -10 -1 -67 63 98 28
4033B8M9r5J36j06Q8k77J62j12J58j4k07J40O4k2J51l65J46K78j25J44k62l8J59
$$ 28 77 -18 118 12 100 -177 -15 -127 31 17 -190 -50 14 -8 143 -222 -76 202 77 221 -41 -79 80
4056H0l1m6J18j07l5O4L0j3n2N6r3R1j38J18j02j69J07K41j25R1J00m18J79R1
$$ 80 49 3 121 14 -21 43 73 60 8 64 -29 62 -76 42 -60 -229 -122 119 -6 85 185 -233 -54 37
4080C7k3M7M8m44K39J58l5m2k72K47r3J93O7N2l07O2P2J03r7J23k41n4L74k55
$$ 37 14 61 109 -335 -96 62 27 -15 -287 -40 -133 60 127 179 -128 -66 6 109 12 135 -106 -160 214 -41
4104d1k0j10J78rO1j48J02J20n4n8j94j9M0L8m3O3K23k40J28P9J00m9k8j64Q6
$$ -41 -61 -171 7 -2 59 -89 13 133 79 21 -173 -192 -152 -114 -157 -94 129 -111 17 96 196 147 119 -45 41
4129D1J04l22Q5jJ6R7p6K5j09J15j1k0m6K2P1j75L3J25K6j45J22r9j55L44P1n8
$$ 41 145 -177 -92 -93 -77 20 -56 -31 -140 -25 -36 -56 -102 -80 -9 -184 -151 -26 0 -145 -23 -122 -277 67 138 80
4155H0n5j9K7J09J14q5j61R0k2j95K02l0p8n1K04n0j63M8O4M2j86J27j85J1K51
$$ 80 25 6 33 142 256 171 10 100 78 -117 85 55 -23 -74 130 80 -83 -35 29 71 -115 12 -173 -162 89
4180H9j25J29j41J95j13Mk27J50j27P7L13j17k26J1J54J6p7K19j70M3j92K36j57
$$ 89 -36 93 -48 147 34 38 -189 -39 -166 -89 224 107 -119 -108 46 62 -15 204 34 77 -115 121 -36
4203c6NK9N9N8j12l9m4L68l96Mk0J56k09%j01P8Q7L18p7o6m9Q8l39K42k8L3P1
$$ -36 -31 -2 57 115 3 -36 -80 288 -108 -104 -124 32 -177 -177 -278 -200 -113 205 128 62 13 101 -238 4 -24 9 80
4230H0k4o5L5M4k8l6k3k6QJ6MJ05o8j37R4j20O2K58j12k08J84j02j28J79Q3o6
$$ 80 56 -9 26 70 42 6 -17 -43 -35 -19 -15 90 22 -115 -21 -141 -79 179 67 -141 43 -59 -187 -8 75 9
4256Io3j07K14r6QL7J59M9k17J62k55q5K68j51l4K50k50K92j95n2j77J34Q5JJ40
$$ 9 -54 -161 53 -43 -35 2 161 210 -7 155 -100 -185 83 -68 -102 148 -102 190 -5 -57 -234 -100 -15 -14 126
4281A26j07j07O7Q2k19Q8m3J57q1J14k52J79q6N6M2j59K6J89pj18P7j67J34N8
$$ 126 19 -88 -21 61 -158 -70 -113 44 -37 77 -175 4 -82 -26 16 -143 -117 72 65 -53 24 -143 -9 49
4305D9J0J75j71J74k21K31j14k58O4L9p5J80mj21mQ1K0m3J90k32QK70m07rK40
$$ 49 59 234 63 237 16 247 133 -125 -61 -22 -97 83 79 -42 -46 35 55 12 202 -30 -22 248 -159 -168 72
4330G2k11J41j08n3J04J2p5K76k34J7Nk5Q3OJ06j32J37l7n0k87M37k27q0N02l56
$$ 72 -139 2 -106 -159 -55 -43 -118 158 -76 -59 -54 -79 4 10 116 -16 121 84 34 -253 184 -43 -123 379 23
4355B3J09k65J5K82j44P8M8k1k32K41j22q7l1O1J39J19k24Pk32l7L97j36q9j58
$$ 23 132 -133 -118 164 20 98 146 125 -107 134 12 -75 -106 -45 94 213 -11 -4 -236 -273 124 -12 -101 -259
4379b59K56j5m7L6k6m9K56l18Q3L38k01j41J7M8P0p8N6L7K06m65K69j39j27J47
$$ -259 -3 -18 -65 -29 -55 -104 152 -166 -83 255 54 -87 -70 -22 48 -30 26 63 269 -196 73 -66 -193 -46
4403d6P7m0M3j80l9K97r9K46l3k18n7J93J64j92j70q8P8j66J41J02l3m5Lj4J20
$$ -46 31 -9 34 -146 -185 112 13 259 226 8 -49 144 308 116 -54 -142 -64 -230 -89 13 -20 -65 -62 -76 44
4428D4n2P1J82k05j09K01k85J17p1J52j98J30K03k89R9L3K7p9l7MJ36j14m0K77
$$ 44 -8 63 245 40 -69 132 -153 -36 -107 45 -153 -23 180 -109 -10 23 50 -29 -66 -62 74 -40 -80 197
4452A97k10p2o3J59n2j43J15m7k3J68O2r8J18r5n3p7J48r0L4J51j85J9j59L35
$$ 197 -13 -85 -148 11 -41 -184 -69 -116 -139 29 91 -7 111 16 -37 -114 34 -56 -22 129 -56 -37 -196 139
4476A39JL6k31j42K77j93N2k7K56l42K04q4j32L68Kj99J2L2K02l35N8J25Q7j83
$$ 139 140 176 -55 -197 80 -113 -61 -88 168 -174 30 -54 -186 182 184 -15 -3 29 231 -104 -46 79 166 -17
$$ [...]
8191a20
##END NTUPLES=NMR FID
##END=
