##TITLE=1H_Ser AmS-2pN 
 200.13MHz,CD3OD,
 8 sc
 
 2.12.2025
##JCAMPDX= 6.0         $$ Bruker NMR JCAMP-DX V2.0
##DATA TYPE= NMR FID
##DATA CLASS= NTUPLES
##ORIGIN= UXNMR, Bruker Analytische Messtechnik GmbH
##OWNER= pz
$$ XWIN-NMR		Version 3.5
$$ Tue Dec  2 15:29:00 2025 Russian Standard Time (UT+4h)  she@DPX200
##.OBSERVE FREQUENCY= 200.1313
##.OBSERVE NUCLEUS= ^1H
##.DELAY= (6, 6)
##.ACQUISITION MODE= SIMULTANEOUS
##.ACQUISITION SCHEME= undefined
##.AVERAGES= 8
##.DIGITISER RES= 18
##SPECTROMETER/DATA SYSTEM= spect
##.PULSE SEQUENCE= zg30
##.SOLVENT NAME= MeOD
##.SHIFT REFERENCE= (INTERNAL, MeOD, 0, 14.3821)
##AUDIT TRAIL= $$ (NUMBER, WHEN, WHO, WHERE, WHAT)
$$ ##TITLE= Audit trail, XWIN-NMR		Version 3.5
$$ ##JCAMPDX= 5.01
$$ ##ORIGIN= Bruker BioSpin GmbH
$$ ##OWNER= she
$$ F:/spectra/data/she/nmr/H-C/1/audita.txt
$$ ##AUDIT TRAIL=  $$ (NUMBER, WHEN, WHO, WHERE, WHAT)
(   1,<2025-12-02 15:26:53.65 +0400>,<she>,<DPX200>,
      <created by zg, POWCHK disabled, PULCHK disabled
       configuration hash MD5:
       00 E9 B6 7A A2 85 ED C7 34 08 36 98 17 FE 4E 26
       data hash MD5: 16K
       C0 77 6E 6D 8C FA C1 71 BA BF D2 54 E7 80 A8 1D>)
$$ ##END=
$$ 
$$ hash MD5
$$ E2 5C 92 49 46 71 FA CA 3E C7 4F 78 EF B7 45 DE
##$RELAX= 
##$RELAX= 
##$RELAX= 
##$RELAX= 
##$RELAX= 
##$RELAX= 
$$ Bruker specific parameters
$$ --------------------------
##$DU= <F:/spectra>
##$EXPNO= 1
##$NAME= <H-C>
##$PROCNO= 1
##$TYPE= <nmr>
##$USER= <she>
##$AMP= (0..31)
100 100 100 100 100 100 100 100 100 100 100 100 100 100 100 100 100 100 
100 100 100 100 100 100 100 100 100 100 100 100 100 100 
##$AQSEQ= 0
##$AQ_mod= 1
##$AUNM= <au_zg>
##$AUTOPOS= <>
##$BF1= 200.13
##$BF2= 200.13
##$BF3= 200.13
##$BF4= 200.13
##$BF5= 200.13
##$BF6= 200.13
##$BF7= 200.13
##$BF8= 200.13
##$BYTORDA= 1
##$CFDGTYP= 0
##$CFRGTYP= 5
##$CHEMSTR= <none>
##$CNST= (0..31)
1 1 145 1 1 1 1 1 1 1 1 1 1 1 1 1 1 1 1 1 1 1 1 1 1 1 1 1 1 1 1 1 
##$CPDPRG= <>
##$CPDPRG1= <>
##$CPDPRG2= <>
##$CPDPRG3= <>
##$CPDPRG4= <mlev>
##$CPDPRG5= <mlev>
##$CPDPRG6= <mlev>
##$CPDPRG7= <mlev>
##$CPDPRG8= <mlev>
##$CPDPRGB= <>
##$CPDPRGT= <>
##$D= (0..31)
0 0.7 0 0 0 0 0 0 0 0 0 0.03 0 0 0 0 0 0 0 0 0 0 0 0 0 0 0 0 0 0 0 0 
##$DATE= 1764674813
##$DBL= (0..7)
120 120 120 120 120 120 120 120 
##$DBP= (0..7)
150 150 150 150 150 150 150 150 
##$DBP07= 0
##$DBPNAM0= <>
##$DBPNAM1= <>
##$DBPNAM2= <>
##$DBPNAM3= <>
##$DBPNAM4= <>
##$DBPNAM5= <>
##$DBPNAM6= <>
##$DBPNAM7= <>
##$DBPOAL= (0..7)
0.5 0.5 0.5 0.5 0.5 0.5 0.5 0.5 
##$DBPOFFS= (0..7)
0 0 0 0 0 0 0 0 
##$DE= 6
##$DECBNUC= <off>
##$DECIM= 32
##$DECNUC= <off>
##$DECSTAT= 4
##$DIGMOD= 1
##$DIGTYP= 9
##$DL= (0..7)
0 120 120 120 120 120 120 120 
##$DP= (0..7)
150 150 150 150 150 150 150 150 
##$DP07= 0
##$DPNAME0= <>
##$DPNAME1= <>
##$DPNAME2= <>
##$DPNAME3= <>
##$DPNAME4= <>
##$DPNAME5= <>
##$DPNAME6= <>
##$DPNAME7= <>
##$DPOAL= (0..7)
0.5 0.5 0.5 0.5 0.5 0.5 0.5 0.5 
##$DPOFFS= (0..7)
0 0 0 0 0 0 0 0 
##$DQDMODE= 0
##$DR= 18
##$DS= 0
##$DSLIST= <SSSSSSSSSSSSSSS>
$$ [...]
##$SUBNAM0= <"">
##$SUBNAM1= <"">
##$SUBNAM2= <"">
##$SUBNAM3= <"">
##$SUBNAM4= <"">
##$SUBNAM5= <"">
##$SUBNAM6= <"">
##$SUBNAM7= <"">
##$SUBNAM8= <"">
##$SUBNAM9= <"">
##$SW= 18.0517328524113
##$SWIBOX= (0..15)
0 0 2 0 0 0 0 0 0 0 0 0 0 0 0 0 
##$SW_h= 3612.71676300578
##$TD= 16384
##$TD0= 1
##$TE= 0
##$TE2= 300
##$TE3= 300
##$TEG= 300
##$TL= (0..7)
0 120 120 120 120 120 120 120 
##$TP= (0..7)
150 150 150 150 150 150 150 150 
##$TP07= 0
##$TPNAME0= <>
##$TPNAME1= <>
##$TPNAME2= <>
##$TPNAME3= <>
##$TPNAME4= <>
##$TPNAME5= <>
##$TPNAME6= <>
##$TPNAME7= <>
##$TPOAL= (0..7)
0.5 0.5 0.5 0.5 0.5 0.5 0.5 0.5 
##$TPOFFS= (0..7)
0 0 0 0 0 0 0 0 
##$TUNHIN= 0
##$TUNHOUT= 0
##$TUNXOUT= 0
##$USERA1= <user>
##$USERA2= <user>
##$USERA3= <user>
##$USERA4= <user>
##$USERA5= <user>
##$V9= 5
##$VALIST= <valist>
##$VCLIST= <CCCCCCCCCCCCCCC>
##$VD= 0
##$VDLIST= <DDDDDDDDDDDDDDD>
##$VPLIST= <PPPPPPPPPPPPPPP>
##$VTLIST= <TTTTTTTTTTTTTTT>
##$WBST= 1024
##$WBSW= 4
##$XGAIN= (0..3)
0 0 0 0 
##$XL= 0
##$YL= 0
##$YMAX_a= 472711
##$YMIN_a= -666192
##$ZGOPTNS= <>
##$ZL1= 120
##$ZL2= 120
##$ZL3= 120
##$ZL4= 120
##$ABSF1= 10
##$ABSF2= 0
##$ABSG= 5
##$ABSL= 3
##$ALPHA= 0
##$AQORDER= 0
##$ASSFAC= 0
##$ASSFACI= 0
##$ASSFACX= 0
##$ASSWID= 0
##$AUNMP= <proc_1d>
##$AZFE= 0.1
##$AZFW= 0.1
##$BCFW= 1
##$BC_mod= 2
##$BYTORDP= 1
##$COROFFS= 0
##$CY= -3
##$DATMOD= 1
##$DC= 2
##$DFILT= <>
##$DTYPP= 0
##$F1P= 0
##$F2P= 0
##$FCOR= 0.5
##$FTSIZE= 0
##$FT_mod= 4
##$GAMMA= 1
##$GB= 0.15
##$INTBC= 1
##$INTSCL= 1
##$ISEN= 128
##$LB= 0.25
##$LEV0= 0
##$LPBIN= 0
##$MAXI= 10000
##$MC2= 0
##$MEAN= 0
##$ME_mod= 0
##$MI= 1.114404
##$NCOEF= 0
##$NC_proc= 0
##$NLEV= 6
##$NOISF1= 3.799351
##$NOISF2= 2.8
##$NSP= 1
##$NTH_PI= 0
##$NZP= 0
##$OFFSET= 14.38212
##$PC= 1
##$PHC0= -3347.719
##$PHC1= 11.19234
##$PH_mod= 1
##$PKNL= yes
##$PPARMOD= 0
##$PSCAL= 0
##$PSIGN= 0
##$REVERSE= no
##$SF= 200.129724274929
##$SI= 16384
##$SIGF1= 3
##$SIGF2= 2
##$SINO= 400
##$SIOLD= 16384
##$SREGLST= <1H.CDCl3>
##$SSB= 0
##$STSI= 0
##$STSR= 0
##$SW_p= 3205.1282051282
##$SYMM= 0
##$S_DEV= 0
##$TDeff= 0
##$TDoff= 0
##$TI= <>
##$TILT= no
##$TM1= 0
##$TM2= 0
##$TOPLEV= 0
##$USERP1= <user>
##$USERP2= <user>
##$USERP3= <user>
##$USERP4= <user>
##$USERP5= <user>
##$WDW= 1
##$XDIM= 8192
##$YMAX_p= 0
##$YMIN_p= 0
$$ End of Bruker specific parameters
$$ ---------------------------------
##NTUPLES= NMR FID
##VAR_NAME=  TIME,          FID/REAL,        FID/IMAG
##SYMBOL=    X,             R,               I
##VAR_TYPE=  INDEPENDENT,   DEPENDENT,       DEPENDENT
##VAR_FORM=  AFFN,          ASDF,            ASDF
##VAR_DIM=   8192,          8192,            8192
##UNITS=     SECONDS,       ARBITRARY UNITS, ARBITRARY UNITS
##FACTOR=    0.0002768,     1,               1
##FIRST=     0,             0,               0
##LAST=      2.2672688,     0,               0
##MIN=       0,             -666192,         0
##MAX=       2.2672688,     472711,          0
$$ Real data points
##PAGE= N=1
##DATA TABLE= (X++(R..R)), XYDATA
$$ [...]
$$ plain form
2989 1263 2135 581 -2644 -3952 153 3214 -1547 -3133 3310 4947 -3353 -3983 5005 3836 -4707
3004 -4707 -2922 3336 -536 -5318 -715 3880 2426 578 710 347 443 -596 -3854 -1449 4143 1079
3020 1079 -5425 -211 5112 -1368 -4784 4064 6756 -2752 -4743 1810 679 -4831 -1692 3715 2560
3035 2560 560 -31 -731 494 2199 -1793 -2701 3121 2484 -6546 -4358 5591 2935 -4248 1877 8221
3051 8221 -922 -7242 -360 2721 -2479 -1949 2210 1360 -100 -269 -1551 564 4764 1038 -4735 165
3067 165 3346 -5582 -7329 4496 6983 -2937 -1758 6751 1379 -6519 -1648 3835 -66 -2228 -109
3082 -109 -668 -646 1155 -596 247 6235 3526 -5645 -3420 4045 -2048 -7747 2177 8021 -1535 -5080
3098 -5080 3585 3850 -3648 -1550 3852 881 -2497 -2157 -2614 -1264 3044 1717 -1216 3999 5117 -5169
$$ packed form
2989A263Q72j554l225j308M105L061m761j586O443J637q300o30Q988j169q543
3004d707J785O258l872m782M603M595j454j848J32l63R6j039l258K405N592l064
3020A079o504N214N323o480l416Q848K692r508j991O553j131n510L139N407j155
3035B560k000n91p00J225J705l992r08N822o37r030K188R949k656p183O125O344
3051H221r143o320O882L081n200N30M159q50j460j69j282K115M200l726n773M900
3067A65L181q928j747J1825K487r920J179Q509n372p898M871N483l901k162K119
3082a09n59K2J801j751Q43N988k709r171K225P465o093n699R924N844r556l545
3098e080Q665K65p498K098N402k971l378L40m57J350M308j327k933N215J118j0286
$$ plain form
3114 -5169 -6386 3866 2921 -6020 -1748 6712 94 -6372 566 5816 136 -871 2888 585 -3033
3129 -3033 -2573 -2925 -1510 3522 2978 -2594 1035 5694 -2084 -6355 3053 5618 -4543 -5458 3698 1378
3145 1378 -5623 -209 6396 2543 -1199 355 -258 -2521 -1328 -1396 -1333 3164 3004 -3387 -2190 5028
3161 5028 1566 -5322 1285 6636 -2287 -8097 145 3315 -3076 -2117 4808 4155 -858 -752 -382 -591
3177 -591 319 -1218 -3082 1048 3138 -2933 -4046 4925 5339 -3599 -1730 5296 88 -8051 -2386 4170
3193 4170 343 -2567 1838 3353 139 -1032 -772 348 2259 -95 -4186 -1138 3145 -1642 -5275
3208 -5275 3177 7073 -725 -3910 3156 2948 -5088 -4173 2824 1614 -2500 -1480 1558 2004 859 -294
3224 -294 -76 2441 1052 -4284 -3398 2525 881 -4250 140 6497 1561 -4367 672 4242 -1389 -4122
$$ packed form
3114e169j217J0252r45q941M272Q460o618o466O938N250n680j007L759k303l618
3129c033M60l52J415N032n44n572L629M659p778m271R408K565j0161r15R156k320
3145A378p001N414O605l853l742J554o13k263J193o8O3M497j60o391J197P218
3161E028l462o888O607N351q923n810Q242L170o391R59O925o53n013J06L70k09
3177e91R10j537j864M130K090o071j113Q971M14q938J869P026n208q139N665O556
3193D170l827k910M405J515l214j171K60J120J911k354m091L048M283m787l633
3208e275Q452L896p798l185P066k08q036R15O997j210m114J020L038M46j145j153
3224b94K18K517j389n336Q86N923j644n131M390O357m936n928N039L570n631k733
$$ plain form
3240 -4122 260 1960 -1473 -2421 152 2274 2451 -169 -1093 2344 1959 -3059 -4001 1793 2188 -3098
3256 -3098 -1994 4083 2648 -3307 -1089 4083 1654 -3207 -1647 1184 -69 -2482 -1213 1399 2755
3271 2755 252 -1362 1455 3465 -1549 -4385 155 2798 -2265 -3657 2058 3715 -1073 -2024 2310
3286 2310 3131 -1860 -3296 -32 1348 -1062 -2605 360 2786 1029 -2074 442 3726 380 -3691
3301 -3691 -719 2937 -445 -4357 -485 3372 847 -2365 662 3698 801 -2832 -1457 1999 177
3316 177 -3520 -2016 2342 2512 -1531 -1017 3505 3012 -2666 -2601 1724 1039 -3884 -3132 2414 2440 -1394
3333 -1394 -1168 2415 2682 -1074 -2714 478 1915 -2263 -3839 788 3432 -551 -2637 1654 3883
3348 3883 -396 -3136 399 2127 -1524 -3580 19 2603 -468 -2200 1191 3583 755 -2256 -1094
$$ packed form
3240d122M382J700l433r48K573K122J77k620r24L437l85n018r42N794L95n286
3256c098J104O077j435n955K218N172k429m861J560K831j253k413J269K612J356
3271B755k503j614K817K010n014k836M540K643n063j392N715J657m788r51M334
3286B310Q21m991j436L264J380k410j543K965K426j757l103K516L284l346m071
3301c691K972L656l382l912L872L857k525l212L027L036k897l633J375L456j822
3316A77l697J504M358J70m043N14M522m93n678O5M325o85m923P52N546K6l834
3333a394K26L583K67l756j640L192J437m178j576M627K644l983k086M291K229
3348C883m279k740L535J728l651k056L599K584l071j732L391K392k828l011J162
$$ plain form
3363 -1094 2069 -319 -3795 -1428 2591 994 -2579 147 4155 1602 -2727 -948 2134 -211 -3844
3378 -3844 -1732 1928 1005 -1667 -271 3188 2345 -1703 -1764 1866 1384 -2948 -3160 1180 2371 -2041
3394 -2041 -1706 3038 3235 -1851 -1851 2060 1684 -3047 -2989 1013 1518 -1101 -1356 1951 3055 -23 -1667
3411 -1667 595 2014 -1431 -4022 -517 2786 -579 -3286 1428 4552 57 -2616 1238 2715 -1889
3426 -1889 -3939 -345 1523 -542 -1904 539 2912 2017 -1101 -505 2265 887 -3702 -2792 2664 1281
3442 1281 -3604 -1049 4924 2024 -3079 -354 3364 35 -3290 -1204 1186 -323 -1666 -1199 1590
3457 1590 3090 416 -1812 1053 2802 -1988 -4549 1056 3052 -2621 -3483 3138 3340 -2284 -1228
3472 -1228 3468 1700 -2438 -1983 -31 -612 -1017 -1064 189 2874 2484 -1932 -1609 3342 854 -4866 -1399
$$ packed form
3363a094L163k388l476K367M019j597l573K726M008k553m329J779L082k345l633
3378c844K112L660r23k672J396L459q43m048o1L630m82m332k12M340J191m412
3394b041L35M744J97n086%L911l76m731N8M002N05k619k55L307J104l078j644
3411a667K262J419l445k591L505L303l365k707M714L124m495k673L854J477m604
3426a889k050L594J868k065j362K443K373q95l118N96K770j378m589R10N456j383
3442A281m885K555N973k900n103K725L718l329l325K086K390j509j343M67K789
3457A590J500k674k228K865J749m790k561N605J996n673q62O621K02n624J056
3472a228M696j768m138M55J952n81m05m7J253K685l90m416L23M951k488n720L467
$$ plain form
3489 -1399 4139 -838 -4774 876 4394 -816 -1728 3156 2755 -1560 -2351 -1078 -810 0 -65 -1014 1016
3506 1016 3477 -737 -2883 2774 3639 -3551 -3464 3080 963 -5800 -1485 4544 984 -1830 2150 3223
3522 3223 -1065 -2198 -764 -951 141 677 -1834 -1139 3124 993 -3549 1727 5587 -969 -5406 1418
3538 1418 2618 -4843 -3666 4448 3275 -1943 164 2352 -344 -1114 -17 -598 44 1218 -2301 -3528
3554 -3528 2579 3291 -2925 -404 6598 1419 -6636 -1417 3931 -2419 -4682 2855 3637 -1791 -1603 1779
3570 1779 827 306 1535 -791 -1238 1362 -1638 -5275 595 5312 -1044 -2772 4861 3745 -5532 -3088
3586 -3088 4626 587 -4537 192 2857 -1746 -2012 1531 1711 1229 2244 -999 -3012 982 480 -4801
3602 -4801 -724 6076 1291 -4804 1343 5010 -2924 -4204 4244 3223 -4240 -2285 1260 -1285 -1646
$$ packed form
3489a399N538m977l936N650L518n210r12M884m01m315p91J273K68Q10o5r49K030
3506A016K461m214k146N657Q65p190Q7O544k117o763M315O029l560k814L980J073
3522C223m288j133J434j87J092N36k511O95M263k131m542N276L860o556m437O824
3538A418J200p461J177Q114j173n218K107K188k696p70J097n81O42J174l519j227
3554c528O107P12o216K521P002n179q055N219N348o350k263P537P82n428J88L382
3570A779r52n21J229k326m47K600l000l637N870M717o356j728P633j116r277K444
3586c088P714m039n124M729K665m603k66L543J80m82J015l243k013L994n02n281
3602d801M077O800m785o095O147L667p934j280Q448j021p463J955L545k545l61
$$ plain form
3617 -1646 1903 1672 980 2534 -412 -4053 82 2668 -3301 -2911 4421 2311 -5111 -1348 5654 587
3633 587 -3671 2309 3291 -3434 -4059 62 -88 -666 1644 1418 -190 1704 415 -3623 -175 3987
3649 3987 -1067 -4658 1629 2989 -4417 -3146 5320 3420 -2418 69 3480 -1953 -3835 -253 799
3664 799 -354 919 -43 -1173 1816 1970 -2151 -1034 4269 347 -5927 -1207 3950 -1970 -4092 3783
3680 3783 5012 -1694 -2087 2347 535 -2312 -543 553 -280 76 -674 -1859 1734 3467 -731 -1745
3696 -1745 3548 2031 -5069 -3200 3455 500 -3793 728 4747 -313 -2523 1242 1908 -785 -1015
3711 -1015 -620 -977 221 -649 -2320 400 4232 796 -2951 1687 3350 -3219 -3999 2252 2540 -3288
3727 -3288 -1998 2959 1437 -1892 84 1979 996 -370 -1461 -1520 202 229 -2063 -563 3580 2142
$$ packed form
3617a646L549k31o92J554k946l641M135K586n969L90P332k110p422L763P002n067
3633E87m258N980R82o725o25M121j50n78K310k26j608J894j289m038L448M162
3649C987n054l591O287J360p406J271Q466j900n838K487L411n433j882L582J052
3664G99j153J273r62j130K989J54m121J117N303l922o274M720N157n920k122P875
3680C783J229o706l93M434j812k847J769J096q33L56p50j185L593J733m198j014
3696a745N293j517p100J869O655k955m293M521M019n060k210L765O66k693k30
3711a015L95l57J198q70j671K720L832l436l747M638J663o569p80O251K88n828
3727c288J290M957j522l329J976J895r83j366j091n9J722K7k292J500M143j438
$$ plain form
3743 2142 -2748 -101 4021 117 -4143 64 2857 -1815 -3303 974 2415 -152 -519 1304 1518
3758 1518 299 -1186 -1747 -196 698 -1564 -2021 2491 2714 -1644 -1028 3461 1809 -2801 -1665 1931
3774 1931 -213 -3343 -842 2258 1020 -784 -11 1651 1310 -935 -2123 -109 1196 -1147 -2568
3789 -2568 883 2797 -509 -1765 2049 3099 -1402 -2495 939 1004 -2098 -2394 1085 1681 -400 -698
3805 -698 1231 2287 238 -1702 -380 913 -516 -3346 -686 2624 843 -1956 691 3247 610
3820 610 -2469 -203 1774 -829 -2748 -494 1761 498 -1189 214 2253 1621 -1554 -1630 1214 665
3836 665 -2740 -2332 1615 1751 -1430 -743 2966 2156 -1234 -1459 1273 831 -2395 -2277 442 1352 -892
3853 -892 -989 2050 2296 -216 -1904 567 1357 -1441 -3261 65 2395 -407 -1483 1466 2734 -47
$$ packed form
3743B142m890K647M122l904m260M207K793m672j488M277J441k567l67J823K14
3758A518j219j485n61J551Q94k262m57M512K23m358O16M489j652m610J136L596
3774A931k144l130K501L100j238j804P73J662l41k245j188K014J305k343j421
3789b568L451J914l306j256L814J050m501j093L434O5l102k96L479N96k081k98
3805f98J929J056k049j940J322J293j429k830K660L310j781k799K647K556k637
3820F10l079K266J977k603j919K254K255j263j687J403K039o32l175p6K844n49
3836F65l405M08L947J36l181O87L709q10l390k25K732m42l226J18K719R10k244
3853h92r7L039K46k512j688K471P90k798j820L326K330k802j076K949J268k781
$$ plain form
3869 -47 -1627 612 1399 -1262 -2536 -425 1005 279 -1433 396 2505 1340 -1287 -220 1670 -71
3885 -71 -3096 -1294 1845 290 -2309 135 2960 1410 -1186 -91 1650 -131 -2265 -1177 886
3900 886 518 -1280 -821 2126 2410 -860 -1308 1456 1394 -2647 -2523 1062 1108 -1862 -980 2664 1716 -969
3918 -969 -970 1553 1000 -1490 -2112 -367 800 -369 -1622 985 3079 490 -1985 776 2522 -1354
3934 -1354 -3242 -25 1512 -1233 -2206 1310 2583 -73 -1144 949 1650 170 -2345 -1571 855 684
3950 684 -1596 -687 2810 1548 -2106 -585 3267 699 -3446 -1168 2069 -213 -2504 -355 1963
3965 1963 953 -436 322 1182 520 -1396 -2386 -107 1987 -665 -2544 1353 3112 -1154 -1748 3060
3981 3060 2671 -2385 -2223 1609 201 -2458 -1152 1448 1460 664 204 -2 670 488 -1855 -991 2224
$$ packed form
3869d7j580K239P87k661j274K111J430p26j712J829K109j165k627J067J890j741
3885g1l025J802L139j555k599K444K825j550k596J095J741j781k134J088K063
3900H86l68j798M59K947K84l270m48K764o2m041J24L585M6k970Q82L644r48k685
3918i69jK523n53k490o22J745J167j169j253K607K094k589k475K761J746l876
3934a354j888L217J537k745r73L516J273k656j071K093P01j480k515P74K426j71
3950F84k280R09L497j262l654J521L852k568m145K278L237k282k291K149K318
3965A963j010j389P58Q60o62j916r90K279K094k652j879L897J759m266n94M808
3981C060l89n056J62L832j408k659J306K600J2p96m60k06O72j82k343Q64L215
$$ plain form
3998 2224 164 -3723 -552 3489 484 -2584 1656 3660 -1311 -2418 539 495 -2234 -1018 1197
4013 1197 836 463 354 -932 392 2213 -535 -2329 1007 1086 -3267 -2423 3093 1752 -2795 550
4029 550 3984 -153 -3037 90 1119 -1628 -1105 592 -32 -312 446 -650 519 3313 1021 -3320
4045 -3320 -491 2334 -2662 -3785 2096 3371 -2219 -1442 3849 1225 -3039 -303 1971 -148 -730
4060 -730 -382 -1461 -542 1063 73 -173 3090 2160 -3637 -2177 3019 -101 -4909 157 4185 -1022
4076 -1022 -2873 2259 2464 -1425 -810 2201 457 -1482 -1251 -2109 -1045 2480 1353 -1321 1621 2769
4092 2769 -2245 -3022 2804 2419 -4042 -2008 3678 148 -3608 326 2694 -50 191 1959 -62 -1923
4108 -1923 -811 -1597 -1477 2396 2036 -2664 -478 3921 -2 -3199 1668 3550 -2776 -3468 1931 796
$$ packed form
3998B224k060l887L171M041l005l068M240K004m971j107K957m4k729J216K215
4013A197l61l73j09j286J324J821k748j794L336P9m353Q44N516j341m547L345
4029E50L434m137k884L127J029k747N23J697o24k80P58j096J169K794k292m341
4045c320K829K825m996j123N881J275n590P77N291k624m264K736K274k119n82
4060g30L48j079R19J605r90k46L263r30n797J460N196l120m808N066M028n207
4076a022j851N132K05l889O15L011j744j939K31q58J064L525j127k674K942J148
4092B769n014p77N826l85o461K034N686l530l756L934K368k744K41J768k021j861
4108a923J112p86J20L873l60m700K186M399l923l197M867J882o326o92N399j135
$$ plain form
4124 796 -3520 -534 3143 1398 -93 507 -1009 -1479 361 79 -1645 1033 1564 -2863 -2385 3499
4140 3499 2286 -3251 152 3780 -956 -4036 238 1285 -2251 -866 3055 1982 -641 -223 -309 -534
4156 -534 1322 499 -2592 -1046 1823 -1806 -2405 2866 3366 -2158 -1258 3501 1066 -3970 -1414 1901
4172 1901 -394 -1298 1361 1077 -609 -273 725 420 1786 843 -3348 -2180 1960 -34 -3156 871
4188 871 4062 -468 -2072 2097 1929 -3200 -2404 1736 905 -1549 -990 141 -124 1147 1002 213 1006
4205 1006 1105 -2474 -2493 2156 1203 -3075 -1064 3390 1306 -2081 651 2587 -905 -2099 944 944 -1463
4222 -1463 -1745 -808 387 2130 1418 -860 200 1631 -981 -2446 950 1586 -2606 -2298 2552 2336
4238 2336 -1676 -1045 2430 914 -1158 -361 49 -964 -1541 -687 626 1600 597 -1368 -95 2376
$$ packed form
4124G96m316K986L677j745j491O00j516m70J840k82j724K678N31m427M78N884
4140C499j213n537L403L628m736l080M274J047l536J385L921j073k623M18q6k25
4156e34J856q23l091J546K869l629n99N271N00n524R00M759k435n036K556L315
4172A901k295r04K659k84j686L36R98l05J366r43m191J168M140j994l122M027
4188H71L191m530j604M169j68n129P96M140q31k454N59J131k65J271j45p89P93
4205A006R9l579j9M649r53m278K011M454k084l387K732J936l492j194L043%k407
4222a463k82R37J195J743p12k278J060J431k612j465L396O36m192L08M850k16
4238B336m012O31L475j516k072P97M10j013n77Q54J313R74j003j965J273K471
$$ plain form
4254 2376 933 -2436 -786 1277 -1204 -2393 801 2377 -938 -1375 1693 2744 -395 -1421 -677
4269 -677 -283 -477 -803 -30 812 342 -907 19 2623 1437 -2233 -1562 1242 669 -2204 -920 1119
4286 1119 80 -831 951 2742 376 -1968 -909 533 809 -1447 -2026 102 1003 157 -247 1474
4302 1474 1389 -1441 -1571 1320 1537 -2365 -2634 516 1680 -159 -580 1462 1222 -327 -502 760 804
4319 804 -1402 -2746 -513 1610 465 -1263 169 1650 646 -1183 299 1039 -1147 -2848 -304
4334 -304 2158 49 -1517 28 2093 1028 -272 -143 523 -479 -2126 -503 1715 393 -1557 -639
4350 -639 2186 2107 -529 -1087 473 190 -1780 -1032 1076 492 -1979 -703 2006 2383 -469 -1550 327
4367 327 643 -678 -1022 -43 189 -921 -551 1954 2175 -269 -1447 523 1671 -452 -1866 -474 305
$$ packed form
4254B376j443l369J650K063k481j189L194J576l315m37L068J051l139j026P44
4269f77L94j94l26P73Q42m70j249R26K604j186l670O71K804n73k873J284K039
4286A119j039r11J782J791k366k344J059J442K76k256n79K128R01q46m04J721
4302A474q5k830j30K891K17l902k69L150J164j839m21K042k40j549j75J262M4
4319H04k206j344K233K123j145j728J432J481j004j829J482P40k186j701K544
4334c04K462k109j566J545K065j065j300J29O66j002j647J623K218j322j950R18
4350f39K825p9k636n58J560k83j970P48K108n84k471J276K709L77k852j081J877
4367C27L16j321l44R79K32j110L70K505K21k444j178J970J148k123j414J392P79
$$ plain form
4384 305 -852 -828 1743 1922 -327 -1459 506 1739 -303 -1907 -1140 428 16 -812 661 1836 -32
4401 -32 -1435 503 2534 39 -2270 -1510 664 303 -764 -77 1408 527 -647 690 1835 384
4417 384 -2105 -1870 725 1173 -1292 -1175 951 1155 -416 376 1663 348 -2075 -1314 801 479 -1205
4434 -1205 -1495 444 1664 819 -91 416 1001 -1044 -1600 836 1497 -1362 -2589 687 2406 460 -386
4451 -386 1025 909 -912 -978 -33 318 -1019 -1917 -33 2270 1428 -1152 -859 1423 960 -1672 -902 881
4469 881 -1100 -2585 84 2850 393 -1038 507 1874 385 -374 -860 -966 -104 -613 -592 1117 1600
4486 1600 -671 -1287 2105 2628 -1334 -2158 718 422 -1969 -650 1477 179 -1274 612 1822 1051
4502 1051 -669 -1289 -947 442 886 -1268 -1166 1020 358 -1272 1321 3371 -640 -2700 427 1862
$$ packed form
4384C05j157K4K571J79k249j132J965J233k042j604P67J568m12q28J473J175j868
4401c2j403J938K031k495k309P60K174l61j067O87J485q81j174J337J145j451
4417C84k489K35K595M48k465J17K126K04j571P92J287j315k423P61K115l22j684
4434a205k90J939J220q45r10N07N85k045n56K436O61k859j227L276J719j946q46
4451c86J411j16j821o6R45L51j337q98J884K303q42k580K93K282m63k632P70J783
4469H81j981j485K669K766k457j431J545J367j489p59m86j06Q62n09K1J709M83
4486A600k271o16L392N23l962q24K876k96k391J319K127j298j453J886J210p71
4502A051j720o20L42J389M44k154J02K186o62j630K593K050m011k060L127J435
$$ plain form
4518 1862 -1478 -1701 720 532 -601 845 1367 314 -87 -310 -706 533 711 -2304 -2404 1123 1995
4535 1995 -1012 -81 2693 207 -2815 130 2258 -1027 -2538 314 968 -592 75 345 -43 628
4551 628 1175 41 -485 370 -1917 -3177 1148 3119 -624 -1910 2254 1838 -1792 -782 1878 -400
4567 -400 -2808 -129 1224 -675 -851 274 223 1563 1910 -624 -2027 395 218 -2420 -14 2664
4583 2664 -375 -3236 1212 3417 -335 -1480 1833 979 -2005 -886 398 -984 -1151 938 891 1271
4599 1271 2179 -712 -2640 746 2130 -1553 -1965 1716 432 -3101 -149 3560 185 -2307 1073
4614 1073 1579 -949 -1242 -226 -942 -624 1564 73 -253 1285 352 -2059 672 3077 -814 -3519
4630 -3519 90 1555 -2040 -1085 2499 1400 -1423 793 2173 -782 -1490 -316 -558 -356 1160 -387
$$ packed form
4518A862l340k23K421j88j133J446N22j053m01k23l96J239J78l015j00L527Q72
4535A995l007R31K774k486l022K945K128l285j511K852O54j560O67K70l88O71
4551F28N47j134n26Q55k287j260M325J971l743j286M164m16l630J010K660k278
4567d00k408K679J353j899j76J125n1J340L47k534j403K422j77k638K406K678
4583B664l039k861M448K205l752j145L313q54k984J119J284j382j67K089m7L80
4599A271R08k891j928L386J384l683m12L681j284l533K952L709l375k492L380
4614A073N06k528k93J016p16L18K188j491l26J538r33k411K731K405l891k705
4630c519L609J465l595R55L584j099k823K216J380k955p08J174k42K02J516j547
$$ plain form
4646 -387 -1778 625 1829 -540 -199 2412 -169 -4073 -616 2259 -1244 -2231 1674 1743 -938 238
4662 238 1741 -301 -1333 334 -107 -282 228 -828 -2130 1153 2863 -197 -1183 1797 908 -2812
4678 -2812 -1077 2316 -283 -2716 311 2297 101 -787 642 493 -160 340 -339 -1074 -42 -452 -1699
4695 -1699 427 2740 383 -2007 669 2379 -1091 -2126 1097 365 -2072 -608 1497 363 -756
4710 -756 210 988 1021 709 -953 -1822 -130 671 -1078 -645 1899 903 -1859 167 2977 210 -2400
4727 -2400 -222 1134 -856 -1414 232 673 -123 290 1027 1086 585 -681 -1705 -154 1188 -875 -2083
4744 -2083 619 1437 -790 -383 1987 1013 -1865 -875 1153 -241 -1902 -563 206 273 322 -85 295 691
4762 691 59 -971 105 1001 -855 -2181 57 1617 89 -572 996 1705 -634 -541 538 163 -1765
$$ packed form
4646c87j391K403J204k369L41K611k581l904L457K875l503r87L905O9k681J176
4662B38J503k042j032J667m41j75N10j056j302L283J710l060r86K980q89l720
4678b812J735L393k599k433L027J986k196q88J429j49o53N00o79p35J032m10j247
4695a699K126K313k357k390K676J710l470j035L223p32k437J464K105j134j119
4710g56R66P78L3l12j662q69J692Q01j749M33K544r96k762K026K810k767k610
4727b400K178J356j990n58J646M41p96M13P37N9n01j266j024J551J342k063j208
4744b083K702Q18k227M07K370r74k878R90K028j394j661J339P69O7M9m07L80L96
4762F91o32j030J076Q96j856j326K238J560j528o61J568P09k339R3J079l75j928
$$ plain form
4779 -1765 -1263 303 557 312 -441 60 1087 593 -611 -375 462 -369 -2061 -569 1413 481 -1375
4796 -1375 438 1817 462 -909 222 610 -690 -1431 -478 599 118 -704 -205 1335 1667 -216 -843
4813 -843 492 350 -1090 -1456 539 544 -1220 -506 1529 1671 -612 -626 588 676 -716 -1449 -56 573
4831 573 -490 -843 966 1542 4 -1076 195 1409 -480 -1481 -368 658 -229 -905 631 1707
4847 1707 280 -988 207 1230 -282 -1699 -759 594 -64 -895 -379 1424 502 -582 118 901 326
4864 326 -1557 -929 762 365 -1187 -93 1290 794 1 -199 932 512 -1041 -1175 259 670 -605
4881 -605 -515 876 1047 304 -124 789 432 -1075 -1567 271 493 -568 -924 812 1517 329 -204 713
4899 713 717 -743 -1206 -388 384 -794 -1040 405 1583 447 -636 322 696 -305 -1450 -261 504 -909
$$ packed form
4779a765N02J566K54k45p53N01J027m94j204K36Q37q31j692J492J982r32j856
4796a375J813J379j355j371J131L88j300p41R53J077m81q22M99J540L32j883o27
4813h43J335j42j440l66J995Nj764P14K035J42k283j4J214Q8j392p33J393O29
4831E73j063l53J809N76j538j080J271J214j889j001J113J026q87o76J536J076
4847A707j427j268J195J023j512j417R40J353o58q31N16J803r22j084P00P83n75
4864C26j883O28J691l97j552J094J383m96p93k00J131m20j553j34J434M11j275
4881f05R0J391J71p43m28R13l57j507m92J838K22j061l56J736P05j188n33R17
4899G13Mj460m63Q18P72j178k46J445J178j136j083R58L74j001j145J189P65j413
$$ plain form
4917 -909 -1265 198 1283 513 -370 163 1236 226 -1002 -672 552 -129 -1332 -454 1515 856 -613
4934 -613 -330 1447 751 -1373 -628 392 -295 -1222 -501 851 643 -39 -171 973 930 -320 -1161 -239
4952 -239 730 -854 -1479 607 1347 -305 -508 1532 1552 -502 -696 231 53 -836 -694 285 458 438 -294
4971 -294 265 1157 364 -1162 -763 534 -186 -1838 -550 1691 245 -1039 1116 1558 -467 -1144 295
4988 295 290 -847 -532 -243 -13 822 32 -324 722 1317 -421 -1155 661 327 -1948 -1159 1350 834 -1403
5007 -1403 341 1722 369 -812 173 151 -395 -434 -372 -397 561 456 -547 232 1919 258 -1519 -138
5025 -138 1103 -1132 -1961 1019 1457 -1130 -355 1466 532 -712 372 151 -246 -100 -722 -944 286
5042 286 807 -617 -324 2066 1421 -2093 -1114 1880 -265 -2177 210 1565 -960 -1036 1327 1036 -365
$$ packed form
4917i09l56J463J085p70q83N33J073j010j228L30J224o81j203Q78J969o59j469
4934f13K83J777o96k124P45J020o87r27P21J352k08o82j32J144m3j250q41R22
4952b39R69j584o25K086P40j652k03K040K0k054j94R27j78q89J42R79J73k0p32
4971b94N59Q92p93j526L99J297p20j652J288K241j446j284K155M42k025o77J439
4988B95nj137L15K89K30Q35p90l56J046N95j738p34J816l34k275P89K509n16k237
5007a403J744J381j353j181R85k2n46l9O2k5R58j05j003P79J687j661j777J381
5025a38J241k235q29K980M38k587P75J821r34j244J084k21l97J46o22k22J230
5042B86N21j424K93K390o45l514R79K994k145j912K387J355k525p6K363k91j401
$$ plain form
5059 -365 472 484 -307 -149 -357 -1407 -719 1522 272 -1009 1157 1915 -1330 -1516 1908 917 -2273 -859
5077 -859 1375 -364 -1646 736 1448 -102 784 762 -729 -435 315 -1354 -1237 1531 852 -1448 132
5094 132 2306 -250 -1451 1394 1771 -1860 -1639 714 28 -1600 158 1337 44 394 766 -755
5110 -755 -408 868 -601 -1634 705 967 -1628 -1045 2271 977 -1087 478 2449 -1064 -2087 374
5126 374 625 -1316 12 652 -5 201 660 -210 -489 1414 245 -1985 -228 1194 -1276 -1804 2022
5143 2022 2087 -981 -351 1821 -61 -1912 20 787 -831 -687 290 15 -110 1140 406 -603 1409
5160 1409 987 -1949 -1166 1543 -346 -2013 857 2233 -704 -1101 1569 882 -1196 -212 957 -397
5176 -397 -1040 -109 -307 -153 1199 257 -635 709 1358 -1272 -1530 1146 649 -2199 -386 2124 287
$$ packed form
5059c65Q37J2p91J58k08j050O88K241j250j281K166P58l245j86L424r91l190J414
5077h59K234j739j282K382P12j550Q86k2j491K94P50j669J17K768o79k300J580
5094A32K174k556j201K845L77l631K21K353o86j628J758J179j293L50L72j521
5110g55L47J276j469j033K339K62k595N83L316j294k064J565J971l513j023K461
5126C74K51j941J328O40o57K06M59q70k79J903j169k230J757J422k470n28L826
5143B022O5l068O30K172j882j851J932P67j618J44R77k75j25J250p34j009K012
5160A409m22k936P83K709j889j667K870J376k937l97K670o87k078R84J169j354
5176c97o43R31j98J54J352r42q92J344O49k630k58K676m97k848J813K510j837
$$ plain form
5193 287 -1421 756 1452 -330 -616 225 -549 -911 -159 -280 -429 957 822 -455 318 1868 -525 -1892
5211 -1892 650 1003 -1470 -1428 1045 729 -1150 221 1748 419 -688 202 -312 -748 -308 -457 -571
5228 -571 1076 1037 -980 -266 1735 688 -1719 -118 1338 -883 -1745 330 1042 -528 -160 1286 671
5245 671 -130 103 -111 -82 -108 -597 -810 92 982 -458 -798 1295 1187 -842 -733 1111 319 -1820 -780
5264 -780 838 125 -317 271 925 18 32 -440 -364 157 -324 -1161 -524 920 110 -705 1002 1459 -411
5283 -411 -1174 692 447 -975 -980 277 330 -405 112 574 711 460 -38 -189 359 63 -933 -757 884 201
5303 201 -502 280 1469 398 -747 133 860 -588 -1138 -274 356 -437 -372 414 815 469 82 -199 451
5322 451 198 -844 -821 198 62 -981 -138 1154 1025 -371 -95 919 113 -1371 -856 448 -18 -649
$$ packed form
5193B87j708K177O96j782k86Q41p74l62P52j21j49J386j35j277P73J550k393j367
5211a892K542L53k473M2K473l16j879J371J527j329j107Q90n14m36M40j49j14
5228e71J647l9k017P14K001j047k407J601J456k221q62K075P12j570L68J446o15
5245F71q01K33k14K9k6m89k13R02Q90j440l40K093j08k029J09J844p92k139J040
5264g80J618p13m42N88O54r07J4m72P6N21m81q37O37J444q10q15J707M57j870
5283d11p63J866k45j422nJ257N3p35N17M62J37k51m98j51N48k96r96J76J641o83
5303B01p03P82J189j071j145Q80P27j448n50Q64O30p93O5P86M01l46l87k81O50
5322D51k53j042K3J019j36j043Q43J292j29j396K76J014q06j484N15J304m66o31
$$ plain form
5340 -649 -553 253 768 257 -383 628 614 -418 -1085 -293 495 -679 -870 553 1370 -38 -576 478 754
5359 754 -380 -1120 -205 249 -387 -465 319 887 499 -546 97 654 20 -998 -580 85 178 -897 -267
5378 -267 1127 597 -225 -54 623 105 -905 -518 -257 -355 -674 -367 716 792 -335 129 625 680 -416
5397 -416 -995 -223 -16 -897 -510 584 867 -301 103 747 516 -421 -407 -74 -143 -704 -599 366 712 -48
5417 -48 81 710 501 -211 -721 -377 444 -636 -712 160 646 4 -131 457 759 -88 -479 -378 114 -257
5437 -257 -718 -168 601 525 -297 118 1306 477 -1201 -473 590 -170 -1153 -271 862 308 -188 323 779
5456 779 394 -596 -281 78 296 -571 -983 247 861 -149 -632 1201 1317 -556 -804 755 317 -1195
5474 -1195 -988 588 409 -299 261 364 526 300 -134 -461 88 -34 -1493 -786 1182 161 -892 610
$$ packed form
5340f49R6Q06N15n11o40J011j4j032o67P92P88j174j91J423Q17j408n38J054K76
5359G54j134p40R15M54o36p8P84N68l88j045O43N57o34j018M18O65R3j075O30
5378b67J394n30q22J71O77n18j010L87K61r8l19L07J083P6j127M64M96N5j096
5397d16n79P72K07q81L87J094K83j168M04O44k31r37J4L33o9n61J05R65L46p60
5417d8J29O29k09p12n10L44Q21j080p6Q72M86o42j35N88L02q47l91J01M92l71
5437b57m61N50P69p6q22M15J188q29j678P28J063p60r83Q82J133n54m96N11M56
5456G79l85r90L15L59K18q67m12J230O14j010m83J833J16j873k48J559m38j512
5474a195K07J576j79p08N60J03J62k26m34l27N49j22j459P07J968j021j053J502
$$ plain form
5492 610 1563 70 -1082 113 267 -822 -873 156 18 33 257 470 388 785 672 -633 -102 495 -759
5511 -759 -1250 523 815 -749 -93 1659 199 -867 53 806 -746 -1060 17 -76 -606 -68 324 279
5529 279 583 421 -428 -361 490 -537 -1457 244 1135 -651 -873 1574 758 -1022 28 1450 -240 -1338
5547 -1338 232 177 -417 -259 418 -123 628 876 -188 -654 691 135 -1805 -252 1362 -544 -1605
5564 -1605 770 1534 -337 -462 1112 430 -1079 -233 -351 -591 -141 285 -391 -75 1469 125 -1243
5581 -1243 884 1389 -1553 -1443 924 119 -1829 -113 1693 298 -559 670 273 -557 -392 -234 -974
5598 -974 242 386 -704 -362 1376 580 -1011 378 1722 -426 -1617 242 777 -1410 -571 1601
5614 1601 380 -500 612 540 -529 -237 272 -1086 -553 594 -564 -968 501 1364 -862 -10 1795
$$ packed form
5492F10R53j493j152J195J54j089n1J029j38J5K24K13q2L97j13j305N31N97j254
5511g59m91J773K92j564O56J752j460j066R20P53j552l14J077r3n30N38L92m5
5529B79L04j62q49O7Q51j027r20J701Q91j786k22K447q16j780J050J422j690j098
5547a338J570n5n94J58O77n41P51K48j064m66J345n56j940J553J614j906j061
5564a605K375P64j871j25J574o82j509Q46j18k40M50M26o76L16J544j344j368
5581a243K127N05k942J10K367q05j948J716J806j395q57J229l97q30J65J58p40
5598i74J216J44j090L42J738p96j591J389J344k148j191J859N35k187Q39K172
5614A601j221q80J112p2j069K92N09j358N33J147j158m04J469Q63k226Q52J805
$$ plain form
5631 1795 346 -1852 8 976 -973 -938 962 718 -837 294 1109 -30 -268 651 -302 -849 341
5648 341 -250 -1304 539 1308 -354 -601 1551 552 -1469 -615 1051 -405 -1533 405 725 -600 -172
5665 -172 799 158 175 669 -369 -1054 255 186 -1372 -324 1697 60 -1377 923 1524 -1017 -1291 1015
5683 1015 184 -1482 -498 843 -359 -27 710 652 -86 755 -115 -874 276 416 -1251 -835 1276 751
5701 751 -1365 143 1743 -81 -915 370 334 -946 -775 -71 -199 -66 626 264 -87 688 163 -862
5719 -862 -103 901 -461 -1327 476 835 -919 -484 1586 715 -637 -23 632 -372 -671 172 -279 -216
5737 -216 468 359 182 470 755 -719 -617 718 -78 -1714 -172 890 -341 -785 1030 975 -536 -91
5755 -91 391 -179 -493 -436 26 -320 26 94 -293 660 961 -63 -482 630 289 -1251 -679 531 129 -782
$$ packed form
5631A795j449k198J860R68j949L5J900k44j555J131Q15j139k38R19r53n47J190
5648C41n91j054J843P69j662k47K152r99k021Q54J666j456j128J938L20j325M28
5665a72R71o41J7M94j038o85J309o9j558J048K021j637j437K300O01k541k74K306
5683A015q31j666R84J341j202L32P37n8p38Q41q70p59J150J40j667M16K111n25
5701G51k116J508J600j824q34J285l6j280J71P04j28J33O92l62l51P75n25j025
5719h62P59J004j362q66J803L59j754M35K070q71j352O14O55j004k99Q43m51O3
5737b16O84j09j77K88K85j474J02J335p96j636J542J062j231m44J815n5j511M45
5755i1M82n70l14N7M62l46L46O8l87R53L01j024m19J112l41j540N72J210m02r11
$$ plain form
5775 -782 283 1193 31 -99 309 485 -467 -569 -488 110 231 -174 -259 456 788 308 -831 664 514
5794 514 -1168 -963 456 400 -974 -404 815 575 41 27 504 58 -279 -533 -614 -136 -109 -471 -51 1031
5814 1031 681 -223 384 825 -213 -1247 -256 302 -416 -652 301 775 248 -207 337 425 -42 -548 -532 -183
5834 -183 108 -366 -357 655 773 -192 -13 639 129 -987 -645 343 -152 -623 -262 808 417 160 87 479
5854 479 380 -366 -331 -212 43 -400 -574 191 628 122 -188 440 543 -276 -401 -35 -121 -807 -411 52 725
5875 725 21 65 286 639 -6 -592 -278 173 -249 -454 -27 484 208 -229 343 942 238 -653 -369 170
5895 170 -198 -887 -119 465 411 -187 27 647 239 -356 -274 237 -300 -751 -418 529 514 -71 152 645 338
5916 338 -421 -502 254 -95 -758 -473 221 242 -209 -216 194 657 -7 -696 66 184 -490 -896 -141 756 -197
$$ packed form
5775g82J065R10j162j30M08J76r52j02Q1N98J21m05q5P15L32m80j139J495j50
5794E14j682K05J419n6j374N70J219k40n34j4M77m46l37k54q1M78K7l62M20J082
5814A031l50r04O07M41j038j034R91N58p18k36R53M74n27m55N44Q8m67n06J6L49
5834a83K91m74RJ012J18r65J79O52n10j116L42R88m95m71L61J070l91k57p3L92
5854D79r9p46L5J19K55m43j74P65M37n06l10O28J03q19j25L66q6o86L96M63O73
5875G25p04M4K21L53o45n86L14M51m22k05M27N11k76m37N72N99p04q91K84N39
5895A70l68o89P68N84n4n98K14O20m08n95Q2N11n37m51L33R47j5n85K23M93l07
5916C38p59q1P56l49o63K85O94K1m51pM10M63o64o89P62J18o74m06P55Q97r53
$$ plain form
5937 -197 -175 897 528 -166 -389 5 -114 -422 -394 18 8 333 -245 175 776 493 -469 -284 246 -74 -937
5958 -937 -261 512 84 -93 250 751 179 -242 146 136 -300 -501 -297 -177 159 -93 -240 845 804 -166
5978 -166 -434 452 340 -1364 -530 413 68 -623 47 859 402 -267 188 -3 -214 -412 -555 -445 521 448
5998 448 -269 431 1194 137 -812 101 486 -718 -1259 313 354 -605 -6 792 394 -60 269 248 -67 -108
6018 -108 -245 -846 -452 460 -646 -446 1224 512 -453 20 1033 -79 -1138 -92 436 -676 -537 463
6036 463 407 225 511 196 -51 -58 -58 -660 -361 671 97 -890 686 927 -531 -445 1212 82 -834 -214
6056 -214 236 -832 -354 618 590 151 408 350 -133 29 134 -807 -860 468 -36 -1046 -9 1323 -214
6075 -214 -698 845 879 -890 -545 450 -500 -912 256 934 -109 401 518 -370 318 796 -453 -972 242
$$ packed form
5937a97K2J072l69o94k23L94j19l08K8M12j0L25n78M20O01k83r62J85N30l20q63
5958i37O76P73m28j77L43N01n72m21L88j0m36k01K04J20L36k52j47J085m1r70
5978a66k68Q86j12j704Q34R43l45o91O70Q12m57o69M55j91k11j98j43J10R66p3
5998D48p17P00P63j057r49R13L85j204n41J572M1r59N99P98l98m54L29k1l15m1
6018a08j37o01L94R12j106K00J670p12r65M73J013j112j059J046N28j112J39J000
6036D63n6j82K86l15k47p%o02K99J032n74r87J576K41j458Q6J657j130r16O20
6056b14M50j068M78R72k8m39K57n8m83J62J05r41n3J328n04j010J037J332j537
6075b14m84J543L4j769L45R95r50m12J168O78j043N10J17q88O88M78j249n19J214
$$ plain form
6094 242 357 -1200 -695 1340 572 -785 468 1027 -707 -908 129 155 -401 -11 292 -425 309 640
6112 640 -221 92 1139 175 -1451 -101 1016 -819 -1202 843 759 -497 247 1112 91 -733 202 109
6130 109 -631 49 -9 -763 34 775 358 -171 701 862 -632 -716 432 -396 -1197 475 1374 -493 -632
6149 -632 1015 684 -152 191 192 -807 -501 310 -636 -451 611 541 -146 606 1027 -386 -675 352 -95 -1169
6169 -1169 -23 746 -187 -559 782 486 -305 275 454 -536 -438 314 -247 -613 477 437 -308 494 1333
6188 1333 -481 -1003 484 697 -1173 -956 781 24 -833 586 972 3 -215 332 -276 -455 202 -427
6206 -427 -613 348 259 -612 -121 1451 579 -627 220 1150 -406 -1068 402 250 -393 140 417 103 48
6225 48 249 92 -388 303 -415 -915 72 548 -195 -535 745 876 -498 -104 722 -295 -920 -179 581
$$ packed form
6094B42J15j557N05K035p68j357J253N59j734k01J037K6n56L90L03p17P34L31
6112F40q61L13J047r64j626J350J117j835l83K045q4j256P44Q65j021q24R35r3
6130A09p40O80n8p54P97P41m17n29Q72J61j494q4J148q28q01J672Q99j867j39
6149f32J647l31q36L43Jr99L06Q11r46J85J062p0o87P52M21j413k89J027m47j074
6169a169J146P69r33l72J341k96p91N80J79r90R8P52n61l66J090m0p45Q02Q39
6188A333j814n22J487K13j870K17J737p57q57J419L86r69k18N47o08j79O57o29
6206d27j86R61q9q71M91J572q72j206Q47R30j556o62J470j52o43N33K77l14n5
6225D8K01j57m80O91p18n00R87M76p43l40J280J31j374L94Q26j017o25P41P60
$$ plain form
6244 581 -98 -141 205 92 231 480 -103 -573 165 124 -512 -401 168 -90 -714 570 1106 -94 -282 465
6264 465 258 -696 -272 -126 -340 -344 95 347 247 287 442 -469 6 489 -442 -394 58 174 -256 160 966
6285 966 436 -313 444 549 -158 -54 -139 -386 -748 -338 -150 283 397 245 -85 196 433 -425 -747 60
6305 60 25 -509 -448 480 269 -490 343 583 403 -674 -181 269 7 -527 -283 211 425 202 327 223 621
6326 621 -66 -680 -227 368 -29 -727 -79 652 141 316 483 247 -51 -550 -354 209 -72 -222 -524 530
6346 530 396 13 175 406 92 -417 -396 160 196 -771 -283 541 585 27 111 404 22 33 -294 -49 -48 -700
6368 -700 -185 140 553 301 -174 199 519 -201 -411 93 -349 -629 -334 232 580 157 40 215 427 226
6388 226 -30 -88 -271 -393 -188 -1 347 22 -208 337 509 256 -296 -23 -67 -161 -539 40 212 -267 -186
$$ packed form
6244E81o79m3L46j13J39K49n83m70P38m1o36J11N69k58o24J284N36j200j88P47
6264D65k07r54M24J46k14mM39K52j00M0J55r11M75M83r31M8M52J16m30M16Q06
6285I66n30p49P57J05p07J04q5k47l62M10J88M33J14j52l30K81K37q58l22Q07
6305F0l5n34O1R28k11p59Q33K40j80j077M93M50k62n34K44M94K14k23J25j04L98
6326F21o87o14M53N95l97o98O48P31n11J75J67k36k98m99J96N63k81j50l02J054
6346E30j34l83J62K31l14n09K1N56L6r67M88Q24M4n58Q4K93l82J1l27K45Jo52
6368g00N15L25M13k52m75L73L20p20k10N04m42k80K95N66L48m23j17J75K12k01
6388B26k56n8j83j22K05J87L48l25k30N45J72k53n52K73m4r4l78N79J72m79Q1
$$ plain form
6409 -186 689 584 97 -423 -79 217 -103 -227 83 47 60 -203 406 935 617 -525 -477 471 256 -669 -201
6430 -201 175 -41 0 381 483 55 -65 -105 129 361 -571 -1016 -18 237 113 -87 642 445 -54 -16 459
6451 459 405 -369 -638 94 407 40 -317 162 218 213 10 152 236 -216 -839 -349 505 -69 -279 137 619 291
6473 291 18 52 -81 -467 -373 -39 170 -12 -99 -175 159 828 328 -374 -350 -159 -283 -335 123 -182 -599 0
6495 0 771 604 -73 216 252 -217 -253 -94 -166 -138 67 198 386 486 104 -381 -237 511 -41 -781 -121 41
6517 41 -583 -323 818 116 -438 188 596 139 -239 68 -354 -543 -48 283 164 115 472 -164 -101 606 314
6538 314 -836 -380 300 -120 -852 362 629 -349 126 889 490 -185 -224 -368 -573 252 176 -561 256 1051
6558 1051 285 -332 523 270 -743 -378 457 -31 -996 -335 729 16 342 841 174 -388 343 179 -230
$$ packed form
6409a86Q75j05m87n20L44K96l20j24L10l6J3k63O09N29l18j142M8R48k15r25M68
6430b01L76k16M1L81J02m28j20m0K34K32r32m45R98K55j24k00P29j97m99L8M75
6451D59n4p74k69P32L13l67l57M79N6nk03J42Q4m52o23M90Q54n74k10M16M82l28
6473B91k73L4j33l86R4L34K09j82q7p6L34O69n00p02K4J91j24n2M58l05m17N99
6495@P71j67o77K89L6m69l6J59p2K8K05J31J88J00l82m85J44P48n52p40O60J62
6517D1o24K60J141p02n54O26M08m57l78L07m22j89M95L31j19m9L57o36O3P07k92
6538C14j150M56O80m20p32J214K67r78M75P63l99o75l9j44k05Q25p6p37Q17P95
6558A051p66o17Q55k53j013L65Q35m88r65O61J064p13L26M99o67n62P31j64m09
$$ plain form
6577 -230 -67 -55 -891 -420 706 634 -297 363 717 -316 -316 190 31 -1288 -389 662 227 -37 573 80
6597 80 -567 405 551 -333 -276 39 -439 -621 933 640 -630 -129 983 -7 -737 250 46 -846 -376 795
6617 795 101 -542 205 413 7 511 594 -571 -668 276 -140 -515 178 683 -611 -177 1035 383 -726
6636 -726 -221 479 -536 -501 350 -386 -554 -14 919 78 433 487 -546 -590 375 313 -855 -465 585 -229
6656 -229 -428 842 715 -571 -441 647 -5 -732 -158 -246 -492 156 730 63 -22 627 50 -454 404 164
6676 164 -1010 -769 632 365 -566 245 815 -100 74 837 67 -803 -625 -156 -276 86 320 -540 -309
6695 -309 745 501 -333 -182 150 -600 -757 487 445 -928 -146 913 335 131 441 179 -655 -147 384
6714 384 -201 -386 -118 -329 -77 723 625 -267 -485 563 34 -850 46 32 -686 -335 572 518 58 98 157
$$ packed form
6577b30J63J2q36M71J126p2r31O60L54j033%N06j59j319Q99J051m35k64O10m93
6597H0o47R72J46q84N7L15m78j82J554k93j270N01J112r90p30R87k04q92M70J171
6617G95o94o43P47K08m06N04Q3j165r7R44m16l75O93N05j294M34J212o52j109
6636g26N05P00j015L5Q51p36j68N40R33q41L55N4j033m4R65o2j168L90J050q14
6656b29j99J270j27j286J30J088o52p27N74q8k46O48N74o67q5O49n77n04Q58k40
6676A64j174K41J401k67r31Q11N70r15J74P63p70q70J78M69j20L62K34q60K31
6695c09J054k44q34J51L32p50j57J244m2j373P82J059n78k04L10k62q34N08N31
6714C84n85j85K68k11K52Q00r8q92k18J048n29q84Q96j4p18L51R07n4m60M0N9
$$ plain form
6735 157 -273 -18 250 -620 -531 75 -7 -64 413 479 -350 -306 601 273 -648 -211 236 -239 -302 459 650 73
6757 73 173 287 158 28 -1 -625 -531 121 322 -157 -31 527 24 -545 362 547 -288 -736 148 -76 -366
6778 -366 59 213 160 74 386 224 58 227 -353 -418 -70 181 -496 -268 322 308 -18 66 158 -296 -640 218
6800 218 200 -343 -371 -236 243 27 473 110 122 119 -251 -277 -293 -18 -537 -464 577 347 -17 -149 275 162
6822 162 -196 33 14 -362 -936 -30 409 221 174 320 403 213 237 104 -157 -1 -491 -382 -15 363 -180
6843 -180 46 403 596 126 -244 -18 -101 -115 -186 -69 14 -42 -45 383 254 234 -298 -161 27 13 -378 111 260
6866 260 117 -141 528 734 269 -448 -280 138 -98 -317 -388 -273 61 -47 569 461 281 -73 -167 21 -13
6887 -13 -380 -372 -82 91 119 390 366 210 -198 -100 -115 12 -431 -361 -171 67 342 206 192 330 390 64 -19 108
$$ packed form
6735A57m30K55K68q70Q9O06q2n7M77O6q29M4R07l28r21M37M47m75o3P61J91n77
6757G3J00J14j29j30k9o24R4O52K01m79J26N58n03n69R07J85q35m48Q84k24k90
6778c66M25J54n3q6L12j62j66J69n80o5L48K51o77K28N90j4l26Q4R2m54l44Q58
6800B18j8n43k8J35M79k16M46l63J2ll70k6j6K75n19P3J041k30l64j32M24j13
6822A62l58K29j9l76n74R06M39j88m7J46Q3j90K4j33k61J56m90J09L67L78n43
6843a80K26L57J93m70l70K26q3j4p1J17Q3n6lM28j29k0n32J37J88j4l91M89J49
6866B60j43k58O69K06m65p17J68M18k36k19p1J15L34j08O16j08j80l54r4J88l4
6887a3l67QK90J73K8K71k4j56m08R8j5J27m43P0J90K38K75j36j4J38O0l26q3J27
$$ plain form
6911 108 -432 -580 -203 88 20 7 357 138 111 26 269 -271 -246 -399 -107 -63 -174 -375 66 551 534 315
6933 315 256 -102 -240 -409 339 141 -242 -173 65 377 78 77 197 43 -379 -225 239 -171 -256 -285 -495 235
6955 235 461 30 -299 234 38 -382 -399 378 23 -252 167 533 225 134 394 159 165 -116 -549 -269 -293 26
6977 26 -432 -18 374 157 -270 445 490 -13 -762 3 -135 -93 -29 206 186 168 332 207 154 -46 -268 -555
6999 -555 -191 332 -268 -298 310 357 -71 241 704 165 -586 -176 78 -429 -69 45 39 7 259 191 -269 179
7021 179 -53 -310 -213 248 -361 -539 162 301 -307 -77 399 565 -364 27 61 -444 -317 -165 -362 -153 645
7042 645 0 -17 184 694 -66 -165 190 -292 -538 197 403 46 -341 533 270 -79 120 -26 -524 -293 57
7063 57 -1 -214 -48 363 -201 405 595 -38 -541 472 -26 -322 -587 630 -99 -376 479 669 9 -241
$$ packed form
6911A08n40j48L77K91o8j3L50k19k7q5K43n40K5j53K92M4j11k01M41M85j7k19
6933C15n9l58j38j69P48j98l83O9K38L12k99jJ20j54m22J54M64m10q5k9k10P30
6955B35K26m31l29N33j96m20j7P77l55k75M19L66l08r1K60k35Ok81m33K80k4L19
6977B6m58M14L92k17m27P15M5n03p49P65j38M2O4K35k0j8J64j25n3k00k22k87
6999e55L64N23o00l0O08M7m28L12M63n39p51M10K54n07L60J14ol2K52o8m60M48
7021A79k32k57R7M61o09j78P01J39o08K30M76J66r29L91L4n05J27J52j97K09P98
7042F45o45j7K01N10p60r9L55m82k46P35K06l57l87Q74k63l49J99j46m98K31L50
7063E7n8k13J66M11n64O06J90o33n03J013m98k96k65J217p29k77Q55J90o60k50
$$ plain form
7083 -241 214 102 -403 -9 113 -427 186 149 -70 204 747 -106 -764 76 460 -695 -350 333 309 -455
7103 -455 116 286 36 46 100 -172 -117 9 67 -412 -86 361 -324 -222 684 491 -632 -238 427 -219 -566
7124 -566 24 17 -183 205 588 -43 7 491 73 -574 126 272 -442 -422 608 -56 -235 209 654 -429 -381
7145 -381 492 -15 -688 70 555 -749 -210 295 176 -188 404 263 -364 142 191 -538 -436 497 62 -354
7165 -354 192 741 -49 -451 581 6 -790 -355 357 -374 -581 646 183 2 262 284 -279 -238 373 -27
7185 -27 -622 -28 245 -341 -40 491 76 -378 232 483 -759 -396 -86 -113 -523 180 260 -97 275 507 -181
7206 -181 -113 447 -58 -588 -388 533 -655 -288 673 326 -296 77 425 -94 -159 88 314 -635 -72 139
7226 139 -271 33 460 -66 -93 383 151 -725 -352 253 -394 -453 312 476 -261 32 282 72 -220 2 -263
$$ packed form
7083b41M55j12n05L94J22n40O13l7k19K74N43q53o58Q40L84j155L45O83k4p64
7103d55N71J70k50J0N4k72N5J26N8m79L26M47o85J02R06j93j123L94O65o46l47
7124e66N90pk00L88L83o31N0M84m18o47P00J46p14K0J030o64j79M44M45j083M8
7145c81Q73n07o73P58M85j304N39N05j19l64N92j41o27N06M9p29J02R33m35m16
7165c54N46N49p90m02J032n75p96M35P12p31k07J227m63j81K60K2n63M1O11m00
7185b7n95N94K73n86L01N31m15m54O10K51j242L63L10k7m10P03Q0l57L72K32o88
7206a81O8N60n05n30K00R21j188L67R61l47o22L73L48n19o5K47K26r49N63K11
7226A39m10L04M27n26k7M76k32q76L73O05o47n9P65J64p37K93K50k10k92K22k65
$$ plain form
7247 -263 -383 -315 -35 156 -195 496 672 -234 408 666 -283 -260 145 -64 -490 -117 620 -124 -58 618 259
7268 259 -121 94 341 -420 -489 -131 57 -254 519 211 51 264 398 -84 -498 81 37 -367 101 45 -16
7289 -16 -304 264 620 184 134 44 -212 -280 -65 -62 -138 287 245 -322 352 395 -103 -206 117 79 -423 -439 -126 -7
7313 -7 -370 151 663 -74 -86 3 -144 -236 -14 -231 -123 -226 150 -17 197 413 121 -300 -179 31 -231 -487
7335 -487 -54 141 -7 -249 305 112 151 274 117 -81 -83 -217 -572 57 207 24 -2 374 277 -15 -193 108
7357 108 -84 -403 -200 162 -210 2 387 598 350 89 155 -124 -110 -359 -123 -597 63 1 -45 301 483
7378 483 276 96 109 256 -199 -455 -65 -178 -1 313 -1 319 77 65 32 170 -131 -110 -356 -31 -306
7399 -306 -155 112 191 288 -71 20 141 -141 -523 -235 -50 -14 -129 3 206 197 76 -96 -67 150 -198 -457
$$ packed form
7247b63j20O8K80J91l51O91J76r06O42K58r49K3M05k09m26L73P37p44O6O76l59
7268B59l80K15K47p61o9L58J88l11P73l08j60K13J34m82m14N79m4m04M68n6o1
7289a6k88N68L56m36n0r0k56o8K15Lp6M25m2n67O74M3m98j03L23l8n02j6L13J19
7313gl63N21N12p37j2Q9j47r2K22k17J08j03L76j67K14K16k92m21J21K10k62k56
7335d87M33J95j48k42N54j93L9J23j57j98kj34l55O29J50j83k6L76r7k92j78L01
7357A08j92l19K03L62l72K12L85K11k48k61O6k79J4k49K36m74O60o2m6L46J82
7378D83k07j80J3J47m55k56L90j13J77L14l14L20k42j2l3J38l01K1k46L25k75
7399c06J51K67P9R7l59R1J21k82l82K88J85L6j15J32K03rj21j72K9K17l48k59
$$ plain form
7421 -457 -437 17 -311 -278 328 328 -41 -114 213 -14 -86 -183 -101 -89 -64 60 22 261 359 -5 -83 218 57 -393
7445 -393 -367 -209 -191 -248 437 368 286 133 152 82 -368 56 -109 -143 -241 -158 8 273 132 334 10 172 61
7468 61 -381 -293 -15 83 -415 -303 304 100 -77 227 185 -118 68 218 89 -187 -114 -103 -44 227 449 -354
7490 -354 481 240 -138 -27 -196 219 -162 -154 326 190 -31 154 246 182 -399 92 -172 0 -209 -161 -191 227
7512 227 165 -75 64 301 228 -615 -343 322 -673 -612 139 106 -128 308 365 135 44 294 -144 -25 -30 -173 -139
7535 -139 116 268 -91 6 320 457 -154 -340 -99 -105 -626 -136 -94 -344 181 396 258 -206 285 120 -457
7556 -457 -89 -304 -286 -227 344 104 -103 183 595 12 109 234 -122 -573 66 -25 -176 -97 156 68 -27 383
7578 383 -125 -314 -331 86 -572 -497 328 -2 -189 217 732 51 -145 361 153 -278 -97 275 -97 -368 190
$$ packed form
7421d57K0M54l28L3O06%l69p3L27k27p2r7Q2J2K5J24l8K39R8l64p8L01j61m50
7445c93K6J58J8n7O85o9q2j53J9p0m50M24j65l4r8Q3J66K65j41K02l24J62j11
7468F1m42Q8K78R8m98J12O07k04j77L04m2l03J86J50j29k76P3J1N9K71K22q03
7490c54Q35k41l78J11j69M15l81QM80j36k21J85R2o4n81M91k64J72k09M8l0M18
7512B27o2k40J39K37p3q43K72O65r95O1P51l3k34M36N7k30r1K50m38J19nj43L4
7535a39K55J52l59R7L14J37o11j86K41on21M90M2k50N25K15j38m64M91j65n77
7556d57L68k15J8N9N71k40k07K86M12n83R7J25l56m51O39r1j51P9K53q8r5M10
7578C83n08j89j7M17o58P5Q25l30j87M06N15o81j96N06k08m31J81L72l72k71N58
$$ plain form
7599 190 215 -61 180 228 -224 -293 160 -174 -478 -249 -23 -286 -138 640 320 -387 229 142 -358 -35 253
7620 253 -319 -444 350 19 -240 366 301 -376 -364 267 -44 -666 -289 396 -40 -224 232 548 -112 162 306
7641 306 -86 -75 283 -301 -651 268 124 109 231 753 6 -255 115 300 -579 -96 298 -264 -263 136 293
7662 293 -37 -68 268 -198 -168 322 -29 -318 -144 253 21 -110 681 565 -301 147 347 -344 -406 327 -185
7683 -185 -194 51 449 24 70 513 227 -219 -231 123 -307 19 284 -301 -330 323 253 3 269 774 -145 -551
7705 -551 186 173 -658 -166 436 116 -91 402 285 -534 2 265 -359 -122 -87 50 -508 484 559 -201 108
7726 108 574 167 -297 45 103 -195 -407 422 375 -332 144 323 -106 244 161 -530 -429 351 -56 -404 138
7747 138 430 36 -283 474 198 28 -189 355 -275 -365 -8 16 -196 51 526 57 94 492 -232 -393 9
$$ packed form
7599A90K5k76K41M8m52o9M53l34l04K29K26k63J48P78l20p07O16q7n00L23K88
7620B53n72j25P94l31k59O06o5o77J2O31l11o22L77O85m36j84M56L16o60K74J44
7641C06l92J1L58n84l50R19j44j5J22N22p47k61L70J85q79M83L94n62JL99J57
7662B93l30l1L36m66L0M90l51k89J74L97k32j31P91j16q66M48K00o91o2P33n12
7683a85rK45L98m25M6M43k86m46j2L54m30L26K65n85k9O53p0k50K66N05r19m06
7705e51P37j3q31M92O02l20k07M93j17q19N36K63o24K37L5J37n58R92P5p60L09
7726A08M66m07m64L42N8k98k12Q29m7p07M76J79m29L50q3o91J01P80m07l48N42
7747A38K92l94l19P57k76j70k17N44o30r0L57K4k12K47M75m69L7L98p24j61M02
$$ plain form
7768 9 -99 -129 -198 94 75 20 441 429 -273 -199 205 -140 -545 211 -112 -138 -69 275 181 -52 191 180 -162 -209
7792 -209 53 -270 -77 -103 35 -25 284 307 -54 -47 -10 59 -174 -266 41 -110 -258 36 26 -19 -45 83 48 -61
7816 -61 -11 -498 -180 13 19 -118 -212 422 303 -34 -112 164 -154 -383 -147 -197 -151 -37 77 11 229 97 13
7839 13 -342 19 -160 -308 159 419 -333 -338 -14 490 27 173 150 44 16 -224 -133 -197 176 -300 -126 72
7861 72 360 138 -69 291 72 -520 -273 -590 -24 -288 151 372 314 21 -26 289 -83 16 -453 -246 -95
7882 -95 13 -22 50 92 129 -17 -61 -54 -94 -86 -16 -41 -150 -26 257 -55 258 470 106 101 -42 -269 -160 -225 -234 22
7908 22 243 103 407 -143 197 -188 -50 -33 -264 25 -195 -311 175 311 -27 181 208 255 -76 -183 -277 -119
7930 -119 161 -93 -192 13 135 -76 164 82 63 -90 41 239 -202 61 89 176 87 361 186 339 73 15
$$ packed form
7768Ij08l0o9K92j9n5M21j2p02P4M04l45m05P56l23k6O9L44r4k33K43j1l42m7
7792b09K62l23J93k6J38o0L09K3l61PL7O9k33r2L07j51j48K94j0m5k6J28l5j09
7816f1N0m87L18J93Oj37r4O34j19l37p8K76l18k29K36n0M6J14J14o6K18j32q4
7839A3l55L61j79j48M67K60p52nL24N04m63J46k3j06k8k40R1o4L73m76J74J98
7861G2K88k22k07L60k19n92K47l17N66k64M39K21n8k93m7L15l72R9m69K07J51
7882i5J08l5P2M2L7j46m4Pm0QP0k5j09J24K83l12L13K12l64nj43k27J09o5rK56
7908B2K21j40L04n50L40l85J38J7k31K89k20j16M86J36l38K08K7M7l31j07r4J58
7930a19K80k54r9K05J22k11K40q2j9j53J31J98m41K63K8Q7q9K74j75J53k66n8
$$ plain form
7952 15 -153 -320 40 -15 -332 24 369 258 -173 274 130 5 -94 74 -261 -221 -99 46 212 -15 260
7973 260 350 -16 184 -143 -342 -242 -4 -418 -154 -29 27 78 -133 368 85 -14 159 -349 -276 -16 88 -16
7995 -16 174 310 108 -42 48 -189 -75 -168 97 -220 -157 100 7 59 215 375 124 -87 -198 -9 186 -10
8017 -10 -15 -307 -55 165 154 -49 393 352 89 116 268 -95 -22 -411 12 -17 -10 367 78 -147 114 50 -191 -336
8041 -336 125 -197 -334 66 171 -102 346 289 -246 -184 128 -73 -557 -72 132 -322 -456 214 -28 -50 7
8062 7 91 -195 -208 -192 -211 -164 115 141 14 67 621 227 -321 54 -103 -53 -341 175 -242 -211 85 372 -129 324
8086 324 347 -65 71 164 -137 -284 19 267 -346 -14 308 411 -87 369 406 -552 -502 186 28 -271 49
8107 49 74 68 12 477 16 -191 222 105 -407 -364 173 -186 -376 -27 215 -227 -56 435 -84 -537 -288 -234
$$ packed form
7952A5j68j67L60n5l17L56L45j11m31M47j44j25r9J68l35M0J22J45J66k27K75
7973B60R0l66K00l27j99J00K38m14K64J25N6N1k11N01k83r9J73n08P3K60J04j04
7995a6J90J36k02j50R0k37J14r3K65l17O3K57r3N2J56J60k51k11j11J89J95j96
8017a0nk92K52K20j1k03M42m1k63K7J52l63P3l89M23k9PL77k89k25K61o4k41j45
8041c36M61l22j37M00J05k73M48n7n35O2L12k01m84M85K04m54j34O70k42k2N7
8062GQ4k86j3J6j9M7K79K6j27N3N54l94n48L75j57N0k88N16m17L1K96K87n01M53
8086C24K3m12J36R3l01j47L03K48o13L32L22J03m98M56L7r58N0O88j58k99L20
8107D9K5on6M65m61k07M13j17n12M3N37l59j90L49K42m42J71M91n19m53K49N4
$$ plain form
8129 -234 -631 -40 333 -222 -106 450 272 -60 295 270 -436 -227 -4 -114 -402 500 325 -62 85 356
8149 356 81 -337 -183 42 -329 -31 38 -116 -102 366 178 -222 65 547 -147 -451 -68 -172 -781 -105 296
8170 296 -17 71 404 309 -429 -77 280 -239 -275 512 -130 -467 238 274 35 119 362 -91 -548 362 219
$$ packed form
8129b34l97N91L73n55J16N56j78l32L55k5p06K09K23j10k88R02j75l87J47K71
8149C56k75m18J54K25l71K98O9j54J4M68j88m00K87M82o94l04L83j04o09O76M01
8170B96l13Q8L33r5p38L52L57n19l6P87o42l37P05L6k39Q4K43m53m57R10j43
8191B19
$$ Imaginary data points
##PAGE= N=2
##DATA TABLE= (X++(I..I)), XYDATA
$$ plain form
0 0 0 0 0 0 0 0 0 0 1 -8 8 -16 16 -17 24 -32 40 -47 57 -67 81 -97 114 -137 159 -187 217 -250 290 -331 380
31 380 -432 490 -556 627 -707 794 -890 993 -1109 1235 -1370 1522 -1684 1863 -2060 2271
47 2271 -2507 2759 -3042 3351 -3690 4070 -4489 4962 -5491 6098 -6794 7599 -8555 9698
61 9698 -11103 12873 -15186 18348 -22952 30310 -43970 77963 -348813 -347017 357201 100177
73 100177 -68842 201569 472711 228290 45482 -7775 -152781 -376311 -293792 -100091
83 -100091 -45488 -82211 78600 326719 402904 195872 -13629 -55702 -65669 -230964 -347429
94 -347429 -240576 -47096 61266 173604 264640 213973 107081 105825 68713 -120924 -283261
105 -283261 -270537 -189281 -90108 45282 137345 168468 245030 284483 123481 -106263 -186194
$$ packed form
0@%%%%%%%%JrJ6k4L2l3M1n6P2q7J04j24J48j78K11k51K96l46M04m67N40o21P11
31C80q12R22j046J183j334J501j684J883k102K344k605K892l206L547l923M331
47B271m778N266n801O393p041P760q559R451j0453J1589j2892J4393j6154J8253
61I698k0801K3976k8059L3534m1300N3262p4280J21933m26776J796P04218k57024
73A00177j69019K70411K71142k44421j82808n3257j45006k23530Q2519J93701
83a00091N4603l6723J60811K48119P6185k07032k09501m2073r967j65295j16465
94c47429J06853J93480J08362J12338R1036n0667j06892j256l7112j89637j62337
105b83261J2724Q1256R9173J35390R2063L1123P6562L9453j61002k29744p9931
$$ plain form
116 -186194 -187418 -214381 -183744 -79748 8930 113636 239783 248038 141739 73509 15185
127 15185 -124035 -226627 -206149 -173734 -135147 16062 182670 214088 189840 184663 95431
138 95431 -68770 -151506 -154607 -180252 -179361 -87593 22703 106325 186477 217731 158708 71515
150 71515 -10257 -109163 -182566 -190714 -176106 -117721 35721 169849 167841 141873 174070 119294
162 119294 -53739 -146128 -126761 -154437 -195450 -102816 46222 108147 137425 197541 198250 86500
174 86500 -53125 -134029 -153659 -156773 -165904 -117873 32828 168901 171540 130188 141378 104920
186 104920 -33684 -134566 -139398 -154345 -175366 -91285 54765 131656 144015 155662 143695
197 143695 76386 -22468 -121055 -176009 -157308 -106913 -64625 10362 117327 162007 132158 112287
$$ packed form
116a86194j224k6963L0637J03996Q8678J04706J26147Q255j06299o8230n8324
127A5185j39220j02592K0478L2415L8587J51209J66608L1418k4248n177q9232
138I5431j64201q2736l101k5645Q91R1768J10296Q3622Q0152L1254n9023q7193
150G1515q1772r8906p3403q148J4608N8385J53442J34128k008k5968L2197n4776
162A19294j73033r2389J9367k7676m1013R2634J49038O1925K9278O0116P09j11750
174H6500j39625q0904j9630l114r131M8031J50701J36073K639m1352J1190l6458
186A04920j38604j00882m832j4947k1021Q4081J46050P6891J2359J1647j1967
197A43695o7309r8854r8587n4954J8701N0395M2288P4987J06965M4680k9849j9871
$$ plain form
209 112287 90463 -6812 -121920 -155087 -139200 -127913 -78975 25851 114071 145173 141595 119253
221 119253 72464 -6083 -106106 -171396 -149984 -89675 -55203 -6242 93645 161106 143488 107722
233 107722 76300 -9251 -120357 -156412 -126466 -105878 -75343 14400 113453 152097 134517 99278
245 99278 56219 -7964 -94431 -159661 -149449 -85748 -36974 4014 81734 151225 143993 94738
257 94738 54789 -11787 -110932 -155514 -116728 -76199 -59525 -3792 97865 159487 137164 80018
269 80018 36891 -10377 -84786 -145401 -136213 -81217 -39935 1789 85960 157425 137710 70026
281 70026 34097 -1435 -85619 -151440 -130626 -73667 -38714 6754 87154 144486 132021 79429
293 79429 29000 -19326 -78054 -129966 -134261 -85064 -26265 18857 74839 135976 139167 74479
$$ packed form
209A12287k1824r7275j15108l3167J5887J1287M8938J04826Q8220L1102l578k2342
221A19253m6789p8547j00023o5290K1412O0309L4472M8961R9887O7461j7618l5766
233A07722l1422q5551j11106l6055K9946K0588L0535Q9743R9053L8644j7580l5239
245I9278m3059o4183q6467o5230J0212O3701M8774M0988P7720O9491p232m9255
257I4738l9949o6576r9145m4582L8786M0529J6674N5733J01657O1622k2323n7146
269H0018m3127m7268p4409o0615R188N4996M1282M1724Q4171P1465j9715o7684
281G0026l5929l5532q4184o5821K0814N6959L4953M5468Q0400N7332j2465n2592
293G9429n0429m8326n8728n1912m295M9197N8799M5122N5982O1137L191o4688
$$ plain form
305 74479 13520 -14682 -61484 -129268 -143539 -84085 -15790 26498 69889 119811 131537 85070
317 85070 21186 -24365 -66769 -118255 -136886 -87106 -13743 28135 62751 115219 135187 82759
329 82759 13790 -21197 -59653 -119163 -137532 -82513 -12183 29831 64661 107841 124650 88808
341 88808 23387 -31513 -69548 -107872 -127543 -89299 -13169 37268 60411 98683 129230 92260
353 92260 16091 -32052 -63524 -109157 -127960 -81236 -11655 30797 60367 98855 122061 94521
365 94521 23861 -42373 -74212 -92319 -111699 -93731 -21848 42635 64905 87798 120004 98374
377 98374 17759 -45450 -67596 -90952 -112774 -86684 -20095 36524 65866 87775 108705 97332
389 97332 29979 -50502 -80758 -76225 -91577 -99171 -38567 45380 76331 81846 105142 96197 21949
$$ packed form
305G4479o0959k8202m6802o7784j4271N9454O8295M2288M3391M9922J1726m6467
317H5070o3884m5551m2404n1486j8631M9780P3363M1878L4616N2468J9968n2428
329H2759o8969l4987l8456n9510j8369N5019P0330M2014L4830M3180J6809l5842
341H8808o5421n4900l8035l8324j9671L8244P6130N0437K3143L8272L0547l6970
353I2260p6169m8143l1472m5633j8803M6724O9581M2452K9570L8488K3206k7540
365I4521p0660o6234l1839j8107j9380J7968P1883O4483K2270K2893L2206k1630
377I8374q0615o3209k2146k3356k1822K6090O6589N6619K9342K1909K0930j1373
389I7332o7353q0481l0256M533j5352p594O0604Q3947L0951N515K3296q945p4248
$$ plain form
402 21949 -48861 -68428 -76571 -97657 -90905 -34691 36717 79005 86132 87579 85333 42344 -37557
415 -37557 -83789 -78677 -83718 -95003 -41880 48005 81083 73392 88281 89240 28062 -42290 -67614
428 -67614 -75824 -87041 -77091 -38226 18577 74722 97179 82621 66080 42384 -21252 -81810
440 -81810 -83655 -72312 -83910 -50464 41324 91654 72096 63974 74670 40458 -24478 -62955
452 -62955 -78161 -87829 -75306 -35687 19587 73772 93138 71987 58529 50274 -11042 -92234
464 -92234 -98377 -57703 -53303 -44478 23088 76556 68325 61934 74644 43576 -24697 -66266 -76429
477 -76429 -75733 -61611 -37677 1524 69140 112831 77234 27551 26449 5210 -69557 -97188 -54917
490 -54917 -39243 -45942 7592 73923 71008 49589 62657 52964 -7197 -64106 -90088 -84918 -47787
$$ packed form
402B1949p0810j9567q143k1086O752N6214P1408M2288P127J447k246m2989p9901
415c7557m6232N112n041j1285N3123Q9885L3078p691J4889R59o1178p0352k5324
428f7614q210j1217R950L8865N6803N6145K2457j4558j6541k3696o3636o0558
440h1810j845J1343j1598L3446R1788N0330j9558q122J0696l4212o4936l8477
452f2955j5206r668J2523L9619N5274N4185J9366k1151j3458q255o1316q1192
464i2234o143M0674M400Q825O7566N3468q231o391J2710l1068o8273m1569j0163
477g6429O96J4122K3934L9201O7616M3691l5597m9683j102k1239p4767k7631M2271
490e4917J5674o699N3534O6331k915k1419J3068r693o0161n6909k5982N170L7131
$$ plain form
503 -47787 -10408 5608 42217 94467 85533 30274 13293 3176 -56365 -90497 -47667 -24070
515 -24070 -49687 -22027 60068 92620 70447 53858 30036 -17453 -53888 -74401 -84437 -54000
527 -54000 -910 21322 39275 80489 76885 17020 280 19419 -26722 -92898 -72903 -22093
539 -22093 -24734 -16159 48353 87157 69046 46589 21341 -22730 -54447 -65123 -67979 -39387 8478
552 8478 16524 12763 56594 84853 34657 -5493 11811 -10588 -81458 -85785 -32085 -17055 -11729
565 -11729 47131 95758 73830 29071 -125 -23090 -37740 -49291 -66949 -50603 6295 29492
577 29492 14848 42326 81056 45645 -7005 132 -10793 -81323 -99181 -29280 17094 13637
589 13637 33484 66702 61484 31505 404 -29698 -39084 -32563 -45241 -50053 -8888 23546 14939
$$ packed form
503d7787L7379J6016L6609N2250q934n5259j6981j0117n9541l4132M2830K3597
515b4070k5617K7660Q2095L2552k2173j6589k3822m7489l6435k0513j0036L0437
527e4000N3090K2232J7953M1214l604n9865j6740J9139m6141o6176J9995N0810
539b2093k641Q575O4512L8804j8111k2457k5248m4071l1717j0676k856K8592M7865
552H478Q046l761M3831K8259n0196m0150J7304k2399p0870m327N3700J5030N326
565a1729N8860M8627k1928m4759k9196k2965j4650j1551j7658J6346N6898K3197
577B9492j4644K7478L8730l5411n2650P137j0925p0530j7858O9901M6374l457
589A3637J9847L3218n218k9979l1101l0102r386O521j2678m812M1165L2434q607
$$ plain form
602 14939 35939 85798 62481 -13698 -30884 -15489 -51800 -83367 -40942 13204 26363 36044
614 36044 52324 45627 27604 9911 -16941 -35109 -35768 -50056 -59112 -13772 37355 31288 28154
627 28154 72008 71860 -4472 -51927 -37148 -38834 -59941 -36995 9028 26721 32272 43552 44917
640 44917 35062 14243 -23020 -46399 -36906 -39339 -55911 -21958 43314 54075 31649 46928 55022
653 55022 -1579 -51420 -39084 -27148 -44870 -37017 2381 24523 29758 38609 43252 35565 17062
666 17062 -17588 -47380 -45880 -38755 -45114 -19625 38674 57124 31265 32302 48877 12812 -41597
679 -41597 -45572 -28983 -38799 -42051 -9524 26120 39163 42562 44261 38366 16849 -24780 -57897
692 -57897 -50769 -29855 -31628 -20530 32054 64444 39653 20437 32742 18609 -29291 -49628
$$ packed form
602A4939K1000M9859k3317p6179j7186J5395l6311l1567M2425N4146J3159R681
614C6044J6280o697j8023j7693k6852j8168o59j4288r056M5340N1127o067l134
627B8154M3854j48p6332m7455J4779j686k1107K2946M6023J7693N551J1280J365
640D4917r855k0819l7263k3379R493k433j6572L3953O5272J0761k2426J5279Q094
653E5022n6601m9841J2336J1936j7722P853L9398K2142N235Q851M643p687j8503
666A7062l4650k9792J500P125o359K5489N8299J8450k5859J037J6575l6065n4409
679d1597l975J6589r816l252L2527L5644J3043L399J699n895k1517m1629l3117
692e7897P128K0914j773J1098N2584L2390k4791j9216J2305j4133m7900k0337
$$ plain form
704 -49628 -35349 -32406 -36741 -13950 24776 46381 45018 35212 28109 15843 -17226 -54341 -54648
717 -54648 -26200 -17398 -19858 12279 54859 51335 23556 21560 21644 -13207 -49474 -47878 -32370 -28769
731 -28769 -17446 17667 49656 50981 33253 21367 13813 -11209 -47678 -57710 -32648 -13236
743 -13236 -13538 4820 45299 58275 33359 15243 14314 -6829 -45151 -55771 -34009 -18191 -12510
756 -12510 9953 44027 55560 35637 14853 7232 -7340 -37183 -54416 -39036 -15185 -6375
768 -6375 6273 36882 54406 36840 14234 9531 -4211 -39261 -55918 -34723 -12454 -9551 3846
781 3846 37184 53277 36294 15664 7540 -6006 -33915 -51031 -38482 -15505 -5765 2590 30284
794 30284 55420 42853 10126 1361 1699 -26163 -57052 -44401 -9693 -1089 -740 25965 54211
$$ packed form
704d9628J4279K943m335K2791L8726K1605j363r806p103j2266l3069l7115l07
717e4648K8448Q802k460L2137M2580l524k7779j996Q4l4851l6267J596J5508L601
731b8769J1323L5113L1989J325j7728j1886p554k5022l6469j0032K5062J9412
743a3236l02J8358M0479J2976k4916j8116r29k1143l8322j0620K1762J5818N681
756a2510K2463L4074J1533j9923k0784p621j4572k9843j7233J5380K3851Q810
768f375J2648L0609J7524j7566k2606m703j3742l5050j6657K1195K2269K903J3397
781C846L3338J6093j6983k0630q124j3546k7909j7116J2549K2977R740Q355K7694
794C0284K5136j2567l2727q765L38k7862l0889J2651L4708Q604L49K6705K8246
$$ plain form
807 54211 43283 13048 56 -2968 -23256 -48530 -46017 -16783 3781 5835 18511 46220 49285
820 49285 16596 -6623 -4477 -15684 -46392 -48211 -14615 5559 2769 16292 45275 46891 16532
833 16532 -5982 -7235 -14348 -37330 -47531 -24214 7200 13324 11681 32253 48779 25528 -8405
846 -8405 -12630 -9621 -32719 -48824 -24151 8208 11917 11296 31443 45546 25745 -4812 -15238
859 -15238 -13515 -25896 -42531 -30112 3706 18446 13705 23357 41583 30058 -4489 -17859 -12712
872 -12712 -23871 -40632 -28028 3447 16860 14808 24068 36524 25782 -1864 -15961 -13958 -21122
885 -21122 -36759 -29320 2689 20249 13491 16384 34672 31416 5 -20851 -16825 -17183 -30228
898 -30228 -27921 -1334 18687 16597 15774 29262 30267 2395 -21902 -16598 -11049 -28359 -34154 -4139
$$ packed form
807E4211j0928l0235j2992l024k0288k5274K513K9234K0564K054J2676K7709L065
820D9285l2689k3219K146j1207l0708j819L3596K0174k790J3523K8983J616l0359
833A6532k2514j253p113k2982j0201K3317L1414O124j643K0572J6526k3251l3933
846h405m225L009k3098j6105K4673L2359L709o21K0147J4103j9801l0557j0426
859a5238J723j2381j6635J2419L3818J4740m741R652J8226j1525l4547j3370N147
872a2712j1159j6761J2604L1475J3413k052R260J2456j0742k7646j4097K003p164
885b1122j5637P439L2009J7560o758K893J8288l256l1411k0856M026l58j3045
898c0228K307K6587K0021k090q23J3488J005k7872k4297N304N549j7310n795L0015
$$ plain form
912 -4139 24183 20041 13070 25880 29097 3151 -21481 -20493 -13260 -21594 -27355 -6705 22094 23254
926 23254 8514 15604 31303 13820 -22709 -27810 -11740 -16569 -27763 -8426 22013 24487 13579
939 13579 17090 21856 5671 -19032 -25226 -12622 -7782 -19399 -18414 12115 33260 17605 5391
952 5391 20807 19314 -16953 -34196 -16014 -9519 -21452 -9368 21786 28650 13996 7735 11491
965 11491 8275 -6649 -22878 -23517 -9482 -7525 -15549 1238 32111 27985 5873 11502 17974 -14093
979 -14093 -40438 -21213 -370 -8929 -9459 13438 25923 17268 8448 6775 4890 -2062 -18025 -27124
993 -27124 -15034 -4959 -10980 1814 35484 35839 3377 -2352 11815 -8336 -37864 -23278 3853
1006 3853 -1493 -8670 7882 20744 15641 10456 9761 6758 -639 -19638 -35856 -21020 3600 136
$$ packed form
912d139K8322m142o971J2810L217k5946k4632R88P233q334n761K0650K8799J160
926B3254j4740P090J5699j7483l6529n101J6070m829j1194J9337L0439K474j0908
939A3579L511M766j6185k4703o194J2604M840j1617R85L0529K1145j5655j2214
952E391J5416j493l6267j7243J8182O495j1933J2084L1154O864j4654o261L756
965A1491l216j4924j6229o39J4035J957q024J6787L0873m126k2112N629O472l2067
979a4093k6345J9225K0843q559n30K2897J2485q655q820j673j885o952j5963r099
993b7124J2090J0075o021J2794L3670L55l2462n729J4167k0151k9528J4586K7131
1006C853n346p177J6552J2862n103n185o95l003p397j8999j6218J4836K4620l464
$$ plain form
1020 136 -2554 28480 42570 8246 -13325 2289 -1073 -29294 -24839 2022 1171 -11657 277
1033 277 20313 26071 19910 6260 -3577 -2770 -14996 -39394 -29893 9903 17721 393 16273 38065
1047 38065 11643 -18804 -3283 9447 -16097 -29168 -10481 -1877 -7265 815 17551 28333
1059 28333 28718 10569 -13527 -15042 -12012 -30519 -31264 8165 26309 2219 1913 31171 22143 -11628
1073 -11628 -7797 9345 -9714 -31088 -21427 -7436 -1946 10340 22618 25488 25080 9918 -18492
1086 -18492 -22873 -6431 -14787 -28482 -1503 24108 4193 -7301 22682 31936 2463 -7083 3933
1099 3933 -10673 -34133 -27748 -8670 4193 17597 23665 19555 20258 11819 -16764 -25994 -4259
1112 -4259 -4192 -27457 -14696 18504 9964 -6830 19233 39485 10459 -13780 -6574 -9852 -29812
$$ packed form
1020A36k690L1034J4090l4324k1571J5614l362k8221M455K6861q51j2828J1934
1033B77K0036N758o161j3650r837Q07j2226k4398R501L9796P818j7328J5880K1792
1047C8065k6422l0447J5521J2730k5544j3071J8687Q604n388Q080J6736J0782
1059B8333L85j8149k4096j515L030j8507p45L9429J8144k4090l06K9258r028l3771
1073a1628L831J7142j9059k1374R661J3991N490J2286J2278K870m08j5162k8410
1086a8492m381J6442q356j3695K6979K5611j9915j1494K9983R254k9473r546J1016
1099C933j4606k3460O385J9078J2863J3404O068m110P03q439k8583r230K1735
1112d259O7k3265J2761L3200q540j6794K6063K0252k9026k4239P206l278j9960
$$ plain form
1125 -29812 -27793 -5915 10873 19374 17933 9099 12541 16690 -6060 -23370 -4932 2610 -26176
1138 -26176 -28666 8726 18646 -49 13080 38795 20650 -14024 -17475 -12045 -20130 -22336 -8546
1151 -8546 6705 17876 15947 3815 8881 23533 6876 -22705 -15544 992 -19189 -33025 174
1164 174 25966 12295 7957 26872 21104 -9783 -21645 -13437 -10365 -12805 -10609 -2330 11654 17656
1178 17656 6929 6060 21502 14183 -18009 -23116 -3965 -10761 -28151 -7129 24794 20237 5077
1191 5077 12486 17440 -89 -15511 -13732 -8189 -8589 -12255 -9627 6464 19385 11502 5103 17898
1205 17898 16918 -12718 -26422 -9110 -4405 -19388 -10987 16961 21667 6890 6356 14160 6910 -9236
1219 -9236 -15756 -10915 -6436 -10728 -12557 3876 22195 16929 2712 8408 14264 -6517 -25110 -12340
$$ packed form
1125b9812K019K1878J6788Q501j441q834L442M149k2750j7310J8438P542k8786
1138b6176k490L7392R920j8695J3129K5715j8145l4674l451N430q085k206J3790
1151h546J5251J1171j929j2132N066J4652j6657k9581P161J6536k0181j3836L3199
1164A74K5792j3671m338J8915n768l0887j1862Q208L072k440K196Q279J3984O002
1178A7656j0727q69J5442p319l2192n107J9151o796j7390K1022L1923m557j5160
1191E077P409M954j7529j5422J779N543m00l666K628J6091J2921p883o399J2795
1205A7898r80k9636j3704J7312M705j4983Q401K7948M706j4777n34P804p250j6146
1219i236o520M841M479m292j829J6433J8319n266j4217N696N856k0781j8593J2770
$$ plain form
1233 -12340 -336 -9922 -11604 9337 20738 8816 269 8258 12004 -1423 -17355 -15778 -3075
1246 -3075 -2908 -11776 -2988 18871 18615 749 2204 13666 1221 -20674 -16303 46 -2797 -12211
1260 -12211 -1694 16661 16484 4258 1511 8759 4514 -13822 -20451 -6389 2223 -6851 -5173 14542
1274 14542 20672 3634 -3168 7496 5391 -14159 -20061 -4617 3616 -2834 -4175 9032 16618
1287 16618 7826 -2336 1330 4669 -8927 -19065 -5981 7069 -2113 -8819 8067 20601 6325
1300 6325 -6707 1352 6586 -6691 -16377 -7447 2881 396 -4024 4339 15600 10841 -3311 -4004
1314 -4004 5482 -1183 -17986 -13220 5698 5232 -6492 1600 18175 12176 -5321 -4879 4113 -3493
1328 -3493 -16243 -11143 3865 6821 -1729 178 14166 14599 -3465 -11612 157 3120 -12610 -15305
$$ packed form
1233a2340J2004r586j682K0941J1401j1922q547P989L746j3427j5932J577J2703
1246c075J67q868Q788K1859k56j7866J455J1462j2445k1895M371J6349k843r414
1260a2211J0517J8355j77j2226k747P248m245j8336o629J4062Q612r074J678J9715
1274A4542O130j7038o802J0664k105j9550n902J5444Q233o450j341J3207P586
1287A6618q792j0162L666L339j3596j0138J3084J3050r182o706J6886J2534j4276
1300F325j3032Q059N234j3277r686Q930J0328k485m420Q363J1261m759j4152o93
1314d004R486o665j6803M766J8918m66j1724Q092J6575n999j7497M42Q992p606
1328c493j2750N100J5008K956q550J907J3988M33j8064q147J1769K963j5730k695
$$ plain form
1342 -15305 3487 11222 -715 -1570 13411 13238 -5116 -10296 1006 2340 -10889 -14058 927
1355 927 11407 4075 -3612 6017 15518 3203 -13423 -7326 5031 -4852 -17255 -3551 14150
1368 14150 6455 -5270 6074 16558 3107 -13143 -7566 2091 -4796 -13668 -5189 10188 10785
1381 10785 1257 1856 12054 7379 -9813 -13325 -792 -308 -13437 -8670 12961 15495 -730 -948
1395 -948 12485 8016 -10417 -12977 -1694 -1655 -9661 -5821 7463 12039 4872 921 7468 9197 -5263
1410 -5263 -16707 -6951 2334 -7268 -11598 7110 19152 4588 -4326 8716 11691 -7113 -15378
1423 -15378 -4119 -835 -9354 -8188 4525 13102 9924 3493 3693 7139 -474 -15966 -14563 1304
1437 1304 878 -11201 -549 19448 11279 -6032 3562 14942 -1325 -17958 -9546 -83 -7368
$$ packed form
1342a5305J8792P735j1937q55J4981j73j8354n180J1302J334j3229l169J4985
1355I27J0480p332p687R629R501j2315j6626O097J2357r883j2403J3704J7701
1368A4150p695j1725J1344J0484j3451j6250N577R657o887q872Q479J5377N97
1381A0785r528N99J0198m675j7192l512J2533M84j3129M767K1631K534j6225k18
1395i48J3433m469j8433k560J1283L9q006L840J3284M576p167l951O547J729j4460
1410e263j1444R756R285r602m330J8708J2042j4564q914J3042K975j8804q265
1423a5378J1259L284q519J166J2713Q577l178o431K00L446p613j5492J403J5867
1437A304m26j2079J0652J9997q169j7311R594J1380j6267j6633Q412R463p285
$$ plain form
1450 -7368 -9593 2208 13397 14268 6006 -766 2745 3754 -11011 -19275 -1964 7150 -8552 -9935
1464 -9935 14400 18551 -2290 -1588 15377 6188 -16575 -15694 -3923 -4655 -6537 1453 10351 15385
1478 15385 10930 -2701 -4300 6285 -757 -19796 -11425 8871 -2217 -16314 5679 24775 7903
1491 7903 -3624 9599 7160 -15015 -18634 -5911 -2412 -1796 3489 5471 8578 11665 816 -7611
1505 -7611 5441 9322 -13924 -19701 2828 2862 -16311 -1804 26443 15877 -4276 4110 7832
1518 7832 -11328 -18118 -5387 -589 -1917 2342 1608 2297 12284 9564 -4516 2302 11962 -10191
1532 -10191 -27957 -5222 8809 -8885 -4902 24523 20638 -6703 -5547 6450 -5412 -13516 -2741
1545 -2741 479 -3964 -898 -1369 -2873 12073 17641 -877 -3996 10792 -3283 -29887 -12845 14944
$$ packed form
1450g368k225J1801J1189Q71q262o772L511J009j4765q264J7311R114j5702j383
1464i935K4335M151k0841P02J6965r189k2763Q81J1771p32j882P990Q898N034
1478A5385m455j3631j599J0585p042j9039Q371K0296j1088j4097K1993J9096j6872
1491G903j1527J3223k439k2175l619J2723L499O16N285J982L107L087j0849q427
1505g611J3052L881k3246n777K2529L4j9173J4507K8247j0566k0153Q386L722
1518G832j9160o790J2731M798j328M259p34O89R987k720j4080O818R660k2153
1532a0191j7766K2735J4031j7694L983K9425l885k7341J156J1997j1862q104J0775
1545b741L220m443L066m71j504J4946N568j8518l119J4788j4075k6604J7042K7789
$$ plain form
1559 14944 1195 -10221 14230 21692 -4782 -10935 6995 5216 -7384 -5794 -4427 -7365 -2052
1572 -2052 -703 -3237 12195 24765 2949 -14446 2908 4337 -22803 -17766 15748 11784 -12359
1585 -12359 -318 17656 1622 -9003 5683 9763 -2220 -6588 -9703 -12565 -797 7229 -1005
1598 -1005 5393 23006 7161 -19279 -6222 10713 -8936 -18166 8782 14421 -11016 -9473 11842
1611 11842 8661 -2390 4633 7254 -3461 -7182 -8774 -11913 77 12794 2561 -2613 13517
1624 13517 8677 -16372 -9405 15096 2769 -17276 -1407 11584 -7367 -12878 8638 14147 1892
1637 1892 1832 3638 -6031 -8605 -5356 -7127 1008 13079 3270 -8405 5384 11524 -9520 -11573
1651 -11573 12790 9540 -15598 -9677 9097 255 -10242 4809 14092 3745 -2862 -3023 -5292
$$ packed form
1559A4944j3749j1416K4451P462k6474o153J7930j779j2600J590J367k938N313
1572b052J349k534J5432J2570k1816j7395J7354J429k7140N037L3514l964k4143
1585a2359J2041J7974j6034j0625J4686M080j1983m368l115k862J1768Q026q234
1598a005O398J7613j5845k6440J3057J6935j9649r230K6948N639k5437J543K1315
1611A1842l181j1051P023K621j0715l721j592l139J1990J2717j0233n174J6130
1624A3517m840k5049O967K4501j2327k0045J5869J2991j8951n511K1516N509j2255
1637A892o0J806r669k574L249j771Q135J2071r809j1675J3789O140k1044k053
1651a1573K4363l250k5138N921J8774q842j0497J5051R283j0347o607j61k269
$$ plain form
1664 -5292 -3113 120 -4879 -687 12216 3867 -13419 -1224 16155 -703 -13626 5732 12279
1677 12279 -10962 -15609 5942 9209 -4057 -534 9045 4879 -4109 -7090 -5717 2286 6477 -3514
1691 -3514 -6187 8674 8206 -11238 -7172 14198 6659 -13435 -3809 11673 -2295 -13956 837
1704 837 11870 2514 -3843 857 2724 218 -3994 -6768 715 8936 -947 -10563 2969 12572 -3083
1719 -3083 -9291 8102 9870 -11069 -11885 5737 4485 -7807 -2464 10102 7191 -1512 -3581 -1468
1733 -1468 733 -1447 -6815 -3137 6964 3211 -7790 609 13108 2429 -11217 175 8977
1746 8977 -5615 -13028 1351 8329 -1708 -3730 5544 7551 219 -4266 -2083 2008 493 -6381
1760 -6381 -5873 4217 4936 -5325 -2113 12262 7528 -8554 -5106 7390 -232 -12533 -5623 6950
$$ packed form
1664e292K179L233m999M192J2903q349j7286J2195J7379j6858j2923J9358O547
1677A2279k3241m647K1551L267j3266L523R579m166q988k981J373Q003M191r991
1691c514k673J4861m68j9444M066K1370p539k0094R626J5482j3968j1661J4793
1704H37J1033r356o357M700J867k506m212k774P483Q221r883r616J3532R603j5655
1719c083o208J7393J768k0939q16J7622j252j2292N343J2566k911q703k069K113
1733a468K201k180n368L678J0101l753j1001Q399J2499j0679j3646J1392Q802
1746H977j4592p413J4379O978j0037k022R274K007p332m485K183M091j515o874
1760f381N08J0090P19j0261L212J4375m734j6082L448J2496p622j2301O910J2573
$$ plain form
1774 6950 3172 -3392 1745 8613 5374 -2888 -4914 746 1371 -7384 -10212 2485 9580 -376 -4364
1789 -4364 9142 11465 -4310 -9607 2327 3052 -10161 -9885 4511 8233 -359 -2384 5993 8873
1803 8873 22 -7420 -3047 2586 -3892 -10869 -1470 9856 3436 -5633 3080 12458 2741 -8980
1817 -8980 -2958 3735 -4304 -10684 -1673 7041 3114 -2575 2844 10440 6422 -5441 -7227 923 65
1832 65 -9538 -7568 5888 7399 -2333 586 11977 7844 -7118 -7885 1637 -351 -9342 -6536 4506
1847 4506 6068 312 1197 8643 7452 -3825 -8948 -1681 2523 -6542 -10091 2034 9376 995 -2155
1862 -2155 7887 9363 -4144 -8899 531 2779 -6907 -9430 239 6450 2646 -404 4508 8284
1876 8284 1585 -6996 -3077 3241 -3922 -12855 -3614 10157 4999 -3653 3903 11737 2011 -8271
$$ packed form
1774F950l778o564N137O868l239q262k026N660O25q755k828J2697P095r956l988
1789d364J3506K323j5775n297J1934P25j3213K76J4396L722q592k025Q377K880
1803H873q851p442M373N633o478o977R399J1326o420r069Q713R378r717j1721
1817h980O022O693q039o380R011Q714l927n689N419P596m018j1863j786Q150q58
1832F5r603J970J3456J511r732K919J1391m133j4962p67R522j988q991K806J1042
1847D506J562n756Q85P446j191j1277n123P267M204r065l549J2125P342q381l150
1862b155J0042J476j3507m755R430K248r686k523R669O211l804l050M912L776
1876H284o699q581L919O318p163q933R241J3771n158q652P556P834r726j0282
$$ plain form
1890 -8271 -2414 2615 -5221 -10595 -2591 6843 6014 -494 622 7787 6486 -4666 -7814 841 870
1905 870 -11183 -7858 9652 9610 -4554 -2435 11374 7053 -6843 -5452 2026 -1214 -7986 -4660
1919 -4660 3246 5554 636 -1991 5173 10652 751 -10809 -3867 5103 -4512 -10766 2835 10175
1933 10175 -2226 -5463 8530 10695 -2942 -6841 -73 851 -4855 -6210 -2764 3525 5494 675
1947 675 1288 9760 4422 -11456 -8738 7343 2900 -12034 -4000 9761 1458 -6493 4963 11213
1961 11213 -704 -6622 -207 1451 -3194 -5898 -4939 1679 8502 3453 -4003 2989 7099 -5950
1975 -5950 -9368 7171 8375 -11447 -11219 7592 6743 -5910 171 10142 2588 -4819 -1371 -337
1989 -337 -2745 -2932 -3237 -52 8582 4884 -9115 -4496 10909 3616 -9638 2209 10470 -8025
$$ packed form
1890h271N857N029p836n374Q004R434q29o508J116P165j301j1152l148Q655K9
1905H70j2053L325J7510m2j4164K119J3809m321j3896J391P478l240o772L326
1919d660P906K308m918k627P164N479r901j1560O942Q970r615o254J3601P340
1933A0175j2401l237J3993K165j3637l899O768R24n706j355L446O289J969m819
1947F75O13Q472n338j5878K718J6081m443j4934Q034J3761q303p951J1456O250
1961A1213j1917n918O415J658m645k704R59O618O823n049p456O992M110j3049
1975e950l418J6539J204j9822K28J8811q49j2653O081R971p554p407L448J034
1989c37k408j87l05L185Q634l698j3999M619J5405p293j3254J1847Q261j8495
$$ plain form
2003 -8025 -15167 4600 10157 -4165 -3724 8539 5285 -3563 -3077 -2256 -2405 2136 970 -3795 2923
2018 2923 5730 -8587 -8583 12775 11936 -9723 -7806 8711 -734 -13616 1063 12674 -439 -6255
2032 -6255 3941 4156 -4259 -3211 -1160 321 7174 4762 -8302 -5953 6034 -1987 -9072 8857
2046 8857 15661 -7397 -14162 6495 7584 -9817 -3738 10708 2134 -7308 97 1836 -3495 -620
2060 -620 2876 792 5240 4443 -10851 -11130 8588 8368 -7929 -314 12498 -4509 -16757 3635
2074 3635 13796 -3472 -6481 7912 4861 -7857 -5074 164 -1080 3498 5551 -1149 -700 4015
2088 4015 -6692 -10162 9314 14479 -8028 -11243 7195 2395 -13360 -470 15526 2830 -7476
2101 -7476 2762 4527 -6398 -6570 -454 876 5468 5879 -5731 -6679 5913 2878 -6898 5028
$$ packed form
2003h025p142J9767N557j4322M41J2263l254q848M86Q21j49M541j166m765O718
2018B923K807j4317MK1358q39k1659J917J6517r445j2882J4679J1611j3113n816
2032f255J0196K15q415J048K051J481O853k412j3064K349J1987q021p085J7929
2046H857O804k3058o765K0657J089j7401O079J4446q574r442P405J739n331K875
2060f20L496k084M448p97j5294k79J9718k20j6297P615J2812j7007j2248K0392
2074C635J0161j7268l009J4393l051j2718K783N238j244M578K053o700M49M715
2088D015j0707l470J9476N165k2507l215J8438m800j5755J2890J5996j2696j0306
2101g476J0238J765j0925j72O116J330M592M11j1610r48J2592l035r776J1926
$$ plain form
2115 5028 13510 -7248 -17591 3007 10372 -6705 -5319 11976 7105 -6083 -2048 2469 -3324
2128 -3324 -3087 1631 814 2128 2607 -7723 -8831 8653 12276 -3693 -3067 9222 -2304 -17081
2142 -17081 -1795 11428 -2000 -8452 6595 9690 -2318 -3821 1514 -160 -163 1887 -2912 -3971
2156 -3971 957 -3319 -5804 8818 15553 -3253 -10822 4367 4379 -11187 -6002 9130 1973 -8399
2170 -8399 1468 8471 88 -4137 1457 3799 3007 575 -6871 -8122 1442 2494 -3619 4850 13220
2185 13220 -523 -11301 3176 10348 -6140 -11697 3490 5163 -6244 -3286 6321 3885 -1298
2198 -1298 1592 4179 2779 -1926 -9262 -8416 3567 7082 -3700 -3035 8874 4416 -7663 -92
2212 -92 10401 -1116 -12876 -2527 6761 -1358 -6640 239 6243 4330 2130 717 457 -506 -5973
$$ packed form
2115E028Q482k0758j0343K0598P365j7077J386J7295m871j3188M035M517n793
2128c324K37M718q17J314M79j0330j108J7484L623j5969O26J2289j1526j4777
2142a7081J5286J3223j3428o452J5047L095j2008j503N335j674lK050m799j059
2156c971M928m276k485J4622O735j8806p569J5189J2j5566N185J5132p157j0372
2170h399R867P003q383m225N594K342p92k432p446j251R564J052o113Q469Q370
2185A3220j3743j0778J4477P172j6488n557J5187J673j1407K958R607k436n183
2198a298K890K587j400m705p336Q46J1983L515j0782O65J1909m458j2079P571
2212i2J0493j1517j1760J0349R288q119n282O879O004j913k200j413k60r63n467
$$ plain form
2227 -5973 -7085 2566 6898 -4194 -8116 5500 10835 -1575 -4157 5973 3011 -8638 -6258 4148
2241 4148 1028 -6682 -2790 6389 8132 2318 -3077 -1700 1825 -478 -5974 -2305 3644 -2248 -7534
2256 -7534 3261 12173 2154 -7099 1018 6680 -2450 -7876 -1203 1678 -3386 -3232 4303 7482 2009
2271 2009 -3759 -1696 4683 2970 -5716 -6602 623 1203 -4081 -155 8734 4204 -5374 -887 7698
2286 7698 2491 -8363 -6130 1791 1489 -2980 -263 4978 3389 -1878 -805 5454 3652 -6100 -8820
2301 -8820 525 5003 -2030 -5066 3722 6383 -1600 -2692 5615 4589 -6811 -8191 2150 5091
2315 5091 -2574 -5818 1715 5944 1584 -1374 2239 4066 -2825 -7676 -605 5714 -618 -8479 -1322
2330 -1322 8855 4434 -3374 -25 5389 -1312 -7156 -578 4685 -1452 -7176 -1084 7638 5422 -2519
$$ packed form
2227e973j112R651M332j1092l922J3616N335j2410k582J0130k962j1649K380J0406
2241D148l120p710L892R179J743n814n395J377L525k303n496L669N949n892n286
2256g534J0795Q912j0019r253Q117N662r130n426O673K881n064J54P535L179n473
2271B009n768K063O379j713q686q86P225N80n284L926Q889m530r578M487Q585
2286G698n207j0854K233P921l02m469K717N241j589n267J073O259j802r752k720
2301h820R345M478p033l036Q788K661p983j092Q307j026j1400j380J0341K941
2315E091p665l244P533M229m360k958L613J827o891m851P071O319o332p861P157
2330a322J0177m421p808L349N414o701n844O578N263o137n724O092Q722k216p941
$$ plain form
2345 -2519 -2555 3110 2662 -4021 -3988 2904 1155 -6730 -3353 7584 6499 -4171 -4492 4315 4354 -3687
2361 -3687 -4016 1626 630 -4597 -2629 4891 5088 -2470 -4451 2487 6619 -667 -6203 -1142 2866 -2650
2377 -2650 -4438 3224 5399 -2633 -4775 4220 7127 -1015 -6089 -1120 2569 -505 -3494 -2 3084
2392 3084 -180 -3202 2000 7018 757 -7393 -2697 5676 1200 -5323 -1655 4410 13 -3839 1826
2407 1826 6029 -74 -5428 -1658 4559 2272 -4998 -4600 2336 3609 -2342 -1784 4871 3053 -6026
2422 -6026 -2895 6952 3651 -7147 -5691 3397 2884 -2796 -1487 3550 2713 -2178 -2123 2545 3164 -3701
2438 -3701 -7406 1291 7781 -557 -6962 966 7267 -1126 -4119 4231 5085 -5645 -7067 2436 4957
2453 4957 -1227 -3984 525 4713 2373 -2737 -2101 3236 2058 -5544 -2110 6456 732 -9722 -2586
$$ packed form
2345b519l6N665m48o683L3O892j749p885L377J0937j085j0670l21Q807L9q041
2361c687l29N642r96n227J968P520J97p558j981O938M132p286n536N061M008n516
2377b650j788P662K175q032k142Q995K907q142n074M969L689l074k989L492L086
2392C084l264l022N202N018o261q150M696Q373m476o523L668O065m397l852N665
2407A826M203o103n354L770O217k287p270L98O936J273n951N58O655j818r079
2422f026L131R847l301j0798J456R088n13n680J309N037q37m891N5M668O19o865
2438c701l705Q697O490q338o405P928O301q393k993Q350Q54j0730j422R503K521
2453D957o184k757M509M188k340n110O36N337j178p602L434Q566n724j0454P136
$$ plain form
2468 -2586 9608 4288 -4946 86 4795 -1680 -5916 -182 3088 -952 -3270 -1392 3023 4209 -1462
2483 -1462 -4643 2832 7303 -1842 -7319 846 2660 -7231 -3992 9478 7093 -4703 -3026 4525
2497 4525 968 -3873 -1345 1196 -99 -926 -2190 -1053 3317 2045 -3796 1407 9412 392 -11007
2512 -11007 -2933 5915 -2370 -5155 5497 6442 -4775 -4701 5068 4558 -1283 -1632 -187 -536 -1035 -3607
2528 -3607 -4562 2764 7189 1 -728 7411 1775 -11698 -5673 8417 2223 -7593 14 6124 -2166
2543 -2166 -4402 3969 5973 298 -1415 -1624 -2003 -489 -2561 -5710 2097 10276 1889 -6518 2255
2558 2255 5811 -6346 -6164 8127 5526 -9367 -6644 4060 1411 -2383 2961 5719 2464 -267
2572 -267 -2924 -5250 -1176 718 -4608 -628 9875 3211 -9377 -1670 9958 1256 -6807 3646
$$ packed form
2468b586J2194n320r234N032M709o475m236N734L270m040k318J878M415J186n671
2483a462l181P475M471r145n477Q165J814r891L239J3470k385j1796J677P551
2497D525l557m841K528K541j295q27j264J137M370j272n841N203Q005r020j1399
2512a1007Q074Q848q285k785J0652R45j1217P4R769n10n841l49J445l49m99k572
2528c607r55P326M425p188p29Q139n636j3473O025J4090o194r816P607O110q290
2543b166k236Q371K004n675j713k09l79J514k072l149P807Q179q387q407Q773
2558B255L556j2157J82J4291k601j4893K723J0704k649l794N344K758l255k731
2572b67k657k326M074J894n326L980J0503o664j2588P707J1628q702q063J0453
$$ plain form
2586 3646 5564 -7849 -9178 2742 4432 -379 2142 4147 1655 437 -2520 -6361 -909 4881
2600 4881 -1437 -5035 4549 4882 -7822 -4094 11391 7018 -7001 -2699 3997 -4054 -8651 1168
2614 1168 5327 483 788 2352 97 732 600 -4014 -1057 6718 68 -9773 -1857 5977 -2447 -3923
2630 -3923 9887 9492 -5865 -6872 2670 -122 -7052 -1334 4336 1433 -99 617 -828 1340 3128
2645 3128 -1676 -2338 4591 661 -10590 -4836 8259 3391 -4595 3573 8679 -3186 -7984 2232
2659 2232 4354 -2858 -3354 1340 765 -749 -1087 -1335 2711 6526 934 -4520 1134 2177 -8299 -6867
2675 -6867 6899 6464 -5032 -1967 7337 2067 -5660 -359 4881 -859 -4231 -1970 237 579 -111
2690 -111 -992 2379 7033 1491 -6366 -1537 4264 -2745 -6674 3315 6640 -3661 -6007 4182 5628
$$ packed form
2586C646J918j3413j329J1920J690m811K521K005k492j218k957l841N452N790
2600D881o318l598R584L33j2704L728J5485m373j4019M302O696q051m597R819
2614A168M159m844L05J564k255O35j32m614K957P775o650r841P916P834q424j476
2630c923J3810l95j5357j007R542k792o930N718N670k903j532P16j445K168J788
2645C128m804o62O929l930j1251N754J3095m868p986Q168N106j1865m798J0216
2659B232K122p212m96M694n75j514l38k48M046L815n592n454N654J043j0476J432
2675f867J3766m35j1496L065R304n270p727N301N240n740l372K261K207L42o90
2690a11q81L371M654n542p857M829N801p009l929R989L325j0301k346J0189J446
$$ plain form
2705 5628 -1721 -1866 3328 1722 -2784 -3736 -1489 1088 1162 -1394 244 5822 2972 -5077 -3139 4858
2721 4858 1723 -6520 -2030 4510 -608 -5659 1103 6633 1511 -2911 351 2781 -527 -4464 -3128
2736 -3128 1603 2789 -1396 -1946 3437 4203 -2588 -3170 4311 3877 -4570 -4714 2491 2202 -3996 -2055
2752 -2055 4328 3627 -1925 -1769 2498 2011 -2806 -4045 753 3079 -1270 -4155 1108 4925 445 -2882
2768 -2882 2111 4725 -2033 -5853 -56 3544 -1488 -4076 1282 4833 548 -2791 856 3753 -582
2783 -582 -4248 -1302 3215 -269 -4500 -802 4818 2465 -3156 -545 4262 1291 -4681 -2351 3104
2798 3104 884 -4852 -2113 4150 2931 -2929 -1361 4437 2677 -3561 -3035 2180 891 -4023 -3078
2813 -3078 3226 3534 -1636 -2233 3511 3998 -2128 -3880 1135 2527 -3014 -4576 2180 4663 -1095 -2822
$$ packed form
2705E628p349j45N194j606m506r52K247K577P4k556J638N578k850q049J938P997
2721D858l135q243M490O540n118n051O762N530n122m422L262K430l308l937J336
2736c128M731J186m185n50N383P66o791n82P481m34q447j44P205k89o198J941
2752b055O383p01n552J56M267m87m817j239M798K326m349k885N263L817m480l327
2768b882M993K614o758l820N797L600n032k588N358L551m285l339L647K897m335
2783e82l666K946M517l484m231L698N620k353n621K611M807k971n972K330N455
2798C104k220n736K739O263j219n860J568N798j760o238N26N215j289m914R45
2813c078O304L08n170n97N744M87o126j752N015J392n541j562O756K483n758j727
$$ plain form
2829 -2822 2919 4917 -1565 -4127 527 2601 -1984 -4174 593 3796 -108 -2632 1116 4899 1066
2844 1066 -4083 -1259 3235 -527 -5331 -1517 4147 1315 -3487 291 5559 1684 -3987 -1145 2908
2859 2908 -3 -4670 -2361 2851 1964 -2156 -689 3918 3349 -2776 -2690 2402 1437 -4602 -4042 2449
2875 2449 3005 -2182 -1676 4069 3853 -1780 -2835 1981 1965 -3319 -4406 1037 3219 -1025 -2264 2653
2891 2653 4743 -400 -3216 1106 2806 -2275 -5290 -395 3387 -504 -3207 1552 5304 773 -3386
2906 -3386 431 3093 -1639 -5285 -1230 2969 -14 -3315 873 5186 1759 -2660 -362 2684 -239
2921 -239 -4975 -2831 2540 1490 -2795 -911 4886 3225 -3307 -1833 3457 1211 -5360 -3147 2383
2936 2383 1044 -3568 -819 4809 3124 -1097 -1835 1477 1604 -2933 -4080 544 3291 -1271 -3610
$$ packed form
2829b822N741J998o482k562M654K074m585k190M767L203l904k524L748L783l833
2844A066n149K824M494l762m804L814N664k832m802L778N268l875n671K842M053
2859B908k911m667K309N212q87m120J467M607n69o125Q6N092r65o039N60O491
2875B449N56n187N06N745k16n633j055M816j6n284j087N443K182m244j239M917
2891B653K090n143k816M322J700n081l015M895L782l891k703M759L752m531m159
2906c386L817K662m732l646M055M199k983l301M188M313l427m419K298L046k923
2921b39m736K144N371j050m285J884N797j661o532J474N290k246o571K213N530
2936B383j339m612K749N628j685m221p38L312J27m537j147M624K747m562k339
$$ plain form
2951 -3610 2569 5859 -936 -3261 3287 3981 -3666 -5579 1037 2328 -2381 -1944 3095 4013 696 -1571
2967 -1571 -231 2396 291 -4004 -2366 3051 713 -5170 -880 6480 2654 -3626 908 5370 -1664
2982 -1664 -6805 -1300 2645 -968 -2111 1207 2753 1285 -982 -1560 1752 3130 -1714 -4850 593
2997 593 2678 -4167 -3823 5742 5768 -3104 -1922 4681 570 -5773 -1770 2919 226 -2455 -910 628
3013 628 1115 1320 -225 829 4302 143 -6604 -2997 3844 -1461 -5383 3653 7417 -1995 -4645 3210
3029 3210 2978 -3837 -2156 2784 537 -2897 -1725 -878 934 3426 1005 -827 3319 2189 -6407
3044 -6407 -4990 4421 2313 -5805 -405 7096 -387 -6120 1936 5927 -871 -2535 1185 -12 -3154
3059 -3154 -2378 -1265 1010 4701 2341 -2865 723 4250 -3217 -6164 3839 5937 -5028 -5014 4862
$$ packed form
2951c610O179L290o795k325O548O94p647j913O616J291m709M37N039R18l317k267
2967a571J340K627k105m295J638N417k338n883M290P360l826o280M534M462p034
2982a664n141N505L945l613j143L318J546j468k267n78L312J378m844l136N443
2997E93K085o845L44R565K6q872J182O603m111o343M003M689k693k681J545J538
3013F28M87K05j545J054L473m159o747L607O841n305l922R036L764r412k650P855
3029C210k32o815J681M940k247l434J172Q47J812K492k421j832M146j130q596
3044f407J417R411k108q118N400P501p483n733Q056L991o798j664L720j197l142
3059c154P76J113K275L691k360n206L588L527p467k947J0003K098j0965J4R876
$$ plain form
3074 4862 2017 -5429 383 7070 1940 -2805 -1000 -918 -2654 -742 -692 -124 4152 3078 -4376 -2260
3090 -2260 5913 1416 -6028 1181 6578 -3587 -8243 1985 4536 -2982 -680 5444 2541 -2915
3104 -2915 -1732 -1046 -974 1169 264 -2593 980 3464 -3311 -4468 5897 6108 -4295 -2412 5496 -912
3120 -912 -9094 -951 5841 288 -2059 3210 2285 -2268 -1177 -95 -476 2102 1121 -4239 -1866 3737
3136 3737 -752 -4386 4394 7858 -2787 -5504 2994 1469 -6212 -2408 5598 1534 -3530 -136 1663
3151 1663 -443 485 1206 -166 1354 734 -5303 -4340 3447 2105 -4034 1509 7968 -418 -7149 726
3167 726 4581 -2981 -3771 3036 2371 -3058 -2047 1622 1720 1646 782 -1082 265 1376 -3533 -5315 2989
3184 2989 4530 -3601 -2620 5789 2390 -5472 -672 6039 870 -4472 -762 1410 -2046 -2238 612
$$ packed form
3074D862k845p446N812O687n130m745J805Q2j736J912N0N68M276j074p454K116
3090b260Q173m497p444P209N397j0165m656J0228K551p518K302O124k903n456
3104b915J183O86P2K143r05k857L573K484o775j157J0365K11j0403J883P908o408
3120i12q182Q143O792n553k347N269r25m553J091J082l81K578r81n360K373N603
3136C737m489l634Q780L464j0645k717Q498j525p681L804Q006m064n064L394J799
3151A663k106R28P21j372J520o20o037R63P787j342o139N543O459q386o731P875
3167G26L855p562p90O807o65n429J011L669R8p4q64j864J347J111m909j782Q304
3184B989J541q131R81Q409l399p862M800O711n169n342L710K172l456j92K850
$$ plain form
3199 612 2154 3098 1279 -1977 -470 2767 -1691 -5641 1024 5179 -2344 -5060 3379 5006 -2427
3214 -2427 -2424 4522 2545 -3763 -3313 358 342 -1045 -656 596 3145 1950 -2235 -1467 3264 1560 -4573
3231 -4573 -1839 4446 -300 -5972 -274 5542 734 -2486 2116 3157 -1208 -3465 -830 661 39
3246 39 -1547 -1192 2234 3061 -1084 -1692 3079 3151 -3330 -3929 2166 985 -4817 -1889 4440 2686 -1886
3263 -1886 -16 2906 845 -2300 -1760 387 654 -1432 -2537 894 3525 138 -2360 2239 4138
3278 4138 -1310 -4080 301 2115 -2357 -3380 2142 2947 -782 -1603 2367 3348 -550 -2606 -766 1236
3294 1236 -1032 -3581 -758 3483 1356 -2145 664 4695 643 -3950 -1369 2477 -1019 -4087 -647
3309 -647 3404 1342 -1560 565 3780 1289 -2880 -2279 1275 888 -3424 -2521 2358 2758 -1678 -1108
$$ packed form
3199F12J542R44j819l256J507L237m458l950O665M155p523k716Q439J627p433
3214b427LO946j977o308M50L671j6j387L89J252K549j195m185P68M731j704o133
3231d573K734O285m746n672N698N816m808l220M602J041m365k257K635J491o22
3246C9j586L55L426Q27m145o08M771P2o481n99O095j181n802K928O329j754m572
3263a886J870K922k061l145N40K147K67k086j105L431K631l387k498M599J899
3278D138n448k770M381J814m472j023N522Q05l729q21L970R81l898k056J840K002
3294A236k268k549K823M241k127l501K809M031m052m593K581L846l496l068L440
3309f47M051k062k902K125L215k491m169O01L554l87m312R03M879M00m436N70
$$ plain form
3325 -1108 3531 2635 -2585 -2793 2170 1421 -3463 -2907 1683 2597 -704 -1475 2564 3386 -815 -2893 719
3342 719 1920 -2288 -4361 158 3341 -289 -2035 2087 3764 -223 -3099 165 1841 -1988 -3697
3357 -3697 -340 2722 416 -1692 731 3624 1109 -3162 -1171 2221 -439 -4034 -1297 2820 1069
3372 1069 -2329 -15 4149 1617 -2146 -766 1896 -38 -3521 -1753 1930 1309 -1796 -781 3374
3387 3374 2711 -1422 -2058 1499 1426 -2918 -3099 1735 2169 -1873 -1337 3670 3202 -1580 -1960 1470 1339
3404 1339 -2672 -2816 337 1721 -640 -1358 1681 3494 336 -2695 461 2745 -1641 -4454 -358
3419 -358 3047 -871 -3232 1689 4072 -278 -2465 1292 2392 -1676 -3529 -862 1515 445 -1582
3434 -1582 -294 3095 2419 -1991 -1359 2704 1518 -4425 -2680 3080 881 -3762 -615 4477 1954
$$ packed form
3325a108M639q96n220k08M963p49m884N56M590R14l301p71M039Q22m201k078L612
3342G19J201m208k073M519L183l630j746M122J677l987k876L264J676l829j709
3357c697L357L062k306k108K423K893k515m271J991L392k660l595K737M117j751
3372A069l398K314M164k532l763J380K662j934l483J768L683o21l105J015M155
3387C374o63m133o36L557p3m344j81M834M34m042N36N007m68m782l80L430j31
3404A339m011j44L153J384k361p18L039J813l158l031L156K284m386k813M096
3419c58L405l918k361M921K383m350k187L757J100m068j853K667K377j070k027
3434a582J288L389o76m410O32M063j186n943J745N760k199m643L147N092k523
$$ plain form
3449 1954 -1896 141 2327 -55 -2526 -2005 416 1115 -646 -1778 1011 3644 -21 -2681 1575
3464 1575 3851 -2471 -4642 1404 2050 -3194 -2049 3635 2849 -1332 -693 1399 586 -1069 -1395 -596
3480 -596 776 178 -2445 -1524 3441 2370 -2707 -176 4775 -97 -5522 -897 3012 -1784 -3455 2464
3496 2464 3085 -1029 -1303 1560 1473 318 -253 -1746 -1140 981 -1800 -3213 2618 5046 -1503 -2361 4066
3513 4066 2184 -5313 -2185 3737 373 -4103 190 2640 -977 -1451 1448 1779 1041 516 -1967 -2371
3529 -2371 1063 54 -3642 692 5618 -155 -4314 2357 4472 -3146 -3499 3681 1999 -4308 -2257
3544 -2257 1829 141 -669 2004 1471 746 1069 -1674 -3613 1196 2570 -3173 -2380 4695 1595 -5307
3560 -5307 -90 6170 163 -3982 2159 2894 -3650 -4267 1130 983 -4 1994 929 -225 1595 1
$$ packed form
3449A954l850K037K186k382k471N21K421O99j761j132K789K633l665k660M256
3464A575K276o322k171O046O46n244J145N684p86m181O39K092q13j655l26P99
3480e96J372n98k623R21M965j071n077K531M951m872n425M625L909m796j671N919
3496B464O21m114k74K863q7j155n71j493O06K121k781j413N831K428o549q58O427
3513D066j882p497L128N922l364m476M293K450l617m74K899L31p38n25k483m04
3529b371L434j009l696M334M926n773m159O671K115p618l53P180j682o307K051
3544b257M086j688q10K673n33p25L23k743j939M809J374n743P93P075l100o902
3560e307N217O260o007m145O141P35o544o17N397j47r87J998j065j154J820j594
$$ plain form
3576 1 -4114 392 4346 -2079 -5070 2347 3463 -4238 -2460 6799 3149 -4038 -802 2425 -2568 -4023
3592 -4023 1018 1674 2 1281 -78 -1762 1800 2180 -2795 -1022 4756 -649 -6988 -1000 4513
3607 4513 -1558 -3076 5292 5257 -3276 -2975 1961 -769 -2905 393 843 -860 510 85 -2279 1653
3623 1653 4650 -740 -2665 3051 1323 -6627 -3143 5090 1172 -4007 2107 5175 -1798 -3250 1988
3638 1988 1738 -1590 29 -37 -2188 -312 743 -1457 1250 5467 673 -4134 957 2763 -4843 -4399
3654 -4399 4240 3358 -3900 -945 4197 -86 -2569 1759 2444 -480 -994 -1299 -2498 -317 1261 -1365
3670 -1365 -179 5025 1849 -4309 -528 4514 -1483 -5251 1947 3594 -3254 -3723 2649 2435 -1032
3685 -1032 595 2178 -7 -1052 -1479 -2727 -62 2284 -1150 -2145 3154 2911 -3537 -2294 4621 1461
$$ packed form
3576Am115M506L954o425k991P417J116p701J778R259l650p187L236L227m993j455
3592d023N041O56j672J279j359j684L562L80m975J773N778n405o339N988N513
3607D513o071j518Q368l5q533L01M936k730k136L298M50j703J370m25k364L932
3623A653K997n390j925N716j728p950L484Q233l918n179O114L068o973j452N238
3638A988k50l328J619o6k151J876J055k200K707M217m794m807N091J806p606M44
3654d399Q639q82p258K955N142m283k483M328O85k924n14l05j199K181J578k626
3670a365J186N204l176o158L781N042n997l768P198J647o848m69O372k14l467
3685a032J627J583k185j045m27j248K665K346l434r95N299k43o448J243O915l160
$$ plain form
3701 1461 -4565 -951 3285 -1352 -4060 959 3091 690 164 1237 521 161 -508 -2717 -570 2336
3717 2336 -304 -3515 1154 4145 -1311 -2561 3131 3522 -3501 -3503 1383 633 -2976 -635 2631 1272
3733 1272 -71 -86 405 782 358 -2151 -1753 1605 350 -3868 -1002 4293 1234 -2331 1274 3964
3749 3964 -1135 -3721 308 1344 -1408 -1666 836 1701 403 -254 69 1364 1434 -1282 -2672 756
3765 756 1105 -2762 -1967 2975 2465 -2054 -257 3341 865 -2918 -1205 1564 -455 -2212 -1169 1510
3781 1510 1354 -212 -118 1378 2222 -573 -2689 56 1701 -1985 -2950 1266 3022 -1184 -1720 2580
3797 2580 2582 -1400 -2077 724 937 -2241 -2044 373 1867 458 -914 703 2537 522 -2352 -880
3813 -880 1923 -529 -3440 -648 2833 386 -1961 1058 3163 737 -2193 -676 1404 -677 -2727
$$ packed form
3701A461o026L614M236m637k708N019K132k401n26J073p16l60o69k209K147K906
3717B336k640l211M669K991n456j250N692L91p023kM886p50l609K341L266j359
3733A272j343j5M91L77m24k509L98L358j255m218K866N295l059l565L605K690
3749C964n099k586M029J036k752k58K502Q65j298o57L23J295P0k716j390L428
3765G56L49l867P95M942n10m519J797L598k476l783J713K769k019j757J043K679
3781A510j56j566R4J496Q44k795k116K745J645l686r65M216J756m206n36M300
3797B580Kl982o77K801K13l178J97K417J494j409j372J617J834k015k874J472
3813h80K803k452k911K792L481k447k347L019K105k426k930J517K080k081k050
$$ plain form
3828 -2727 -1117 1582 1161 -986 -478 2516 2041 -1662 -2009 1292 829 -2769 -2138 1720 1872 -1415 -927
3845 -927 2715 2327 -1591 -1386 1130 407 -1763 -2250 604 1623 -603 -1169 1482 2520 -218 -2010
3861 -2010 358 1874 -1382 -2897 -26 1726 -614 -1741 1485 2771 -43 -1188 464 1354 -1192
3876 -1192 -2548 -773 1437 558 -1351 358 2586 1166 -1471 -309 2028 -84 -2951 -1371 1767
3891 1767 390 -1969 209 2674 1334 -1308 133 1444 178 -2112 -1668 676 1106 -1212 -1156 2010
3907 2010 2461 -956 -1172 2198 1131 -2550 -2261 1196 688 -1824 -1122 2070 1885 -273 -497 750 903
3924 903 -1016 -2336 -445 1635 -891 -2654 958 3417 399 -1882 1182 2406 -1541 -2947 193
3939 193 1180 -1771 -1701 1177 2236 706 -936 -81 1537 897 -2181 -1577 1191 451 -2694 -1044 3299
$$ packed form
3828b727J610K699m21k147N08K994m75l703l47L301m63l598O31L858J52l287M88
3845i27L642l88l918K05K516p23k170m87K854J019k226n66K651J038k738j792
3861b010K368J516l256j515K871J752k340j127L226J286k814j145J652Q90k546
3876a192j356J775K210q79j909J709K228j420k637J162K337k112k867J580L138
3891A767j377k359K178K465j340k642J441J311j266k290M44K344M30k318N6L166
3907B010M51l417k16L370j067l681K89L457n08k512P02L192j85k158k24J247J53
3924I03j919j320J891K080k526j763L612K459l018k281L064J224l947j406L140
3939A93R87k951P0K878J059j530j642Q55J618o40l078O04K768p40l145J650M343
$$ plain form
3956 3299 1952 -1951 93 3100 123 -3275 -1013 1272 -370 -1396 72 1098 1148 119 -995
3971 -995 1131 2110 -765 -3209 -126 1737 -1722 -2623 2186 2840 -1415 -1130 2920 1597 -2122 -1103
3987 -1103 800 167 -1444 -980 -106 860 1270 29 -15 2453 574 -3740 -1616 2516 -320 -3569 607
4004 607 3746 -217 -2065 2059 2203 -1572 -824 850 -287 -1559 -1186 -1182 550 2477 803 -1013 1667
4021 1667 1848 -2530 -2434 2484 1342 -4296 -1292 3444 436 -2890 1323 3235 -105 -803 486 -635
4037 -635 -1657 -792 -789 309 2492 1165 -2592 682 3630 -561 -3557 1510 2614 -3276 -3254 2532 1852
4054 1852 -2544 440 3450 1420 -818 -152 -937 -1392 420 -301 -1458 1578 1405 -2671 -1448 4425
4070 4425 1872 -3665 -204 3617 -1698 -4680 770 2411 -1628 -575 3074 1331 -993 -294 -302 -463
$$ packed form
3956C299j347l903K044L007k977l398K262K285j642j026J468J026N0j029j114
3971i95K126R79k875k444L083J863l459r01M809O54m255K85M050j323l719J019
3987a103J903o33j611M64Q74R66M10j241m4K468j879m314K124M132k836l249M176
4004F07L139l963j848M124J44l775P48J674j137j272L73MJ732J927j674j816K680
4021A667J81m378R6M918j142n638L004M736l008l326M213J912l340o98J289j121
4037f35j022Q65LJ098K183j327l757L274K948m191k996N067J104n890K2N786o80
4054A852m396K984L010k030k238O66p85m55J812p21j157L036j73m076J223N873
4070D425k553n537L461L821n315k982N450J641m039J053L649j743k324O99qj61
$$ plain form
4086 -463 1486 404 -2851 -841 2457 -1225 -2217 3575 3964 -2908 -2154 3142 -212 -4864 -1042 2910
4102 2910 -54 -845 2080 848 -1163 421 621 -678 1537 603 -3683 -2419 2585 834 -3151 1750
4118 1750 4643 -1043 -2951 2340 1303 -3481 -1632 2710 885 -1733 -194 462 -611 1599 1522 -868
4134 -868 281 881 -3023 -3214 2718 1755 -2966 -237 4658 383 -3753 732 2736 -1929 -2072 1773
4150 1773 569 -2607 -1111 771 646 2031 1788 -1298 -890 1358 -1228 -3140 1441 2355 -2621 -2061
4166 -2061 3868 2266 -3051 -716 3381 405 -2258 -159 305 -1775 -854 999 894 1816 1232 -1853
4182 -1853 -1187 2415 507 -3392 -671 2664 -1410 -3341 1653 2826 -1753 -1115 3424 2107 -2052
4197 -2052 -1803 -380 -710 -260 598 -10 710 1327 -764 -901 2587 1911 -2993 -2009 2530 478 -3005
$$ packed form
4086d63J949j082l255K010L298l682r92N792L89o872P54N296l354m652L822L952
4102B910k964p91K925j232k011J584K00j299K215r34m286J264N004j751l985M901
4118A750K893n686j908N291j037m784J849M342j825k618J539O56j073K210p7k390
4134h68J149O00l904j91N932r63m721K729M895m275m136M485K004m665j43L845
4150A773j204l176J496J882j25J385k43l086M08K248k586j912M581R14m976N60
4166b061N929j602n317K335M097k976k663K099M64k080R21J853j05R22n84l085
4182a853O66L602j908l899K721L335m074j931M994J173m579O38M539j317m159
4197b052K49J423l30M50Q58o08P20O17k091j37L488o76m904R84M539k052l483
$$ plain form
4214 -3005 -300 2631 186 -1283 2118 2065 -1267 -2244 -575 151 611 -156 -1337 -404 2004 611 -913
4231 -913 1494 2107 -1875 -2524 1684 1477 -2944 -2056 2134 1906 -715 337 1181 120 -860 -103 77
4248 77 166 -832 -2114 -834 2383 1285 -1154 75 2697 239 -2041 263 1214 -1949 -2426 1216 2400
4265 2400 -195 -1136 888 1407 584 -62 -533 -463 -743 -1716 -521 1599 1203 -1551 -684 2944 1431 -2044
$$ packed form
4214c005K705K931k445j469L401n3l332r77J669P26M60p67j181R33K408j393j524
4231i13K407O13l982o49M208k07m421Q88M190k28k621J052Q44j061r80P57J80
4248G7Q9r98j282J280L217j098k439J229K622k458k280K304R51l163m77L642J184
4265B400k595r41K024N19q23o46m71P0k80r73J195K120l96k754Q67L628j513l475
$$ [...]
8191b00
##END NTUPLES=NMR FID
##END=
