##TITLE=1H_Ser Am-O-5241N
 200.13Hz,CDCl3.
 8 sc
 21.8.2026
##JCAMPDX= 6.0         $$ Bruker NMR JCAMP-DX V2.0
##DATA TYPE= NMR FID
##DATA CLASS= NTUPLES
##ORIGIN= UXNMR, Bruker Analytische Messtechnik GmbH
##OWNER= pz
$$ XWIN-NMR		Version 3.5
$$ Fri Aug 21 14:48:39 2026 Russian Standard Time (UT+4h)  she@DPX200
##.OBSERVE FREQUENCY= 200.1313
##.OBSERVE NUCLEUS= ^1H
##.DELAY= (6, 6)
##.ACQUISITION MODE= SIMULTANEOUS
##.ACQUISITION SCHEME= undefined
##.AVERAGES= 8
##.DIGITISER RES= 18
##SPECTROMETER/DATA SYSTEM= spect
##.PULSE SEQUENCE= zg30
##.SOLVENT NAME= CDCl3
##.SHIFT REFERENCE= (INTERNAL, CDCl3, 0, 14.3821)
##AUDIT TRAIL= $$ (NUMBER, WHEN, WHO, WHERE, WHAT)
$$ ##TITLE= Audit trail, XWIN-NMR		Version 3.5
$$ ##JCAMPDX= 5.01
$$ ##ORIGIN= Bruker BioSpin GmbH
$$ ##OWNER= she
$$ F:/spectra/data/she/nmr/H-C/1/audita.txt
$$ ##AUDIT TRAIL=  $$ (NUMBER, WHEN, WHO, WHERE, WHAT)
(   1,<2026-08-21 14:47:26.78 +0400>,<she>,<DPX200>,
      <created by zg, POWCHK disabled, PULCHK disabled
       configuration hash MD5:
       00 E9 B6 7A A2 85 ED C7 34 08 36 98 17 FE 4E 26
       data hash MD5: 16K
       17 CE 1C D5 72 F2 46 9C F2 7D B8 F5 A5 CF 25 11>)
$$ ##END=
$$ 
$$ hash MD5
$$ 4C 10 B6 09 83 46 BA E3 99 6E 30 E4 A6 59 03 3B
##$RELAX= 
##$RELAX= 
##$RELAX= 
##$RELAX= 
##$RELAX= 
##$RELAX= 
$$ Bruker specific parameters
$$ --------------------------
##$DU= <F:/spectra>
##$EXPNO= 1
##$NAME= <H-C>
##$PROCNO= 1
##$TYPE= <nmr>
##$USER= <she>
##$AMP= (0..31)
100 100 100 100 100 100 100 100 100 100 100 100 100 100 100 100 100 100 
100 100 100 100 100 100 100 100 100 100 100 100 100 100 
##$AQSEQ= 0
##$AQ_mod= 1
##$AUNM= <au_zg>
##$AUTOPOS= <>
##$BF1= 200.13
##$BF2= 200.13
##$BF3= 200.13
##$BF4= 200.13
##$BF5= 200.13
##$BF6= 200.13
##$BF7= 200.13
##$BF8= 200.13
##$BYTORDA= 1
##$CFDGTYP= 0
##$CFRGTYP= 5
##$CHEMSTR= <none>
##$CNST= (0..31)
1 1 145 1 1 1 1 1 1 1 1 1 1 1 1 1 1 1 1 1 1 1 1 1 1 1 1 1 1 1 1 1 
##$CPDPRG= <>
##$CPDPRG1= <>
##$CPDPRG2= <>
##$CPDPRG3= <>
##$CPDPRG4= <mlev>
##$CPDPRG5= <mlev>
##$CPDPRG6= <mlev>
##$CPDPRG7= <mlev>
##$CPDPRG8= <mlev>
##$CPDPRGB= <>
##$CPDPRGT= <>
##$D= (0..31)
0 0.7 0 0 0 0 0 0 0 0 0 0.03 0 0 0 0 0 0 0 0 0 0 0 0 0 0 0 0 0 0 0 0 
##$DATE= 1787309246
##$DBL= (0..7)
120 120 120 120 120 120 120 120 
##$DBP= (0..7)
150 150 150 150 150 150 150 150 
##$DBP07= 0
##$DBPNAM0= <>
##$DBPNAM1= <>
##$DBPNAM2= <>
##$DBPNAM3= <>
##$DBPNAM4= <>
##$DBPNAM5= <>
##$DBPNAM6= <>
##$DBPNAM7= <>
##$DBPOAL= (0..7)
0.5 0.5 0.5 0.5 0.5 0.5 0.5 0.5 
##$DBPOFFS= (0..7)
0 0 0 0 0 0 0 0 
##$DE= 6
##$DECBNUC= <off>
##$DECIM= 32
##$DECNUC= <off>
##$DECSTAT= 4
##$DIGMOD= 1
##$DIGTYP= 9
##$DL= (0..7)
0 120 120 120 120 120 120 120 
##$DP= (0..7)
150 150 150 150 150 150 150 150 
##$DP07= 0
##$DPNAME0= <>
##$DPNAME1= <>
##$DPNAME2= <>
##$DPNAME3= <>
##$DPNAME4= <>
##$DPNAME5= <>
##$DPNAME6= <>
##$DPNAME7= <>
##$DPOAL= (0..7)
0.5 0.5 0.5 0.5 0.5 0.5 0.5 0.5 
##$DPOFFS= (0..7)
0 0 0 0 0 0 0 0 
##$DQDMODE= 0
##$DR= 18
##$DS= 0
##$DSLIST= <SSSSSSSSSSSSSSS>
$$ [...]
##$SUBNAM0= <"">
##$SUBNAM1= <"">
##$SUBNAM2= <"">
##$SUBNAM3= <"">
##$SUBNAM4= <"">
##$SUBNAM5= <"">
##$SUBNAM6= <"">
##$SUBNAM7= <"">
##$SUBNAM8= <"">
##$SUBNAM9= <"">
##$SW= 18.0517328524113
##$SWIBOX= (0..15)
0 0 2 0 0 0 0 0 0 0 0 0 0 0 0 0 
##$SW_h= 3612.71676300578
##$TD= 16384
##$TD0= 1
##$TE= 0
##$TE2= 300
##$TE3= 300
##$TEG= 300
##$TL= (0..7)
0 120 120 120 120 120 120 120 
##$TP= (0..7)
150 150 150 150 150 150 150 150 
##$TP07= 0
##$TPNAME0= <>
##$TPNAME1= <>
##$TPNAME2= <>
##$TPNAME3= <>
##$TPNAME4= <>
##$TPNAME5= <>
##$TPNAME6= <>
##$TPNAME7= <>
##$TPOAL= (0..7)
0.5 0.5 0.5 0.5 0.5 0.5 0.5 0.5 
##$TPOFFS= (0..7)
0 0 0 0 0 0 0 0 
##$TUNHIN= 0
##$TUNHOUT= 0
##$TUNXOUT= 0
##$USERA1= <user>
##$USERA2= <user>
##$USERA3= <user>
##$USERA4= <user>
##$USERA5= <user>
##$V9= 5
##$VALIST= <valist>
##$VCLIST= <CCCCCCCCCCCCCCC>
##$VD= 0
##$VDLIST= <DDDDDDDDDDDDDDD>
##$VPLIST= <PPPPPPPPPPPPPPP>
##$VTLIST= <TTTTTTTTTTTTTTT>
##$WBST= 1024
##$WBSW= 4
##$XGAIN= (0..3)
0 0 0 0 
##$XL= 0
##$YL= 0
##$YMAX_a= 138021
##$YMIN_a= -117102
##$ZGOPTNS= <>
##$ZL1= 120
##$ZL2= 120
##$ZL3= 120
##$ZL4= 120
##$ABSF1= 10
##$ABSF2= 0
##$ABSG= 5
##$ABSL= 3
##$ALPHA= 0
##$AQORDER= 0
##$ASSFAC= 0
##$ASSFACI= 0
##$ASSFACX= 0
##$ASSWID= 0
##$AUNMP= <proc_1d>
##$AZFE= 0.1
##$AZFW= 0.1
##$BCFW= 1
##$BC_mod= 2
##$BYTORDP= 1
##$COROFFS= 0
##$CY= -3
##$DATMOD= 1
##$DC= 2
##$DFILT= <>
##$DTYPP= 0
##$F1P= 0
##$F2P= 0
##$FCOR= 0.5
##$FTSIZE= 0
##$FT_mod= 4
##$GAMMA= 1
##$GB= 0.15
##$INTBC= 1
##$INTSCL= 1
##$ISEN= 128
##$LB= 0.25
##$LEV0= 0
##$LPBIN= 0
##$MAXI= 10000
##$MC2= 0
##$MEAN= 0
##$ME_mod= 0
##$MI= 1.114404
##$NCOEF= 0
##$NC_proc= 0
##$NLEV= 6
##$NOISF1= 3.799351
##$NOISF2= 2.8
##$NSP= 1
##$NTH_PI= 0
##$NZP= 0
##$OFFSET= 14.38212
##$PC= 1
##$PHC0= -4578.702
##$PHC1= 8.392296
##$PH_mod= 1
##$PKNL= yes
##$PPARMOD= 0
##$PSCAL= 0
##$PSIGN= 0
##$REVERSE= no
##$SF= 200.129724274929
##$SI= 16384
##$SIGF1= 3
##$SIGF2= 2
##$SINO= 400
##$SIOLD= 16384
##$SREGLST= <1H.CDCl3>
##$SSB= 0
##$STSI= 0
##$STSR= 0
##$SW_p= 3205.1282051282
##$SYMM= 0
##$S_DEV= 0
##$TDeff= 0
##$TDoff= 0
##$TI= <>
##$TILT= no
##$TM1= 0
##$TM2= 0
##$TOPLEV= 0
##$USERP1= <user>
##$USERP2= <user>
##$USERP3= <user>
##$USERP4= <user>
##$USERP5= <user>
##$WDW= 1
##$XDIM= 8192
##$YMAX_p= 0
##$YMIN_p= 0
$$ End of Bruker specific parameters
$$ ---------------------------------
##NTUPLES= NMR FID
##VAR_NAME=  TIME,          FID/REAL,        FID/IMAG
##SYMBOL=    X,             R,               I
##VAR_TYPE=  INDEPENDENT,   DEPENDENT,       DEPENDENT
##VAR_FORM=  AFFN,          ASDF,            ASDF
##VAR_DIM=   8192,          8192,            8192
##UNITS=     SECONDS,       ARBITRARY UNITS, ARBITRARY UNITS
##FACTOR=    0.0002768,     1,               1
##FIRST=     0,             0,               0
##LAST=      2.2672688,     0,               0
##MIN=       0,             -117102,         0
##MAX=       2.2672688,     138021,          0
$$ Real data points
##PAGE= N=1
##DATA TABLE= (X++(R..R)), XYDATA
$$ plain form
0 0 0 0 0 0 0 0 0 0 0 0 0 0 0 0 0 0 0 -8 8 -8 8 -8 8 -14 16 -16 20 -24 26 -32 36 -40 47 -52 60 -68 76 -85 95
39 95 -107 119 -133 148 -164 181 -199 221 -243 268 -298 324 -358 396 -435 480 -532 589 -653 727
59 727 -813 916 -1035 1183 -1371 1614 -1940 2400 -3105 4261 -9556 112962 53358 -117102
73 -117102 -57081 -3395 -52975 -30530 45886 -13957 -63265 41885 91713 -5806 -13480 47023
85 47023 17911 7152 66323 21076 -67302 -16050 51619 -25994 -73876 7871 12050 -69018
97 -69018 -15457 54202 -29872 -64228 39177 47786 -31037 11098 80669 3283 -53999 35747
109 35747 54779 -43301 -29140 45827 -2370 -50511 882 9358 -38777 -17261 25379 -7237
121 -7237 -21362 28086 11635 -36817 16456 52343 -15940 -16974 54013 18359 -53487 -2448
$$ packed form
0@%%%%%%%%%%%%%%%%%qJ6j6J6j6J6k2L0l2L6m4N0n8O8p6Q7r9J12j28J44j61J80
39I5k02K26k52K81l12L45l80M20m64N11n66O22o82P54q31R15j012J121j242J380
59G27j540J729j951K218k554K985l554M340n505P366j3817J22518n9604j70460
73a17102O0021N3686m9580K2445P6416n9843m9308J05150M9828r7519p674O0503
85D7023k9112j0759N9171m5247q8378N1252O7669p7613m7882Q1747M179q1068
97f9018N3561O9659q4074l4356J03405Q609p8823M2135O9571p7386n7282Q9746
109C5747J9032r8080J4161P4967m8197m8141N1393Q476m8135K1516M2640l2616
121g237j4125M9448j6451m8452N3273L5887o8283j034P0987l5654p1846N1039
$$ plain form
133 -2448 52983 -16885 -55682 21679 33002 -39780 -23414 25408 -12393 -28783 19457 14927
145 14927 -26801 -2959 32768 -379 -20417 18858 14917 -19510 8694 26765 -16438 -14813
157 -14813 22625 -1442 -30297 8309 29722 -15618 -23963 19913 1379 -37131 7397 33910
169 33910 -18620 -23511 28449 19056 -23895 -6174 26294 1853 -14385 16041 12129 -17422 -974
182 -974 10279 -13154 -7171 10208 -10114 -19570 8608 10636 -23126 -15464 22059 7159 -13907
195 -13907 18042 19774 -21302 -8364 31234 13071 -17015 583 17042 -6550 -12939 8250
207 8250 -6287 -23870 5697 14529 -16282 -15844 6735 4847 -1590 6775 5272 -6732 5563 21342
221 21342 -2981 -15332 13572 12088 -14915 -2096 12755 -9700 -19032 4642 6752 -18699 -11236
$$ packed form
133b448N5431o9868l8797P7361J1323p2782J6366M8822l7801j6390M8240m530
145A4927m1728K3842L5727l3147k0038L9275l941l4427K8204J8071m3203J625
157a4813L7438k4067k8855L8606K1413m5340q345M3876j8534l8510M4528K6513
169C3910n2530m891N1960r393m2951J7721L2468k4441j6238L0426l912k9551J6448
182i74J1253k3433N983J7379k0322r456K8178K028l3762P662L7523j4900k1066
195a3907L1949J732m1076J2938L9598j8163l0086J7598J6459k3592o389K1189
207H250j4537j7583K9567Q832l0811M38K2579j888o437Q365j503j2004J2295J5779
221B1342k4323j2351K8904j484k7003J2819J4851k2455r332K3674K110k5451P463
$$ plain form
234 -11236 16562 363 -16919 8504 14462 -6745 276 15548 4680 -3259 7112 7457 -7213
247 -7213 -1675 10996 -6162 -13423 6237 -575 -18071 -1619 7925 -8783 -8750 10051 5896 -13191
261 -13191 -246 20585 1030 -10181 12679 9244 -10874 391 12358 -2180 -9461 3352
273 3352 3113 -13444 -8215 7224 -4619 -10003 7057 2505 -9530 3397 9503 -2869 -1148 12281
287 12281 6539 -8688 2429 15668 -3904 -9838 10043 2587 -14013 -1366 5501 -10495 -13171
300 -13171 4470 5670 -11245 -5108 10616 -995 -6122 9838 6164 -3797 7120 11073 -1350
313 -1350 -4070 5989 3717 -8393 -1829 6299 -9137 -11182 4964 -2479 -12532 832 7044 -3824
327 -3824 -4998 7713 7763 -4872 2972 14813 1094 -3719 9628 3085 -8870 -1227 3379 -5130
$$ packed form
234a1236K7798j6199j7282K5423N958k1207P021J5272j0868p939J0371L45j4670
247g213N538J2671j7158p261J9660o812j7496J6452R544j6708L3J8801m155j9087
261a3191J2945K0831j9555j1211K2860l435k0118J1265J1967j4538p281J2813
273C352k39j6557N229J5439j1843n384J7060m552j2035J2927O106j2372J721J3429
287A2281n742j5227J1117J3239j9572n934J9881p456j6600J2647O867j5996k676
300a3171J7641J200j6915O137J5724j1611n127J5960l674r961J0917L953j2423
313a350k720J0059k272j2110O564Q128j5436k045J6146p443j0053J3364O212j0868
327c824j174J2711N0j2635P844J1841j3719m813J3347o543j1955P643M606q509
$$ plain form
341 -5130 -9064 -1093 -531 -9763 -4722 4025 -4877 -3438 9192 2760 -4127 6023 9154 704 -839
356 -839 6901 5181 -5167 377 6467 -6583 -8704 3416 -1253 -8385 -2374 832 -3854 -3925 3558
371 3558 4434 -2895 1737 7949 -751 -982 7725 2848 -1760 2778 1944 -3004 -4320 740 676 -5809
387 -5809 -1981 1717 -6656 -4533 4413 -341 -3483 2262 3418 -422 -1392 4487 5438 -1422 1678 5643
403 5643 -1339 -928 4266 -1318 -4168 -641 240 -1754 -3527 -2038 -2291 -5417 38 3668 -3511 -1360
419 -1360 4972 1640 513 3160 2899 1910 2209 5007 2774 -4564 -2204 1886 -3517 -3086 -186 -4515
435 -4515 -4292 -1142 -1923 -3266 -2389 2620 4905 756 3808 5621 -303 2155 6418 2737 1265 1538
451 1538 -466 -2999 -5029 -2936 -3017 -6444 -2096 -65 -5540 -2035 2561 -1073 -560 3959 6753 5219
$$ packed form
341e130l934P971N62r232N041Q747q902J439J2630o432o887J0150L131q450j543
356h39P740j720j0348N544O090j3050k121J2120m669p132O011L206m686p1P483
371C558Q76p329M632O212q700k31Q707m877m608M538q34m948j316N060o4o485
387e809L828L698q373K123Q946m754l142N745J156l840r70N879R51o860L100L965
403E643o982M11N194n584k850L527Q81j994j773J489k53l126N455L630p179K151
419a360O332l332j127K647k61r89K99K798k233p338K360M090n403M31K900m329
435d515K23L150p81j343Q77N009K285m149L052J813n924K458M263l681j472K73
451A538k004k533k030K093q1l427M348K031n475L505M596l634N13M519K794j534
$$ plain form
467 5219 2215 3873 3434 -878 2174 3127 -3813 -2745 -332 -4344 -5130 -4320 -5322 -4978 -1114 5208
483 5208 2482 -4771 1343 6774 2183 3752 5851 2058 1755 3966 2313 -3207 -5982 -1541 -1254 -4295
499 -4295 142 -1718 -9182 -3324 3078 -1764 -3521 2455 6747 4301 1676 4068 1027 -2376 5886
514 5886 7032 -1242 87 511 -6091 -6199 -886 -1055 -5948 -3297 4481 -782 -8241 639 4183 -1814
530 -1814 3022 8912 3506 487 2837 1802 -2557 -962 5573 271 -5644 1115 -1260 -11011 -4678
545 -4678 1688 -3366 -2928 4935 5154 -4073 -4133 5443 3947 792 8515 5508 -4478 1192 4670 -4784
561 -4784 -6640 1601 3437 -3480 -3057 1710 -7052 -10558 4114 6173 -3531 831 5408 -229 -1908
576 -1908 3163 2816 -1689 3891 9877 -1126 -7527 2495 89 -8539 -77 5279 -3830 -6012 1705
$$ packed form
467E219l004J658m39m312L052R53o940J068K413m012p86Q10j002L44L864O322
483E208k726p253O114N431m591J569K099l793l03K211j653n520k775M441K87l041
499d295M437j860p464N858O402m842j757N976M292k446k625K392l041l403Q262
514E886J146q274J329M24o602j08N313j69m893K651P778n263p459Q880L544n997
530a814M836N890n406l019K350j035m359J595O535n302n915O759k375r751O333
545d678O366n054M38P863K19r227o0R576j496l155P723l007r986N670L478r454
561d784j856Q241J836o917M23M767q762l506J4672K059r704M362M577n637j679
576a908N071l47m505N580N986j1003o401J0022k406q628Q462N356r109k182P717
$$ plain form
591 1705 1058 -7566 -3422 6385 874 -2124 7455 4027 -5612 1314 5239 -1230 -7 6754 3572
606 3572 -6090 -3783 2941 -4904 -7158 4513 1475 -7119 -246 2866 -4712 -4184 3990 4187 -856
621 -856 3449 7943 -2558 -4870 6946 2969 -5443 2107 5629 -2589 -4610 744 -1913 -8451 -2214
636 -2214 5585 -2421 -5378 3116 -422 -4743 4372 6300 -789 971 7876 4276 -4675 -316 5413
651 5413 -2815 -3656 5318 -828 -8587 -2316 158 -6193 -5020 2597 2003 -3719 905 5774 -1981 -1903
667 -1903 8295 4840 -1176 4567 5500 -2171 -3659 1321 -179 -5919 -1737 2331 -6171 -6615 1550
682 1550 -1947 -5477 2482 5127 306 462 5986 3921 -2654 2051 8259 822 -2129 3747 -1179
697 -1179 -6610 -1568 302 -4309 -4987 -183 103 -5190 -1943 3868 -1114 -471 6768 3772 -848 3151
$$ packed form
591A705o47q624M144R807n511k998R579l428r639O926L925o469J223O761l182
606C572r662K307O724p845k254J1671l038q594O873L112p578N28Q174J97n043
621h56M305M494j0501k312J1816l977q412P550L522q218k021N354k657o538O237
636b214P799q006k957Q494l538m321R115J928p089J760O905l600q951M359N729
651E413q228q41Q974o146p759O271K474o351J173P617n94n722M624M869p755P8
667a903J0198l455o016N743R33p671j488M980j500n740M182M068q502m44Q165
682A550l497l530P959K645m821J56N524k065o575M705O208p437k951N876m926
697a179n431N042J870m611o78M804K86n293L247N811m982O43P239k996m620L999
$$ plain form
713 3151 4925 816 -1394 2117 2131 -3707 -1886 1913 -4661 -6232 432 -1350 -4936 -946 2113 7
729 7 -2112 2247 4678 -32 1854 6106 1033 -833 3459 1649 -2473 -912 639 -1647 -4050 -1397
745 -1397 -295 -5266 -2915 2537 -1685 -2708 2908 2193 -340 1570 4103 2433 -445 2618 4327
760 4327 -1289 -536 3283 -1888 -3692 58 -1150 -4143 -2977 -316 -601 -3236 -204 2499 -1616 253
776 253 4857 1267 -124 3466 2509 53 476 2401 722 -2610 -288 748 -4458 -3341 963 -2922
792 -2922 -4149 306 265 -1367 -29 2614 2149 -544 2749 4614 -68 917 4179 -159 -1465 1438
808 1438 -91 -2411 -2203 -905 -2096 -4451 -776 932 -3379 -678 3180 -457 -569 3270 2468 1038
824 1038 1682 3079 1585 -1242 1476 1682 -3576 -1766 891 -3068 -3396 -574 -1176 -2242 -1033 903
$$ packed form
713C151J774m109k210L511J4n838J821L799o574j571O664j782l586L990L059k106
729Gk119M359K431m710J886M252n073j866M292j810m122J561J551k286k403K653
745a397J102m971K351N452m222j023N616p15k533J910K533j670k878L063J709
760D327n616P53L819n171j804L750j208k993J166K661k85k635L032K703m115J869
776B53M604l590j391L590r57k456M23J925j679l332K322J036n206J117M304l885
792b922j227M455m1j632J338K643m65k693L293J865m682R85L262m338j306K903
808A438j529k320K08J298j191k355L675J708m311K701L858l637j12L839q02j430
824A038O44J397j494k827K718K06n258J810K657l959l28K822o02j066J209J936
$$ plain form
840 903 290 -1217 2343 2878 -858 1765 4151 136 539 3001 561 -1393 -597 453 -1744 -3641
856 -3641 -332 -213 -3771 -1242 1109 -2137 -900 2021 567 -3 1472 2493 1123 -49 3068 1983
872 1983 -1624 1182 2003 -2418 -1391 491 -1854 -2546 -1437 -414 -1961 -2231 1363 683 -2158 1765
888 1765 2614 -877 1311 3713 1384 339 1742 1921 -663 -1825 1381 -438 -3605 -202 -130 -3721
904 -3721 -1467 276 -2047 -1384 942 1866 -321 114 3508 1821 -734 3469 3077 -1442 875 2747
920 2747 -892 -2569 -910 -329 -2570 -2810 658 -1745 -4010 827 1139 -2017 768 3120 903 687
936 687 2795 2719 -381 137 3555 680 -2544 1124 102 -4516 -1992 115 -2352 -2840 -312 640 -2212
953 -2212 -1144 3204 1201 -655 4424 3950 -570 1459 3049 16 -1243 480 1177 -2450 -2976 387
$$ packed form
840I03o13j507L560N35l736K623K386m015M03K462k440j954P96J050k197j897
856c641L309J19l558K529K351l246J237K921j454n70J475J021j370j172L117j085
872A983l607K806Q21m421J027J882k345o92J109J023j547k70L594o80k841L923
888A765Q49l491K188K402k329j045J403J79k584j162L206j819l167L403P2l591
904c721K254J743k323O63K326R24k187M35L394j687k555M203l92m519K317J872
920B747l639j677J659N81k241k40L468k403k265M837L12l156K785K352k217k16
936F87K108p6l100N18L418k875l224L668j022m618K524K107k467m88K528R52k852
953b212J068M348k003j856N079m74m520K029J590l033j259J723O97l627n26L363
$$ plain form
969 387 -2287 -4463 -34 -436 -3050 238 2336 180 -726 1918 3189 311 1122 4956 1016 -2203
985 -2203 1612 838 -3244 -1631 139 -1581 -2519 -1075 -527 -3490 -2285 2193 178 -1222 3353 2184
1001 2184 -580 1450 2558 688 -78 2327 2763 -1353 -1929 520 -2507 -3509 628 -228 -2891 -448
1017 -448 481 -1766 -1789 788 2301 143 1058 4185 954 -1390 2046 1051 -1205 924 1280 -581 -1770
1034 -1770 -1271 -1196 -3171 -1422 1525 -1323 -1324 1898 -220 -2206 1017 1755 870 1682 2893 2060 -1277
1051 -1277 -484 1906 -1009 -863 1715 -765 -2559 -522 -1457 -3128 -1671 669 890 -586 837 1492
1067 1492 -1366 164 3247 1081 939 3241 1425 -911 -436 393 -815 -2053 587 585 -3420 -2151
1083 -2151 486 -2500 -2157 1583 1178 79 1559 1772 -16 -502 1965 2355 -311 1777 2752 -1987
$$ packed form
969C87k674k176M429m02k614L288K098k156r06K644J271k878Q11L834l940l219
985b203L815p74m082J613J770j720r38J444N48k963J205M478k015j400M575j169
1001B184k764K030J108j870p66K405M36m116n76K449l027j002M137q56k663K443
1017d48R29k247k3K577J513k158R15L127l231k344L436r95k256K129L56j861j189
1034a770M99P5j975J749K947k848jL222k118j986L223P38q85Q12J211q33l337
1051a277P93K390k915J46K578k480j794K037r35j671J457K340K21j476J423O55
1067A492k858J530L083k166j42K302j816k336M75Q29j208j238K640km005J269
1083b151K637k986L43L740m05j099J480K13j788m86K467L90k666K088R75m739
$$ plain form
1099 -1987 -2018 584 -2116 -3064 23 784 -1715 -2481 507 -431 -2915 993 3561 -189 665 3971 837
1116 837 -1084 1185 2161 -317 -324 2093 60 -3826 -959 413 -3822 -1612 1880 -766 -1864 764
1132 764 875 -1668 -154 3996 2172 -945 2756 3031 -2530 -716 2642 -619 -2312 725 717 -2919
1148 -2919 -2992 748 -1171 -3378 1240 2480 -2102 -28 3250 -230 -903 2652 2826 -297 244 3023
1164 3023 -415 -3488 747 1117 -3493 -982 2065 -2219 -3624 102 741 -2158 -461 3455 1056
1179 1056 -2004 2514 2652 -1677 470 3351 212 -1215 1152 589 -2634 -1957 1157 -1065 -3170 641
1195 641 647 -3190 -599 2035 -569 -707 2284 2394 -523 -3 3152 409 -1552 1868 1620 -2549 -730
1212 -730 1122 -1666 -2341 -334 159 -1928 -1477 1896 -159 -1783 1508 1558 -732 1245 2589 414
$$ packed form
1099a987l1K602k700r48L087P61k499p66K988r38k484L908K568l750Q54L306l134
1116H37j921K269R76k478pK417k033l886K867J372m235K210L492k646j098K628
1132G64J11k543J514M150j824l117L701K75n561J814L358l261j693L037ql636
1148b919p3L740j919k207M618J240m582K074L278l480o73L555J74l123N41K779
1164C023l438l073M235L70m610K511L047m284j405L726O39k899J697L916k399
1179A056l060M518J38m329K147K881l139j427K367n63l223O77L114k222k105L811
1195F41Ol837K591K634k604j38K991J10k917N20L155k743j961L420k48m169J819
1212g30J852k788o75K007M93k087M51L373k055j624L291N0k290J977J344k175
$$ plain form
1228 414 -55 1477 829 -1036 -750 1160 -892 -2572 370 -374 -2601 -709 580 -849 -950 650
1244 650 1112 -240 26 2045 930 -421 1743 1302 -632 343 544 -710 -1157 -305 -238 -1396 -1326 109
1262 109 -868 -1518 367 458 -635 746 1118 575 720 1169 1130 391 -285 987 80 -1163 224 -305 -1545
1281 -1545 -688 -632 -793 -1124 -828 113 -108 -687 1009 728 24 1358 777 327 863 543 356 172 -467
1300 -467 213 -405 -1322 -172 -629 -1493 -462 -113 -661 -317 112 365 418 204 1274 951 190 1191 1031
1319 1031 -236 502 350 -317 -680 -847 -187 -817 -1443 -105 -539 -1305 -117 198 -469 443 739 630 688
1338 688 566 1215 555 -110 1144 232 -1224 190 207 -1130 -934 -505 -598 -1190 -999 169 -411 -733 923
1357 923 936 -306 1039 1296 470 893 956 608 -301 -245 315 -775 -1460 90 -745 -1938 -442 -129 -1328
$$ packed form
1228D14m69J532o48j865K86J910k052j680K942p44k227J892J289j429j01J600
1244F50M62j352K66K019j115j351K164m41j934R75K01j254m47Q52O7j158P0J435
1262A09r77o50J885R1j093J381L72n43J45M49l9p39o76J272r07j243J387n29j240
1281a545Q57N6j61l31K96R41k21n79J696k81p04J334n81m50N36l20j87j84o39
1300d67O80o18r17J150m57q64J031L49n48L44M29K53N3k14J070l23p61J001j60
1319A031j267P38j52o67l63j67O60o30o26J338m34p66J188L15o67R12K96j09N8
1338F88j22O49o60o65J254r12j456J414J7j337J96M29r3n92J91J168n80l22J656
1357I23J3j242J345K57q26M23O3l48r09N6N60j090o85J550q35j193J496L13j199
$$ plain form
1376 -1328 -516 513 552 -69 534 1621 555 297 1754 999 -468 663 932 -872 -779 -109 -534 -1518
1394 -1518 -1216 231 -1146 -1276 1010 206 -869 854 1332 83 351 1377 904 -377 457 1424 -485
1411 -485 -1157 855 -540 -2021 -358 81 -1410 -1053 350 84 -1112 153 1606 -222 -28 2305
1427 2305 738 -555 1340 1181 -1006 -261 851 -82 -1790 -511 341 -1858 -1640 979 -282 -1764
1443 -1764 863 1006 -839 -154 1761 1045 -341 1043 1792 -849 -669 1537 -398 -1766 268 604
1459 604 -1633 -1172 488 -426 -1895 98 1366 -841 -382 2231 402 -1262 1279 1502 -491 -103
1475 -103 1685 343 -1624 209 938 -1939 -1379 1333 -794 -1933 603 337 -1441 -571 1729 592
1491 592 -1088 1117 1968 -752 -177 2374 162 -1162 1241 970 -1779 -926 576 -484 -2110 238
$$ packed form
1376a328Q12J029L9o21O03J087j066k58J457p55j467J131K69j804R3O70m25r84
1394a518L02J447j377j30K286q04j075J723M78j249K68J026m73j281Q34R67j909
1411d85o72K012j395j481J663M39j491L57J403k66j196J265J453j828J94K333
1427B305j567j293J895j59k187P45J112r33j708J279Q52k199K18K619j261j482
1443a764K627J43j845O85J915p16j386J384P49k641J80K206j935j368K034L36
1459F04k237M61J660r14j469J993J268k207M59K613j829j664K541K23j993L88
1475a03J788j342j967J833P29k877N60K712k127j139K536k66j778Q70K300j137
1491E92j680K205Q51k720N75K551k212j324K403k71k749Q53J502j060j626K348
$$ plain form
1507 238 1066 -1731 -1049 1533 -394 -1577 1306 1750 -463 275 2061 210 -1251 899 1511 -1526
1523 -1526 -415 1677 -858 -2204 390 170 -1805 -581 1179 -293 -1424 778 1305 -1229 189
1538 189 2455 325 -813 1836 874 -1220 -379 948 -425 -1575 718 732 -2297 -1132 905 -1066
1554 -1066 -1339 1367 1191 -768 305 1516 -138 -960 1675 1727 -977 289 1718 -1032 -1674 741
1570 741 -20 -1698 -528 833 -1261 -1921 517 665 -1358 407 2334 -290 -472 1753 621 -854
1586 -854 682 1629 -217 -1165 831 117 -2183 -485 1109 -1386 -1066 1019 166 -1557 -65 1041
1602 1041 -495 -379 2044 1303 -1069 692 1686 -891 -853 1358 143 -1199 51 384 -1376 -1727 604
1619 604 43 -1496 455 1539 -896 -636 1568 180 -341 971 1750 -118 -234 1123 74 -1646
$$ packed form
1507B38Q28k797O82K582j927j183K883M44k213P38J786j851j461K150O12l037
1523a526J111K092k535j346K594k20j975J224J760j472j131K202N27k534J418
1538A89K266k130j138K649r62k094Q41J327j373j150K293J4l029J165K037j971
1554a066k73K706j76j959J073J211j654q22K635N2k704J266J429k750o42K415
1570G41p61j678J170J361k094o60K438J48k023J765J927k624j82K225j132j475
1586h54J536R47j846r48J996p14k300J698J594k495L20K085q53j723J492J106
1602A041j536J16K423p41k372J761R94k577L8K211j215j342J250L33j760l51K331
1619F04n61j539J951J084k435K60K204j388n21J312P79j868j16J357j049j720
$$ plain form
1635 -1646 448 928 -1433 -692 590 -792 -1618 120 717 -791 -256 1629 520 -1063 1057 1429
1651 1429 -718 292 1539 71 -800 371 229 -1311 -838 727 -81 -1329 178 343 -1308 -477
1667 -477 1123 -91 -423 1303 1050 -196 19 1029 198 -814 707 736 -1333 -475 328 -960 -1258
1684 -1258 66 30 -880 -299 878 -236 -797 975 822 -537 615 1199 5 -498 484 429 -569 -423
1702 -423 761 -453 -1282 276 31 -1221 -398 523 -261 -310 587 478 -308 90 1258 304 -399 1239
1720 1239 650 -718 338 570 -678 -752 -20 -37 -1099 -405 112 -444 -1024 776 188 -335 577 751 50
1739 50 253 819 557 -207 -149 726 -394 -909 413 -217 -1095 -120 85 -936 -441 195 -44 -427 71 973
1759 973 -111 -24 1168 561 -157 631 587 -307 -264 388 -126 -909 -288 -20 -611 -694 473 -327 -624 128
$$ packed form
1635a646K094M80k361P41J282j382q26J738N97j508N35J885j109j583K120L72
1651A429k147J010J247j468q71J171j42j540M73J565q08j248J507J65j651Q31
1667d77J600j214l32J726k53j246K15J010q31j012J521K9k069Q58Q03j288k98
1684a258J324l6r10N81J177j114n61J772j53j359J152N84j194n03R82n5r98J46
1702d23J184j214q29J558k45j252Q23R21p84m9Q97j09p86L98J168r54p03J638
1720A239n89j368J056K32j248p4P32j7j062O94N17n56n80J800n88n23R12J74p01
1739E0K03N66k62p64N8Q75j120n15J322o30q78R75K05j021M95O36k39l83M98R02
1759I73j084Q7J192o07p18P88m4q94M3O52n14p83O21K68n91q3J167q00k97P52
$$ plain form
1779 128 581 -243 -9 730 456 -188 450 684 -338 -175 932 10 -790 -25 21 -993 -515 -17 -154
1798 -154 -755 -89 561 -486 -204 937 559 -384 864 735 -182 178 691 -150 -527 -30 459 -743 -631
1817 -631 435 -386 -996 279 268 -754 -59 673 293 -316 579 930 -68 28 1024 127 -484 390 119 -783
1837 -783 -544 -91 -258 -1018 34 381 -774 -438 713 66 -344 636 831 -160 117 674 230 -394 53
1856 53 567 -707 -722 516 -502 -903 140 216 -758 -317 333 226 -501 512 944 -335 150 935 83
1875 83 -410 445 502 -596 -33 424 -191 -912 -187 221 -993 -510 529 -360 -522 456 405 -344 84 905
1895 905 439 -285 469 799 -530 -245 862 -449 -827 134 -28 -640 -404 213 -367 -969 186 567 -549
1914 -549 3 940 201 -198 842 536 -439 40 627 71 -975 247 377 -1162 -554 456 -557 -895
$$ packed form
1779A28M53q24K34P39k74o44O38K34j022J63J107r22q00P65M6j014M78M98j37
1798a54o01O66O50j047K82J141l78r43J248j29r17L60N13q41l77M97M89j202J12
1817f31J066q21o10J275j1j022O95P32l80o09Q95L51r98R6R96q97o11Q74k71r02
1837g83K39M53j67p60J052L47j155L36J151o47m10R80J95r91K77N57m44o24M47
1856E3N14j274j5J238j018m01J043P6r74M41O50j07p27J013M32j279M85P85q52
1875H3m93Q55N7j098N63M57o15p21P25M08j214M83J039q89j62R78n1p49M28Q21
1895I05m66p24P54L30j329K85J107j311l78R61j62o12K36O17n80o02J155L81j116
1914e49N52R37p39l99J040l06r75M79N87n56j046J222J30j539O08J010j013l38
$$ plain form
1932 -895 533 292 -387 -93 716 276 -445 708 950 -461 242 1045 -146 -396 370 181 -840 -381
1950 -381 328 -369 -984 -150 345 -1044 -35 906 -296 -142 697 808 -209 40 826 -74 -547 355 496
1969 496 -938 -163 566 -637 -877 54 32 -427 -93 403 -293 -419 563 780 -412 190 1096 -107 -406
1988 -406 727 521 -365 -473 269 -497 -1074 196 42 -1032 -364 660 -368 -516 429 570 -324 172
2006 172 922 364 -110 751 643 -598 -261 497 -339 -725 179 37 -751 -381 285 -294 -660 486 602
2025 602 -399 202 1049 -137 -290 776 516 -28 -11 668 -277 -744 215 85 -951 -204 391 -642 -767
2044 -767 99 256 -384 70 1051 70 -293 595 597 -372 182 661 -235 -319 356 42 -991 -571 185 -296 -429
2065 -429 494 402 -726 -51 610 -37 -137 681 622 26 209 400 -36 -548 356 224 -808 -101 260 -743
$$ packed form
1932h95J428k41o79K94Q09m40p21J153K42j411P03Q03j191k50P66j89j021M59
1950c81P09o97o15Q34M95j389J009R41j202J54Q39J11j017K49P86r00m73R02J41
1969D96j434P75P29j203k40R31k2m59L34M96o96j26R82K17j192O02R06j203k99
1988d06J133k06q86j08P42p66n77J270j54j074O68J024j028j48R45J41q94M96
2006A72P50n58m74Q61j08j241L37P58q36l86R04j42p88L70O66n79l66J146J16
2025F02j001O01Q47j186j53J066k60n44J7O79r45m67R59j30j036P47N95j033j25
2044g67Q66J57o40M54R81r81l63Q88Kr69N54M79q96q4O75l14j033M20P56m81j33
2065d29R23r2j128O75O61o47j00Q18n9n96J83J91m36n12R04j32j032P07L61j003
$$ plain form
2085 -743 -594 40 128 -355 -223 493 108 -406 584 479 -422 520 1006 -103 -96 213 140 -555 -165 647 -168
2106 -168 -682 106 -100 -991 63 391 -168 -35 569 373 -255 52 521 140 -2 608 266 -562 42 164
2126 164 -389 -446 131 57 -323 -124 274 -321 -704 258 167 -95 349 520 -189 -14 138 271 -134 141 364
2147 364 -126 -688 91 -345 -673 -14 75 -320 -102 178 116 -110 143 409 126 33 625 354 -183 271 156
2168 156 -298 -19 196 18 -257 -285 126 -495 -588 296 -119 -276 288 194 -29 -32 366 220 170 353 498 -140
2190 -140 -265 309 -189 -614 -124 -114 -291 102 -185 -72 4 -130 269 -63 -31 382 260 -88 160 267 -12
2211 -12 182 145 -59 -322 -236 -189 -493 -7 165 -239 -347 186 -57 -148 70 300 169 235 162 86 -172 14 140
2234 140 -26 -126 101 24 -322 50 43 -292 -195 -92 -26 -315 -179 447 10 -156 434 219 104 159 319 -27
$$ packed form
2085g43J49O34Q8m83J32P16l85n14R90j05r01R42M86j109PL09p3o95L90Q12q15
2106a68n14P88k06q91J054L28n59J33O04j96o28L07M69l81j42O10l42q28O04J22
2126A64n53n7N77p4l80J99L98n95l83R62r1k62M44J71p09J75J52J33m05K75K23
2147C64m90n62P79m36l28O59Q9l95K18K80o2k26K53K66k83r3N92k71n37M54j15
2168A56m54K79K15j78k75k8M11o21r3Q84m15j57N64r4k23lL98j46n0J83J45o38
2190a40j25N74m98m25M90J0j77L93k87J13P6j34L99l32L2M13j22l48K48J07k79
2211a2J94l7k04k63Q6M7l04M86J72m04j08N33k43r1K18K30j31O6p3p6k58J86J26
2234A40j66j00K27p7l46L72pl35R7J03O6k89J36O26m37j66N90k15j15N5J60l46
$$ plain form
2256 -27 -201 -314 88 -214 -369 -94 -239 -373 -170 -391 -162 43 -44 293 -74 -6 310 276 43 468 194
2277 194 128 69 36 -186 -129 -104 48 -193 -92 53 -365 -121 -106 94 -131 164 340 131 38 68 310 86 110
2300 110 159 -239 -196 124 -311 -269 -162 -68 -346 -134 67 -117 -186 -164 285 -56 4 283 150 130 251 214 -49
2323 -49 9 5 183 -278 -249 158 -259 -154 -48 -133 -407 -31 57 -88 -258 170 323 -216 41 312 -33 -117 401
2346 401 245 -157 -156 -104 -74 -414 -8 -64 -257 -128 163 -52 -27 243 210 154 187 403 219 78 43 180 -140
2369 -140 7 51 -269 -51 -29 -180 -236 -107 -202 -36 -150 -82 387 75 80 290 204 30 320 365 -210 216 156
2392 156 148 -30 -10 -101 -359 -306 54 -123 -232 48 -64 -205 44 221 105 -104 247 311 19 240 173 -94
2414 -94 -29 -118 -32 -226 -223 82 -171 -231 -2 -117 -173 58 99 -63 -61 260 4 128 193 112 10 -134 277 14
$$ packed form
2256b7j74j13M02l02j55K75j45j34K03k21K29K05q7L37l67O8L16l4k33M25k74
2277A94o6n9l3k22N7K5J52k41J01J45m18K44J5K00k25K95J76k09r3L0K42k24K4
2300A10M9l98M3L20m35M2J07R4k78K12K01j84o9K2M49l41O0K79j33k0J21l7k63
2323d9N8mJ78m61K9M07m17J05J06q5k74L76Q8j45j70M28J53n39K57K71l45q4N18
2346D01j56m02JN2L0l40M06n6j93J29K91k15K5K70l3n6L3K16j84j41l5J37l20
2369a40J47M4l20K18K2j51n6J29r5J66j14O8M69l12NK10q6j74K90M5n75M26o0
2392A56qj78K0r1k58N3L60j77j09K80j12j41K49J77j16k09L51O4k92K21o7k67
2414i4O5q9Q6j94LL05k53o0K29j15n6K31M1j62KL21k56J24O5q1j02j44M11k63
$$ plain form
2438 14 -161 17 -12 -298 -284 120 15 -265 76 269 -111 -153 152 62 -3 328 67 -197 144 67 -174 -175 -51
2461 -51 -78 -204 -67 39 -201 -198 365 199 -229 -216 509 -111 -248 304 133 -121 143 421 71 -237 176 -18
2483 -18 -336 -259 -8 -223 -421 95 86 -196 -9 278 105 -259 242 57 -200 141 381 -164 -242 240 5 -423
2505 -423 -82 108 -221 -223 132 -26 -558 -27 221 -155 -16 314 89 -197 76 247 -47 -297 405 166 -338
2526 -338 180 222 -155 -422 186 18 -44 -47 189 -108 -281 407 106 -148 151 462 -51 -149 163 68 -287 -243
2548 -243 394 -445 -428 117 57 -399 68 65 -239 -45 171 128 -525 143 470 -47 -65 476 261 -351 190 112
2570 112 -264 -216 89 -188 -333 -163 232 -122 -143 264 -112 -167 203 292 58 -139 280 178 -168 22 484
2591 484 -262 -302 340 -13 -554 23 282 -283 -218 81 241 -176 -51 429 134 -185 327 346 -224 81 126
$$ packed form
2438A4j75J78k9k86J4M04j05k80L41J93l80m2L05r0o5L31k61k64L41p7k41jJ24
2461e1k7j26J37J06k40LN63j66m28J3P25o20j37N52j71k54K64K78l50l08M13j94
2483a8l18P7K51k15j98N16rk82J87K87j73l64N01j85k57L41K40n45p8M82k35m28
2505d23L41J90l29kL55j58n32N31K48l76J39L30k25k86K73J71k94k50P02k39n04
2526c38N18M2l77k67O08j68o2lK36k97j73O88l01k54K99L11n13r8L12r5l55M4
2548b43O37q39J7N45o0m56M67ll04J94K16m3o53O68L27n17j8N41k15o12N41p8
2570A12l76M8L05k77j45J70L95l54k1M07l76n5L70Q9k34j97M19j02l46J90M62
2591D84p46m0O42l53n41N77K59n65O5K99J60m17J25M80k95l19N12J9n70L05M5
$$ plain form
2612 126 -221 -166 142 164 -349 -183 142 -312 -388 27 126 -306 153 176 -231 -167 392 176 137 136 260 2 -103
2635 -103 167 -17 -262 20 83 -360 -230 239 73 -368 -49 337 -172 -116 384 66 -234 -134 207 -58 39
2656 39 264 93 -205 11 333 -121 -406 121 -152 -179 22 97 -153 -70 142 319 -40 -80 262 -140 101 461
2678 461 173 -303 -18 596 -296 -424 281 -64 -421 -105 133 1 25 -25 177 -213 111 231 -60 -130 260
2699 260 -23 21 -78 278 -38 -341 339 -73 -358 86 104 -189 -192 112 -4 -141 196 298 -9 -105 481 -97
2721 -97 -151 222 48 -143 -64 226 -57 -98 -92 192 -119 -35 -43 -65 -199 82 137 -119 -26 277 175 171 113 93 -70
2746 -70 53 185 -105 -43 8 -34 48 6 233 146 -33 99 173 -183 -19 221 -243 49 46 -10 -40 -33 201 70 -202
2771 -202 -40 134 -117 -136 247 -65 -133 -67 -49 -159 -233 11 144 105 164 149 17 89 -22 129 -42 110 89
$$ packed form
2612A26l47N5L08K2n13J66L25m54p6M15R9m32M59K3m07O4N59k16l9jJ24k58j05
2635a03K70j84k45K82O3m43J30M69j66m41L19L86n09N6N00l18l00J00L41k65R7
2656C9K25j71k98K16L22m54k85N27k73k7K01P5k50Q3K12J77l59m0L42m02K41L60
2678D61k88m76K85O14q92j28P05l45l57L16K38j32K4n0K02l90L24J20k91p0L90
2699B60k83M4r9L56l16l03O80m12k85M44J8k93lL04j16j37L37J02l07r6N86n78
2721i7n4L73j74j91P9K90k83m1OK84l11Q4qk2j34K81N5k56R3L03j02mn8k0j63
2746g0J23J32k90O2N1m2Q2m2K27q7j79J32P4l56J64K40m64K92ln6l0PK34j31k72
2771b02J62J74k51j9L83l12o8O6J8j10p4K44J33l9N9j5j32P2j11J51j71J52k1
$$ plain form
2794 89 -256 -151 95 82 -52 -70 10 -389 -268 189 -165 -155 102 300 52 97 51 66 -105 -17 -95 -342 -190
2817 -190 -78 15 -189 197 103 -164 -98 39 23 -117 36 29 94 -9 16 -82 -138 156 31 -138 -42 -136 -50 -308
2841 -308 67 -9 -328 -85 -44 -100 -9 84 188 80 146 24 120 -122 -21 -24 70 -90 -233 -266 -299 -106 -37 -45 -52 16
2867 16 165 14 74 -72 112 -82 79 -20 26 -89 177 19 -108 200 73 2 76 -8 -134 -124 -42 -68 -34 -222
2891 -222 -64 44 63 -73 139 182 -81 67 190 101 -156 -158 -33 91 0 -180 -119 -30 23 35 54 50 42 116 50 2
2917 2 99 80 121 -45 -166 94 14 88 -283 -47 -323 -126 3 110 -9 -107 -13 191 -16 -29 136 6 69 -126
2941 -126 71 38 -116 70 -219 88 110 131 -199 -105 9 212 -18 -122 -38 -70 42 -132 141 21 106 204 -81
2964 -81 141 -104 -186 28 -193 -277 -92 -78 -152 -48 -118 -160 -94 58 -156 -134 56 115 145 203 219 -67 -142 215 21
$$ packed form
2794H9l45J05K46j3j34j8Q0l99J21M57l54J0K57J98k48M5m6J5j71Q8p8k47J52
2817a90J12R3k04L86r4k67O6J37j6j40J53pO5j03K5r8n6K94j25j69R6r4Q6k58
2841c08L75p6l19K43M1n6R1R3J04j08O6j22R6k42J01lR4j60j43l3l3J93O9qpO8
2867A6J49j51O0j46J84j94J61r9M6j15K66j58j27L08j27p1P4q4j26J0Q2k6L4j88
2891b22J58J08J9j36K12M3k63J48J23q9k57kJ25J24r1j80O1Q9N3J2J9mqP4o6m8
2917BR7j9M1j66j21K60q0P4l71K36k76J97J29J07j19r8R4K04k07j3J65j30O3j95
2941a26J97l3j54J86k89L07K2K1l30R4J14K03k30j04Q4l2J12j74K73j20Q5R8k85
2964h1K22k45q2K14k21q4J85J4p4J04p0m2O6J52k14K2J90N9L0N8J6k86p5L57j94
$$ plain form
2989 21 -128 -234 -109 -262 144 -134 -180 -37 -221 5 32 -74 175 -30 141 148 230 207 138 -91 -119 210 31
3012 31 -52 317 200 297 -205 -158 -60 -29 -24 -189 -143 105 3 -17 123 177 -101 -84 -6 9 171 78 -159 212 -100
3037 -100 -90 47 -27 142 -35 -117 53 163 30 21 -77 137 183 21 4 4 -150 -96 -25 -243 -73 -224 -190 1
3061 1 -131 -177 19 -268 72 11 -102 12 161 188 208 131 128 190 79 68 188 66 -69 58 48 -181 -110 -173 -167
3086 -167 -40 77 -62 -128 36 185 -210 35 191 54 6 66 336 -26 -3 95 -131 -217 110 -104 -179 345
3108 345 65 -207 -104 14 -132 85 192 321 2 194 238 -71 54 70 -30 -72 34 -32 -123 -128 -40 -116 -29
3131 -29 -332 -18 -24 -67 165 -194 -33 239 144 130 125 69 187 -243 -10 -83 -4 -250 49 -51 -118 -200 165 75 -13
3156 -13 51 64 138 -91 74 183 44 221 108 -179 -42 112 -181 -211 155 -109 -152 -93 -43 -66 31 -27 131 -114
$$ packed form
2989B1j49j06J25j53M06k78m6J43j84K26K7j06K49k05J71PQ2k3o9k29k8L29j79
3012C1q3L69j17R7n02M7R8L1Nj65M6K48j02k0J40N4k78J7P8J5J62r3k37L71l12
3037a00J0J37p4J69j77q2J70J10j33rr8K14M6j62j7%j54N4P1k18J70j51L4J91
3061Aj32m6J96k87L40o1j13J14J49K7K0p7lO2j11j1J20j22j35J27j0k29P1o3O
3086a67J27J17j39o6J64J49l95K45J56j37m8O0K70l62K3R8k26q6L27k14p5N24
3108C45k80k72J03J18j46K17J07J29l19J92M4l09J25J6j00m2J06o6r1nQ8p6Q7
3131b9l03L14om3K32l59J61K72r5j4nn6J18m30K33p3P9k46K99j00o7q2L65r0q8
3156a3O4J3P4k29J65J09j39J77j13k87J37J54k93l0L66k64m3N9N0k3R7n8J58k45
$$ plain form
3180 -114 101 274 115 126 116 109 -41 61 159 -105 -85 -105 35 -226 -114 -22 -88 29 -193 52 -74 -278 213
3203 213 -39 -20 183 -17 173 -21 109 170 -95 209 54 -84 -154 145 19 -195 52 97 -150 22 95 142
3225 142 -68 52 161 -173 172 129 166 -221 4 242 -162 -272 191 146 -227 82 59 -134 -217 173 -141 -74
3247 -74 161 -108 -134 -35 28 127 16 134 128 -1 -105 15 -99 -264 -85 -110 -4 0 121 92 -254 46 196 -119
3271 -119 -208 143 -105 -4 -113 224 29 48 26 48 -263 -80 116 -143 56 104 -41 -217 -66 -11 -51 17 204
3294 204 257 -20 157 252 -104 -256 177 -20 -193 145 156 -150 -60 -102 -61 -171 144 200 -21 -64 112 -70 -102
3317 -102 76 99 40 45 207 171 88 -74 -41 -150 -77 77 -201 -215 -29 -43 -71 74 -254 26 -246 -11 113 -50
3341 -50 -49 42 122 -32 45 145 140 35 109 -163 -245 20 -7 -194 -84 76 -90 69 -102 137 91 24 231 100
$$ packed form
3180a14K15J73j59J1j0pj50J02R8k64K0k0J40k61J12R2o6J17k22K45j26k04M91
3203B13k52J9K03k00J90j94J30O1k65L04j55j38p0K99j26k14K47M5k47J72P3M7
3225A42k10J20J09l34L45m3L7l87K25K38m04j10M63m5l73L09k3j93q3L90l14O7
3247g4K35k69k6R9O3R9j11J18oj29j04J20j14j65J79k5J06MJ21k9l46L00J50l15
3271a19q9L51k48J01j09L37j95J9k2K2l11J83J96k59J99M8j45j76J51N5m0O8J87
3294B04N3k77J77R5l56j52M33j97j73L38J1l06R0m2M1j10L15N6k21m3J76j82l2
3317a02J78K3n9NJ62l6q3j62L3j09P3J54k78j4J86j4k8J45l28K80k72K35J24j63
3341e0JR1Q0j54P7J00nj05P4k72q2K65k7j87J10J60j66J59j71K39m6o7K07j31
$$ plain form
3365 100 -3 57 68 -96 -150 -98 128 -126 -262 -77 -130 -233 -66 33 92 27 51 78 68 152 172 -58 323 54
3389 54 98 73 -54 -205 -174 -68 110 -206 -238 111 -296 -162 80 -98 -127 -68 139 30 -5 213 219 130 189 251
3413 251 33 56 102 113 -277 -119 -124 98 -26 -111 -8 -147 6 131 -100 124 117 88 -64 39 160 -74 -74 15
3437 15 -54 -209 -10 188 -145 -45 56 9 -244 142 56 -8 -81 284 223 -259 214 46 121 116 223 122 -222
3460 -222 120 92 -128 -159 -43 -48 -205 123 -73 -247 1 40 89 52 116 280 222 80 344 96 -243 -25 70
3483 70 -326 -50 175 -159 -272 39 -77 -229 -113 238 49 -307 6 260 -204 -42 302 114 -54 295
3503 295 243 14 -140 130 -184 -166 33 -62 -253 -135 233 -63 22 -68 171 22 -161 309 287 -91 73 -10
3525 -10 -190 -206 168 -327 -190 -58 -71 -207 -136 40 254 -183 399 84 -8 3 -61 -27 15 158 -59 -79 12 285
$$ packed form
3365A00j03O0J1j64n4N2K26k54j36J85n3j03J67R9N9o5K4K7j0Q4K0k30L81k69
3389E4M4k5j27j51L1J06J78l16l2L49m07J34K42j78k9N9K07j09l5K18Oq9N9O2
3413B51k18K3M6J1l90J58nK22j24q5J03j39J53J25k31K24pk9j52J03J21k34%Q9
3437A5o9j55J99J98l33J00J01m7k53L86q6o4p3L65o1m82M73j68P5nJ07j01l44
3460b22L42k8k20l1J16nj57L28j96j74K48L9M9l7O4J64n8j42K64k48l39K18R5
3483G0l96K76K25l34j13L11j16j52J16L51j89l56L13K54m64J62L44j88j68L49
3503B95n2k29j54K70l14J8J99r5j91J18L68k96Q5r0K39j49j83M70k2l78J64q3
3525a0j80j6L74m95J37J32j3j36P1J76K14m37N82l15r2J1o4L4M2J43k17k0R1K73
$$ plain form
3549 285 112 -116 71 -15 -180 -17 -60 44 -197 101 -71 -113 51 240 -27 -4 196 221 -50 105 -159 65
3571 65 107 -4 -60 -242 -115 144 23 -192 91 -12 -164 175 175 8 108 157 -14 6 116 285 134 58 121
3594 121 -132 -36 -126 96 -42 -23 117 67 -192 -252 70 -66 55 374 23 4 110 -1 -141 68 187 -44
3616 -44 -173 16 290 -279 -186 118 32 -67 78 -181 -121 8 130 36 86 277 168 -182 -162 143 -48 -132 248
3639 248 -11 -123 -149 -232 -27 -61 -127 -80 -275 27 -31 -75 120 76 152 82 82 206 105 -92 124 -18 -187 -63
3663 -63 -40 -282 -117 210 174 -158 -179 11 -270 145 196 168 -156 -73 110 77 -47 130 159 -105 56 187 -91
3686 -91 -332 87 -131 -100 -11 78 -137 -94 2 -3 99 35 124 -75 -115 245 -40 -235 -7 163 -132 -107 -224 12
3710 12 31 -9 -54 -77 -203 152 -33 -35 248 43 -69 75 36 -132 95 -5 -71 97 8 141 76 -139 -3 -167
$$ packed form
3549B85j73k28J87q6j65J63m3J04k41K98j72m2J64J89k67K3K00K5k71J55k64K24
3571F5M2j11n6j82J27K59j21k15K83j03j52L39%j67J00M9j71K0J10J69j51p6O3
3594A21k53R6r0K22j38J9J40n0k59o0L22j36J21L19l51j9J06j11j40K09J19k31
3616d4j29J89K74n69R3L04q6r9J45k59O0J29J22r4N0J91j09l50K0L05j91q4L80
3639B48k59j12k6q3K05l4o6M7j95L02n8m4J95m4P6p0%J24j01j97K16j42j69J24
3663f3K3k42J65L27l6l32k1J90k81M15N1k8l24Q3J83l3j24J77K9k64J61J31k78
3686i1k41M19k18L1Q9Q9k15M3R6nJ02o4Q9j99m0L60k85j95K28J70k95K5j17K36
3710A2J9m0m5k3j26L55j85kK83k05j12J44l9j68K27j00o6J68q9J33o5k15J36j64
$$ plain form
3734 -167 -395 -177 41 -135 -91 -14 48 -139 94 123 208 50 48 259 116 140 190 -178 -169 -148 66 -274 -302 -73
3758 -73 -9 -284 17 17 -6 165 166 172 23 222 118 185 -12 32 146 -101 251 12 -7 48 102 -150 -35 -99 69
3783 69 -39 -112 284 65 -137 129 103 93 186 -12 -30 28 -76 -15 -46 -32 80 -128 -110 -83 57 -265 37 100
3807 100 160 40 242 172 54 94 171 102 -24 -58 50 -187 125 90 -24 -180 19 -75 -127 -233 245 -212 -202
3830 -202 103 -192 -2 -158 132 0 -142 3 -29 -288 -93 77 -25 -86 -168 -166 -88 -279 -123 2 -90 -39 101
3853 101 9 120 142 161 38 302 -54 -11 33 -129 16 -25 -19 -44 -344 62 -71 -159 -72 203 94 -66 53 293
3877 293 179 256 -21 24 -171 -77 -4 -40 110 -23 -3 -79 -120 -120 -48 -23 -90 25 -81 97 -23 14 94 225 152
3902 152 -139 6 51 86 -202 222 51 189 -356 127 -210 -4 95 -174 -143 -167 -30 -22 -187 147 163 249 -137
$$ packed form
3734a67k28K18K18j76M4P7O2j87K33K9Q5j58kK11j43K4N0l68RK1K14l40k8K29
3758g3O4k75L01%k3J71JOj49J99j04O7j97M4J14k47L52k39j9N5N4k52J15o4J68
3783F9j08p3L96k19k02K66k6j0R3j98j8N8j04O1l1J4J12k08J8K7J40l22L02O3
3807A00O0j20K02p0j18M0P7o9j26l4J08k37L12l5j14j56J99r4n2j06M78m57J0
3830b02L05k95J90j56K90j32j42J45l2k59J95J70j02o1q2KP8j91J56J25r2N1J40
3853A01r2J11K2J9j23K64l56M3M4j62J45m1Ok5l00M06j33q8Q7K75j09j60J19K40
3877B93j14P7k77M5j95R4P3l6J50j33K0p6m1%P2K5o7J15j06J78j20L7Q0J31p3
3902A52k91J45M5L5k88M24j71J38n45M83l37K06R9k69L1k4J37Qj65L34J6Q6l86
$$ plain form
3925 -137 121 -138 124 -79 -22 -21 68 -107 90 -149 176 -102 -35 -167 -99 -68 138 151 -14 106 257 299 88
3948 88 86 150 80 -81 -66 180 -50 -244 -283 -87 -105 -74 130 -215 -80 60 114 -66 -73 10 10 47 -84 80 -18 -18
3974 -18 102 -138 -61 -117 98 -309 17 107 -208 -54 51 17 229 11 106 10 106 54 29 -3 197 189 79 -38
3998 -38 16 -26 -243 -39 -157 105 -150 66 133 15 -92 48 -109 -75 186 -67 104 89 45 -17 -150 91 -10
4021 -10 17 -356 -26 -168 -105 -96 -21 -93 -93 -27 -9 -94 109 70 -64 159 125 21 -151 58 -70 -123 153 71 -114
4046 -114 -131 -77 -153 -197 -262 15 -59 -164 213 -57 -95 -3 118 -42 44 244 44 -82 -30 105 -140 6 62 26
4070 26 -109 -179 -96 106 8 301 -28 67 14 38 -113 30 131 141 51 -194 -40 44 -185 -190 133 -155 -83 -12 -154
4095 -154 -155 -101 42 43 84 118 199 58 -96 0 -179 -29 208 -44 -84 87 99 0 -148 240 -154 -224 -88 140
$$ packed form
3925a37K58k59K62k03N7JQ9j75J97k39L25k78O7j32O8L1K06J3j65J20J51M2k11
3948H8kO4p0j61J5K46k30j94l9J96j8L1K04l45J35J40N4j80pQ3%L7j31J64r8%
3974a8J20k40P7n6K15m07L26R0l15J54J05l4K12k18R5r6R6n2k5l2K00qj10j17
3998c8N4m2k17K04j18K62k55K16O7j18j07J40j57L4K61k53J71j5m4o2j33K41j01
4021a0K7l73L30j42O3RP5p2%O6J8q5K03l9j34K23l4j04j72K09j28n3K76q2j85
4046a14j7N4p6m4o5K77p4j05L77k70l8R2J21j60Q6K00k00j26N2J35k45J46N6l6
4070B6j35p0Q3K02r8K93l29R5n3K4j51J43J01J0r0k45J54Q4k29nL23k88P2P1j42
4095a54jN4J43JM1L4Q1j41j54R6j79J50K37k52m0J71J2r9j48L88l94p0J36K28
$$ plain form
4119 140 1 99 299 -31 -36 97 37 10 39 83 -2 -226 131 103 -118 -39 86 -21 0 98 28 31 -64 149 45
4144 45 -40 173 22 320 198 92 -91 -187 97 -34 -8 51 28 -3 -247 -1 -28 -184 36 -118 -204 -109 -43 3
4168 3 69 -79 216 -35 35 69 -61 -222 86 -67 -52 -10 10 -65 232 -168 181 -90 134 66 -8 -109 -21 37
4192 37 52 132 12 377 -139 139 187 -9 123 153 155 -94 -24 93 -172 -49 -35 45 123 -61 84 -156 8 43
4216 43 -163 142 171 -310 181 -24 -62 104 -47 71 17 -140 -4 110 -40 -51 293 -165 -13 -132 93 28
4238 28 34 213 251 150 100 299 -114 -146 -69 -235 -227 -19 41 -127 -97 -147 -52 -97 -110 -56 1 7 257 -11 24 264 66
4265 66 75 -23 -119 -34 -182 43 43 52 -127 95 -12 -178 126 42 139 2 -49 -32 -298 40 54 -33 8 55 -126 -19
4291 -19 -169 76 43 -69 106 -92 -67 4 -190 -54 106 12 -7 9 56 89 -292 112 26 -38 -18 106 -205 -128
$$ packed form
4119A40j39R8K00l30nJ33o0k7K9M4q5k24L57k8k21P9J25j07K1R8p0Lr5K13j04
4144D5q5K13j51K98j22j06j83r6K84j31K6N9k3l1k44K46k7j56K20j54q6R5O6M6
4168CO6j48K95k51P0L4j30j61L08j53J5M2K0p5K97m00L49k71K24o8p4j01Q8N8
4192C7J5Q0j20L65n16K78M8j96J32L0Kk49P0J17k65J23J4Q0P8j84J45k40J64L5
4216D3k06L05K9m81M91k05l8J66j51J18n4j57J36J14j50j1L44m58J52j19K25o5
4238B8OJ79L8j01n0J99m13l2P7j66QK08O0j68L0n0R5m5j3N4N7OK50k68L5K40j98
4265F6Rr8r6Q5j48K25%Rj79K22j07j66L04q4R7j37n1J7k66L38J4q7M1M7j81J07
4291a9j50K45l3j12J75j98K5P1j94J36J60r4j9J6M7L3l81M04q6o4K0J24l11P7
$$ plain form
4315 -128 9 -119 -147 68 -2 -58 58 5 352 268 -51 220 252 -267 35 -256 53 -103 184 -202 -87 -74
4337 -74 -205 -103 -209 -73 121 102 84 0 -14 6 -116 14 170 -45 235 251 -149 31 135 -152 89 95 -200
4360 -200 -127 -245 131 104 -46 -31 -134 -60 -51 376 -67 -36 128 -65 98 93 138 9 -58 -18 -11 -53 -97 -191 -163 -102
4386 -102 45 -197 37 150 -135 -59 81 -6 91 -27 71 -38 64 -64 33 -255 -83 -121 -93 -87 -256 -109 -189
4409 -189 -148 227 -195 -26 -178 59 118 81 58 1 105 -189 27 -46 -191 242 10 -188 -13 -135 -167 -24
4431 -24 -83 -146 -123 -55 84 -229 -20 29 33 73 179 115 -25 -110 -85 -107 94 -22 -94 56 -94 188 14 -11 -129
4456 -129 136 -54 51 82 141 -37 150 59 14 199 321 -68 -62 -46 113 -84 64 83 -170 85 -157 -53 -40
4479 -40 -36 -7 -52 -90 5 100 245 20 -69 38 -31 -146 -27 -82 136 -44 31 -160 77 152 18 -109 61 -26 -141
$$ packed form
4315a28J37j28k8K15p0n6J16n3L47q4l19K71L2n19L02k91L09j56K87l86J15J3
4337g4j31J02j06J36J94j9j8q4j4K0j22J30J56k15K80J6m00J80J04k87K41Ok95
4360b00P3j18L76k7j50J5j03P4RM27m43L1J64j93J63nM5j29o7M0Pm2m4r4K8O1
4386a02J47k42K34J13k85P6J40q7R7j18R8j09J02j28R7k88J72l8K8Oj69J47q0
4409a89M1L75m22J69j52K37N9l7k3n7J04k94K16p3j45M33k32j98J75j22l2J43
4431b4n9o3K3O8J39l13K09M9MM0J06o4j40q5K5k2K01j16p2J50j50K82j74k5j18
4456a29K65j90J05L1N9j78J87r1m5J85J22l89OJ6J59j97J48J9k53K55k42J04J3
4479d0MK9m5l8R5R5J45k25q9J07o9j15J19n5K18j80P5j91K37P5j34j27J70q7j15
$$ plain form
4504 -141 -43 63 74 -54 33 17 55 313 221 -64 27 -133 -277 70 -27 187 -2 -143 -201 -4 -77 -35 17 55
4528 55 27 -52 303 -98 -70 121 124 117 -63 -87 34 -138 43 -173 -149 92 10 -72 36 30 -146 -6 99 50 20
4553 20 240 -9 165 -56 -143 -2 -215 -153 -50 -27 119 51 -124 40 -101 144 -66 -132 121 -17 -80 -29 122
4576 122 -236 81 112 -221 -198 68 115 -11 -72 85 122 -64 4 -226 -38 226 112 -150 -32 46 -199 8
4598 8 -13 175 -189 42 -72 114 -229 -115 56 -32 -98 -5 -161 -288 23 -33 58 -13 40 -107 -151 28 92 218
4622 218 -179 227 33 -14 -58 -142 -14 -313 -138 99 -114 -83 82 38 -69 -97 104 -20 149 66 149 49 128
4645 128 -12 -94 208 -90 128 -90 -27 72 -160 -110 228 -45 -49 82 -99 -87 -51 232 180 77 210 -74 -51
4668 -51 -5 0 195 -75 69 73 -182 -123 106 -8 -162 -170 -50 -17 80 242 -99 63 125 45 28 96 95 123 98 -48
$$ packed form
4504a41R8J06J1j28Q7j6L8K58r2k85R1j60j44L47r7K14j89j41n8J97p3M2N2L8
4528E5k8p9L55m01K8J91Lpj80k4J21j72J81k16K4K41q2q2J08oj76J40J05m9l0
4553B0K20k49J74k21q7J41k13O2J03K3J46o8j75J64j41K45k10o6K53j38o3N1J51
4576A22l58L17L1l33K3K66M7j26o1J57L7j86O8k30J88K64j14k62J18P8k45K07
4598Hk1J88l64K31j14J86l43J14J71q8o6R3j56j27L11n6R1p1N3j47m4J79O4J26
4622B18l97M06j94m7m4q4J28k99J75K37k13L1J65m4j07k8K01j24J69q3Q3j00P9
4645A28j40q2L02k98K18k18O3R9k32N0L38k73mJ31j81J2L6K83n2j03J33k84K3
4668e1M6NJ95k70J44Mk55N9K29j14j54qJ20L3R7J62l41J62O2q0j7O8jK8k5j46
$$ plain form
4694 -48 10 -110 -51 -75 -108 -82 -65 64 -40 163 -12 -99 -142 105 -26 128 59 87 -83 101 191 -57 -31 -219
4718 -219 85 73 -45 -83 16 161 -89 169 -10 -133 33 259 233 141 -93 41 19 -122 119 91 -205 -67
4740 -67 31 26 87 -203 -320 -180 -20 230 34 -154 -194 -34 107 332 167 -91 35 -117 32 0 -150 -140 -18
4763 -18 119 -34 -133 -73 53 -41 -103 59 -66 -19 168 -116 -42 -124 -213 43 -136 68 208 -35 -142 -112 -114 -78
4787 -78 -195 110 56 135 107 18 24 0 239 -57 -133 44 152 118 -78 37 141 -137 104 -150 -130 -236 -140 68
4811 68 -32 -26 -209 -243 93 -32 87 -13 41 64 46 0 215 148 79 12 -110 53 15 -59 -143 -68 -196 -67 -153
4836 -153 -41 -101 -138 61 192 -23 54 -66 102 177 71 -48 44 -84 -264 30 187 -120 -165 -124 67 -150
4858 -150 -18 98 84 30 197 107 -73 -69 64 292 -246 133 -154 -124 -143 20 -272 -104 -63 -67 1 94 40 -162
$$ packed form
4694d8N8j20N9k4l3K6J7J29j04K03j75q7m3K47j31J54o9K8j70J84R0k48K6j88
4718b19L04j2j18l8R9J45k50K58j79j23J66K26k6r2k34J34k2j41K41k8k96J38
4740f7R8nO1k90j17J40J60K50j96j88m0J60J41K25j65k58J26j52J49l2j50J0J22
4763a8J37j53r9O0J26r4o2J62j25M7J87k84P4q2q9K56j79K04J40k43j07L0kL6
4787g8j17L05n4P9k8q9Ok4K39k96p6J77J08l4j96J15J04k78K41k54K0j06R6K08
4811F8j00Oj83l4L36j25J19j00N4K3j8m6K15o7o9o7j22J63l8p4q4P5j28J29q6
4836a53J12o0l7J99J31k15P7j20J68P5j06j19R2j28j80K94J57l07m5M1J91k17
4858a50J32J16j4n4J67r0j80MJ33K28n38L79k87L0j9J63k92J68M1mO8R3n4k02
$$ plain form
4882 -162 127 40 -63 -113 139 -50 -43 -2 273 91 -90 29 165 50 48 48 -189 -13 -152 -210 -197 -51 -166 -248
4906 -248 78 -172 45 32 -31 143 -145 -90 -40 -14 -39 -95 -139 42 -89 -82 -81 -83 80 8 30 103 -82 45 149 -19
4932 -19 225 -110 36 157 -12 -103 17 -184 48 -8 -45 40 -95 78 -41 -144 -15 55 107 121 96 108 237
4955 237 -77 21 -17 64 108 84 87 -131 -25 63 -26 -21 -29 -32 -75 107 107 89 51 32 -51 -154 -199 -162 -113 -6 74 106 23
4984 23 -49 105 -2 10 3 73 17 -6 -161 109 19 -122 1 149 93 -54 320 -5 -12 64 135 -40 65 -40 59
5009 59 16 117 147 -56 -250 -117 -15 57 -39 130 197 -17 92 296 151 73 -60 29 -59 -56 -185 3 -98 12
5033 12 61 -152 -185 38 -124 -39 77 11 32 98 4 -116 293 216 168 -89 110 33 -35 73 -85 107 82 -204
5057 -204 -111 -43 -255 -43 -22 -158 237 41 29 104 7 53 -130 31 102 -67 -166 144 122 -174 135 -75 -123 -99
$$ packed form
4882a62K89q7j03n0K52j89PM1K75j82j81J19J36j15k%k37J76j39n8J3J46j15q2
4906b48L26k50K17j3o3J74k88N5N0K6k5n6m4J81j31PJkJ63p2K2P3j85J27J04j68
4932a9K44l35J46J21j69r1J20k01K32n6l7Q5j35J73j19j03J29P0N2J4k5J2J29
4955B37l14R8l8Q1M4k4Lk18J06Q8q9Nqlm3J82%j8l8j9q3j03m5L7M9J07Q0L2q3
4984B3p2J54j07J2pP0n6k3j55K70r0j41J23J48n6j47L74l25pP6P1j75J05j05R9
5009E9m3J01L0k03j94J33J02P2r6J69O7k14J09K04j45p8j33Q9q8Lj29J88j01J10
5033A2M9k13l3K23j62Q5J16o6K1O6r4j20M09p7m8k57J99p7o8J08j58J92k5k86
5057b04R3O8k12K12K1j36L95j96j2P5r7M6j83J61P1j69r9L10k2k96L09k10m8K4
$$ plain form
5081 -99 -57 -70 -97 61 -10 -49 28 127 44 -34 63 -35 -246 177 167 90 67 -48 0 -116 -86 151 29 -197 -28 91
5107 91 -43 -26 -41 125 87 45 32 -26 -33 205 -101 22 -5 -38 -49 51 123 84 -201 124 -83 -218 40 198 -75
5132 -75 -23 124 82 -15 -33 -20 169 -129 -1 92 -11 29 -14 -34 108 -50 40 -44 20 44 95 -117 149 163 -28
5157 -28 45 178 250 106 127 -69 -157 -128 132 -111 -149 -9 17 -7 -126 54 -79 -42 -67 9 -37 -20 73 82 100 -28
5183 -28 -143 -44 35 108 -107 -337 69 -80 -227 -8 28 -142 29 -19 157 46 18 -2 -151 76 171 -57 -31
5206 -31 -123 113 75 10 -19 36 -119 19 60 4 -22 167 -158 -70 52 13 116 151 -118 -103 12 78 103 65 -10 -69
5232 -69 -145 -6 66 179 -188 -103 171 50 75 -33 121 -32 -13 140 118 90 -80 13 -202 19 77 155 -170 -74
5256 -74 28 99 -312 41 -70 54 113 -202 -144 120 10 121 -116 161 228 -179 145 139 74 -33 -42 -53 -123 -94
$$ packed form
5081i9M2j3k7J58p1l9P7R9q3p8R7r8k11M23j0p7k3j15M8j16L0K37j22k26J69J19
5107I1j34J7j5J66l8m2j3n8pK38l06J23k7l3j1J00P2l9k85L25k07j35K58J58k73
5132g5N2J47m2r7j8J3J89k98J28R3j03M0m3k0J42j58R0q4O4K4N1k12K66J4j91
5157b8P3J33P2j44K1j96q8K9K60k43l8J40K6k4j19J80j33L7k5P6m6J7R3RJ8j28
5183b8j15R9P9P3k15k30M06j49j47K19L6j70J71m8J76j11k8k0j49K27R5k28K6
5206c1r2K36l8o5k9N5j55J38M1n6k6J89l25Q8J22l9J03L5k69J5J15O6K5l8p5n9
5232f9p6J39P2J13l67Q5K74j21K5j08J54j53J9J53k2k8j70R3k15K21N8P8l25R6
5256g4J02P1m11L53j11J24N9l15N8K64j10J11k37K77O7m07L24oo5j07rj1p0K9
$$ plain form
5280 -94 -17 97 -64 -90 95 -25 -164 -95 -63 -19 159 -25 -28 21 104 102 93 -76 12 -101 21 -49 79 -112 -138 108
5306 108 161 -130 89 14 -60 47 149 -9 142 126 -176 222 47 -19 -88 -74 66 46 -193 -169 131 -57 -105
5329 -105 116 -58 -189 -120 103 -156 -136 -38 -71 -4 -211 237 55 166 -19 -23 -307 54 39 50 -72 -18 -110 -183
5353 -183 246 69 -159 64 94 -55 95 164 204 28 24 -125 -65 -167 -47 -198 -7 1 -91 -123 -5 23 -24 -125
5377 -125 236 -153 53 36 59 192 -172 37 -109 -129 -43 22 -82 -34 114 54 20 -101 220 -143 -42 -79 76
5400 76 194 88 101 30 43 145 106 -163 -14 13 29 -81 -43 -31 -59 -41 -53 40 7 9 37 -74 59 233 128 -89
5426 -89 -31 -17 184 -89 13 -24 -121 89 174 20 -180 -122 -122 -101 119 -82 -112 -66 -45 -4 137 87 62 -158 24
5451 24 136 -78 125 -29 135 13 -150 -337 31 -9 -138 -103 -220 -117 154 99 101 27 146 67 16 -113 55
$$ packed form
5280i4P7J14j61k6J85j20j39O9L2M4J78j84lM9Q3krj69Q8j13J22p0J28j91k6K46
5306A08N3k91K19p5p4J07J02j58J51j6l02L98j75o6o9J4J40k0k39K4L00j88m8
5329a05K21j74j31O9K23k59K0R8l3O7k07M48j82J11j85mk84L61j5J1j22N4r2p3
5353a83M29j77k28K23L0j49J50O9M0j76mj49O0j02J20j51J91Qr2l2J18K8m7j01
5377a25L61l89K06j7K3J33l64K09j46k0Q6O5j04M8J48o0l4j21L21l63J01l7J55
5400G6J18j06J3p1J3J02l9k69J49K7J6j10L8J2k8J8j2R3l3KK8j11J33J74j05k17
5426h9N8J4K01k73J02l7r7K10Q5j54k00N8%K1K20k01l0M6K1M1J41n0k5k20J82
5451B4J12k14K03j54J64j22j63j87L68m0j29L5j17J03K71n5Kp4J19p9n1j29J68
$$ plain form
5474 55 84 -65 54 99 -86 132 -70 -120 -144 96 15 343 -63 25 105 101 6 94 -108 112 -275 27 -54 -212
5498 -212 2 115 54 34 -82 56 -36 -88 -101 29 185 11 117 290 51 -16 95 -41 -25 43 20 17 3 29
5522 29 -139 7 197 -30 34 -41 58 145 37 105 186 26 65 90 -87 175 40 39 23 36 107 -126 176 -204 -218
5547 -218 -319 187 -71 -126 -21 -66 72 -166 16 90 190 29 2 -28 -12 -38 3 133 162 98 -19 -36 -68 23
5571 23 143 -60 -207 2 -47 -59 146 -163 -6 316 103 63 -102 104 -110 9 -85 77 56 89 78 -284 -136
5594 -136 -31 -89 -146 -98 13 -110 -31 184 -79 -22 -42 185 -39 -11 155 -38 12 169 -23 138 -336 -206 -51
5617 -51 -126 44 224 -43 26 310 -137 226 19 88 63 100 292 27 66 -63 73 25 36 -15 -12 87 73 -163 7
5642 7 -250 144 58 -237 -10 245 24 -153 275 -33 -185 -65 76 -74 -24 -36 -1 -22 21 236 -180 95 70
$$ packed form
5474E5K9j49J19M5j85K18k02n0k4K40q1L28m06Q8Q0mr5Q8k02K20l87L02q1j58
5498b12K14J13o1k0j16J38r2n2j3J30J56j74J06J73k39o7J11j36J6O8k3lj4K6
5522B9j68J46J90k27O4p5R9Q7j08O8Q1j60L9K5j77K62j35jj6J3P1k33L02l80j4
5547b18j01N06k58n5J05m5J38k38J82P4J00j61k7l0J6k6M1J30K9o4j17j7l2R1
5571B3J20k03j47K09m9j2K05l09J57L22k13m0j65K06k14J19r4J62k1L3j1l62J48
5594a36J05n8n7M8J11j23P9K15k63N7k0K27k24K8J66j93N0J57j92J61m74J30J55
5617e1p5J70J80k67O9K84m47L63k07O9k5L7J92k65L9j29J36m8J1n1LR9j4k36J70
5642Gk57L94q6k95K27K55k21j77M28l08j52J20J41j50N0j2L5k1M3K15m16K75k5
$$ plain form
5665 70 -216 58 45 133 8 146 33 131 -27 225 108 -147 -13 -35 44 -47 21 -9 -34 -6 74 -75 6 -64 142
5690 142 182 2 134 201 107 48 245 -121 121 -37 -45 -169 -124 46 65 -158 -23 35 87 63 13 -32 -53 -194 10
5715 10 62 47 237 27 -70 120 -8 16 -35 -4 -120 -11 45 -44 -162 -56 16 42 49 -120 18 -66 77 290 126
5740 126 5 43 80 40 -153 136 52 -65 -103 -233 93 46 -54 5 -133 78 155 55 -39 -52 110 -46 -174
5763 -174 17 33 -226 -113 -85 -195 86 209 67 -105 -2 -65 -98 -8 20 30 186 24 117 35 -90 47 -41
5786 -41 149 91 -52 78 -150 -18 -60 71 -3 55 4 89 -248 67 -14 -234 0 -76 57 44 -6 69 81 196
5810 196 -117 90 -1 32 -49 -186 17 -52 -100 129 79 -89 190 16 -80 92 33 -124 168 70 -147 117 -216
5833 -216 159 -119 -147 -226 -156 4 67 -207 134 42 18 81 -100 29 159 -85 18 25 11 32 -71 148 -57 7
$$ packed form
5665G0k86K74j3Q8j25J38j13R8j58K52j17k55J34k2P9r1O8l0k5K8Q0j49Q1p0K06
5690A42M0j80J32O7r4n9J97l66K42j58qj24M5J70J9k23J35N8N2k4n0m5k1j41K04
5715A0N2j5J90k10r7J90j28K4n1L1j16J09N6q9j18J06P2K6Pj69J38q4J43K13j64
5740A26j21L8L7m0j93K89q4j17l8j30L26m7j00N9j38K11P7j00r4j3J62j56j28
5763a74J91J6k59J13K8j10K81J23j42j72J03o3l3R0K8J0J56j62R3q2j25J37q8
5786d1J90n8j43J30k28J32m2J31p4N8n1Q5l37L15q1k20K34p6J33j3n0P5J2J15
5810A96l13K07r1L3q1j37K03o9m8K29n0j68K79j74r6J72n9j57K92r8k17K64l33
5833b16L75k78k8p9P0J60O3k74L41r2k4O3j81J29J30k44J03Pj4K1j03K19k05O4
$$ plain form
5857 7 38 -194 -189 22 15 178 68 62 -154 -226 -185 57 128 -99 130 -216 -127 35 10 47 25 -51 -38 -57 -60 -113 -2
5884 -2 -85 -174 112 -173 211 -270 8 -226 28 113 40 149 83 -24 -100 -30 -53 16 37 -92 -138 -57 33 -15 -76 221
5910 221 -1 124 39 43 11 -79 54 20 -53 129 -38 4 -100 -97 -157 76 -90 -113 3 -58 -49 120 -42 -115 -77 3
5936 3 -77 90 -84 15 317 145 -7 69 0 24 -108 -136 31 -160 -269 -30 -101 -33 -44 -157 86 215 -15 81
5960 81 -65 -135 105 226 158 -30 66 -149 153 -81 -103 -186 -29 78 -182 -98 -7 67 -55 101 -56 -9 148
5983 148 97 -23 206 -56 -9 162 114 116 -137 16 155 -83 40 13 85 -386 190 182 -46 -40 34 11 108 -4 10
6008 10 245 -14 -142 -158 34 202 106 40 -234 -63 -191 -77 -38 213 113 -146 -210 -46 -17 -57 127 36 32 16
6032 16 -46 -208 225 41 85 66 161 -25 -236 -137 19 156 -197 -87 57 -111 10 189 -101 159 164 -90 -154
$$ packed form
5857GL1k32NK11pJ63j10ok16p2M1K42P1k27K29l46Q9J62k5L7k2p6J3j9ln3J11
5884bq3q9K86k85L84m81K78k34K54Q5p3J09o6j07p6P0k3O9K1j29m6Q1R0m8o1K97
5910B21k22J25q5Ml2r0J33l4p3J82j67M2j04Lo0K33j66k3J16o1RJ69j62p3L8Q0
5936Cq0J67j74R9L02j72j52P6o9K4j32k8J67j91j09K39p1O8j1j13K43J29k30R6
5960H1j46p0K40J21o8j88R6k15L02k34k2q3J57J07k60Q4R1P4j22J56j57M7J57
5983A48n1j20K29k62M7J71m8Kk53J53J39k38J23k7P2m71N76qk28OP4k3R7j12J4
6008A0K35k59j28j6J92J68r6o6k74J71j28J14L9K51j00k59o4J64K9m0J84r1mj6
6032A6o2j62M33j84M4j9R5j86k11R9J56J37l53J10J44j68J21J79k90K60Nk54o4
$$ plain form
6055 -154 -3 169 -87 67 90 -10 -144 107 96 15 -129 95 -43 78 -226 -18 177 -38 71 98 -3
6076 -3 -63 -76 -212 114 36 30 -242 -161 131 168 93 -191 -167 22 84 -144 126 -230 -19 101 -92 -25 53 74 -18
6101 -18 26 150 115 63 -15 8 259 -35 -125 -62 -16 132 6 -169 -130 -121 -31 -148 144 98 19 -136 -150 126 -35
6126 -35 111 -61 -138 218 -91 20 -15 160 -25 162 -87 -235 139 -60 87 -15 56 120 -1 -20 -109 -24 -135
6149 -135 -186 5 -70 -4 142 -15 -107 -53 15 -107 -330 13 5 126 2 -13 -79 5 66 -28 195 -15 125 46 -147
6174 -147 -89 6 165 159 -126 1 -123 -15 -176 95 35 -86 -30 150 207 -106 36 -28 -19 67 95 43 -83 -200
6198 -200 168 28 -65 -6 4 -73 -24 -1 215 209 -245 55 84 -48 -102 180 -67 -22 -87 0 134 -43 112 11
6222 11 95 -13 -158 -251 -25 52 -36 -13 -79 103 7 87 31 287 114 62 102 121 -23 197 -183 -95 -11 94 -98
$$ packed form
6055a54J51J72k56J54K3j00j34K51j1q1j44K24j38J21l04K08J95k15J09K7j01
6076co0j3j36L26p8ok72Q1K92L7p5k84K4J89O2k28K70l56K11J20j93O7P8K1r2
6101a8M4J24l5n2p8K3K51k94r0O3M6J48j26j75L9RR0j17K92m6p9j55j4K76j61
6126c5J46j72p7L56l09J11l5J75j85J87k49j48L74j99J47j02P1O4j21j9q9Q5j11
6149a35n1J91p5O6J46j57r2N4O8j22k23L43qJ21j24j5o6Q4O1r4K23k10J40p9j93
6174a47N8R5J59ok85J27j24J08j61K71o0j21N6J80N7l13J42o4RQ6K8n2j26j17
6198b00L68j40r3N9J0p7M9K3K16om54L00K9j32n4K82k47M5o5Q7J34j77J55j01
6222A1Q4j08j45r3K26P7q8K3o6J82r6Q0n6K56j73n2M0J9j44K20l80Q8Q4J05j92
$$ plain form
6247 -98 188 52 5 147 13 6 -61 -117 -60 -143 -1 17 99 9 27 104 -40 -219 55 -74 19 -229 -49 39 -153
6272 -153 62 37 -57 168 -229 3 -26 68 242 -38 -19 -40 -17 99 213 138 -178 -23 27 -60 -6 23 -46 -56 -86
6297 -86 -53 157 82 245 -62 126 -64 -135 -175 171 -187 1 -28 47 58 -132 -28 -74 -34 -34 -214 29 80 -1 95
6322 95 -105 31 310 254 167 139 -161 -162 96 -61 104 -38 34 134 -227 -33 85 -85 46 126 42 42 -95 100
6346 100 292 49 -84 52 70 -180 -58 95 -59 27 13 68 61 -146 62 -66 22 60 29 -29 80 61 -37 239
6370 239 108 118 103 85 -5 -45 39 37 15 -21 -111 -31 195 100 28 88 -72 -13 -2 29 -182 291 108 56 105 -129 73
6397 73 -68 -54 -46 -103 -87 129 -15 -20 110 -114 -45 -70 139 -44 36 -57 -59 132 114 236 170 80 -2 -166 -212 -9
6423 -9 -3 -107 185 120 107 35 -187 204 90 -193 95 103 -43 143 177 -69 -36 -36 -88 -71 166 179 -64 -48 1 33
$$ packed form
6247i8K86j36m7J42j34po7n6N7q3J42J8Q2r0J8P7j44j79K74j29R3k48J80Q8j92
6272a53K15k5r4K25l97K32k9R4J74k80J9k1K3J16J14p5l16J55N0q7N4K9o9j0l0
6297h6L3K10p5J63l07J88j90p1m0L46l58J88k9P5J1j90J04m6M0%j80K43N1q1R6
6322I5k00J36K79n6q7k8l00jK58j57J65j42P2J00l61J94J18j70J31Q0q4%j37J95
6346A00J92k43j33J36J8k50J22J53j54Q6j4N5pk07K08j28Q8L8l1n8J09j9r8K76
6370B39j31J0j5j8r0m0Q4kk2l6r0Q0K26r5p2O0j60N9J1L1k11M73j83n2M9k34K02
6397G3j41J4Qn7J6K16j44nJ30k24O9k5K09j83Q0r3kJ91j8J22o6r0q2j64m6K03
6423iOj04K92o5j3p2k22L91j14k83K88Qj46J86L4k46L3%n2J7K37J3k43J6M9L2
$$ plain form
6449 33 141 232 -113 -21 14 18 79 177 -314 -44 74 -80 81 98 110 -150 -50 -214 -39 59 24 -47 -89 48 114
6474 114 -145 34 46 77 23 -120 -180 185 85 8 -270 -72 110 76 67 -40 -109 -32 120 -123 -136 65 -44 -105
6498 -105 -171 -81 -38 -193 115 169 -91 210 -82 -58 -28 42 -234 4 -39 -60 3 82 -9 -137 -46 151 -61 151
6522 151 -28 40 23 -140 -32 -6 48 -76 56 -83 -69 88 75 69 87 -29 -76 59 19 106 117 173 18 262 -69
6547 -69 23 104 -112 -23 54 60 117 147 -24 -23 18 62 62 -101 91 -42 -178 40 103 -6 -36 -16 -12 93 -21 110 175
6574 175 -116 -74 97 121 72 76 74 -38 -87 199 -147 131 -107 -21 -120 15 127 3 196 -13 -110 126 147 65
6598 65 197 -288 -68 -61 -12 54 57 -136 -71 -70 72 -50 98 -1 -30 19 29 -105 -119 -13 -63 69 -76 -10 167 -44
6624 -44 -79 51 -57 96 -1 -66 90 63 39 43 83 34 -143 12 -46 43 125 141 178 -40 -89 234 -86 135 -125
$$ packed form
6449C3J08R1l45R2L5MO1R8m91K70J18j54J61J7J2k60J00j64J75R8l5p1m2J37O6
6474A14k59J79J2L1n4j43o0L65j00p7k78J98J82l4rj07o9P7J52k43j3K01j09o1
6498a05o6R0M3j55L08N4k60L01k92K4L0P0k76K38m3k1O3P9r1j28R1J97k12K12
6522A51j79O8j7j63J08K6N4j24J32j39J4J57j3oJ8j16m7J35m0Q7J1N6j55K44l31
6547f9R2Q1k16Q9P7ON7L0j71JM1M4%j63J92j33j36K18O3j09l0K0MJ05j14J31O5
6574A75k91M2J71K4m9Mkj12m9K86l46K78k38Q6r9J35J12j24J93k09r7K36K1q2
6598F5J32m85K20PM9O6Lj93O5JJ42j22J48r9k9M9J0j34j4J06n0J32j45O6J77k11
6624d4l5J30j08J53r7o5J56k7k4MM0m9j77J55n8Q9Q2J6L7k18m9L23l20K21k60
$$ plain form
6649 -125 99 -232 -172 -32 -34 -192 -33 -39 105 -13 -191 56 204 3 1 132 -69 -47 -111 91 150 0 -145
6672 -145 113 76 99 -132 7 122 143 29 -147 174 -27 272 -10 -27 -113 -29 52 -9 75 -130 88 68 -77
6695 -77 -11 -27 -39 -30 -61 105 153 84 2 252 -180 -17 56 114 164 -117 -10 165 176 -32 19 -101 -56 -66 -25 -65
6721 -65 28 -1 -15 -181 -40 -32 -107 -29 6 120 39 -211 7 -22 64 -33 231 -13 -114 52 -83 -8 5 51 93 -203
6747 -203 50 129 84 374 161 17 -110 -71 -96 -144 23 -150 -58 49 85 28 121 102 -2 19 104 167 -4 29 -105
6772 -105 -219 206 73 -25 105 44 -175 302 91 146 -25 69 21 -38 -182 24 57 53 99 98 158 -23 -109 54 84
6797 84 177 66 -97 40 -164 75 -47 47 -54 -78 45 -117 -106 64 151 -4 170 66 143 8 17 148 -30
6820 -30 -113 80 60 183 85 68 -109 -17 60 40 40 62 -142 -39 -161 38 -73 255 90 134 -57 -4 -29 -106 -62
$$ packed form
6649a25K24l31O0J40kj58J59oJ44j18j78K47J48k01kJ31k01K2o4K02N9j50j45
6672a45K58l7K3k31J39J15K1j14j76L21k01K99k82j7q6Q4Q1o1Q4k05K18k0j45
6695g7O6j6j2Rl1J66M8o9q2K50m32J63P3N8N0k81J07J75J1k08N1j20M5j0M1m0
6721f5R3k9j4j66J41Qp5P8L5J14q1k50K18k9Q6r7K64k44j01J66j35P5J3M6M2k96
6747b03K53P9m5K90k13j44j27L9k5m8J67j73R2J07L6n7R3j9j04K1Q5O3j71L3j34
6772a05j14M25j33r8J30o1k19M77k11N5j71R4m8n9j44K06L3mM6jO0j81q6J63L0
6797H4R3j11j63J37k04K39j22R4j01k4J23j62J1J70Q7j55J74j04P7j35RJ31j78
6820c0q3J93k0J23r8j7j77R2P7k0%K2k04J03j22J99j11L28j65M4j91N3k5p7M4
$$ plain form
6845 -62 -43 13 -37 190 -212 123 -182 -58 33 -95 -235 53 31 141 247 68 26 64 -126 -50 -69 -195 140
6868 140 34 -147 -85 166 -92 -190 -129 -180 -206 244 -74 64 143 -60 24 -134 60 17 14 242 -85 78 -11 -1
6892 -1 -114 41 -45 39 83 115 76 50 121 17 -228 36 160 97 -4 65 98 -89 -58 -170 127 143 103 80 -173
6917 -173 -98 -90 44 -205 -131 38 155 -36 -106 285 -64 99 -105 -223 -128 -45 82 21 145 -59 79 -19 -169
6940 -169 -114 -152 -164 21 8 -226 1 -223 26 -92 -143 -189 100 -49 -105 159 -216 81 204 -132 -49 62 100
6963 100 -44 -36 33 -143 139 -83 30 102 116 -96 105 55 -18 -90 -65 127 -28 138 -84 -6 -79 83 20 49
6987 49 -52 128 -60 -56 2 219 35 -75 -7 241 90 189 22 14 1 13 -11 -33 -102 -129 -144 -100 -32 -93 75 -42
7013 -42 69 -116 14 46 14 79 80 24 -187 77 -18 33 -20 100 -46 127 -104 -184 49 -84 -45 -135 -61 94 90
$$ packed form
6845f2J9N6n0K27m02L35l05J24R1j28j40K88k2J10J06j79m2L8j90P6j9j26L35
6868A40j06j81O2K51k58r8O1n1k6M50l18J38P9k03Q4j58J94m3lK28l27J63q9J0
6892aj13J55q6Q4M4L2l9k6P1j04k45K64J24o3j01O9L3j87L1j12K97J6m0k3k53
6917a73P5QJ34k49P4J69J17j91p0L91l49J63k04j18R5Q3J27o1J24k04J38r8j50
6940a69N5l8j2J85j3k34K27k24K49j18n1m6K89j49n6K64l75K97J23l36Q3J11L8
6963A00j44QO9j76K82k22J13P2J4k12K01n0p3p2K5J92j55J66k22P8p3J62o3K9
6987D9j01J80j88MN8K17j84j10O8K48j51R9j67qj3J2k4k2o9k7j5M4O8o1J68j17
7013d2J11j85J30L2l2O5Jn6k11K64r5N1n3J20j46J73k31q0K33j33L9r0P4J55m
$$ plain form
7038 90 -29 112 -62 240 -39 12 263 190 -22 -121 -122 -16 -15 -126 -224 48 -148 38 -8 135 267 94 25 -89
7062 -89 172 -180 32 -265 -38 59 -170 -27 -143 32 -100 -38 -168 -58 -30 195 29 -26 46 6 121 149 62
7085 62 -115 40 42 168 195 26 -49 44 -169 -109 -3 -10 -125 78 -6 -210 -19 -80 -34 -25 64 -41 62 68 37 156
7111 156 -78 -2 79 -104 -35 -148 45 -45 -232 -262 -29 -106 -8 56 10 76 -141 85 -108 -104 157 54 198 30
7135 30 125 27 -234 139 -102 -36 -126 -14 128 214 -200 -7 28 -56 -11 162 -55 57 -94 -87 113 63 -71 34
7159 34 78 39 -52 215 57 211 -101 -34 -260 -154 20 134 -24 0 197 86 37 -37 297 -29 27 55 -59
7182 -59 59 -40 -119 57 -38 -78 -182 -36 -156 -13 75 81 170 -124 -205 174 148 106 -47 -40 -100 166 255 100 55 277
7208 277 61 59 -54 -200 88 81 -87 -47 220 -57 179 196 317 -52 32 37 161 -32 59 105 31 50 105 105 61 82
$$ packed form
7038I0j19J41j74L02k79N1K51p3k12r9jJ06Jj11r8K72j96J86m6J43J32j73o9j14
7062h9K61l52K12k97K27R7k29J43j16J75j32O2j30J10K8K25j66n5P2m0J15K8q7
7085F2j77J55KJ26K7j69p5R3k13O0J06pj15K03q4k04J91o1M6RQ9j05J03Ol1J19
7111A56k34P6Q1j83O9j13J93r0j87l0K33p7R8O4m6O6k17K26j93MK61j03J44j68
7135C0R5r8k61L73k41O6r0J12J42Q6m14J93L5q4M5J73k17J12j51PK00n0j34J05
7159C4M4l9r1K67j58J54l12O7k26J06J74J14j58K4J97j11m9p4L34l26N6K8j14
7182e9J18r9p9J76r5m0j04J46j20J43Q8OQ9k94q1L79k6m2j53Po0K66Q9j55m5K22
7208B77k16kj13j46K88pj68M0K67k77K36J7J21l69Q4NJ24j93R1M6p4J9N5%m4K1
$$ plain form
7234 82 54 -100 -36 -134 -82 108 -97 86 4 -53 60 -148 71 -15 39 149 -61 -86 83 64 92 -137 -60 -51 -57 52
7260 52 92 51 -79 -158 -25 14 1 55 -131 41 -189 -173 134 -16 -113 23 -129 -159 3 -169 -151 75 36 212
7284 212 -13 63 -47 98 -39 -101 1 -48 -58 282 171 173 104 105 -1 23 85 -204 -42 -154 -49 9 63 -260
7308 -260 -132 4 155 35 131 15 120 256 -148 67 -95 -26 -25 181 -242 58 120 -82 119 -323 -12 -45
7330 -45 -158 2 -184 -118 55 67 -76 -43 -195 -34 64 14 -88 -137 -162 -255 -16 117 -18 -182 -52 49 289
7353 289 67 -55 66 72 -116 23 -61 57 -10 -203 -99 31 14 -205 123 18 -30 -68 -72 -50 -42 7 -80 56 -189
7378 -189 -116 44 -143 50 -85 68 130 -25 -1 2 15 185 -55 -14 40 32 -50 -1 200 -50 134 2 66 61 181
7403 181 -166 177 144 69 1 -48 43 -38 -193 1 151 77 -45 108 19 55 21 195 143 -49 167 113 87 4 -85
$$ packed form
7234H2k8j54O4r8N2J90k05J83q2n7J13k08K19q6N4J10k10k5J69j9K8k29P7RoJ09
7260E2M0m1j30p9J33L9j3N4j86J72k30J6L07j50r7J36j52l0J62j72J8K26l9J76
7284B12k25P6j10J45j37o2J02m9j0L40j11Ko9Jj06K4O2k89J62j12J05N8N4l23
7308b60J28J36J51j20R6j16J05J36m04K15j62O9JK06m23L00O2k02K01m42L11l3
7330d5j13J60j86O6J73J2j43L3j52J61R8n0j02m9k5r3K39J33j35j64J30J01K40
7353B89k22j22J21Oj88J39q4J18o7j93J04J30j7k19L28j05m8l8mK2QM9q7J36k45
7378a89P3J60j87J93j35J53O2j55K4LJ3J70k40M1N4qq2M9K01k50J84j32O4nJ20
7403A81l47L43l3p5o8m9R1q1j55J94J50p4j22J53q9L6l4J74n2j92K16n4k6q3q9
$$ plain form
7428 -85 -50 33 80 1 -250 60 31 103 49 -235 -37 -80 -60 230 -148 -31 -29 -90 -28 103 116 -220 -129 42 -16 -246
7454 -246 -226 -163 62 -83 -59 -72 -26 113 -43 157 -110 -37 135 -21 -46 73 153 242 31 -383 -41 -21 85
7477 85 -137 -41 -142 126 163 23 -92 -204 78 -111 153 166 -23 78 169 -92 58 191 32 -38 5 -90 -84
7500 -84 -142 48 38 81 31 85 88 -58 40 241 -30 -186 -125 -46 85 117 -116 -44 -41 52 -21 -230 -64 73 -69 116
7526 116 -76 62 19 -146 -135 -31 -18 -185 8 129 29 130 -133 116 -38 -175 -80 -72 -66 -43 206 -40 -7
7549 -7 144 -12 69 15 30 90 -40 115 171 71 170 95 -105 -142 162 130 -163 -13 35 -56 -44 -55 72 -27 -2 163
7575 163 -11 123 178 103 159 2 87 4 -119 82 9 29 219 39 7 -303 110 -104 28 -73 -57 83 -7
7598 -7 40 196 -19 -44 48 3 -62 -45 -58 -54 86 65 -65 168 -101 -89 66 -134 -71 -73 276 -77 105 -185 -25
$$ packed form
7428h5L5Q3M7p9k51L10k9P2n4k84J98m3K0K90l78J17Ko1O2J31J3l36R1J71n8k30
7454b46K0O3K25j45K4j3M6J39j56K00k67P3J72j56k5J19Q0Q9k11m14L42K0J06
7477H5k22R6j01K68L7j40j15j12K82j89K64J3j89J01R1k61J50J33j59p0M3r5O
7500h4n8J90j0M3n0N4Lj46R8K01k71j56O1P9J31L2k33P2LR3p3k09J66J37j42J85
7526A16j92J38m3j65J1J04J3j67J93J21j00J01k63K49j54j37R5QOK3K49k46L3
7549gJ51j56Q1n4J5O0j30J55N6j00R9p5k00l7L04l2k93J50M8r1J2j1J27r9K5J65
7575A63j74J34N5p5N6j57Q5q3j23K01p3K0J90j80l2l10M13k14J32j01J6J40r0
7598gM7J56k15k5R2m5o5J7j3MJ40k1j30K33k69J2J55k00O3kL49l53J82k90J60
$$ plain form
7623 -25 -63 -54 -206 174 -132 94 161 -47 158 -262 -152 -26 -41 -117 29 -186 144 176 -109 -13 112 -99 -192
7646 -192 70 -76 -47 56 -25 25 160 126 -128 23 -172 -4 -190 -248 -250 327 -183 -223 73 -72 121 256 153
7669 153 104 -14 22 183 -121 104 114 63 -2 22 42 122 65 79 -89 -49 -2 -138 -86 106 77 115 -69 -48 21 149
7695 149 -83 96 -18 25 32 -102 -16 69 -126 120 -78 -185 58 237 89 103 -49 37 -6 9 22 -145 197
7718 197 -84 62 80 -38 63 -87 -112 0 -84 -230 -15 -41 62 -80 79 44 29 -102 29 246 155 202 -63
7741 -63 -49 110 70 -153 -98 95 -23 52 256 6 105 74 48 57 61 -15 11 -234 43 182 -63 237 13 188 98
7766 98 272 -114 37 -227 -47 -241 -33 -140 -23 94 -229 2 77 130 -120 163 76 -152 79 -78 -216
7787 -216 -50 -52 -78 182 -127 -85 153 5 118 49 45 -137 -151 -245 -45 75 -210 -17 116 49 -98 23 -195
$$ packed form
7623b5l8Rj52L80l06K26O7k08K05m20J10J26j5p6J46k15L30L2k85R6J25k11r3
7646a92K62j46K9J03q1N0J35l4k54J51j95J68j86n8kN77n10m0K96j45J93J35j03
7669A53m9j18L6J61l04K25J0n1o5K4K0Q0n7J4j68M0M7j36N2J92k9L8j84K1O9J28
7695A49k32J79j14M3Pj34Q6Q5j95K46j98j07K43J79j48J4j52Q6m3J5J3j67L42
7718A97k81J46J8j18J01j50k5J12q4j46K15k6J03j42J59l5j5j31J31K17r1M7k65
7741f3J4J59m0k23N5J93j18P5K04k50R9l1k6RMp6K6k45K77J39k45L00k24J75r0
7766I8J74l86J51k64J80j94K08j07J17J17l23K31P5N3k50K83q7k28K31j57j38
7787b16J66kk6K60l09M2K38j48J13o9mj82j4r4K00J20k85J93J33o7j47J21k18
$$ plain form
7810 -195 32 113 -90 -116 -73 115 12 -21 75 -31 36 -44 -179 111 79 -74 142 -67 84 81 -241 -111 -41 2
7834 2 58 89 49 -151 46 -94 29 -201 72 51 1 -100 -94 141 36 5 -151 26 81 24 -48 -84 -69 135 -131
7859 -131 274 -154 108 -67 -22 172 -73 175 96 331 -25 203 -28 -19 96 -29 222 77 -109 -140 -204 -229
7881 -229 -27 -78 -70 99 -11 67 70 -34 21 160 4 0 262 46 -117 2 -24 -24 160 2 17 -64 -25 270 -129
7906 -129 86 -162 110 -82 154 231 125 -56 -18 120 -149 -96 -197 -174 53 114 -273 42 -279 -99 139 110
7928 110 -70 -168 -149 0 -11 -129 27 3 105 -170 -200 97 140 -4 150 93 41 -89 148 69 51 -76 -8 154
7952 154 -105 -67 -42 31 89 -176 -36 -13 -112 -19 -107 -37 229 64 -15 71 64 110 65 -43 122 -153 -93 -45 -176 -48
7978 -48 182 71 -155 -3 106 70 178 -69 45 97 -103 34 29 -213 -264 32 170 247 121 29 -160 -26 22
$$ packed form
7810a95K27Q1k03k6M3J88j03l3R6j06O7q0j35K90l2j53K16k09J51ll22J30P0M3
7834BN6L1m0k00J97j40J23k30K73k1n0j01OK35j05l1j56J77N5n7p2l6J5K04k66
7859a31M05m28K62j75M5J94k45K48p9K35l56K28k31RJ15j25K51j45j86l1o4k5
7881b29K02n1QJ69j10P8Lj04N5J39j56mK62k16j63J19k6%J84j58J5q1L9K95l99
7906a29K15k48K72j92K36P7j06j81L8J38k69N3j01K3K27O1l87L15l21J80K38k9
7928A10j80r8J9J49j1j18J56k4J02k75l0K97M3j44J54n7n2j30K37p9j8j27O8J62
7952A54k59L8K5P3N8k65J40K3r9R3q8P0K66j65p9Q6pM6m5j08J65k75O0M8j31J28
7978d8K30j11k26J52J09l6J08k47J14N2k00J37nk42n1K96J38P7j26r2j89J34M8
$$ plain form
8001 22 -131 -35 179 -31 -191 -121 19 185 276 48 -41 -48 -43 -134 -106 284 86 -49 -75 -189 111 -283 119 -88
8025 -88 131 108 45 104 58 -31 -85 -2 121 3 -122 -35 36 132 -64 266 59 64 48 51 26 47 -124 -143 -7 -177
8051 -177 -152 162 -111 10 12 -4 -86 156 90 -78 170 -63 74 145 22 93 -40 96 73 -129 222 -99 -94 -19
8075 -19 18 80 -9 -131 0 15 -39 -133 -84 -204 -141 259 -52 79 21 125 -54 130 113 -76 110 -12 0 182
8099 182 104 -36 -60 -288 170 -105 -35 82 173 37 115 -74 53 -43 -210 0 98 -28 -121 -5 55 136 -70
8122 -70 96 -120 -28 30 -324 -273 -172 -126 -76 169 -119 47 -12 -34 34 -100 65 -55 -1 98 -51 -19 -109 216
8146 216 -94 -204 35 -125 -54 5 0 250 -126 154 39 -52 -57 -229 16 -43 31 50 -107 31 -177 -11 -72 55
8170 55 166 -8 -310 3 -41 51 80 115 72 81 -17 71 -12 1 -67 -46 79 147 -49 116 44
$$ packed form
8001B2j53R6K14k10j60P0J40J66R1k28q9pNr1K8L90j98j35k6j14L00l94M02k07
8025h8K19k3o3N9m6q9n4Q3J23j18j25Q7P1R6j96L30k07Nj6Lk5K1j71j9J36j70
8051a77K5L14k73J21Kj6q2K42o6j68K48k33J37P1j23P1j33J36k3k02L51l21NP5
8075a9L7O2q9j22J31J5n4r4M9j20O3M00l11J31n8J04j79J84j7j89J86j22J2J82
8099A82p8j40k4k28M58k75P0J17R1j36P8j89J27r6j67K10R8j26r3J16O0Q1k06
8122g0J66k16R2N8l54N1J01M6N0K45k88J66n9k2O8j34J65j20N4R9j49L2r0L25
8146B16l10j10K39j60P1N9nK50l76K80j15r1nj72K45n9P4J9j57J38k08J66o1J27
8170E5J11j74l02L13m4R2K9L5m3Rr8Q8q3J3o8K1J25O8j96J65p2
8191D4
$$ Imaginary data points
##PAGE= N=2
##DATA TABLE= (X++(I..I)), XYDATA
$$ plain form
0 0 0 0 0 0 0 0 0 0 0 0 0 0 -8 8 -8 8 -8 16 -16 24 -24 32 -32 40 -48 56 -64 73 -88 98 -112 128 -145 167
34 167 -188 212 -236 265 -296 332 -368 409 -452 501 -555 612 -676 747 -821 904 -996 1097
52 1097 -1210 1336 -1476 1634 -1817 2024 -2264 2552 -2895 3319 -3855 4557 -5519 6932 -9203
67 -9203 13469 -24229 112756 138021 -106814 -37100 46002 -4933 -40398 25972 -29404 -89091
79 -89091 -9815 49156 -52894 -71008 17828 20599 -8318 48968 31003 -40869 8949 91095
91 91095 20321 -46155 26012 48063 -44505 -27874 41563 -32223 -87110 11418 35057 -51983
103 -51983 -28783 50999 -5657 -64083 27976 73570 -20691 -21854 66226 30431 -36982 9900
115 9900 33301 -21024 -17898 24252 -6254 -36949 4000 2920 -46541 -6319 42683 -18442 -36146
$$ packed form
0@%%%%%%%%%%%%qJ6j6J6j6K4l2M0m8N6o4P2q8J04j20J37j61J86k10K40k73L12
34A67l55M00m48N01n61O28p00P77q61R53j056J167j288J423j568J725j900K093
52A097k307K546k812L110l451L841m288M816n447O214p174Q412j0076J2451j6135
67i203K2672l7698J36985K5265k44835O9714Q3102n0935l5465O6370n5376n9687
79h9091P9276N8971j02050j8114Q8836K771k8917N7286j7965p1872M9818Q2146
91I1095p0774o6476P2167K2051r2568J6631O9437p3786n4887R8528K3639q7040
103e1983K3200P9782n6656n8426R2059M5594r4261j163Q8080l5795o7413M6882
115I900K3401n4325L126M2150l0506l0695M0949j080m9461M0222M9002o1125j7704
$$ plain form
128 -36146 37560 22912 -47760 -2723 62670 2757 -45517 26779 49900 -29348 -28786 30473
140 30473 -301 -33418 11438 15679 -30974 -14810 26888 -1053 -29923 8664 20175 -16503
152 -16503 -68 27048 -9599 -16888 24444 10298 -22925 9871 34513 -10599 -28357 16573
164 16573 11649 -31753 -30 33467 -17340 -34105 18436 15999 -30477 -15616 22788 3714
176 3714 -18578 10980 17263 -14171 -1484 21135 -989 -4658 16015 1436 -13762 7965 12037
189 12037 -19322 -18089 17574 6501 -23980 189 12071 -25129 -14884 29700 14664 -19545
201 -19545 -430 24306 3933 -9754 11611 7618 -13735 6456 17314 -15786 -20269 6088
213 6088 3403 -10751 -4820 -1766 -11235 -3067 13817 -2424 -16482 12509 20900 -7394 -537 19776
$$ packed form
128c6146P3706j4648p0672M5037O5393n9913m8274P2296K3121p9248N62N9259
140C0473l0774l3117M4856M241m6653J6164M1698k7941k8870L8587J1511l6678
152a6503J6435K7116l6647p289M1332j4146l3223L2796K4642m5112j7758M4930
164A6573m924m3402L1723L3497n0807j6765N2541k437m6476J4861L8404j9074
176C714k2292K9558O283l1434J2687K2619k2124l669K0673j4579j5198K1727M072
189A2037l1359J233L5663j1073l0481K4169J1882l7200J0245M4584j5036l4209
201a9545J9115K4736k0373j3687K1365l993k1353K0191J0858l3100m483K6357
213F088k685j4154N931L054r469Q168J6884j6241j4058K8991Q391k8294O857K0313
$$ plain form
227 19776 708 -11871 9940 13344 -12872 -11276 14624 871 -23585 -1863 10931 -12650
239 -12650 -11139 9218 1582 -8023 3659 8969 -2111 361 14781 2937 -8348 9690 8148
252 8148 -12680 -1482 11623 -6934 -13261 3963 2275 -16281 -7872 13463 -1276 -16478 6604
265 6604 11489 -9416 487 17109 3644 -5923 7190 10222 -5937 -4716 11333 1809 -11388
278 -11388 2876 2787 -13289 -3993 4714 -7344 -7918 5485 2377 -11044 -927 15754 566 -9343
292 -9343 11832 11480 -8441 1038 12045 -3482 -8921 6397 7158 -11235 -10227 5811 -3262 -13501
306 -13501 2369 3327 -9420 459 8978 -1842 -4188 8045 9875 -971 1857 11985 -24
319 -24 -7006 8137 3404 -12015 -1684 5340 -8114 -11728 504 1761 -10110 -5088 9808 499
$$ packed form
227A9776j9068j2579K1811L404k6216J596K5900j3753k4456K1722J2794k3581
239a2650J511K0357p636r605J1682N310j1080K472J4420j1844j1285J8038j542
252H148k0828J1198J3105j8557o327J7224j688j8556Q409K1335j4739j5202K3082
265F604M885k0905R903J6622j3465r567J3113L032j6159J221J6049r524j3197
278a1388J4264q9j6076R296Q707j2058n74J3403l108j3421J0117J6681j5188r909
292i343K1175l52j9921R479J1007j5527n439J5318P61j8393J008J6038r073j0239
306a3501J5870R58j2747R879Q519j0820k346J2233J830j0846K828J0128j2009
319b4o982J5143m733j5419J0331P024j3454l614J2232J257j1871N022J4896r309
$$ plain form
333 499 -7452 7885 7935 -3908 3665 11288 2459 -2395 4241 4609 -5628 -4774 4177 -4648 -9797 2045
349 2045 -1782 -11301 -1238 4775 -2843 -3321 5286 6614 -1304 2212 10639 485 -4348 8521 5381
364 5381 -6490 -1353 2579 -3668 -6036 -730 555 -6781 -5229 2854 -3234 -5099 5452 3342 -2855
379 -2855 3558 5331 413 327 5063 5294 -1715 -1029 4021 -2859 -4849 3605 -43 -6266 -800 531
395 531 -3901 -3558 1375 2642 -3316 -1859 4995 152 -1590 5501 2505 -1374 3149 4331 1253 -764
411 -764 -801 -217 -3337 -1108 2112 -5390 -6268 1471 -1388 -5348 -1022 795 312 1304 3485 3280 -1268
428 -1268 1208 7370 3296 1131 4190 23 -2015 829 -1497 -4562 -4446 -1648 -91 -5506 -4933 -108
444 -108 -3381 -1713 5017 3352 1826 4457 3620 2210 2053 3691 3735 -807 -168 1470 -5177 -5507 -813
$$ packed form
333D99p951J5337N0j1843P573P623q829m854O636L68j0237Q54Q951q825n149J1842
349B045l827r519J0063O013p618m78Q607J328p918L516Q427j0154m833J2869l140
364E381j1871N137L932o247k368N306J285p336J552Q083o088j865J0551k110o197
379b855O413J773m918q6M736K31p009O86N050o880j990Q454l648o223N466J331
395E31m432L43M933J267n958J457O854m843j742P091k996l879M523J182l078k017
411g64l7N84l120K229L220p502q78P739k859l960M326J817m83R92K181k05m548
428a268K476O162m074k165L059m167k038K844k326l065J16K798J557n415N73M825
444a08l273J668O730j665j526K631q37j410j57J638M4m542O39J638o647l30M694
$$ plain form
461 -813 -4768 -6586 -1662 191 -1387 -3160 -792 2726 1056 4371 7837 2151 2478 6992 2522 -810
477 -810 -19 -1598 -2585 -1321 100 -3590 -10885 -6049 1690 -2593 -2873 2423 354 796 4949 4230 693
494 693 313 5345 6838 1385 1900 1396 -6587 -3537 2723 -3718 -7337 -1896 940 -2403 -5659 -1876
510 -1876 -228 -2002 5302 8982 552 461 5282 623 -166 5090 3941 -1437 -2033 2391 -2388 -10934
526 -10934 -3352 2504 -5274 -3091 3752 -1580 -5149 -71 2282 536 2667 9052 5418 -1876 3459
541 3459 4411 -5558 -1727 6052 -1211 -4954 728 -426 -9107 -9007 2131 3061 -2909 2783 3849 -5046
557 -5046 371 7722 141 -1966 6936 8102 -329 -3072 1545 -3322 -8088 3820 6635 -6814 -6097
572 -6097 1578 -3464 -5979 443 1957 -871 2383 7801 -442 -6994 4604 6904 -3205 2569 8825
$$ packed form
461h13l955j818M924J853j578j773K368L518j670L315L466n686L27M514m470l332
477h10P91j579r87J264J421l690p295M836P739m283k80N296k069M42M153p19l537
494F93l80N032J493n453N15n04p983L050O260o441l619N441K836l343l256L783
510a876J648j774P304L680q430r1M821m659p89N256j149n378n96M424m779q546
526a0934P582N856p778K183O843n332l569N078K353j746K131O385l634p294N335
541C459R52r969L831P779p263l743N682j154q681J00J1138R30n970N692J066q895
557e046N417P351p581k107Q902J166q431k743M617m867m766J1908K815j3449P17
572f097P675n042k515O422J514k828L254N418q243o552J1598K300j0109N774O256
$$ plain form
587 8825 -1339 -5792 1463 1357 -6719 -4701 4776 462 -6675 1229 1063 -8582 -1935 5965 124
602 124 -449 6595 4429 -4416 -1815 6761 1744 -3592 5395 4484 -7134 -2602 2827 -5362 -6232 2041
618 2041 2178 -4277 -2079 3307 -3618 -6528 6138 6004 -4075 2493 8679 319 -2680 3241 2571
633 2571 -3383 272 6866 -1435 -8077 172 -981 -7710 -228 3198 -4467 -3906 4025 1898 -5147
648 -5147 -392 8069 2709 -910 7912 4438 -5198 582 4827 -2744 -3947 2523 958 -6767 -5123
663 -5123 823 -4808 -6625 3691 3150 -4236 1779 5845 -361 -618 5685 5783 302 1991 5874 -1878
679 -1878 -5910 2314 -452 -7611 -1456 1545 -4654 -5692 -227 -258 -4538 -2 8028 2486 -2006 5005
695 5005 4213 -1560 3189 5913 111 -2129 1019 669 -5201 -4589 1161 -3332 -5819 1256 -242 -5418
$$ packed form
587H825j0164m453P255j06q076K018R477m314p137P904j66r645O647P900n841
602A24n73P044k166q845K601Q576n017n336Q987r11j1618M532N429q189q70Q273
618B041J37o455K198N386o925k910J2666j34j0079O568O186q360k999N921o70
633B571n954L655O594q301o642Q249j153o729P482L426p665N61P931k127p045
648e147M755Q461n360l619Q822l474r636N780M245p571j203O470j565p725J644
663e123N946n631j817J0316n41p386O015M066o206k57O303R8n481J689L883p752
679a878m032Q224k766p159O155L001o199j038N465l1m280M536Q030n542m492P011
695E005p92n773M749K724n802k240L148l50n870O12N750m493k487P075j498n176
$$ plain form
711 -5418 -263 3612 276 -434 4018 5611 934 1149 5777 515 -3146 2904 1702 -4279 -2114 385
727 385 -3288 -5623 -2230 534 -3218 -2642 3128 24 -2673 3765 3845 -9 2091 4443 2481 -366
743 -366 1117 2500 -2252 -2411 2239 -1869 -5463 -386 -503 -4372 -2375 787 -179 -2029 704 4083
759 4083 206 -325 5047 2256 -1048 3114 2730 -1223 -417 1240 -207 -3358 -2302 231 -3357 -3877
775 -3877 1192 -1278 -3667 992 1575 -550 837 3044 2923 319 2087 4290 -345 -967 3614 -129
791 -129 -3799 18 -156 -3298 -3246 -1208 -1174 -3328 -1303 1945 -1520 -1246 4099 1447 -691 3590 3180
808 3180 445 890 2299 864 -2009 -279 1452 -3348 -3454 626 -2670 -4387 7 166 -1921 -469
824 -469 1918 1440 -63 2353 4362 -105 402 4353 711 -1458 1710 355 -2208 -1765 -791 -1659 -3379
$$ packed form
711e418N155L875l336p10M452J593m677K15M628n262l661O050j202n981K165K499
727C85l673k335L393K764l752N76N770l104k697O438Q0l854K100K352j962k847
743c66J483J383m752j59M650m108l594N077j17l869J997L162r66j850K733L379
759D083l877n31N372k791l304M162l84l953Q06J657j447l151J056K533l588n20
775c877N069k470k389M659N83k125J387K207j21k604J768K203m635o22M581l743
791a29l670L817j74l142N2K038L4k154K025L248l465K74N345k652k138M281m10
808C180k735M45J409j435k873J730J731m800j06M080l296j717M394J59k087J452
824d69K387m78j503K416K009m467N07L951l642k169L168j355k563M43R74q68j720
$$ plain form
841 -3379 -1130 316 -3338 -1351 2621 -413 -918 3075 1925 72 1718 2944 1376 -618 1452
856 1452 2312 -2271 -1347 1572 -2165 -3096 182 -1579 -2918 -965 131 -681 -1582 1471 2493 -833
872 -833 1102 3609 -45 578 3534 1141 -821 617 820 -1052 -2101 -133 -281 -3699 -1593 549
888 549 -3187 -1700 1991 27 -1072 1362 2050 757 496 3160 2711 -913 1408 3028 -1594 -942
904 -942 1243 -1502 -2532 -353 -718 -2676 -3091 87 94 -2586 1005 2873 -1169 922 4265 1300 -309
921 -309 2153 3130 715 -683 1472 30 -3729 -421 426 -4145 -2447 653 -1953 -2660 -143 956
937 956 -690 -82 3842 2466 -874 2558 3847 -1067 477 3076 -122 -1729 -174 -192 -3380 -3654
953 -3654 43 -1045 -4197 264 1696 -2595 -316 2904 1185 267 2887 3827 746 -324 2699 1182
$$ packed form
841c379K249J446l654J987L972l034n05L993j150j853J646J226j568j994K070
856A452Q60m583R24K919l737r31L278j761j339J953J096q12r01L053J022l326
872h33J935K507l654O23K956k393j962J438K03j872j049J968j48l418K106K142
888E49l736J487L691j964j099K434O88j293k61K664m49l624K321J620m622O52
904i42K185k745j030K179l65j958m15L178Pk680L591J868m042K091L343k965j609
921c09K462R77k415j398K155j442l759L308Q47m571J698L100k606p07K517J099
937I56j646O08L924j376l340L432J289m914J544K599l198j607J555j8l188k74
953c654L697j088l152M461J432m291K279L220j719r18K620R40l081j070L023j517
$$ plain form
969 1182 -2456 582 874 -3399 -1694 546 -2902 -3779 -923 528 -1343 -977 3048 1017 -1732 2795
985 2795 4002 -565 1138 3818 1397 -613 181 194 -2563 -2709 1155 -756 -3914 -235 99 -3462
1001 -3462 -1420 1408 -37 175 2560 3367 61 -798 2647 1434 -1104 2583 2168 -2223 -806 202
1017 202 -2692 -3253 -714 509 -1904 -1990 1392 -477 -2766 1441 2252 -54 2057 3228 1002 -102
1033 -102 478 959 -419 83 2166 -892 -2919 188 -1378 -4158 -762 972 -669 -739 697 375 -1804
1050 -1804 -293 3063 1391 495 3519 1722 -1179 803 511 -1384 -356 979 -33 -2209 -2131 -735
1066 -735 -2904 -2198 1615 451 -892 1771 1134 -1278 568 2453 1630 905 2236 2520 -1630 -1666 1330
1083 1330 -1382 -2763 905 37 -2420 -1599 -718 -1461 -1748 781 2276 -193 969 3359 -534 -914
$$ packed form
969A182l638L038K92m273J705K240l448q77K856J451j871L66M025k031k749M527
985B795J207m567J703K680k421k010P94J3k757j46L864j911l158L679L34l561
1001c462K042K828j445K12K385Q07l306q59L445j213k538L687m15m391J417J008
1017B02k894n61K539J223k413q6L382j869k289M207Q11k306K111J171k226j104
1033a02N80M81j378N02K083l058k027L107j566k780L396J734j641p0J436l22k179
1050a804J511L356j672q96L024j797k901J982k92j895J028J335j012k176P8J396
1066g35k169P06L813j164j343K663o37k412J846J885q23p25J331K84m150l6K996
1083A330k712j381L668q68k457Q21Q81p43k87K529J495k469J162K390l893l80
$$ plain form
1099 -914 2614 1287 -620 2056 2132 -1182 -2668 -202 -383 -3496 -980 1648 -2127 -2499 1353 -527
1115 -527 -2477 943 2875 997 374 3081 1879 -1605 499 2824 -1415 -1003 2392 -767 -3607 -921
1131 -921 -705 -3022 -1912 1782 638 -2803 616 2466 -1754 -461 4322 1515 -768 2561 2567 -1126
1147 -1126 -1467 1758 583 -3044 66 1661 -3585 -2958 1172 -1595 -2708 1393 2272 -846 -341 2821
1163 2821 1127 -1829 2081 3970 -933 20 3322 -779 -3246 276 798 -2532 -2135 1144 -452 -4260
1179 -4260 -294 1947 -2202 -685 3563 868 -961 1976 2208 -574 -138 2833 1044 -2117 789
1194 789 1403 -3382 -2023 1347 -1379 -2669 241 610 -1986 -1497 1924 992 -1496 1854 2985 -1023
1210 -1023 358 2926 374 -1390 984 1183 -1145 -1561 446 -678 -3251 -368 543 -2391 -904 1638
$$ packed form
1099i14L528j327j907K676P6l314j486K466j81l113K516K628l775l72L852j880
1115e27j950L420J932j878o23K707j202l484K104K325m239M12L395l159k840K686
1131i21K16k317J110L694j144l441L419J850m220J293M783k807k283L329Ol693
1147a126l41L225j175l627L110J595n246O27M130k767j113M101Q79l118N05L162
1163B821j694k956L910J889m903R53L302m101k467L522N22l330L97L279j596l808
1179d260L966K241m149J517M248k695j829K937K32k782M36K971j789l161K906
1194G89O14m785J359L370k726j290K910L69k596M89L421r32k488L350J131m008
1210a023J381K568k552j764K374J99k328m16K007j124k573K883R11k934J487K542
$$ plain form
1226 1638 -515 -951 1101 1437 -25 436 2379 1360 -1083 1269 1478 -1793 -632 1169 -909 -1813
1242 -1813 -535 -12 -1529 -1741 410 90 -1390 797 1579 -630 434 1828 564 548 1156 1172 142
1259 142 -374 590 -445 -1764 -208 0 -1868 -910 2 -1005 -694 40 356 -7 -58 1446 1288 34
1277 34 1188 1459 -263 433 594 -11 -456 -704 -586 -442 -1453 -245 -451 -1470 -419 276 -796 135
1295 135 619 548 734 596 942 655 255 921 621 -696 -239 180 -1074 -1056 -755 -671 -857 -1062 -360 -186
1315 -186 -909 119 851 -227 822 1159 672 838 527 724 592 -405 403 315 -1287 -396 -277 -1321 -717
1334 -717 -345 -949 -566 -548 462 220 -252 995 1206 -236 982 1564 66 318 816 95 -571 -780 -258
1353 -258 -546 -1777 -414 -336 -1516 -479 425 -460 -129 743 819 370 830 1589 661 10 1257 962 -1037
$$ packed form
1226A638k153m36K052L36j462M61J943j019k443K352K09l271J161J801k078r04
1242a813J278N23j517k12K151l20j480K187P82k209J064J394j264j6O08J6j030
1259A42n16R64j035j319J556K08j868R58R12j007L11P34L16l63n1J504j58j254
1277C4J154K71j722O96J61o05m45k48J18J44j011J208k06j019J051O95j072R31
1295A35M84p1J86j38L46k87m00O66l00j317M57M19j254J8L01Q4j86k05P02J74
1315a86p23J028P32j078J049L37m87J66l11J97j32r97Q08q8j602Q91J19j044O04
1334g17L72o04L83J8J010k42m72J247K11j442J218N82j498K52M98p21o66k09N22
1353b58k88j231J363P8j180J037R04q85L31Q72P6m49M60P59r28o51J247k95j999
$$ plain form
1372 -1037 -201 584 -990 -955 -303 -737 -1191 -1139 221 -402 -1051 1035 1017 -639 882 1748 341 468 1313
1391 1313 903 -234 -191 683 -454 -1818 156 -320 -1951 -600 80 -1281 -865 695 350 -255 503
1408 503 1716 530 -207 1680 1269 -998 493 1365 -752 -696 204 -511 -1575 -980 266 -945 -1553
1425 -1553 685 300 -1358 825 1720 -54 234 1840 785 -403 389 1447 -516 -972 1061 54
1441 54 -2150 -319 502 -1722 -1342 677 49 -1343 111 1554 -195 -659 2078 1010 -878 1249
1457 1249 1772 -833 -659 911 -127 -1545 -296 1024 -1231 -1963 811 -172 -2269 458 1397 -855
1473 -855 -267 1707 853 -870 581 2149 -490 -587 1883 417 -1836 309 770 -1598 -1215 982 -292
1490 -292 -1868 -46 1187 -1219 -1267 1899 877 -1015 1290 1629 -850 -277 1664 691 -957 661
$$ packed form
1372a037Q36P85j574L5O52m34m54N2J360o23o49K086j8j656J521Q66j407J27Q45
1391A313m10j137M3Q74j137j364J974m76j631J351O80j361M16J560l45o05P58
1408E03J213j186p37J887m11k267J491Q72k117N6R00p15j064N95J246j211o08
1425a553K238l85j658K183Q95j774K88J606j055j188P92J058j963m56K033j007
1441E4k204J831Q21k224L80K019o28j392J454J443j749m64K737j068j888K127
1457A249N23k605J74J570j038j418J249J320k255p32K774r83k097K727R39k252
1473h55N88J974q54j723J451J568k639r7K470j466k253K145M61k368L83K197j274
1490b92j576J822J233k406m8L166j022j892K305L39k479N73J941r73j648J618
$$ plain form
1506 661 1620 -1329 -1815 1039 -389 -2369 70 988 -1598 -876 1234 36 -1359 908 1951 -315
1522 -315 -293 2225 417 -1628 863 1212 -1156 -558 1177 -353 -2093 -420 677 -1702 -1148 1799
1538 1799 81 -1503 927 1150 -929 101 2248 944 -675 929 1426 -1325 -1170 1477 -364 -1860
1554 -1860 671 279 -2142 -1228 728 -538 -1461 826 1667 -1009 -114 2168 -87 -1113 1752 1520
1570 1520 -902 130 1210 -558 -1788 15 441 -1761 -546 1301 -981 -1926 521 360 -882 356
1586 356 1810 616 -774 1105 1209 -1161 169 1807 -385 -1230 1092 161 -2069 -740 603 -659
1602 -659 -1351 828 898 -1581 -240 1775 -159 -437 2081 1129 -672 310 1270 -531 -1220 810 616
1619 616 -1388 -360 883 -1378 -1461 535 77 -1286 430 1349 -376 -600 1200 1110 -726 809 1819
$$ packed form
1506F61R59k949m86K854j428j980K439R18k586P22K110j198j395K267J043k266
1522c15K2K518j808k045K491L49k368N98J735j530j740J673J097k379N54K947
1538A799j718j584K430K23k079J030K147j304j619J604M97k751J55K647j841j496
1554a860K531l92k421R14J956j266r23K287Q41k676Q95K282k255j026K865k32
1570A520k422J032J080j768j230J803M26k202J215J847k282r45K447j61j242J238
1586C56J454j194j390J879J04k370J330J638k192q45K322r31k230J329J343j262
1602f59o92K179P0k479J341K015j934k78K518r52j801R82R60j801o89K030j94
1619F16k004J028J243k261q3J996m58j363J716R19j725k24J800r0j836J535J010
$$ plain form
1636 1819 -503 -734 1130 -52 -1463 57 640 -780 -1152 366 -238 -1658 0 1037 -834 -166
1652 -166 1545 354 -558 757 1135 -192 -185 1139 720 -1213 -57 480 -1512 -982 643 -383 -1149
1669 -1149 138 367 -1026 -630 1020 637 -350 1002 1534 -427 -121 1177 164 -751 364 394 -747
1686 -747 -871 417 -502 -1617 119 554 -1056 -260 909 -271 -352 900 869 -93 110 1238 322 -418
1704 -418 294 688 -944 -304 784 -628 -1037 -125 11 -912 -557 642 -216 -928 652 708 -421 295
1722 295 1096 241 3 731 397 -608 -326 541 -358 -1133 89 219 -1132 -297 434 -548 -647 413 470
1741 470 -161 267 998 203 -186 805 892 -560 180 697 -420 -565 100 -296 -865 -415 303 -373 -633 335
1761 335 547 -636 280 817 -13 73 658 500 -142 360 628 -9 -560 431 12 -981 -442 44 -491 -487 472
$$ packed form
1636A819k322k31J864j182j411J520N83j420l72J518o04j420J658J037j871O68
1652a66J711j191r12J315L78j327PJ324m19j933J156N37j992N30J625j026p66
1669a149J287K29j393L96J650l83r87J352N32j961L06J298j013r15J115L0j141
1686g47j24J288r19j115J736M35j610P96J169j180q1J252l1r62K03J128r16p40
1704d18P12L94j632O40J088j412m09R12J36r23L55J199q58p12J580N6j129P16
1722B95Q01q55k38P28l34j005K82Q67q99p75J222J30j351Q35P31r82r9J060N7
1741D70o31M28P31p95l89R91Q7j452P40N17j117j45O65l96n69M50P18o76k60R68
1761C35K12j183R16N37q30Q6N85j58o42N02K68o37n51R91m19r93N39M86n35MR59
$$ plain form
1782 472 108 -544 -166 578 46 -211 913 477 -331 747 776 -160 -38 441 -147 -704 -315 221 -680 -846
1802 -846 174 -29 -984 305 320 -404 77 703 363 -95 424 921 0 -414 506 91 -804 -139 162 -950
1822 -950 -548 51 -159 -407 -215 392 -147 -482 835 487 -250 745 887 -66 -37 543 280 -577 -101 563
1842 563 -721 -1015 240 -290 -1112 167 275 -549 -199 392 290 -346 429 911 174 -60 1163 481 -704
1861 -704 269 305 -420 -375 165 -324 -702 -282 212 -755 -670 635 20 -596 405 578 -180 -6 796 466
1881 466 -411 165 515 -479 -636 601 -268 -1017 -56 112 -662 -472 304 -64 -623 241 791 -97 -398 984
1901 984 544 -410 743 588 -462 -176 426 -58 -934 -157 110 -747 -700 518 -96 -927 351 588 -464
1920 -464 -13 688 399 -456 586 860 -242 -180 749 -89 -677 250 188 -651 -568 173 -283 -786 50 900
$$ packed form
1782D72l64o52L78P44n32k57J124m36q08J078K9r36J22M79n88n57L89N36r01j66
1802h46J020k03r55J289J5p24M81O26l40m58N19M97r21m14R20m15q95O65L01j112
1822i50M02N99k10k48J92O07n39l35J317l48p37R95J42r53K9N80k63q57M76O64
1842E63j284k94J255n30q22J279J08q24L50N91j02o36P75M82p37k34J223o82j185
1861g04R73L6p25M5N40m89l78M20M94r67Q5J305o15o16J001J73p58J74Q02l30
1881D66q77N76L50r94j57J237q69p49R61J68p74J90P76l68n59Q64N50q88l01J382
1901I84m40r54J153j55j050K86O02m84q76P77K67q57M7J218o14q31J278K37j052
1920d64M51P01k89q55J042K74j102O2R29q38n88R27o2q39Q3P41m56n03Q36Q50
$$ plain form
1940 900 -482 -284 878 -24 -339 644 665 -200 -70 664 132 -518 103 447 -1113 -657 367 -317 -1011
1959 -1011 89 255 -560 -294 480 355 -405 482 1071 -244 28 962 -184 -400 505 289 -522 -653 514
1978 514 -205 -909 -59 361 -925 -276 868 -214 -476 615 531 -170 234 862 342 -360 216 696 -470
1997 -470 -268 727 -473 -950 -16 -24 -789 -428 445 207 -661 306 921 -692 155 984 237 -310 706 372
2017 372 -525 -386 294 -284 -824 147 272 -800 -353 281 -289 -280 306 558 -153 156 575 228 -443 347
2037 347 767 -368 -177 744 -354 -798 58 -104 -585 -447 318 -248 -620 -66 278 -510 47 1210 300
2056 300 -119 493 564 -248 -95 621 222 -688 338 110 -674 -520 187 -356 -506 286 287 -387 -424 485 55
2077 55 -109 671 954 -227 30 848 -155 -483 487 302 -465 -262 7 -388 -767 84 404 -542 -52 838
$$ packed form
1940I00j382J98J162r02l15R83K1q65J30P34n32o50O21L44j560M56J024o84o94
1959a011J100J66q15K66P74j25p60Q87N89j315K72R34j146k16R05k16q11j31J167
1978E14p19p04Q50M20j286O49J144j082k62J091q4p01M04O28n20p02N76M80j166
1997d70K02R95j200m77R34qp65L61Q73k38q68R67O15j613Q47Q29p47n47J016l34
2017C72q97J39O80n78n40R71J25j072M47O34n70RN86K52p11L09M19l47o71P90
2037C47M20j135J91R21j098m44Q56j62m81J38P65n66l72N54L44p88N57J163r10
2056C00m19O12P1q12J53P16l99r10J026k28p84J54P07n43j50P92Jo74l7R09m30
2077E5j64P80K83j181K57Q18j003l28R70j85p67K03K69l95l79Q51L20r46M90Q90
$$ plain form
2097 838 -112 -351 257 599 25 95 724 193 -461 240 425 -726 -354 271 -426 -664 25 49 -693 -277
2117 -277 445 244 -273 468 598 -212 128 504 329 -292 525 430 -374 -400 146 -246 -814 198 79 -536
2137 -536 -105 141 -506 -288 97 239 170 251 660 334 -192 241 301 -216 125 267 -306 -359 -19 -111 -562 -392
2159 -392 355 -60 -307 262 -100 -302 206 557 -1 -37 568 452 -96 -60 228 39 -96 160 -49 -556 -356
2180 -356 -39 -466 -363 18 224 -32 -152 482 248 -269 510 449 -113 212 458 -89 -108 162 -67 -363 -254
2201 -254 -41 -172 -550 95 -69 -276 96 237 -130 -43 445 253 103 112 300 10 -148 121 7 -531 -72
2222 -72 -128 -403 -396 -122 -89 -233 -53 185 -42 94 557 45 -49 560 394 -93 183 96 21 -184 -166 85 -236
2245 -236 -264 -202 -311 -238 -16 19 -391 -34 103 15 58 191 327 103 -57 246 28 -367 129 27 -334 -95
$$ packed form
2097H38r50k39O08L42n74P0O29n31o54P01J85j151L72O25o97k38O89K4p42M16
2117b77P22k01n17P41J30q10L40L76j75o21Q17r5q04k6N46l92n68J012j19o15
2137e36M31K46o47K18L85J42o9Q1M09l26n26M33O0n17L41J42n73n3L40r2m51J70
2159c92P47m15k47N69l62k02N08L51n58l6O05j16n48L6K88j89j35K56k09n07K00
2180c56L17m27J03L81K06k56j20O34k34n17P79o1n62L25K46n47j9K70k29k96J09
2201b54K13j31l78O45j64k07L72J41l67Q7M88j92j50RJ88k90j58K69j14n38M59
2222g2n6k75PK74L3j44J80K38k27J36M63n12r4O09j66m87K76q7p5k05J8K51l21
2245b36k8O2j09P3K22L5m10L57J37q8M3J33J36k24j60L03k18l95M96j02l61K39
$$ plain form
2267 -95 -83 -340 -219 -255 19 -262 -257 183 71 48 420 239 156 257 182 215 -81 -44 92 9 -403 10 -326 -390
2291 -390 -42 12 -57 -145 -39 115 -88 -139 172 16 -37 367 241 83 445 105 58 -154 20 -26 -236 -246 -49
2314 -49 -143 -290 144 -51 -275 69 128 28 264 278 334 79 9 156 -31 -356 85 36 -411 -40 -145 -133 -178
2337 -178 -200 17 -186 21 200 192 -46 144 365 43 365 227 89 -128 -94 122 -275 -201 34 -212 -311 -1
2359 -1 -34 -138 49 -31 164 -41 0 255 198 -116 377 21 107 22 279 -176 -190 -92 -63 -481 -245 -18 -380 -370
2383 -370 128 -129 -216 249 121 30 268 190 125 107 38 42 -121 146 137 -123 -171 -88 -191 -264 -158 167 109 -120 191
2408 191 -95 -100 -22 166 92 -67 311 0 -24 184 -56 -102 -239 21 4 -412 -76 14 -169 -206 19 -111 74
2431 74 306 136 60 281 385 266 -40 63 337 8 -233 98 18 -84 59 -172 -116 -323 164 121 -116 220
$$ packed form
2267i5J2k57J21l6K74k81NM40j12k3L72j81q3J01p5L3k96L7J36q3m12M13l36o4
2291c90L48N4o9q8J06J54k03n1L11j56n3M04j26j58L62l40m7k12J74m6k10j0J97
2314d9r4j47M34j95k24L44N9j00K36J4N6k55p0J47j87l25M41m9m47L71j05J2m5
2337a78k2K17k03K07J79qk38J90K21l22L22j38j38k17L4K16l97P4K35k46r9L10
2359al3j04J87q0J95k05M1K55n7l14M93l56Q6q5K57m55j4R8K9m18K36K27l62J0
2383c70M98k57q7M65j28r1K38p8o5j8o9Mj63K67rk60m8Q3j03p3J06L25n8k29L11
2408A91k86nP8J88p4j59L78l11k4K08k40m6j37K60j7m16L36R0j83l7K25j30J85
2431G4K32j70p6K21J04j19l06J03K74l29k41L31q0j02J43k31N6k07M87m3k37L36
$$ plain form
2453 220 276 85 -164 395 71 -61 120 117 141 46 -44 142 -230 62 200 -300 -166 126 -226 -98 -51 77
2475 77 -190 199 293 189 -232 281 310 -32 274 312 -64 -133 123 73 -302 -3 33 -45 -462 -3 -175 -163 52
2498 52 426 -215 -50 352 177 -239 173 336 152 -179 11 12 -532 -50 112 -57 -346 -38 -43 -146 -193 223
2520 223 -9 -99 230 422 -165 -23 289 -144 -331 187 170 -53 -21 149 -148 -495 301 -5 -313 31 458
2541 458 -196 -312 382 278 -122 119 266 155 -316 303 20 -481 14 336 -249 -339 209 2 -285 -149
2561 -149 44 119 -174 257 391 -332 -47 609 -55 -142 213 361 45 15 141 -316 -446 130 -135 -304 -15
2582 -15 189 -240 -227 223 103 -105 32 430 -121 -289 120 148 -134 131 318 -83 -352 97 -8 -277 -223
2603 -223 147 -125 -240 117 295 -330 -25 315 219 29 324 102 -36 -102 170 -108 -293 191 195 -515 -144
$$ packed form
2453B20N6j91k49N59l24j32J81lK4r5r0J86l72K92J38n00J34K92l52J28M7J28
2475G7k67L89R4j04m21N13K9l42L06L8l76o9K56n0l75K99L6p8m17M59j72J2K15
2498E2L74o41J65M02j75m16M12J63j84l31J90Jn44M82J62j69k89L08nj03m7M16
2520B23k32r0L29J92n87J42L12m33j87N18j7k23L2J70k97l47P96l06l08L44M27
2541D58o54j16O94j04m00K41J47j11m71O19k83n01M95L22n85r0N48k07k87J36
2561a49J93P5k93M31J34p23K85O56o64q7L55J48l16l0J26m57j30N76k65j69K89
2582a5K04m29J3M50j20k08J37L98n51j68M09K8k82K65J87m01k69M49j05k69N4
2603b23L70k72j15L57J78o25L05L40r6j90K95k22j38o6K72k78j85M84Mp10L71
$$ plain form
2624 -144 166 -455 -377 84 149 -351 30 294 -62 -390 392 84 71 -11 481 -118 -225 297 34 46 -100 166
2646 166 -126 -252 48 -59 -335 46 416 258 -10 258 295 -296 -26 165 191 -301 217 62 -64 35 224
2667 224 -17 -289 182 -14 -346 -260 167 -90 -205 354 157 -227 182 437 -109 109 245 210 16 31 295
2688 295 22 -291 108 -265 -367 205 235 -191 -155 98 77 -217 -44 202 -215 46 154 163 -292 -47 32 -106
2710 -106 -230 90 -156 -182 -313 87 -162 -104 206 160 139 161 306 -145 -210 191 199 -222 -140 29 -167 -146 71
2733 71 -74 -279 60 376 -125 -118 231 71 -19 -2 284 -19 55 433 31 -96 88 115 -23 -223 235 -36
2755 -36 -165 -7 93 -67 -193 6 53 -107 32 67 78 51 277 32 73 24 44 79 -13 176 -49 -212 76
2778 76 46 -248 -181 -44 -261 -307 -2 11 -239 212 302 -53 5 141 96 -106 -79 24 119 -2 -137 -115 90 -128
$$ packed form
2624a44L10o21P8M61O5n00L81K64l56l28P82l08j3q2M92n99j07N22k63J2j46K66
2646A66k92j26L00j07k76L81L70j58k68K68L7n91K70J91K6m92N18j55j26R9J89
2667B24k41k72M71j96l32Q6M27k57j15N59j97l84M09K55n46K18J36l5j94J5K64
2688B95k73l13L99l73j02N72L0m26L6K53k1k94J73K46m17K61J08Rm55K45P9j38
2710a06j24L20k46k6j31M00k49N8L10m6k1K2J45m51o5M01Qm21Q2J69j96K1K17
2733G1j45k05L39L16n01PL49j60r0J7K86l03P4L78m02j27J84K7j38k00M58k71
2755c6j29J58J00j60j26J99M7j60J39L5J1k7K26k45M1m9K0L5r2J89k25j63K88
2778G6l0k94O7J37k17m6L05J3k50M51R0l55N8J36m5k02K7J03R5j21j35K2K05k18
$$ plain form
2802 -128 -22 -198 -312 102 36 -147 -14 -112 5 199 89 113 201 37 70 -89 -195 158 21 -91 -162 -8
2824 -8 -61 -207 133 -6 -67 215 210 -77 -156 104 -8 -77 53 190 0 -78 -179 186 75 -182 143 23 -82
2847 -82 -97 171 -66 74 25 136 20 205 115 64 63 163 210 -291 -40 -31 -47 -67 -46 -279 -45 -123 -70 -82 -112 163
2873 163 8 -18 172 138 76 -84 127 -59 73 -16 183 21 -204 -96 69 -81 -1 -180 192 91 178 -185
2895 -185 -165 -79 142 172 -1 280 22 93 118 18 174 250 48 -169 -18 -86 -80 -7 -308 -109 -167 -124 -169 43
2919 43 -166 147 -146 293 0 -25 49 -121 -5 123 222 -53 90 -31 -45 -187 -67 105 -195 -100 -35 -70 216
2942 216 176 112 33 69 7 77 24 0 -201 -247 33 43 -35 -200 3 82 -288 53 -62 22 -177 -168 102 248 -22
2967 -22 80 320 -37 208 -98 67 -42 -14 -141 -166 -43 32 127 -223 -34 -34 -281 -31 58 226 -67 -48 241
$$ packed form
2802a28J06j76j14M14o6j83J33r8J17J94j10K4Q8j64L3j59j06L53j37j12p1J54
2824hn3j46L40j39o1K82nk87p9K60j12o9J30J37j90p8j01L65j11k57L25j20j05
2847h2j5K68k37J40m9J11j16J85r0n1jJ00M7n01K51Rj6k0K1k33K34p8N3j2l0K75
2873A63j55k6J90l4o2j60K11j86J32q9J99j62k25J08J65j50Q0j79L72j01Q7l63
2895a85K0Q6K21L0j73K81k58P1K5j00J56P6k02k17J51o8OP3l01J99n8M3m5K12
2919D3k09L13k93M39k93k5P4j70J16J28R9k75J43j21j4j42J20J72l00R5O5l5K86
2942B16m0o4p9L6o2P0n3k4k01m6K80J0p8j65K03P9l70L41j15Q4j99RK70J46k70
2967b2J02K40l57K45l06J65j09K8j27k5J23P5R5l50J89%k47K50Q9J68k93J9K89
$$ plain form
2990 241 -5 105 165 -18 -18 26 -215 122 -126 -77 -139 25 -32 -41 143 -251 -42 -3 64 0 -126 173 230 121
3014 121 181 224 41 54 48 -52 -129 30 -142 46 -57 -106 -61 32 -16 283 -20 210 56 -56 24 195 106 104 267
3039 267 -24 282 -116 -74 -182 -170 -181 -97 52 103 -10 -23 89 -121 -17 64 54 197 104 102 190 -175 133 15
3063 15 -130 185 -48 26 85 -85 55 199 59 -83 337 -58 77 78 -107 75 232 -65 181 77 -9 143
3085 143 -32 68 15 -54 -14 3 -242 141 -130 -34 -94 -53 18 108 243 -29 -58 -51 147 337 -190 -8 124 -249
3109 -249 -194 -229 -57 -1 30 -110 35 -76 22 -39 -59 105 -27 58 191 116 -55 -39 27 1 100 -65 -9 -137 -383
3134 -383 51 9 -101 -235 -41 -108 31 23 -44 -50 99 136 358 124 139 229 -133 59 46 -205 -39 168 1 -268
3158 -268 -287 -248 -19 -65 52 212 -3 153 -6 -84 -93 201 209 86 44 110 -46 -244 10 219 -303 -46 89
$$ packed form
2990B41k46J10O0j83%M4k41L37k48M9o2J64n7rJ84l94K09L9O7o4j26K99N7j09
3014A21O0M3j83J3oj00p7J59j72J88j03m9M5R3m8K99l03K30j54j12Q0J71q9kJ63
3039B67k91L06l98M2j08J2j1Q4J49N1j13j3J12k10J04Q1j0J43r3kQ8l65L08j18
3063A5j45L15k33P4N9j70J40J44j40j42M20l95J35Jj85J82J57k97K46j04q6J52
3085A43j75J00n3o9M0J7k45L83k71R6o0M1P1R0J35k72k9PJ98J90n27J82J32l73
3109b49N5l5J72N6L1j40J45j11R8o1k0J64j32Q5J33p5j71J6O6k6R9j65N6j28k46
3134c83M34m2j10j34J94o7J39qo7oJ49L7K22k34J5R0l62J92j3k51J66K07j67k69
3158b68j9L9K29m6J17J60k15J56j59p8rK94Qj23m2O6j56j98K54K09n22K57J35
$$ plain form
3181 89 -136 -28 -168 -60 47 12 219 12 -262 205 133 -133 101 -127 48 -97 -87 22 -60 -49 28 5 -240
3204 -240 -42 185 -307 -53 -14 55 72 148 147 -54 -84 252 -25 -248 146 331 158 -142 40 35 -217 -227 231
3227 231 -62 -420 80 -7 -77 33 120 -3 61 154 11 22 166 312 -52 -345 -14 -95 -355 -125 -14 -99 -157
3250 -157 -103 -60 -75 76 55 114 -104 191 120 -137 -51 18 27 -107 210 -80 -349 73 213 86 -174 84 60 -64
3274 -64 -36 143 14 -121 207 227 -39 -27 81 -142 -155 323 -26 -295 -53 75 -173 -109 -66 51 -87 118
3296 118 159 7 -220 252 191 53 322 91 -27 -21 121 11 95 135 -69 -240 -172 50 -75 24 -58 11 -116
3319 -116 164 154 -9 22 -157 217 147 93 -19 188 22 -69 32 -101 -73 62 -14 -219 -144 50 1 -42 -41 -254
3343 -254 -28 163 250 147 153 -26 90 72 -17 39 49 -22 98 -50 -193 -149 -124 -313 -20 -6 -164 -153 126 121 -185
$$ packed form
3181H9k25J08j40J08J07l5K07k07k74M67p2k66K34k28J75j45J0J09q2J1P7k3k45
3204b40J98K27m92K54L9O9J7P6jk01l0L36k77k23L94J85j73l00J82nk52j0M58
3227B31k93l58N00q7p0J10Q7j23O4R3j43J1J44J46l64k93L31q1k60K30J11q5n8
3250a57N4M3j5J51k1N9k18K95p1k57Q6O9Rj34L17k90k69M22J40j27k60K58k4j24
3274f4K8J79j29j35L28K0k66J2J08k23j3M78l49k69K42J28k48O4M3J17j38K05
3296A18M1j52k27M72o1j38K69k31j18OJ42j10Q4M0k04j71O8K22j25R9q2O9j27
3319a16K80j0j63L1j79L74p0n4j12K07j66r1J01j33K8J35p6k05P5J94m9m3Jk13
3343b54K26J91Q7j03Oj79J16j8q9N6J0p1J20j48j43M4K5j89K93J4j58J1K79nl06
$$ plain form
3368 -185 62 200 64 7 229 64 -59 157 193 57 -93 -94 -100 -99 -1 143 -95 -35 -34 -61 30 -14 269 83 -189
$$ packed form
3368a85K47J38j36n7K22j65j23K16L6j36j50joJR8J44k38O0Jk7R1m4K83j86k72
$$ [...]
8191A06
##END NTUPLES=NMR FID
##END=
