##TITLE=1H_Ser 5325
 200.13Hz, DMSO-d6+CDCl3.
 8 sc
 
 24.4.2026
##JCAMPDX= 6.0         $$ Bruker NMR JCAMP-DX V2.0
##DATA TYPE= NMR FID
##DATA CLASS= NTUPLES
##ORIGIN= UXNMR, Bruker Analytische Messtechnik GmbH
##OWNER= pz
$$ XWIN-NMR		Version 3.5
$$ Mon Apr 27 15:46:40 2026 Russian Standard Time (UT+4h)  she@DPX200
##.OBSERVE FREQUENCY= 200.131
##.OBSERVE NUCLEUS= ^1H
##.DELAY= (6, 6)
##.ACQUISITION MODE= SIMULTANEOUS
##.ACQUISITION SCHEME= undefined
##.AVERAGES= 8
##.DIGITISER RES= 18
##SPECTROMETER/DATA SYSTEM= spect
##.PULSE SEQUENCE= zg30
##.SOLVENT NAME= DMSO
##.SHIFT REFERENCE= (INTERNAL, DMSO, 0, 14.3821)
##AUDIT TRAIL= $$ (NUMBER, WHEN, WHO, WHERE, WHAT)
$$ ##TITLE= Audit trail, XWIN-NMR		Version 3.5
$$ ##JCAMPDX= 5.01
$$ ##ORIGIN= Bruker BioSpin GmbH
$$ ##OWNER= she
$$ F:/spectra/data/she/nmr/H-C/1/audita.txt
$$ ##AUDIT TRAIL=  $$ (NUMBER, WHEN, WHO, WHERE, WHAT)
(   1,<2026-04-27 15:44:55.50 +0400>,<she>,<DPX200>,
      <created by zg, POWCHK disabled, PULCHK disabled
       configuration hash MD5:
       00 E9 B6 7A A2 85 ED C7 34 08 36 98 17 FE 4E 26
       data hash MD5: 16K
       0C AB 3C AB 2C 81 79 C7 8D E3 5C 1D FA 18 8E 05>)
$$ ##END=
$$ 
$$ hash MD5
$$ 00 89 CC 2E 20 11 4F FC C8 9E 70 BC 39 6E B2 5A
##$RELAX= 
##$RELAX= 
##$RELAX= 
##$RELAX= 
##$RELAX= 
##$RELAX= 
$$ Bruker specific parameters
$$ --------------------------
##$DU= <F:/spectra>
##$EXPNO= 1
##$NAME= <H-C>
##$PROCNO= 1
##$TYPE= <nmr>
##$USER= <she>
##$AMP= (0..31)
100 100 100 100 100 100 100 100 100 100 100 100 100 100 100 100 100 100 
100 100 100 100 100 100 100 100 100 100 100 100 100 100 
##$AQSEQ= 0
##$AQ_mod= 1
##$AUNM= <au_zg>
##$AUTOPOS= <>
##$BF1= 200.13
##$BF2= 200.13
##$BF3= 200.13
##$BF4= 200.13
##$BF5= 200.13
##$BF6= 200.13
##$BF7= 200.13
##$BF8= 200.13
##$BYTORDA= 1
##$CFDGTYP= 0
##$CFRGTYP= 5
##$CHEMSTR= <none>
##$CNST= (0..31)
1 1 145 1 1 1 1 1 1 1 1 1 1 1 1 1 1 1 1 1 1 1 1 1 1 1 1 1 1 1 1 1 
##$CPDPRG= <>
##$CPDPRG1= <>
##$CPDPRG2= <>
##$CPDPRG3= <>
##$CPDPRG4= <mlev>
##$CPDPRG5= <mlev>
##$CPDPRG6= <mlev>
##$CPDPRG7= <mlev>
##$CPDPRG8= <mlev>
##$CPDPRGB= <>
##$CPDPRGT= <>
##$D= (0..31)
0 0.7 0 0 0 0 0 0 0 0 0 0.03 0 0 0 0 0 0 0 0 0 0 0 0 0 0 0 0 0 0 0 0 
##$DATE= 1777290295
##$DBL= (0..7)
120 120 120 120 120 120 120 120 
##$DBP= (0..7)
150 150 150 150 150 150 150 150 
##$DBP07= 0
##$DBPNAM0= <>
##$DBPNAM1= <>
##$DBPNAM2= <>
##$DBPNAM3= <>
##$DBPNAM4= <>
##$DBPNAM5= <>
##$DBPNAM6= <>
##$DBPNAM7= <>
##$DBPOAL= (0..7)
0.5 0.5 0.5 0.5 0.5 0.5 0.5 0.5 
##$DBPOFFS= (0..7)
0 0 0 0 0 0 0 0 
##$DE= 6
##$DECBNUC= <off>
##$DECIM= 32
##$DECNUC= <off>
##$DECSTAT= 4
##$DIGMOD= 1
##$DIGTYP= 9
##$DL= (0..7)
0 120 120 120 120 120 120 120 
##$DP= (0..7)
150 150 150 150 150 150 150 150 
##$DP07= 0
##$DPNAME0= <>
##$DPNAME1= <>
##$DPNAME2= <>
##$DPNAME3= <>
##$DPNAME4= <>
##$DPNAME5= <>
##$DPNAME6= <>
##$DPNAME7= <>
##$DPOAL= (0..7)
0.5 0.5 0.5 0.5 0.5 0.5 0.5 0.5 
##$DPOFFS= (0..7)
0 0 0 0 0 0 0 0 
##$DQDMODE= 0
##$DR= 18
##$DS= 0
##$DSLIST= <SSSSSSSSSSSSSSS>
$$ [...]
##$SUBNAM0= <"">
##$SUBNAM1= <"">
##$SUBNAM2= <"">
##$SUBNAM3= <"">
##$SUBNAM4= <"">
##$SUBNAM5= <"">
##$SUBNAM6= <"">
##$SUBNAM7= <"">
##$SUBNAM8= <"">
##$SUBNAM9= <"">
##$SW= 18.0517599122864
##$SWIBOX= (0..15)
0 0 2 0 0 0 0 0 0 0 0 0 0 0 0 0 
##$SW_h= 3612.71676300578
##$TD= 16384
##$TD0= 1
##$TE= 0
##$TE2= 300
##$TE3= 300
##$TEG= 300
##$TL= (0..7)
0 120 120 120 120 120 120 120 
##$TP= (0..7)
150 150 150 150 150 150 150 150 
##$TP07= 0
##$TPNAME0= <>
##$TPNAME1= <>
##$TPNAME2= <>
##$TPNAME3= <>
##$TPNAME4= <>
##$TPNAME5= <>
##$TPNAME6= <>
##$TPNAME7= <>
##$TPOAL= (0..7)
0.5 0.5 0.5 0.5 0.5 0.5 0.5 0.5 
##$TPOFFS= (0..7)
0 0 0 0 0 0 0 0 
##$TUNHIN= 0
##$TUNHOUT= 0
##$TUNXOUT= 0
##$USERA1= <user>
##$USERA2= <user>
##$USERA3= <user>
##$USERA4= <user>
##$USERA5= <user>
##$V9= 5
##$VALIST= <valist>
##$VCLIST= <CCCCCCCCCCCCCCC>
##$VD= 0
##$VDLIST= <DDDDDDDDDDDDDDD>
##$VPLIST= <PPPPPPPPPPPPPPP>
##$VTLIST= <TTTTTTTTTTTTTTT>
##$WBST= 1024
##$WBSW= 4
##$XGAIN= (0..3)
0 0 0 0 
##$XL= 0
##$YL= 0
##$YMAX_a= 720163
##$YMIN_a= -806174
##$ZGOPTNS= <>
##$ZL1= 120
##$ZL2= 120
##$ZL3= 120
##$ZL4= 120
##$ABSF1= 10
##$ABSF2= 0
##$ABSG= 5
##$ABSL= 3
##$ALPHA= 0
##$AQORDER= 0
##$ASSFAC= 0
##$ASSFACI= 0
##$ASSFACX= 0
##$ASSWID= 0
##$AUNMP= <proc_1d>
##$AZFE= 0.1
##$AZFW= 0.1
##$BCFW= 1
##$BC_mod= 2
##$BYTORDP= 1
##$COROFFS= 0
##$CY= -3
##$DATMOD= 1
##$DC= 2
##$DFILT= <>
##$DTYPP= 0
##$F1P= 0
##$F2P= 0
##$FCOR= 0.5
##$FTSIZE= 0
##$FT_mod= 4
##$GAMMA= 1
##$GB= 0.15
##$INTBC= 1
##$INTSCL= 1
##$ISEN= 128
##$LB= 0.25
##$LEV0= 0
##$LPBIN= 0
##$MAXI= 10000
##$MC2= 0
##$MEAN= 0
##$ME_mod= 0
##$MI= 1.114404
##$NCOEF= 0
##$NC_proc= 0
##$NLEV= 6
##$NOISF1= 3.799351
##$NOISF2= 2.8
##$NSP= 1
##$NTH_PI= 0
##$NZP= 0
##$OFFSET= 14.38212
##$PC= 1
##$PHC0= -4065.765
##$PHC1= 15.19229
##$PH_mod= 1
##$PKNL= yes
##$PPARMOD= 0
##$PSCAL= 0
##$PSIGN= 0
##$REVERSE= no
##$SF= 200.129724274929
##$SI= 16384
##$SIGF1= 3
##$SIGF2= 2
##$SINO= 400
##$SIOLD= 16384
##$SREGLST= <1H.CDCl3>
##$SSB= 0
##$STSI= 0
##$STSR= 0
##$SW_p= 3205.1282051282
##$SYMM= 0
##$S_DEV= 0
##$TDeff= 0
##$TDoff= 0
##$TI= <>
##$TILT= no
##$TM1= 0
##$TM2= 0
##$TOPLEV= 0
##$USERP1= <user>
##$USERP2= <user>
##$USERP3= <user>
##$USERP4= <user>
##$USERP5= <user>
##$WDW= 1
##$XDIM= 8192
##$YMAX_p= 0
##$YMIN_p= 0
$$ End of Bruker specific parameters
$$ ---------------------------------
##NTUPLES= NMR FID
##VAR_NAME=  TIME,          FID/REAL,        FID/IMAG
##SYMBOL=    X,             R,               I
##VAR_TYPE=  INDEPENDENT,   DEPENDENT,       DEPENDENT
##VAR_FORM=  AFFN,          ASDF,            ASDF
##VAR_DIM=   8192,          8192,            8192
##UNITS=     SECONDS,       ARBITRARY UNITS, ARBITRARY UNITS
##FACTOR=    0.0002768,     1,               1
##FIRST=     0,             0,               0
##LAST=      2.2672688,     0,               0
##MIN=       0,             -806174,         0
##MAX=       2.2672688,     720163,          0
$$ Real data points
##PAGE= N=1
##DATA TABLE= (X++(R..R)), XYDATA
0@%%%%%%%%%%%%%qJ6j6J6j6J6k0K8l2L2l8M6n2N8o6Q0q9R7j10J23j38J54j72J92
37A01k11K32k55K80l08L39l75M11m47M89n38N92o52P18p91Q73r68J080j208J358
57G20j540J763k038K388k851L482m376N714p870J1723j9785M2315k05528o30291
71h06174Q64463M43462m67387k62358m2919L78097K12420m03227j55614J99585
81c9652J71125N7371k76960j65609L30298K16842l09506k65261L14928K34753
91B68329l12798j05875J86765j1240K390n032j16402O7534P4242m1345J200p6914
103f9146K1857J61386j02589j11160J33373J2717m1458Q028n7745R1401K7789
114G4453j66824J06317P8205j78962Q9130P2133j60438P7352O0354r3545M6353
$$ y = [0, 0, 0, 0, 0, 0, 0, 0, 0, 0, 0, 0, 0, 0, -8, 8, -8, 8, -8, 8, -12, 16, -16, 16, -22, 24, -28, 30, -36, 44, -45, 52, -58, 65, -73, 81, -91, 101, -110, 122, -133, 147, -161, 178, -197, 214, -233, 256, -282, 310, -342, 376, -415, 458, -510, 570, -638, 720, -820, 943, -1095, 1293, -1558, 1924, -2452, 3262, -4608, 7115, -12670, 29645, -175883, -806174, 58289, 501751, 34364, -227994, -270913, 107184, 319604, -83623, -239237, -39652, 131473, 188844, -88116, -253725, 76573, 293415, -16091, -281352, 33576, 268329, -44469, -150344, 36421, 25181, 27571, 22539, -93863, -26329, 47913, 6568, 7768, -69146, -47289, 114097, 11508, -99652, 33721, 46438, 4980, 13008, -44737, 46664, 74453, -92371, 13946, 92151, -86811, 2319, 74452, -85986, -8634, 51720, -41825, 4528]
125D528k3829j6172J07464q2730n9816J27480k1823q1693P5992K3701r9747L9418
137g227J02697j18989m9209J52555n3227r5473Q1747j054j3175R497o5880O1572
149C834N7617j09457K0213P7714p1133K1101N7625r4977K1149R7345q9531k4174
161c2674P8395m2250l794J2134l6644N4640k2236n4780P0136k1018k3976M2809
173B0742m9607K3636M0994n7041K6274Q785j8934L7312l6091M922L6001m9869
185a2876K2296J4673l6064L0071k3448o009M0183n2182J3612L3922n4190L4341
197D329J0069m2647N2708j6698l5440O3970k5010k8238N4129l5126j3380N4584
209D3250m0459j9397M3544k5513n984K0305l2728J7227J4078l7922L1150L887
$$ y = [4528, -19301, -35473, 71991, -10739, -70555, 56925, 35102, -46591, 29401, 53102, -46645, -7227, 95470, -23519, -72728, 79827, 26600, -68873, 12874, 11820, -1355, 8142, -57738, 3834, 61451, -48006, -27793, 49921, -21212, -111, 57514, -37463, -16314, 81031, -8500, -32674, 45721, 3471, -323, 11811, -24833, 29807, 7571, -47209, 22927, 1909, -22067, 20742, -28865, -5229, 35765, -21276, 4998, 13783, -5151, 32161, -3930, 992, 36993, -12876, 9420, 24093, -11971, 18100, -5348, -11357, 28826, -23356, -9744, 24178, -30012, 4329, 14398, -28249, 24459, 7761, -27679, 36291, 11281, -16957, 37172, 2046, -11334, 43250, 2791, -16606, 26938, 1425, -4559, 15746, -16982, 245, 14323, -23599, 7551, 11438]
221A1438l8814L9282N201k8372J4891L409J5092j6356k0173N0804k3427k8369
233a5394M6693l4186K151L0107n4805L3191J3470n5794N3345r810m3869O0359
245B5458k5480k1620N0112l3464j547K9367k4254J5518r55k0630L0259m880k2808
258d924J1488J035K306m859j8129J7075J0625k7607N640K0997k0750J939K0099
271A4935k0148M612J4638j2207J1799q677n201K8296k6100l461K5807k8983J0616
284E926Q472k6073K3964j6061o045L4906m7958J4123M1302n8550K7574K4895n2304
297b5829M3519M002l9917M1058j2679j2963K9710l0565L023K4183k4901J443K821
310B905l782J0765j5996j366J4774j0215K593J958p745J7795m583j7696K5926
$$ y = [11438, -27376, 11906, 17107, -11265, 3626, 7035, 22127, 5771, -14402, 36402, 12975, -15394, 31299, -2887, -736, 29371, -25434, 7757, 21227, -34567, 18778, 8968, -34901, 25458, -22, -21642, 28470, -4994, -6541, 22826, -1428, 14090, 13135, -7495, 22764, 17884, -4924, 6564, 7599, 9905, 5046, -13083, 3992, 14617, -12990, -7350, 13647, -7103, -5164, 14935, -5213, -601, 14037, 1830, 13629, 4952, -249, 28047, 1947, -1514, 24293, -4690, 5926, 14398, -11675, 12289, -3772, -9817, 25089, -22869, -8746, 32556, -25994, 1580, 26475, -25829, 17690, 21692, -18225, 22833, 10154, -2809, 26901, -3664, -641, 23542, -1359, 84, 2905, -877, 9888, -6108, -7474, 7300, -2915, -322, 1636, -6109, 11686, 7103, -10593, 15333]
323A5333J954k7205K3587M619k5206K3745p321k1196L4487j7824k0916L0063j6656
336b536K324Q245l1600L4532N493l8615L0812m291n581K4463l7856J8501K5760
349B9651m1337K6647k808k9217M9107k4668l0415M4055j9252o061J4079k7498
361a7717K1637R071k6638J3222K86M157Q095k4334J5167J7983k2659M792O310
374I372o639J3011j2001j3428K5307l484k3815J3168J961o094J4060k5839l367
387a7788M6522k7663k9009L7545K356o098o236j4057L6022j549l3871J8063K509
400F746N765L449l8857K5352K2984l4701P203n898K610L2778m5435p314N2553
413B7235k6124j3592J7154p630J8666r229k3925L0821O661k4248O05P859R815
$$ y = [15333, 17287, -9918, 13669, 18288, -6918, 16827, 9506, -11690, 22797, 4973, -15943, 14120, -2536, -212, 8033, -23567, 10965, 16458, -22157, 8655, 4364, -1217, 23246, -14610, 3891, 29651, -11686, 14961, 12153, -17064, 32043, 7375, -23040, 21015, 1763, -4298, 9781, -17717, 3920, 12991, -13647, -425, -139, 4018, 12113, -12221, 2946, 20929, -1730, 3062, 9372, 2733, 15744, 3743, -9685, 15622, 12138, -11677, 1491, 3452, -2642, 11418, -14421, -17788, 28734, 1071, -27938, 9607, 11963, 5865, -371, -14428, 21594, 20045, -13826, 4237, 6746, 12511, 15960, -22897, 2455, 25439, -9262, -2059, -7957, -5347, 27431, -18004, -25318, 27235, 1111, -12481, 4673, -2957, 15709, 6480, -17445, 13376, 20037, -4211, -3606, 4253, 14068]
426A4068q607j9016J5601J0244j7581K01L669k993J1903j0552j3821K7551l789
439F878j8935K0254j0336J899K3456l5840O938L2485l4784P896J4116k5970J9088
452G145l324j1710J6672k2246J1488J4084l1431K3078K93j9002L0157k5066J243
465h619L9229m6949N564L8415l2026O881K613j6723L0498j4570k1788K5477m601
478C401q855J733q43R892j2234k160J5223j2020N610P488k0995J4501J8848k5758
492f169m679K4653o500j4004Q146j73M464j876k3881K1366K1551m2149K282K9906
506A2937j7072q21M603o783P068j212N750j413j3853J6800q64q857J5063j8059
520f713J148K0605k4560R182J1116l1716K0402J6104l2235O895J6508j0209k697
$$ y = [14068, 5461, -13555, 2046, 12290, -5291, -5090, -1421, -4414, 7489, -3063, -16884, 10667, 6878, -12057, 8197, -2139, -240, 23216, -12624, -5686, 26799, -7985, -89, 14027, -11943, 7145, 3821, -7889, 8783, -13463, -1975, 12109, -19322, 3756, 4049, -14953, 15204, -9862, -8619, 30610, -16339, -10775, 27640, -4386, 2495, 5108, -11615, 18883, 4313, -17475, 8002, 3401, -5454, -3721, -4564, 5328, -6906, -9066, 6157, -5863, -253, 7235, -13760, 741, 19589, -6169, -10848, 13805, 7305, -6699, 1447, 1274, 5738, 3862, -20019, 1347, 22898, -19251, -16969, 12937, -4135, -4956, -353, -7136, -68, -1280, 4470, 3057, -10796, 6004, 5140, -3717, 11346, -6713, -5565, 15040, -9520, -338, 10778, -20938, -536, 15568, -16667, -9772, 6736, -3473, -6170]
533f170P52O709L308j1092K817R736m520k433K825q86k450j270P584M041k4282
548a5331Q88L4668k1645j9953K8768j4843m289K6990k5128l477J8871j1692J4244
561H071p161j8960K9953o414j4730J4785p011M296o671o107K6588k6335q896L7183
575A8591l1292r04K8260l1178J3640J0117k7812K7642L28k3337K1290p718l783
588f156K0183j7374p305J1371L686K875j6932k341J9986r595o532P221o938L650
602d201M249q157P809O07j2465J2846O161j5400P080N900j0181P251L26o718Q190
617C297o428k850P640o576M872k861j0683J5571k097r277R693r363M754J1371
631G063j6527Q602M508j6039J7384L564j8490P909L442l309L799n934k102M972
$$ y = [-6170, -5418, 1291, 4599, -6493, -3676, 6060, 1540, -893, 1932, 1046, -1404, -2674, 4910, 8951, -15331, -14443, 20225, -1420, -21373, 7395, -7448, -11737, 15253, -9875, -13352, 5519, -6173, 8071, 910, -18050, 11903, 5489, -9241, 5544, -1467, 2829, -3842, -9949, 16639, -9696, -18592, 18591, -12701, -13605, 14655, -16523, -2883, 7234, -20578, 7064, 7392, -15945, 5345, -2373, -6156, 14027, -3347, -10652, 719, 4405, 7280, -9652, -11993, 7993, -1602, -8134, -913, -7851, -4201, 48, -8109, -300, 307, -12158, 688, 6849, -8551, -1471, 4429, -5752, 1499, 1825, -4893, 3297, -3131, -5981, 1659, -4917, -45, -2906, -13589, 1982, -115, -9392, 301, -9062, -4308, 7063, -9464, -862, 3646, -12393, 4991, 8555, -9935, -2026, 1416, -1893, 1906, -4028, -6130, -1158]
645a158l54m073O71L951n155j197O499j446l76k164j115Q409j168m985n17M798
661F20M597j2924M141J3288j8954L049J1260j4936J2561m918j6480K6671r054
674a079j3808J9978j2995K536J1927j8821J3661M115j6809J3470l923J600O841
687F693k1671J4786J0877k2259J0583j676p412J8598j5741n802J9143j3160N55
700f486R362j0851O001L219o513N544j578r3K594o078M033M083p601R08L469l682
716c669K231j896m832J1097m146j3547J6632J785j4325J1123m039l009J7373j6439
730e661n564J8604o668j649j877n285J5834o908j1378J0818k632L006l852r885
744a3097J9686p195j4567K0262p346n470J3221j3416M723J2040j6554M997Q633
$$ y = [-1158, -1512, -5585, -4914, -963, -6118, -7315, -816, -2262, -2638, -4802, -5917, 2492, 1324, -3661, -4178, 620, 5217, -7707, -3566, 9722, -9232, -6183, 5077, -9859, 2702, -2216, -18696, 7975, -1079, -14887, 5091, -7904, -5368, 6559, -12262, 1399, 5514, -11295, 2175, -1748, -148, 6693, -14978, -192, 10685, -11574, -991, -2667, -10079, 8519, -7222, -13024, 6119, -7041, -6486, 2876, -7975, -1974, 1245, -5268, 276, -1302, -1395, 1199, -4879, -846, 3237, -4364, -3456, 13, -3669, -1438, -3334, -8166, 2931, -1215, -14762, 1870, 3655, -10670, 453, -3586, -6595, 10778, -5661, -11225, 7379, 711, -938, -2815, -8100, 7734, 826, -10552, 266, -2366, 640, -3212, -13097, 6589, -606, -15173, 5089, -2257, -7727, 5494, -7922, -3199, 8841, -7713, -2716, 5917]
757E917q902J882j75j201M580l796l927K757L614j559o039K189N826k495m417
772e746L903P10k452N105k034n603R645k815n858R842q344q37J2746j4240k87
787f265J1846j1039L663J223o881R676m562l235O374o290O772l20r131J2906m340
802C97o669J2605j0075R18R963j4441N962Q295j4374M435O155o314Q40n67n37
817c407L590j130l462J043N319o38n206K010L740j70k933l42J583J273J331n964
833c363j687J1964p800p271J2174o890j073Q442j2606O839P408j4860Q680M377
847D334r022O964l164K86N619r610N367K954o514O395p531J291J1028j5143K069
862d677J0926j1202M619K264q890J0050k95q286O584J161l904K567N54j255l22
$$ y = [5917, -2985, -1103, -1278, -2479, 2101, -1695, -5622, -2865, 749, -810, -6849, -4660, 1166, -1329, -5746, -1843, -1133, -3585, 1520, -514, -6117, 3528, 713, -5145, 4697, -3647, -4484, 8262, -5978, -6265, 5581, -5458, -1795, -572, -7453, 2223, -2339, -5574, 800, -5490, 1282, 962, -8169, 4737, 397, -6272, 6333, -3742, -2824, 7139, -7302, -1340, 6955, -7419, -2984, 3171, -3143, -2303, -2870, -3407, 183, -947, -4409, -3366, 1953, 1315, -3891, -1881, 1859, 1689, -1244, -1586, -3, 1270, 2601, -3363, -5050, 6914, -886, -8157, 4017, -2873, -3946, 4496, -8110, -1271, 6137, -8723, -43, 4334, -4688, 2276, -888, -602, 5017, -4593, 774, 3728, -2786, 3609, -3922, -2631, 8397, -6746, -4677, 6249, -4953, -334, 1930, -6960, 3090, 2795, -5491, 1093, 2254, -1650, 917, 1471, 216, -106]
877a06J292L66j456j72k68J070O12k738j489K865L680p017k023J0355n199l166
893c394P178p367N100N257j3542Q940N346j3570Q411J674o769O176n053P55N344
908D486p622K748M51j046N044r490L214J0116j2177K829N999p648Q121k493r058
923f526J2829o96j0416O842J320l861J825m64j360J677k79k106J959P01k684P19
939e20K122ok474P15L918m048M75N098p585L349N386j0846P269L544j2573R809
955C633J02q342R892n831l787R694o373N33K754m362O026l811j34O548j0530N742
971A754N486j1411Q002K94q509J0502m527n894J0596n606l831O393k626K47Q37
986A707k531O59K216K311m255k572P206p23m142K130j303N86K947k850j750L088
$$ y = [-106, 1186, 1552, 96, -76, -344, 726, 1338, -1400, -2889, -24, 3656, -3361, -5384, 4971, -228, -3394, 3784, -3583, 1517, 6774, -6768, 2172, 7518, -6052, 2359, 4033, -2736, 3440, -1613, -858, 4486, -3136, -388, 63, -983, 4061, -5429, -2215, 7901, -4276, -1447, 4552, -3096, 5025, 2532, -6526, 6303, 5607, -4809, 2033, 3353, -508, 1317, 853, -507, 1170, 891, -1215, 744, 1445, -1239, -520, 1602, 1596, -878, -163, 3755, -293, 182, 5280, -2305, 1044, 6430, -4416, 2853, 6397, -6176, 3633, 3735, -4607, 5285, -546, -4333, 5361, -1012, -479, 2275, -2087, 3939, 128, -6, 6542, -3988, 1754, 7240, -4171, 3831, 4125, -4384, 6118, 1591, -4303, 6293, 687, -3144, 3249, 623, 870, 1707, -824, -165, 2051, 4362, 107, -2465, 4741, 4018, -124, 2006, 703, 1289, 4236, 1386, -364, 2724]
1002B724r69l809N718M99q703M845M451n609L041j442l280Q912l791o470P614
1017C731Q79l402r40p5M597r20m444k27K126N193m282p219P282K375o472L770
1033A972r2l684M298r3j634K953l042l262Q343K03q383L094L001j241J666m684
1049e85m66N865l137j598O27L5L941o304N77O377o722M159J046r296J1188n15
1065E192q774R508o251j500J1744r914k136N951n237O439k194o352O467l319K215
1080A839K937q303O062j98m338J0281q443m310J1913n955p59L755o962N484K622
1095E625p926L437K274j879j277j270L460L10k281m45p16L394J026m605J697J326
1111B150j476J951J130k930j412L328M08j956J396l232l67P174n133l317N228
$$ y = [2724, 1755, -2054, 3664, 4163, -4540, 305, 4756, -853, 2188, 746, -2534, 6378, 2587, -3883, 3731, 4610, 1208, 268, 193, 4790, 3870, -574, -801, 1325, 6518, 2236, -4983, 2299, 4674, -1798, 1972, 1880, -1804, 2494, 2401, 767, 3720, 678, -2584, 5759, 5962, -2421, 673, 3674, 2433, 4099, -585, -1051, 4814, 1677, 79, 706, 741, 4682, -1622, -1045, 5332, -1390, 2769, 3815, -5481, 5707, 5192, -3582, 5926, -325, -1825, 9919, 5, -2131, 3820, -1417, 5022, 2828, -3524, 2943, -376, 1839, 4776, -3527, 2535, 2337, -2001, 8280, -163, -4473, 7440, 1485, 726, 4481, -2481, 3003, 5625, -2301, 1136, 3410, 1531, 254, -1016, 2444, 2754, 473, 28, -688, 2706, 3732, -873, 824, 2150, 674, 2625, 3755, 825, -587, 2741, 3149, 1193, 2589, -643, -1010, 6164, 1031, -2286, 2942]
1126B942l404J159L508n122P61K035j220J809j254o42R30j70K218l132j58M304
1142D564m868m37N040l641k19J412k795K502J725m387N8M007j810k437M001j081
1158A634k751L356j145L57K729n521P19M845k114j463j545J512K345l558J698
1173A098k97l088N929l206k075O770p574N84Q898q673J364L941n774N321m01n212
1189b395N460j925j049J966l139L601j868k518M987m079K66M759o943K505M108
1204C736n946L952R80n583M965J408m677J658M81j008K079q15k348J076J709j046
1220F21j031O13p3k73N65O81k234O42L241l579J8L669l954J374K729n524L641
1237A126K250n593L421N44l674L339p50k004J770j048J512j060p98J821j997K363
$$ y = [2942, -462, 697, 4205, -917, -156, 1879, 659, 2468, 1214, 572, 1502, 1332, 3550, 418, 260, 4564, -304, -741, 4299, 658, 439, 1851, -944, 1558, 3283, -1104, -1046, 2961, 1151, -1286, 2715, 1634, -1117, 2239, 1094, 1451, 4180, -1341, -622, 4223, 2109, 646, -899, 613, 2958, -600, 1098, 801, -2287, 3642, 436, -1639, 5131, -2443, -1859, 7039, -1634, -270, 3671, -2103, 3218, 2817, -2395, 3065, 1140, 91, 2057, -1082, 2519, 651, -1867, 3120, -959, -693, 4066, -2877, -372, 3736, -2210, 1742, 2722, -2861, 2104, 3512, -1165, 493, 974, -34, 2045, 1230, -1118, -42, 1667, 621, -410, 203, 130, -143, 422, 1103, -1131, -489, 2752, -827, -809, 2860, -1094, 280, 3009, -2515, 1126, 3376, -2217, 1204, 1748, -1926, 1413, 663, -1341, 429, -619, 893, -167, -965, 856, -1141, 1222]
1253A222P26n108M063K186n108K406O57k309L219j645k512L786j09l034J374J628
1269A442k544j18K293k126M45J796k553K054L84l053K019J397j136j110J94K660
1285B044k075j434K730k719J878J284n577M823J227o039M907J0m363M361j330
1300b73j101K761k651J031J316j917N69r71K631K0m920L880J504m185K691r97
1316f12j225L815l213j671M432r93l078J724J955j627l61J023j339J801k12l028
1332b609L158Q81l740J285J897r12j492m67K487o70j141O08j456L461n20n428
1348d658N264J211n111L823p57j797L887l401o74L776k751o6R22k46K64j686J744
1365b56M64k334J928n75j125L267l005q97M094k050k042K768n93n48J156r70j421
$$ y = [1222, 1948, -3160, 903, 3089, -2019, 387, 1044, -1265, 1954, 309, -2203, 1583, 1474, -1560, -186, 1442, -1102, -1220, 1073, -1053, -608, 1188, -1365, 689, 1073, -1980, 39, 1436, 300, -810, -616, 2044, -31, -1465, 1265, -1454, 424, 1708, -3869, 954, 2181, -3858, 1049, 1059, -3304, 1057, -273, -1374, 1387, -1264, -233, 1083, -834, -265, -1236, 1395, 1415, -3505, 375, 1879, -2306, 385, -612, -1837, 1978, -1235, -2906, 1526, 533, -2545, -821, 1134, -493, -854, 169, -1170, 631, 419, -2609, 549, 1430, -2310, -1025, 872, -40, -1532, -1999, 488, -182, -1323, -715, -2171, 1290, 770, -4658, 606, 1817, -3294, 529, -228, -2025, 1862, -1539, -2213, 1563, -1188, -1254, -332, -578, -314, -2000, -256, 208, -2126, -198, -773, -1898, 1369, -1636, -2533, 1561, -489, -2531, 237, -356, -904, 252, -718, -2139]
1382b139K781k08l233K329R26k686K263r87j394K303m28j225Q95j7L59r49P21
1399f89R84k486K314M86l655L535q49k266M398l421j551M836k801r58K364k218
1415a977J438K39j247P79r6M27j82j334K550j565j371L448k015j284L011j880
1431a059o70K498k496j90K906k379j237L186j021j790J858n69j75J396j928J98
1447a472J776p40p53p6J016J98k148K231j59k294K721j574q43M055m291l10M693
1464B030m284O46K853l732J631O89j398K200j447n09R27m14J569k295j195L976
1480A247k790R7K155l770K578J387l599K175K90k167K163k44q73O7P93M43j277
1497a325N26N96j382J929j227j369L650j737k063K282n16k2J79j025J2M54J444
$$ y = [-2139, 642, 434, -2799, -470, 456, -2230, 33, -954, -2348, -45, -473, -1698, -803, -820, -461, -1410, -689, 295, -2191, 123, 609, -3046, 489, -360, -2626, 1772, -1649, -3200, 1636, -1165, -2123, 241, -1977, -539, -300, -1547, -768, -864, -437, -619, -1953, 597, -968, -2339, 1109, -906, -2190, 821, -1059, -1729, 769, -1727, -1917, 989, -1390, -2627, 559, -462, -2252, -394, -963, -1138, 258, -1670, -1472, 304, -436, -1189, -1265, -249, -51, -2199, 32, -127, -2421, 300, -1274, -2117, 1938, -2353, -2663, 2030, -2254, -1608, 1245, -2487, -856, -167, -1565, 635, -812, -1321, -394, -808, 761, -1534, -2729, 1247, -1543, -1446, 709, -3061, -483, 904, -2695, -520, -230, -2397, -234, -478, -1351, -1284, -491, -48, -1325, -799, -203, -1585, 344, -883, -2252, 1398, -339, -2402, -120, -636, -658, -479, -1504, -1492, -1038, 406]
1514D06o73j752J355m46N13J778l293l57L922k159m16J026j849J634J518k793
1530a586K7J609p70n69R21k04r30J204L60j596M48J584p45n76K93l93N98J397
1548A072k603j031L991j305j569J706k768K151K535m449R80J729k440L102r38
1563A63j877J344m37J413k00k985L037p36p68L236m624Q13M290n078K017J807
1579A415m230L661q98k745M290j760j119J826k191K141L7j296J395k486J268L136
1595B444m210J293J048k716L830j063l563L083j74j261K304j635p68J087N04j12
1611I1m80m75Q08J33O58j252r31K255o79j026J408m11j098J225o46m08J814j280
1629b94j498K599oj894Q18N51j180J038L39p35O0M09n62M22Q40j244o13J497n89
$$ y = [406, -267, -2019, -664, -1110, -597, 1181, -2112, -2469, 1453, -706, -1122, -96, -1945, -311, 1207, -1586, -1559, 50, -720, -1289, -368, -572, -1502, -298, 62, -1534, -1086, 498, -247, -823, -530, -923, -325, 1072, -1531, -2562, 1429, 124, -1445, 261, -2507, -356, 2179, -2270, -1290, 439, -2001, 1101, 163, -1714, -370, -807, 606, 406, -2579, 458, -278, -1046, 2190, -2434, -1621, 2669, -2409, -392, 1415, -2815, 846, -52, -2797, 1493, -267, -1386, 440, -1751, 390, 427, -869, 526, -1960, -692, 2444, -1766, -473, 575, -2141, 1689, 626, -2937, 146, -28, -1289, 1015, -620, -1388, -301, 203, 91, -389, -864, -56, 77, 735, -517, -1448, 807, 128, -898, 510, 99, -999, 226, -420, -828, 986, -294, -1792, 807, 801, -1093, -275, 276, -904, 134, 473, -262, -202, 207, -355, 67, 907, -337, -950, 547, -42]
1648d2M9R58k174O23J710j038m98J34R7J61L96R6j572J209J475k660J262J538
1666A724l037J119J851k541J854n00j673K696j024j629J807o95O42r82o9K084
1682A627j816m53J019j226K749j052l710M709K7l333K958j243j083K428j859J38
1698a20J305j835N97Q75p3o79j093K083L32k237J360j19k88J391j986K67K384
1715B164k231q51K456o40j109R62o61j88J220n49r64J392l78j250J575o3j080
1732a95Q6J146K38j320j07R44l48L99o17r37K360j096j443K349j038q13J839j349
1750I8j99J363j501K10J128n88p61P25J140j671n58K064q08o45P34o40N80P90
1768A461j847J98J522q05o9k0j02R3K57k70q63J752n20j453K348q83j253J811
$$ y = [-42, 7, 965, -1209, -586, 1124, 86, -412, -278, -181, -20, 376, 472, -1100, 109, 1584, -1076, 186, 1724, -1313, -194, 1657, -884, 970, 470, -1203, 1493, 469, -1160, 647, -48, 594, -388, -457, 1627, -189, -642, 377, -849, 1900, 848, -2862, 1847, 1874, -1459, 1499, 256, -827, 1601, -258, -120, 1185, -650, -53, 822, 749, 70, -1023, 1060, 1392, -845, 515, 396, 108, 1499, -487, -220, 2164, -67, -918, 1538, 898, -211, 751, 90, -98, 1122, 573, -391, 1001, 623, -627, 948, 885, -195, -109, 1037, 1275, -45, -152, 792, 444, 843, 226, -711, 1649, 553, -890, 1459, 421, -392, 1447, 98, -101, 1262, -239, -29, 1099, 511, -250, 475, 1615, -56, -614, 1450, 642, -3, 731, 91, 671, 1461, -386, -188, 1334, 529, 460, 440, 338, 431, 688, 418, -445, 1307, 787, -666, 1682, 799, -454, 1357]
1786A357o57j196J341k29k25L52l14M37m78L55Q0j413J683l41j142J834j250k13
1804a9J696j545l00J482j748Q71O60j251R34M06n24p96Q59O91j704O05J238j599
1822d4K12J084j151J27J115j104q9J031q80k67R63j94r12Q50o1l81Q31j289J63
1841DJ875j602q06J637o51l61N70m37n9K66O26r25j25J566j354m04K258k508K07
1860b23J846j318j58P57q74Q12j70j000J077K76o00n96Q10L54r65N32L45j106
1878b01J374l64j333J637m1j534J350J90j164l7J446j023n75J102J05p65J101
1895A268j485O5J758j604J42Q20r06N40k17j87N76Q1l96l78O70j2j164Q89J163
1914A623k380P34J385j752M85J105j764J336mr82O48P03r87j16N82J67m46j54
$$ y = [1357, 700, -496, 845, 616, 391, 743, 429, 866, 388, 743, 823, -590, 1093, 752, -390, 1444, 194, -19, 1677, 132, -168, 1314, -434, 437, 1097, -154, 780, 1186, 662, -134, 725, 1416, -288, 317, 1555, -44, 168, 1252, 101, 228, 1343, 239, 150, 1181, 301, 34, 997, 803, -109, 741, 680, 299, 1130, -159, 4, 1879, 277, -529, 1108, 457, 96, 666, 229, 170, 436, 1062, 137, 12, 1578, 224, -180, 2078, -430, -223, 1623, 305, 147, 904, 30, 842, 672, -328, 749, 1025, 425, -171, 639, 993, 28, 560, 905, -201, 1173, 809, -524, 1113, 1072, -462, 888, 1078, -86, -123, 1323, 300, -275, 827, 932, 167, 1268, -217, -152, 1606, 2, 144, 964, 58, 598, 381, 194, 770, 851, 455, 77, 747, 735, -429, 460, 1623, -757, -23, 1362, -390, 95, 1200, -564, 772, 768, -214, 434, 1137, 150, 34, 616, 783, 337, 183]
1932A83K05l35M87m77o0O99l29q44J150J45j304Q61O67j543Q54J090j576J49J080
1951A102j588Q10Q41j476N72N49o16M71q46N27M3l39M65qn38P78j192J015J39
1970G09j902K059j16j817J724k1j224J504p55n36J099m33l79j31N79M41j319P65
1988B47K59j133J643p66o37J347j093M58N44j456JJ489o47j20k62k21M77M24o0
2007D94j434L78J794j689pJ556j468K41R10j276N51M29m72J15j3m0o8L9J22p08
2027e46P07M06o37Q5J67o07J261l59j557J391M36j252Q72l70j318K107j66q85
2045b65k24L13M46j80j46o6J03J89L13r71J43P89j423J011M22j562J438n9j455
2064a184K065j044q26J912j202p30J560l72j71k01o33J213n52K2J36j217J755
$$ y = [183, 388, 53, 540, 63, 3, 702, 373, -471, 679, 824, -480, 381, 1048, -495, 359, 1449, -127, 22, 1102, -486, 324, 1165, -311, 261, 810, 194, 665, -181, 346, 389, 50, 515, 507, -31, 747, -445, 570, 709, -1193, 866, 750, -1067, 657, 636, -588, 916, 161, -375, 724, 291, -88, -219, 360, 801, -518, 247, 506, -627, 1016, 250, -387, 960, -133, 325, 869, -587, -586, 903, 256, 136, -126, -347, 130, 554, 494, -940, -562, 1232, -457, -464, 1092, -376, -135, 775, -501, 50, 479, 7, 122, 109, 69, 1, 40, 162, -546, 161, 567, -70, 15, 182, -425, 836, 477, -1080, 311, 747, -505, 367, -3, -1321, 786, 620, -265, -489, -176, 270, 90, -56, -122, -19, 170, 483, -488, -345, 444, -979, 32, 454, -1108, 330, 271, -1184, 881, -163, -989, 923, -279, -1009, 551, 179, 8, -193, -826, 387, -165, -143, -7, -1224, 531]
2081E31m5j540J374l91r50K103j605o29J424q98R00J59j519Q32N46n83L42p29
2099f78J094o10l71Q94o59l34J245j220J51J170j889N53J098j042O8Q54m44l53
2117d73J69L12J73n7o55J41L94k3q44P75J13m53J75N21r08M44M76q21M71L88j389
2138a071N71R16r54k29N50j70P3M7l06K52K38K00p23N46L75j414P61P92j267Q25
2158A2q2o93Q81k68p84J622r79p52P71K28Q1q61R4P57o01Q11n59r39J700n94n67
2179g22J073j125k1J651j284j0L19n63O18k75l58M63m54O28l25m65J244q90k26
2198g22J334j409N9J266j512J62J179j369R35j0q97N91L27K3l37l33N31r8N7j6
2218b39p25O92M32p61L26l2n44Q01J1p23L25Q11j038L00N00j068L90P33q79j07
$$ y = [531, 486, -1054, 320, -71, -1021, 1082, -523, -1152, 272, -626, 274, 433, -1086, -254, 292, -291, 51, -678, 416, -194, -565, 329, -330, -664, 581, -639, -488, 682, -1207, -654, 444, -598, -530, 324, -120, -473, -304, 8, 181, 124, -531, -390, 4, -19, -863, -88, 25, -428, -253, 268, -640, -196, 280, -541, -70, 318, -1071, -500, 416, -538, -767, -217, -387, -314, -267, -573, -321, -83, 117, -606, -60, 315, -1099, -338, 454, -813, 12, -70, -763, 118, -150, -934, 688, -291, -1043, -272, -44, 37, -824, -730, 27, -574, 237, -322, -1261, 439, -155, -722, 351, -774, -795, 856, -428, -438, -119, -682, -64, -339, -697, -234, -688, -60, -385, -850, 394, -496, -722, 612, -797, -738, 528, -984, -822, 357, -1012, -77, -87, -984, -393, -66, -43, -380, -713, -182, -280, -223, -239, -964, -272, 160, -601, -275, -307, -851, -50, -39, -762, -437, 374, -664, -364, 136, -932, -542, 191, -688, -795]
2238g95P15J29m39K02k78J62K0Qo0K62r9m68M81o8m91O60M23j374Q88J28j91L73
2260A88m10n87P74K78p44k64Q62l09p67R79m53n7L74j62m66O01q7k49M88k77j99
2281d87J63M77m05k87L87k2j81N48j036R42M68j377J32J029r06Q2L67j97N0Q6
2301a67j45p0K1N05q13N78K36j055Q28N2m72M30J27p69Q18l48m72P20O6n93N6
2322d67N01l86k33N15m30L58J04Lo29Q38n84j19Q09j95p12N84R6m69M5L64m33
2343d40L56N1n81O99j19n22L58L93n26K39L7k09Q7L00j82k27K24k1j87L79p8q85
2365h54J046J18j223R33J40k23K04n23j55P56j96l73K80J91l37L7L37l34J84L83
2385C91o66k08O52n18M10L45o63J01J85j10j18N6L00k70K51l53l81Q90j23p57
$$ y = [-795, -80, 49, -390, -188, -466, -304, -284, -276, -336, -74, -173, -641, -160, -228, -719, -59, 364, -1010, -122, 6, -185, 188, -222, -809, -35, 243, -501, -765, 97, -212, -979, 0, -453, -510, -136, -298, -764, -163, -250, -499, -11, -288, -487, -324, 153, -252, -539, -152, -174, -355, 193, -843, 99, 567, -810, -678, 351, -555, -473, -106, -303, -253, -167, -312, -382, -361, 144, -669, -91, 145, -910, -82, -30, -502, -72, 55, -714, 104, -244, -716, 4, 70, -523, -467, 34, -352, -585, -70, -500, -142, -38, -35, -664, 174, -410, -529, 280, 85, -627, -43, 53, -416, -371, -7, -440, -84, -33, -614, 85, -34, -556, -198, 195, -331, -92, -55, -264, -177, 123, -59, -286, -62, -83, -270, 109, 31, -854, 192, 310, -913, 20, 160, -63, 141, -382, -537, 219, 23, -350, -70, 121, -216, -179, 158, -176, 8, 391, -275, -483, 169, -349, 61, 406, -257, -156, 29, -81, -199, -143, 157, -113, 138, -215, -596, 294, 171, -586]
2405e86P46K65q64M82J48n33M84k52J63K09j22k75Q6M15l70NK85j41l38M40k96
2426d9j86K92l7k70M31K20p14J017p91l2J20n7j40K17j12k89N27K38o19K53J66
2447A85m11p1N65l14N0O04o36K14J41l71n41J122o82k23R48n43l77N91m48J62
2467c5K82l89L83m96K53L03j01N2k47j58P79p98l81R17m62R0L06n59L15K85n35
2488a96L85M1k65J42J58k7m95J39M43m18J6Q86q79K19O1n54O20K94p49M15kr3
2510A41J43M7l18j18M79j7m19L44J8l05O01l29p41P00q9j16N02m46J36M27m49
2531A91l77K16K79j03N9r6n39M68P0j96J74K48j78K93o5n50k20J061m45o25P55
2552D20l11K35P5l68j58O85m95p7K65K6k02L34Qm23k65O78k17J34K83p81L01P56
$$ y = [-586, 160, 425, -439, 43, 191, -342, 142, -110, 53, 262, 140, -135, -49, 366, -4, 1, 286, 145, -193, 247, -49, -235, 57, 20, -250, 181, 401, -313, 704, -87, -119, 1, -56, -196, 21, -91, -380, 147, 385, -234, 19, 185, -226, -297, 268, -46, 4, 608, -28, 186, 327, -44, -585, 537, -145, -368, 580, 37, -340, 251, -197, -35, 247, -142, 241, -255, -2, 301, 200, 252, 5, -153, 626, -172, -553, 364, -98, -8, 298, -261, 54, 339, -196, 189, 230, -35, 107, 265, 238, -257, -118, 325, -93, -77, 809, -70, 149, 210, -344, 276, 570, -179, 236, 234, 141, 284, 331, 13, -105, 374, 357, -62, 282, 300, -5, 596, 267, -474, 226, 137, 21, 523, 77, 213, 640, 191, -186, 30, 309, 206, 265, 169, -370, 98, 168, -28, 146, 394, 216, 509, 444, -106, -326, 735, 290, -335, 420, 109, 344, 419, 51, -107, 578, 83, 6, 271, 297, 95, 429, 437, 14, -251, 427, 210, 344, 627, -154, 147, 903]
2574I03j112l8Q69q33P40l94l86O40k53k65M83j29J59j89l66R05r12Q8P66j009
2594c33P91J28p55P22m44m42O73ln68M72j31K88M8l41L49l96K77J45n11L55Mm49
2616a21Q26k75p32P00k65l27O86m26j19M26q9k35J5J8K35l01K02J8m45P94k25
2637C60p81J114n87J92L68q57Q7P40q35j8O26k07M1p8j60l9K71J25k53M0L6l60
2659a75K05N82q55J16M29p2N6P4k83L42j77j43m8J58j14q3K42k19M21m69M44k77
2681A54l8L18n58M83j12n69L78L57n37M19K25n32L66j34K5R7j09K40m96K81j51
2702A07j34J24P1j01J35J92m89K74j71k61Q34n55n13J006l38m23L58Q4q0L08l67
2723F1j5K33j10k80K91K26n32K68J70p8j99K45j97j28M30n99L50K97l62k84N19
$$ y = [903, -209, -247, 622, -211, 529, 135, -251, 389, 136, -129, 354, 225, 384, 195, -171, 734, -178, -90, 676, -333, 458, 586, -169, 553, 109, -333, 340, 337, -231, 241, 110, 398, 446, 105, 454, 58, 335, 480, -31, 324, 328, -121, 705, 430, -302, 398, 133, -194, 492, 66, -53, 373, 284, 49, 64, 82, 317, 16, 218, 236, -209, 585, 360, -421, 693, 106, 298, 666, -191, -104, 636, -199, -217, 409, 202, 243, 165, 5, -34, 237, 362, 109, 149, 185, -175, 30, 612, -243, -127, 302, 230, 286, 360, 77, 419, 242, 99, 51, 209, 95, 12, 254, 35, 456, -13, 431, 154, 116, 434, -124, 359, 247, -322, 56, 413, -124, 295, 520, -12, 354, 220, 245, 342, 233, 473, -23, 258, 107, -27, 97, 168, 67, 202, 394, -95, 179, 8, -253, 581, 26, -487, 519, 181, -242, 116, 200, 120, 428, 61, 46, 279, 169, -111, 180, 406, -126, 142, 312, 234, 35, 280, 83, -45, 385, -214, 136, 433, 71, -213, 306]
2744C06l96k0JJ64k28L82l3r1l03M23j51j71K94k27k27O28r1p6J78k04l3%l47
2767b22L45M8j28J3Rj01J16qn2j24J02J30k32J70K55p1j65K20l10NjJ85l38O60
2791E06m83Ok58K57o1J95O5n31R73o03l71L29K24m34N84l32j75K74j96K40Q6l60
2813f5J72k99L39p2o2j22J32j42L80l83l2L97l09p3P0M5m12N85j33r7J57J53o73
2836d44K45K20m89O63l2m34N14j26j47k14M41k04j73L9N6k93N62j40k55O51o94
2857b54K42J35k16N5K19o01O4L86o3m4j02K03l78M62P7l97L50J45n84J68J17o0
2879g6R1q2j27K88J73n18J57o8j05J20J47K28l23Q9j13p7K40k1m56L72O9k12J96
2902hN5k14J31j08N4j07J50l98K67J67k13L3M32m40L10q0p1p1L87n78K75O7k24
$$ y = [306, -90, -110, -109, 55, -173, 209, 176, 85, -218, 205, 54, -117, 177, -50, -277, 351, 260, 184, 362, 158, 125, 125, -222, 123, 171, 43, 56, 65, -36, 80, 72, 20, -104, -2, 128, -104, 66, 321, 250, 85, 305, -5, 0, -1, 184, -154, 506, 23, 29, -229, 28, -33, 162, 227, -304, 669, 66, -305, 24, 248, -186, 398, 66, -109, 165, -31, 209, 295, -65, 107, -192, 147, 75, 13, -109, 23, -119, 261, -122, -154, 243, -66, -139, -69, -24, -436, 149, 16, -81, 76, 229, -444, -199, 21, -468, 195, 163, -271, 243, 117, -30, -244, 197, -7, -180, -141, -85, -378, 184, 44, -211, 440, -254, -12, 123, -93, -38, 181, -420, -356, 30, -33, -77, -179, 24, -354, 108, 185, -212, 138, 283, -301, -133, -16, -76, 15, -67, -194, 94, 267, -251, -94, -162, -267, -147, 0, 228, -95, -6, -119, -196, 44, 23, -433, -61, 8, -204, -8, 47, -167, -36, -144, -90, -197, -47, -445, -178, -11, -224, -191, 241, -199, 111, 31, -40, -111, 276, -302, -27, 40, -184]
2925a84Q8K58k18l79N29k66PK0n2M29l46RJ12l50O74o60L70L2n3l21K56J26m1
2948D0lj65j58L42j50j89L65k23P1J32j98o9Q4N2k16L71j01k45K56j53k04M49
2970H8j56j45J66j41M5K36k44N5K00O5k04n9j31K61j17J79j32j13J70j69r4K54
2992A4l00lM70n58M15O3j7q7j36L4L24l11n5K76l89L89n93K82L12l14J21nn60
3015f28K55M62k29J88j60J15m0j38j07K11j62J67k26M9L78l26k6q2j17l76O68
3036a24M37j21r4K0m04K42Q66q39k90J591k050K28P48O40j315L24k2N79k03j252
3056a039J208k28l46J31l57O61j37j7l94J050l84o02K47p2J42m10J030k59K04
3075D28p82L2Q8K37M40m63O21p85JN01l41M7Ln0M46k01r59J175l5m28K32M90r43
$$ y = [-184, -96, 162, -56, -435, 94, -172, -165, -145, -197, 232, -114, -105, 7, -343, 331, -329, 41, 73, 20, -301, -45, 81, 40, 37, -128, -286, 56, -94, -283, 82, -141, -70, 62, -136, -205, -121, -69, -285, 86, -15, -260, -4, -157, -361, 88, -68, -213, -47, -188, -143, 93, -151, -96, 104, 169, -35, -94, -225, 36, -81, 98, -34, -147, 23, -146, -240, 14, -286, -289, 181, -377, 38, 101, 84, -3, -139, -105, 219, -92, -147, 129, -260, 129, -464, -182, 130, -184, -63, -68, -628, -373, 89, -140, 48, -112, 3, -37, -175, -282, -71, -233, -66, -292, -243, 135, -191, -217, -299, -416, -792, -124, 313, 192, 98, 118, -286, -44, 822, -17, -307, 1284, -766, -538, 210, 850, -465, -141, -163, 416, 213, -1039, 169, -59, -405, -274, -631, 30, -107, -124, -518, 532, 148, -454, -207, -279, -137, -547, 483, 224, 428, -354, -322, -234, 3, 443, -20, 601, -184, -183, 318, -23, 24, 27, -23, 423, 222, -737, 438, 403, -25, 207, 697, -246]
3098b46K86m53O96m85L61n67Q9K09Q7k74M19m5k05J21o2q8K45K52m66L7j12J37
3120f4k03m7L04k42K17j7qK00J7n32K61K63l95O1K1P3K22j21l33J64l3K49Ok28
3144a65J13k02M23k90j98L14J83m11J18r9J83N6N7n60K09K72k12K74Q2m91K96
3165d8J30k84J73J3J01j19j13L12j14K86n25qL65k52Q7K8l52J74L32l30J62k11
3187a93L66r3l2J58j41k4Km01K76K49m56L90k0k83j40L15k16K67P5K7R3l96k4
3210b01M12k82L5L03m82K66l5J74j86l74M67R7k66j60J31j20J82k9M9jk9n3J51
3233D9j9m0l46L06k36J49J96Q0j18q2M29n11L10J00l91J14k7j12K86j32m3J7m5
3256f6j48L05r2k06J83J03j81J33J87j22r4J00j8r7O8M7j32Q9j88r4R5J81J9J33
$$ y = [-246, 40, -413, 283, -202, 159, -408, -319, -110, -23, -297, 122, 77, -128, -7, -69, -157, 88, 340, -126, -89, -201, -64, -267, -314, -10, -252, -35, -52, -60, 140, 157, -375, -114, 149, -246, -185, -164, -91, 131, 10, -323, -159, -192, 57, 63, -165, -52, -254, 169, -121, -319, -5, 178, -233, -115, -214, -31, 25, 82, -478, -269, 3, -209, 65, 147, -344, -48, 82, -202, -29, -16, 85, -34, -147, 165, 51, 337, -188, -196, 169, -83, 4, 32, -320, -146, 186, -144, 18, -193, 173, 80, 48, 206, 65, 41, 43, -358, -82, 167, -289, 101, 81, -202, -342, -27, -243, 24, 99, 126, 219, -177, -201, 211, -71, -36, 267, -215, 51, 16, 190, 4, -370, 97, 194, -72, -232, -101, -221, -39, -68, -19, -20, -49, -102, 49, 30, -10, -356, -50, -286, -137, 59, 139, 21, -61, 368, -143, 167, 267, -124, -10, -37, -149, 137, 5, -38, -21, -66, -214, 91, -1, -207, -24, 79, -102, 31, 218, 96, 2, 102, 84, -13, 55, 102, -30, 59, -129, -223, -128, 53, 72, 205]
3280B05j06o4j62J10R2r6J62k86K86j43l3J99k60P9L18m06K03k42J71J78j21j42
3302e8O6L5K1M6j95k9j29L23j24J64l00j65N97k6j86J08p5J08k3k67L15k37O2
3325C1k32J12j9J87Q2p4j33J42k56N1L66k35r9L30n3m7Q7l10k03K17N6Q8n16L66
3349f2J47O1j00M8pj83j78N32k77Q0k03L41l30J3J88K5n8K13k89J43Qm3j8M5Q2
3374A78n43M46llj75N35l58k33J16j49L99j35J06n48L88K73l13J41k80L07m05
3395b56L36j59k12J63J39K21o51O80l22J93j62J37n3j86L21j10J14j82K29l16
3415g6L1Q7r0J04k69N4L78k82K43J41%J33l51k25j21L19j96O1K07j12j50J36Q1
3438A03j53Q1k06K72K64m95L36l79K46K6r6J61k85j93M83j51J60k30J24M4j99
$$ y = [205, 99, 35, -127, -17, 75, -21, 141, -145, 141, -2, -35, 164, -96, -17, 301, -105, 98, -144, 27, 205, 84, -58, 8, 43, 64, 110, -85, -114, -243, 80, -44, 120, -180, -345, 252, 226, 40, 148, 73, 181, 158, -109, 206, -31, 31, -201, -89, -108, 79, 161, 87, -46, 96, -160, -109, 257, 22, -77, 253, 200, 153, 240, -70, -273, -56, 0, 88, -428, -62, 85, 146, 46, 94, 87, -96, -274, 258, -19, 61, -142, 199, -131, -118, 70, 95, 37, 250, -39, 104, 112, 69, 51, 96, 178, -365, 81, 78, 75, -100, 435, 77, -156, -40, -189, 210, 75, 181, -367, 21, 294, -19, 122, -158, 149, -256, 80, -79, -291, -128, 11, 232, -419, 261, -61, 132, -30, 107, 54, -132, 189, 79, 193, 11, 240, -76, -45, 42, -48, 56, -213, -159, 219, -63, 180, 321, 321, 454, 103, -122, -243, 76, -120, -59, 148, 36, -114, 22, 103, -50, 31, -175, 97, 361, -134, 202, -177, 69, 95, -1, 160, -125, -318, 165, 14, 174, -56, 68, 112, -87]
3459h7P6j01M0N4L93m21M8o5K36kJ35j68j39j1O7J89j11l00R4M74n54m2N30k31
3483A04N0mj21Q0j36k80M96m4j25l16K13K28l23R9K15k10J47l4j86K16K16o49
3505c64N29o2k64K49j67Q4j22J2L09j66j4J50j81O6j53K10j20Q9K04j07m48M20
3527A54J61m28K63j45l5K16l33nJ96qk39L00q8l7R6M8j69L1J49m0l8Kpj86L61
3552B19q7l09N93m16K1k1j5L03o65K52J08q1N5m8K45P3j37M2K06k76n7K46k33
3575A8k42J97mJ41Pk25K38j49J60O4k29P8p1J22l8j07J30k25M1R0J77n50N47L5
3599B05k51J03m0RJ04k15K67j93q5l6K94l50R3K69j1j27K0k07L61j47k94K76J05
3622A50j48J5j83L14j34j82L24k76J52J21m8q2L6J35rk31J31O7p6J48o48N03l11
$$ y = [-87, -11, -112, -72, -18, 375, -46, 2, -63, 173, 171, 306, 138, -1, -12, 55, 244, 133, -167, -73, 401, -153, -195, 335, 104, 154, 150, 29, 109, -27, -307, 189, 145, 20, -296, -83, 145, -178, -79, 136, -74, 73, 39, -147, 69, 285, -364, 165, 103, -161, 88, -79, 5, -117, -105, 204, 38, 24, 174, -7, 59, -94, 116, -4, 85, 289, 182, -266, 154, 315, -113, 150, 5, -30, 186, -147, -152, 44, 36, -203, 97, 9, -28, 68, 116, -53, -22, 127, 87, 49, 51, 44, -142, 219, 132, -177, 416, 0, 21, 0, -15, 288, -377, -125, -17, -98, -43, -91, 154, 227, 90, 132, 338, 62, 5, 251, 18, -224, -27, -31, 110, 117, -108, 130, -19, 141, 205, -24, 54, -17, 105, 67, -40, 90, -135, -94, -4, 173, -377, 170, 205, -46, 57, 17, 26, 130, -85, 182, -11, -96, -132, 162, -188, -95, 174, 163, 36, 56, -151, 210, 63, -231, 45, 150, 2, 17, -166, 148, 14, -168, 156, -120, 32, 153, 105, 23, 59, 194, 185, -46, 85, 152, 76, 224, -424, 79, -232]
3645b32J28L15j65m9J22k25K50j88R1J26l30K43J63l18o7MlK80k81K82j03Q6m1
3668H8j19O4M3n6r7L1k78M36n4J01k78L81m18J51Jk9Q6l7M8K23k71j58J89j11
3692f4PJ05J88k5l19N39o32L89K17j77k71O3R6l07J15L50l68J6J29j33J4M56k75
3715A13r0j32n7P9KJ30j44R8J13j52m7J16j31K19K8L1l02Q4k14L59k61L90k86
3738e4M43n50Q9J69o7j8P1N1q7jJ32k47N0k14K66o6j20R8J33l2Kq6n1J93OJ45
3764B55n9k21j61K81j77K11k54M09m13K8J17j1Q2j29j44K50J41m86K47O2ll3q
3787a6m4R6j27J43q4J21k40J10K77k25OO1k88M9L8l1J3R9j76J33k5M68o62J47
3811a57L98j88k96L50j07J00j10n8J50k47J77n3p0r3J83j42L75n4j89l91N33K13
$$ y = [-232, -104, 211, 46, -3, 119, -106, 144, -44, 47, 173, -157, 86, 249, -69, -136, -132, -135, 145, -136, 146, 43, 129, 88, -31, 33, 76, 20, -77, -46, -324, 112, 58, 159, -119, 262, -156, -5, -4, -33, 53, 16, 64, 287, 16, -142, 47, -64, -57, 48, 236, 211, -108, 431, -201, 188, 405, 228, -43, 20, 116, -191, -76, 274, -94, -78, 51, -82, -68, 388, 113, 23, -109, -166, -87, -85, 45, -99, -1, 112, -40, -87, 29, -102, 117, 145, 176, -126, -42, -256, 103, -158, 232, -54, 389, -161, -72, 97, 30, 12, 83, 134, 47, 46, 178, -69, -19, -233, 33, -33, -153, -55, 78, 46, 48, -38, -89, 104, 110, 255, 196, -25, -186, 95, -82, 129, -125, 284, -129, -101, 16, 5, 87, -42, -186, 64, 205, -281, -34, 28, 25, -8, -16, -60, 36, -91, 52, -32, 89, -151, -41, 236, 11, 17, 78, -210, -161, -123, -154, -141, -42, -218, -85, -110, 358, -304, -157, 241, 53, -243, 107, 0, 100, -10, -68, 82, -165, 12, -41, -111, -204, -21, -163, 212, 158, -31, -422, 111, 324]
3833C24m48mK34j08o4kQ7P8j03n5j94K47QL1K81j84j93P2K05l46J05l6k40pJ35
3858a77J53K57m06N53k33k22k33K57Q3K8J22p6j55j15Q1J92k92M5j5K94k40K0
3880g9J92j73K5R2J1m8L8j74J21k09J68j62J98J91k3k33J33J0j31oj31j37K67
3903f0q3K15j52K12j10K77m59K16n3o6%J54j55J56k4l15L46k66K31O6j91K6J94
3926A59J51k63l63K44p7k0L15k04k28Q8L22j8l78K55J0q4J06R2q3NJ21k17M1M3
3950A7J44l97P7K50j4K26n38L88rk2j2l52K06j5R0K49L2m58Q1N6J51n3m07K37
3974g3O8J20j84J68O3k77m1J94j48O9l3L30l82L72l36J13N6j27n9n5L67j22J43
3997B26l15K7R1q8M8K72m00J72ll27K75n8Q8J32j78J31o5J4k40J53j16q6J85Q2
$$ y = [324, -124, -128, 106, -2, -66, -68, 19, 97, -6, -61, -255, -8, 0, 31, 312, 128, -65, 7, 212, -134, -29, -65, -305, -312, -177, -24, 233, -173, 380, 147, -75, -308, -51, 32, 60, 182, 106, -49, -164, -83, 109, -183, -138, -153, 141, -99, -79, 113, -60, -35, 57, 68, 20, 58, -116, 5, -204, -36, -198, 0, 191, 168, -65, 68, 78, -53, -59, -190, -327, -60, -143, 72, -80, 132, 22, 299, -160, 56, 3, -63, -63, 91, -64, 92, 68, -247, 99, -167, 64, 130, -61, -35, 159, 310, 47, -316, -72, -149, -169, 146, -58, -286, -198, 124, 106, -272, -17, -7, -91, 15, 107, 24, 29, 150, -67, -26, 17, 161, -236, -159, 91, 77, 303, -235, 153, 144, 122, 110, -242, -36, -51, 39, 288, 320, -138, -57, -1, 150, 97, -310, -73, -5, 115, -69, 99, 162, -115, -156, 38, -110, -41, -74, 256, -126, 246, -90, 23, 79, -48, -107, -162, 205, 83, 226, -89, -62, 29, -59, -11, 261, -139, 33, 30, -297, -22, -80, 8, 140, -38, 93, 28, 42, -198, -45, -161, -247, -62, 20]
4021B0r0K91o9q5l60J91R9j10J76k40K71j14k15P9K81k79J50LJ60l63K64J21p
4044A74k08J09Nk21K28q9J85j76N1j02N6j96m2O0J73n0J00j25L0J39j6K5n5j85
4068a30r0L78j68r0p2K47k31J62q1j3o7M0J08k5j13J36j16K63l9k01Q1k00K69
4091D8q9J27k08J09n1J05k65M85m12m2J75j42J79ol41K14k32L64N8L8rj46J15
4114G4q4M1K21l89J19R6j14L0K22l72r5M59l08Q1j22r5M55k48r0Q5K19j04j49
4137f8J88j18r1m0L4J99j38l06L06l8J2J4k6J40k61J89K8k87K45J98j33j44q1
4160a78K86j63J6j1L33m36K35j97J84j76qL50k42k0p1O4l51J26J75Q9pJ58q6j03
4184c3j01K3j29J29n8J49n2P1r2J95p9j63N7j30J18K36k51J34l0r6R4L71m77Q
$$ y = [20, -70, 221, 152, 67, -293, -102, -3, -113, 63, -177, 94, -20, -235, -156, 125, -154, -4, -1, 159, -204, 60, 181, 174, -34, 75, 80, -141, 87, -2, 183, 7, 58, -44, 12, -184, -226, -166, 7, -43, 57, -68, -38, 101, 85, 110, 55, -130, -220, 158, -10, -100, -172, 75, -156, 6, -75, -88, -155, -115, -7, -32, -145, -9, -125, 138, 99, -102, -21, -221, 48, -41, 86, -122, -13, -64, 41, -224, 261, -151, -193, -18, -160, 19, 13, -328, -114, -346, 18, 76, 114, 105, -41, 74, -10, 31, 252, -137, -18, 78, -36, -6, 216, -156, -251, 208, -100, -19, -141, -236, 219, -29, -119, -34, 185, 81, -68, 120, 2, -89, -129, -95, 104, -34, -340, -34, -72, -60, -46, -72, 68, -193, -4, 24, -263, -18, 180, 47, -97, -178, 108, -55, -39, -50, 283, -153, 82, -115, 69, -107, -115, 235, -7, -27, -98, -34, -385, -259, -84, 5, -2, 156, 70, -33, -134, -111, -240, -111, -169, -20, -72, -1, -93, 102, 23, -140, -83, -213, -95, 141, -110, 24, -6, -102, -8, 363, -114, -106]
4208a06k6J86M7j57J77j31J93rk31j32K53n0m83M11n2J34q1j11J61k78L15L8j6
4231E2m5PO0j21K9M1P6m9j58o1l6L29Mq2j70K76o4J73k28m9J10n6O0k30K97k99
4257a34K06k46K14N0O0k76j18L17k8j30J80l7j2j1n2L17j93r6Q3n0L34l92q9j44
4281b47K10P6r8K11k71J26L42n93O4L00j10J78n7l05M58m08J16J60N4k07k41Q8
4303a54kK07lj88j4J49K34m74J05R0K2J42l2o0q0P6j61L42j9k25JJ38l22L23k4
4328G1m49L83J58m92K9K73M4O6m4j3k03M4Nj0j36M91l00L02J25k37R6k22K33J9
4352B33k40J71l77L96k91N18n88M04k31j69K01J11Lj22Rk3l6J37j11j2R5k47J36
4375c3P7j13JJ83j99J72j59K55j30k17L12J16k02j29K54l8r1m8J42o9j18O9J64
$$ y = [-106, -132, 54, 101, -56, 121, -10, 183, 174, -57, -189, 64, 14, -469, -58, -110, 24, -57, -168, -7, -285, 30, 68, 52, 7, 14, 74, -47, -18, 23, 99, 50, -108, -169, -205, 124, 128, 46, -124, 152, 88, 261, 33, -16, 94, 38, 98, -132, 165, -134, 72, -174, 40, 90, 150, -126, -244, 73, 45, -85, 95, 58, 46, 35, -17, 300, 107, 11, 94, 44, 378, -14, -103, -247, -37, 39, -59, 152, -119, 7, 349, -244, -180, 120, 10, 188, 131, -174, 284, -124, -8, 152, 206, -1, -242, -154, -156, 51, 48, -140, -154, -5, 229, -245, -140, -50, -28, 114, 82, 22, -58, 18, -143, 199, 180, -45, -44, 94, -228, 95, 71, -378, 5, 163, -329, -300, -27, 17, 83, 39, 26, -177, -133, -128, -138, -274, 217, -83, 219, 344, 107, 203, -19, 214, 233, -7, 164, -213, 183, -108, 410, -178, 226, -5, -174, 27, 138, 141, 19, 28, 5, -31, 106, -5, -17, 78, -169, -33, 44, -69, -68, 115, -84, 88, -71, 184, 54, -163, 149, 265, 63, -66, 188, 150, 59, 11, 153, 84, -34, 35, 199]
4398A99j53k26m2K58j11LL87m93R1R7j05J6J65Oj71J64k34Q0J92J22n18K70J09
4421A06k83K37M4K37m74J10m1K42j32O0j56N1r0m8M9L51m28J40J76J47k36J3j20
4444d5j76p0K55k82M76k07P0Kj38M03m01J30j18K76j90L64m85K04m8P9Rk84L97
4467B21n00L66j10J26l11K26ok09J27kK34j47l5o0R2j18M9J35J42j79o6n3K60
4490A82l2o2k04%r7J28K25k12R5pK92p16N24o4k06J50k3K09P6j37k72J54L6j01
4514f2n2k91N05M1k37J19k46K73l5LK58j00k12J99m54M51M7l54J67k00K44m1J2
4537C5m3K13k47L23k64k05P1J99j88J03l73K79Q8j60K23l08K07P6q8O4O6k38K77
4560A10m5j53N8j11K08J92l90k5Q4p9N7o5J83n9J77j79K03N5j24m2N3L82m32k79
$$ y = [199, 46, -180, -222, 36, -75, -72, 315, -178, -87, 10, -95, -79, 86, 92, -79, 85, -149, -69, 123, 245, -273, -3, 106, -177, 60, 104, 341, -133, -23, -64, 178, 46, 106, -50, 1, -89, -137, -88, 263, -165, -25, 151, 298, 62, 75, -45, -221, -291, -36, -318, 158, -49, 21, 23, -115, 288, -113, 17, -101, 175, -15, 349, -136, 68, 20, 99, 108, -176, 221, -279, 87, -23, 103, -208, 18, 12, -197, -70, -72, 162, 15, -20, -80, 12, -106, -57, 78, 220, 41, -25, -78, 182, 150, 88, -116, -116, -213, -85, 140, -72, 23, 16, 308, -408, 116, 52, -154, -4, -27, 182, 258, 121, -151, 3, 39, -62, -114, -405, 100, 141, -96, 23, -223, 50, 15, 18, 276, 176, -36, 163, -291, 160, 207, -147, 20, -180, 64, 23, 35, -8, 205, -42, 281, 17, -188, -117, 82, -106, -3, -376, -97, -9, -169, 54, -254, -47, 29, -59, 5, 71, -167, 110, 65, -88, -30, -141, 67, 259, -131, -156, -72, -151, -94, -159, 24, -35, 142, -37, 166, 221, 97, 55, 108, 490, 58, -221]
4584b21K19k1r6K72j78L35l49O7J11J64l03K14k30L5k35K01j09k78K72L04j72
4605BL86Jk46J5k7j51J68j47Jn0L32Pj27l56J8J41m4L25j61K94k11j51q1j5n7
4630a34R7j20J98j18M1p4k31L06M16l74L11j89k90P7qK63o8m2q0j6J28P4j76k4
4654c3J1k92K66K67j28j69K45j60j32q9K30p8p4L74l92J26O9j67J9l4Mp9J05K08
4678I7J72j99q6j79K95j39j91K35K95k88k1L7J3q2Lj64L0J50j05J47Q5j79J08
4701C4j4J0p2K4MJ09j89J21o2J46j09J52k97Q5K37j25j31O6m12L30L25k35R5j10
4725a8k1K3l5K01l90N49l13j69J86k43J36LK38p0O2j53p3L21k17K83k94j01p4
4748a69K19J8k75K92j95K66p9k43J67j10OJ77n3k23K87L09n28O6Q8q5O8J04J71
$$ y = [-221, -2, -23, -119, 153, -25, 310, -39, 28, 139, 303, 0, 214, -16, 19, -216, -15, -124, -402, -130, 174, 2, 388, 389, 143, 158, 131, -20, 148, 1, 2, -48, 284, 291, 164, -192, -174, -33, -77, 248, 87, 381, 170, 19, -62, -77, -134, -37, -157, 41, -77, -36, -110, -341, -35, 381, 7, 318, 129, -161, -84, -92, 171, 103, 61, -19, -35, 93, 167, -9, -33, -22, -314, -48, 219, 91, -78, 167, 7, -125, -214, 16, -62, -136, 238, -154, -28, 41, -126, -107, -141, -137, -216, -111, 97, 269, 70, -16, -195, 100, -39, -230, 5, 300, 12, -9, 28, 41, -41, -38, -202, -172, -22, -127, 20, 105, -74, 34, 20, 30, -42, -18, -14, 95, -94, 27, -35, 111, 2, 154, -143, -58, 179, 54, -77, -11, -423, -93, 232, -3, 92, -18, -39, -16, -51, 150, -240, 309, -4, -173, 13, -230, -94, -91, 147, 77, 139, -14, -87, 234, 17, 300, 6, -95, -169, 50, 68, -207, 85, -110, 156, 77, -166, 1, -109, -103, 74, 21, -202, 85, 394, -134, -68, 20, -65, 3, 107, 278]
4771B78m47J92k13K44o0N1j32p0L3P7o0L1R3k6j63m8J32J00pK2RM7j35M48n31
4796a35q3K53j09L06j19L0j96j13m0L26n7k92q0M56j04k0k72K19j61N7K24m6l9
4819Eq7K54J66j54k92K67j01l66R6J36Q7o3J38k32N0p1J61j62K44k46J1M17l63
4842a05J44p6J77r7J8l66K04Q6K50k91J19J10l62K95o6PN5j53J76j80J73k55J03
4865c4j61J46K06p1Kj97K26j72L29j04j90q9K19O7l35J65N0O0k39J35Lj48J18
4888a4j76M1N3K49j43J40j42k5q7R8P0j86L32j68j39K70j91j92K91j84J16L6j47
4911i8J4K34R2l37O7j10R9J43k20q6o2M79k9q9p3K14j92l50J62rM1Q7M8j2k03
4936a90p8K45p9j79K68L9O8j66J6k76R3J35o7J40J47m7M2j96Qk8j51J11j15N53
$$ y = [278, -169, 23, -190, 54, -6, 45, -87, -157, -124, -47, -107, -76, 17, -9, -172, -220, -88, 12, 5, 27, 36, 83, -52, 396, -135, -218, 35, -74, 232, 113, 143, -53, -166, -206, 120, 63, -229, -309, 147, 43, 23, -249, -30, -191, -134, 90, 44, 5, -82, 172, 338, 184, -108, 159, 58, -308, -212, -76, 11, -52, 86, -146, -96, -167, -6, -168, 76, -170, -159, 258, -105, 39, -37, 140, 43, 61, -305, -101, -15, 235, -56, 63, 173, -189, 106, 40, 47, 102, -51, 125, -55, 118, -137, -34, -195, -49, 157, 86, 88, -109, 117, -55, 274, 170, -20, -109, 110, 177, -158, 7, 57, 117, -122, 13, 16, -132, -14, -190, -149, -96, 153, 10, 150, 8, -17, -104, -6, 64, -122, 210, 42, -97, 173, -18, -210, 81, -103, 13, 49, -98, -84, 150, 242, -95, -28, -138, -39, 104, -116, -202, -264, 215, 186, 97, 24, 238, 46, -304, -142, -151, -110, -23, 25, 13, -190, -268, -23, -102, -281, -13, 26, 94, -72, -56, -332, -239, -104, -171, -31, 116, 69, 111, -85, -77, -105, -256, -145, -260, 293]
4960B93j82j62J47n9J45k34Q9k37K06K21l02J11Qk37M8J92Pl4P2pk31o2M20l11
4984i9r0l25O52k7j23m7J84l57M30m4j69J72k42K44k31K17l87M85M9o81O9L04
5006a6j24j5J10P4n1J44k20R0K73j88k33K15j19r2J9K98k65J9L9K92m06NK98M2
5030A89j15k48k2K26MR4N8l93J27M87k21j12k40N4j78J84j02J03R7l02O13k91
5052A2J17k88R9Q5m3K5j5J09k52J58KK7k93J74L16k07j16J7K2K49m54J25N21n28
5076a38L57l29J38k40M90l65p7L19j60J66K2k06l1J5k94L34L16j56k30k05L49
5097G5l91J51J89j25j6O8R6j58J38K35k31l58K55q1J65l6O1o0K42l84K54Q0k79
5120a10K25q2J8J19l94M1L8K56n9L8l23K47K20j24J6k61K40j51j14L16k17k19
$$ y = [293, 111, -51, 96, 37, 182, -52, 37, -200, 6, 227, -75, 36, 44, -193, -145, 47, 54, 20, 92, 85, -146, -208, 212, -99, -189, -514, 138, 111, -12, -59, 125, -232, 198, 154, -15, 157, -85, 159, -72, 145, -242, 243, 292, -389, -320, -16, -140, -155, -45, 29, -22, 122, -98, -8, 265, 77, -156, 59, -60, -152, -133, 165, -100, -81, -42, 250, -156, -151, 147, 189, 74, -174, -196, 30, 34, 128, 186, -207, -80, 407, 186, 74, -166, -112, -290, -106, -208, -105, -8, -310, 303, 12, 129, -159, -60, 25, -18, 7, -8, 101, -151, 7, 9, 36, -257, -83, 233, 26, -90, -73, -51, 198, -256, -131, 390, -138, 219, -110, 28, -212, 278, -87, -164, 155, -5, 161, 183, -23, -54, -39, -333, 1, 317, 161, -69, -274, 75, -316, -165, 24, -101, -117, -49, 47, -111, 27, 262, 31, -327, -72, -153, 12, -24, 37, -23, 219, -165, 89, 169, -110, 115, 33, 51, 170, -224, -183, -145, 111, 52, 90, -233, 14, 234, 110, 126, -135, 105, -46, -160, 156, -61, -280]
5142b80J81Q2L14m81J89J84rJ9J65l28j05J58j05j82K38J45l94M80p4m23K18L9
5164C1n1k45K41K62j90j16L8K90k77M6K81j97r6m9RJ10K38k70k03M06k02P1l00
5187a73J42j22J27P2j3K70k35O6j19j58J18J50P7j08j26K74k63K8M5J4K5Q0j81
5210a0K22k23K32j23n1K06j37k06j66P4K48m3o1J99k80K55j74K60j62P8j3K9p8
5233G6j30K15o8l1p6j1K18P8m37K93p7j56n1K46q0j72J30J84j07O1l63J64K15
5256A21j34O9r5Qp6J95q9J49j66j32L33j93M01l65j62K66j79k43L99m7K4l2MJ23
5280A79l03O9p4M28k61NO3k53L74l11J15j18N3J05q2L43k03k00J00R3J61l76O
5303h7M4O4j17J22J03j25q7j20M27O4j44j68j40J49J78j58J59k03J6J76k08j16
$$ y = [-280, -99, -17, 297, -184, 5, 189, 180, 199, 364, 36, -69, 89, -16, -198, 40, 185, -209, 271, 197, -226, -8, 31, -20, -265, -24, 238, 48, -68, -30, 260, -17, 29, 310, 113, 17, -32, -23, 87, 325, 55, -148, 258, 56, 127, -173, -31, -153, -26, 46, 33, 303, 68, 134, 15, -143, -25, 125, 202, 94, -32, 242, -21, 7, 52, 66, 91, 171, -10, 212, -11, 221, 98, 47, 253, 116, -90, -256, -182, 66, 23, -38, 161, -119, 136, -38, 222, 60, 138, 125, 154, 76, -54, 161, 93, 62, -14, -25, 193, 271, -166, 127, 50, -106, -157, 89, 9, -163, -33, 151, 44, 105, -258, -94, 121, -13, 56, -39, -31, -107, 88, -1, 148, -18, -150, 183, -10, 391, 26, -136, 130, -49, -292, 107, 60, 84, 52, 56, 179, -124, -55, -129, 299, 38, 43, 106, -147, 227, -84, 31, -87, -34, 71, -11, 332, 129, -71, 29, 122, 283, -93, -87, -43, 21, -96, 26, 129, 4, -83, -203, 224, 288, 144, -24, -164, -15, 163, 5, 164, -39, -23, 153, -55, -171]
5325a71J97K3K59k45k44M47k63m0J49j0j45J36l69P1K50j23J36j4k43K40k00J63
5347Dm5L44n6k62j7K26k80r0J78j1j0J06m5rJ68l24J61j06j88K62p1N5j96L26
5371A20j00K26l24R1M7j99L52l95J62J10j20J72j80L00l07j40kJ45j04K47j30
5392b9J25j78j05jN6J62j1K1mj70K59l2O2k91o6L63k85n7M09P7j74M0l2k32L60
5417B67m75L17j08J10M26m89j1j10L88k79R3j24J38k48O8Q7Q2j6l7J2l81M86k04
5440hNj8mj25J24Q1r3L30k64K4j79J69l30J72n3J36JJ96k49K83j22J79J71l83
5464D3R6O0n53J11M20q1j07J58k6M5k48J56K56o76M70k44n4M6J06%K1j69J30M5
5488EO2Kk03J08J60L9m7l73L89n5J76l71j50J90k06N17m75L37j07L3J44l19k0
$$ y = [-171, 26, 49, 308, 63, -181, 266, 3, -37, 112, 102, -43, 93, -276, -205, 45, -78, 58, 44, -199, 41, -159, 4, -41, 303, 247, -15, -32, 194, -86, -176, 2, -9, -19, 87, 42, 33, 201, -123, 38, -68, -256, 6, -65, -10, -206, 120, 20, 246, -78, 13, 60, -139, 213, -182, -20, 90, -30, 142, -38, 262, -45, -185, -187, -42, -146, 101, -29, 96, -82, -187, -188, -132, 30, 19, 40, 36, -134, 125, 93, 155, -136, -202, 161, -124, -181, 228, 305, 131, 171, 139, -93, 267, -208, 109, 1, 111, 537, 48, 37, -73, 315, 36, 129, 5, 143, -105, -37, 50, 132, 116, 79, 91, -290, 196, -8, -3, -21, -25, -150, -26, 55, -38, 292, 28, 52, -127, 42, -288, -116, -169, -33, -32, 164, -85, 198, 76, 255, 426, 43, 139, 199, -354, -243, 177, 96, -11, 147, 121, 166, -82, 74, 330, -346, 124, -120, -174, -128, -22, -22, -1, -170, -40, 5, 67, 69, -134, -26, 134, 173, 126, -247, 142, 87, 263, -108, -258, -68, -274, 243, -232, 105, -2, 31, 175, -144, -164]
5511a64K63m24J40J78K7J29l65K0R4K28r3o7J63j5k67K02p6J98j20J60o4j75k24
5534b52J66J79l60L25k18P6k51M91p5j06p1J17L41l72j05L81j03m7l61J9P71n53
5556hj59m1JK51k08j6K09M7k50R2r2J59J2k96J77L06j37r3m3N9J04N4J24r0j79
5581a7Q6J85m15J38K35k01k78K30K70k22Qk38L34j6j76Q9k05J80j63K03r5lM43
5604C72l78l8l17O28o23K39K19k43K3J06k60K84p9J12j27jj28K50j16M9j98J63
5626f3J80O2r7K18m36K67J16m4k48m5L94n36K88J52m69K03K01k25N0RM4K22m6
5649A97j29j74J19l00K36l19O17j11J31n19K40p6J36r7J44k40M26k60j45K69k16
5670g1J87j86R0k99M21k4j9k35q6J24L23m42j66M99k7O2N4l89j64K42K68k04J27
$$ y = [-164, 99, -325, -185, -7, 20, 149, -216, -196, -102, 126, 33, -34, 129, 114, -153, 49, -27, 171, 51, 211, 147, -28, -252, -86, 93, -267, 58, -160, -84, -335, 156, 81, -25, -96, 21, 362, -10, -115, 266, 163, 116, -245, -226, 545, -8, -167, -208, -207, 44, -164, -180, 29, 76, -174, -82, -174, -15, -3, -299, -122, 184, 47, -46, -89, -30, 74, 128, 252, 162, -17, 69, 254, -161, -23, 212, 11, -267, -37, 233, 11, 19, -219, 115, 99, -77, 12, -193, -13, -176, 27, -68, -71, 372, -6, -44, -361, 267, -356, -117, 102, -141, -118, -12, -272, 12, -67, 45, -82, -83, -211, 39, -77, -28, -226, -63, 117, 179, 82, 300, -136, 131, 247, 203, -45, -90, 304, -232, 56, 208, -261, -58, 143, -82, -32, -23, 21, 243, 197, 68, -106, 13, -287, -51, -370, 247, 136, 267, -252, -12, -88, 48, -49, 95, -145, 281, 21, -124, 145, -71, 116, -70, 20, -279, 142, 118, 99, -136, -222, -98, 225, -217, -383, 116, 89, 151, 205, -184, -348, -106, 162, -42, 85]
5693H5n7k60k4m5M54j5j01j72K43o3m09J56J52J31K04p4l24J18k00J31Q8M6q7
5716b3L27k97j0L5k07K04M6j94J49j53L18j15k00L28k01R4l63J40kM2m4M61m73
5739a38M1L83n88J98M6J57k10m8K09k03O3J6K60j92O2k7j44J7j32P4M88l72L28
5762B88l05n8J40j59Q7O1n1k8J17j64J00j45J36l2m3L3J69m87L87j19L1Jj22k8
5786a91J10pr5J66K38k80K78q5j41J75j86q2J02R4p6J37J18j15j75Nk20J51M3
5809c6JN7j6j54Q9j95K79J17j69P1Lr6P9k23K27l15L81Q6k92Q5j49J84k92K04
5833g4J63l20L19L4k19K00Q3j44l34K23q1O5k60J43K46j27L2K6p1L9k21N27l53
5856a04R1J74k0l44J61j73K59rj88J94L1M9l36m7J71J62k8o6q4n3K16j39M3N1
$$ y = [85, 28, -232, -256, -301, 153, 138, 37, -135, 108, 45, -364, -208, -56, 75, 279, 205, -119, -1, -201, -70, 18, 64, -23, 304, 7, -3, 32, -175, 29, 75, -119, 30, -123, 195, 80, -120, 208, 7, 101, -262, -122, -124, -82, -126, 335, -138, -97, 286, -302, -104, -58, 99, -111, -159, 50, -153, -90, -74, 186, -6, 56, 29, -115, -98, -230, -156, 332, -40, 288, -17, -75, 65, -94, -7, 54, 3, -25, 92, -72, 28, -117, 19, -13, -56, -23, 146, -341, 46, -73, -42, -41, -163, -191, -81, -88, -183, -17, 221, -59, 219, 134, -7, 168, -18, -100, 2, 96, 20, 157, 275, 160, -15, -10, -230, -79, -36, -35, 22, 6, -148, -59, -254, 25, 142, -27, 44, 47, -49, 30, -193, 34, -281, 100, 186, -106, -21, -170, 14, -278, -74, 89, -231, 88, 122, -97, 103, 186, 42, -292, -69, -150, -85, -345, -202, 44, -83, -51, -25, -96, -57, -278, 249, -104, -13, 161, 141, -203, -42, -215, 44, 35, -153, 41, 72, 121, -215, -262, -91, 71, 43, -23, -107, -160, 56, -83, -40, 11]
5880A1p8K45j56L49l58M3l31J09L5j67N08m26R1n4K01P2m4M3J10K0k84L43m59
5903a77L71k17n1L2J50p3j38J11l81K26K2J50k22J66p7K90j45J7p4j45L12k4k14
5926i1J10O5k43K21L63m24N9O0J19Ol30J79k37p4M98l80J15l13N20m6m11L89l
5949A52j30O9j78K92k91J9O2l0J76o3j61kJ04k04L48J85n50K39l0ll0K65r1M8
5973A96j85L1rJ15l40J97P8j2R6k07M0Qk98J98K77j04k3K74j85l93J63M05j31
5996A91j21j26J3j34J21L05m54J13J6j14K71j30J09r2j98M29jl00j61O41p39N82
6018B21l25p5K16j06J21k50K78K21k25l4J77l53J80J33j98N0k12K34j35p6m7j99
6040d04K26N49l22R7m2r6j56K59p7J31K05m61N5J22k1NO9j92L59j69m21O45k61
$$ y = [11, -67, 178, 22, 371, 13, 56, -275, -166, -131, -298, 210, -216, -125, -179, 22, 94, 50, 93, 203, 223, -61, 282, -177, 194, -23, -74, -42, 108, 35, -103, 8, -373, -147, -125, 25, -197, -31, -108, 182, 37, 54, -20, -165, 147, 123, -91, 19, 84, -159, 62, 425, 1, 60, 120, 239, 245, -85, 94, -143, -217, 281, -99, 16, -297, 223, 177, -234, 155, 152, 22, 91, -87, 205, -86, -67, -5, -35, 141, 78, -83, -85, 19, -185, 163, 348, -202, 37, 7, 4, -26, 239, 148, 196, 11, 42, 33, 148, -192, 5, 83, 71, 167, -40, 0, 8, -290, -92, 185, 81, 58, 332, 147, -246, -83, 322, 191, 70, -56, -43, -177, -56, 249, -205, -92, -76, -190, 81, -49, 60, -32, -230, 199, 198, -102, -263, 378, -361, 221, -104, -179, 37, -69, 52, -198, 80, 301, 76, 42, 219, -134, 46, 179, -19, 31, -181, 53, -82, -158, -205, -404, -178, 371, 49, 146, 104, 8, -148, 111, 34, 165, 370, -91, -36, 86, 65, 70, 139, -53, 306, 137, -284, 361, 100]
6063A00J64k33j31L9q2K6K44n9Q1j85K56K8j83pJ93j03J90n50L52j80j51K14P0
6086I3k53M7L80j93m33M78k54om0j05Q3J72J46k42P8lQ5J12o0j1j19Q5rj83oJ25
6112c3K62k46j16n8M3L38l86M03q2k91N7o5K54L1q7J7p3o8%J57N5O4k65J54J71
6137B36l24J4OJ53o4J1j74P9L34n01K18L26l81J30j39J02k2K37j52q4J51J11m36
6160a69Q0J06j21J39L2q7k15K4L84l79L71k53J60q4k2J84j35M2k46J6K01RQ5l3
6184H9q1p5P9J46k35r1J84K9Q2On17O49j83J43o9l29J90L5j29K45j21k15J38o4
6208i4o9L54kl11K65j4q5O4L20m40j29K72k00L5l49P37j42j6k08L6Q7j76j88L31
6232G8L18K3o09K39o0j1J03j8j44J78N2k3p0J55k41l5n2K60k97j05N2K00Q7k48
$$ y = [100, 264, 31, -100, -61, -143, -117, 127, 68, 149, -36, 220, 248, 65, 58, 251, 148, 338, -212, 140, -40, -191, 23, 93, -160, -113, 267, 74, -359, 119, -135, -141, -181, -286, -203, -31, 115, -127, -49, -52, 33, 145, 85, 74, -45, 40, 31, -152, -158, -33, 229, -17, -133, -191, -148, 190, -196, 207, 125, -166, -109, -174, 80, 111, 24, 41, -32, -100, -100, 57, 112, 176, -89, 65, 236, -88, -74, -68, 85, 21, 32, -142, -63, 271, -230, -12, 314, -67, 63, -76, 26, 4, 241, 89, 5, 156, 267, -169, -89, 17, -104, 35, 67, -20, -235, -211, 173, -206, 165, -88, 72, -12, -34, 150, 15, 57, -189, -173, 28, 37, 122, 89, 8, -67, 12, 158, -77, -168, 16, 45, 127, 133, -384, 265, 82, 225, 156, -173, 17, 52, -77, 168, 47, -168, -30, -94, -163, 191, 189, -122, 143, 129, 44, 108, 428, -12, -141, 131, -69, -34, -383, 354, 212, 196, -12, 24, 111, -65, -253, 78, 396, 419, -190, 49, -11, -22, 81, 63, -81, 97, 149, 126, 56, 211, -30, -65, -117, 143, -154, -259, -207, -7, 80, -168]
6256a68R7N9Q3J26n0n08M62k5K89j86r5l77K97J5j44P0j75L31p3k4o8J85k09M6
6280d2j96L70k88j29J86K80k87J63Q5k49k01L73o4L1p2j09K48k64ML31j01J20
6302A89n1k58Q0pj50J10J04m6k17K95Q3j43n5K43j63N1J61n15L44o0n4p7R3J52
6326A09J14J6l3j96j28r5pL45j33K05k26j52p4J4M55p2k26l2J83k10K69O4m46
6349b56L40k3m0J23j7kk55K66l2jj41K3J10n73N97j14k27M71k45J44J04m01L14
6372A65j13o5k38m2M12k4j58K23j55j76K56l6l7J28q4J8k36L40k64K41m5l80J77
6395i3j34L27l35K40L3M7J55k57r3O7l0o3L4m2K55l29k8J39K93j50q5N7M2j88
6419a38q8K60m9K19j43j28J3L7m02N17k68J01k15J89o5M0O4j82L32j43L14l28
$$ y = [-168, -71, -12, 71, 197, 147, -361, 101, 76, 365, 179, 84, -293, 4, 19, -125, -55, -230, 101, 28, 4, -64, 121, -88, -42, -238, 132, -156, -285, -99, 181, -106, 57, 142, -107, -308, 65, 1, 32, -40, -149, 99, -165, -161, 170, 69, 189, 138, -120, -40, -47, -197, -87, 17, -29, -246, 49, 132, -11, -66, 177, 14, 65, 226, -289, 55, -5, -59, -136, -43, 109, 223, 239, 206, 10, -118, -213, -220, 125, -8, 197, -29, -181, -255, -241, 214, 142, -84, -116, 67, -143, 126, 190, -256, 84, 61, 21, 144, 127, 125, -130, 136, 104, 103, -38, -15, 95, -478, 119, 5, -222, 249, 4, 148, 252, -149, 165, 52, -13, -251, -293, 119, 95, -63, 160, 5, -171, 85, 49, 12, 140, 56, 74, -162, 178, -86, 155, 110, -270, -93, -227, 100, -235, 5, 38, 85, 240, -17, -110, -43, -73, -136, -102, -144, 111, -218, -246, -107, 186, 36, -49, 8, 50, -138, -226, 34, -15, 204, 61, -67, -54, -17, -419, 98, -170, -69, -284, -95, -160, -120, -56, -238, 94, -49, 265, -63]
6441f3J24K5l76N06j47k82K52n26O22m37K68l6L02J22J111j456j37n11J575r22
6461A4J016j087k8j158J288N34m52j10q3O24j382k7p7O91K24K14p89J200o11K31
6481B32J46m34j82k61L91J87m1k70J52j6j09k68M05m6M1k10P6k6J15n1k16K88
6503i7J56j00J60K4m98P54l50p4O4J31r1k10M37m06j0jJ48M4k67O1L91j81p2j03
6527i0K70k63J49n7Pk42K03j54j05L58j10J98k41Nj41M05J0l11j98K28J16j89
6549a52oQ6K60m5k88P8N2N5k11J59n3K88k72N2o5J85O8j44n8j29j70L98k94K9
6573a77J96k3j81lJ13R0K68k79M7O1j47L59k97mq7J3K33k21r8J29K96j23l60K36
6597D1j02j08K30M6k20P9l2k0Q3PL2l02M98m67O6K69r0j78J89k40J01M6P8j67
$$ y = [-63, 61, 86, -290, 216, 69, -213, 39, -487, 135, -302, -34, -70, 232, 354, 1465, 9, -128, -639, 936, 14, 1030, -57, -85, -1243, 45, 579, 127, 17, -66, 558, -824, -851, -928, -237, -13, 201, -588, 612, 1, 232, 378, -56, -238, -499, -108, 79, 38, -232, -80, -96, -205, -473, -68, -114, -73, -283, -207, -233, -118, -169, -385, -97, 59, -41, 119, 143, -355, 399, 49, -25, 39, 170, 79, -131, 306, -100, -110, -111, 37, 81, -186, -125, 266, 85, 13, -90, 180, -83, 66, 9, 16, -226, -23, -177, -282, 76, -34, 164, -77, -72, -213, 192, 202, -109, -307, -79, 37, -152, -158, -72, 188, 143, -145, -67, -15, 40, -171, -12, -65, 223, -49, 3, -62, 123, 191, 47, -11, -140, -310, 88, -206, -177, 19, -4, -185, -188, -75, 15, 283, 4, 51, 112, -35, 324, 27, 23, -64, -51, 182, -39, -137, -8, 288, 165, -195, 41, -61, -169, 61, 107, -113, -34, -66, -86, -3, 4, 36, -266, 232, -235, -169, 100, 10, -168, 21, -219, -118, -72, 6, -161]
6621a61K34O5q0k8l9o3K47p6k35o0P3O1qJ37k40K91j34J76k69J41K51k51p4K03
6645A61j82J74q0lJ1Ol00L97k32J90j73J38m8l4m3L9K66l43K16k04q6K42R2j38
6669F6J7J11k66J18J17k1q9k21l8K80j69J62K45k08J75m95L33K0k14N5R0l8k42
6692b12K41N2j29j21K56j33j16K95l01O7J02P3J02j84r5Q3l21M65l70M17k14P
6714c6O6j94L26L5k07k52K51j06K91l15J13K09k28J02jK44l91J6J51r7L1l0J64
6737A42Mj6j97R0J05j5j15p0Q0R4j25q0J24J55l43J10q3n7M23k82O6k47L03l6
6761C0j80K57r2K32l13n4L85m92K22l22J61M48m97j36J66J50O1J20j78JK84l35
6783h2O6n5J22j59K27q6L1l2j03QR7K7q2j0%r0k89M44Jj48K48n6j0R3rp2r2j80
$$ y = [-161, 73, 138, 58, 30, -9, -72, 175, 99, -136, -196, -123, -62, -70, 67, -173, 118, -16, 160, -109, 32, 283, 32, -42, 161, -21, 153, 73, 70, 81, 87, -213, 184, -48, 142, -31, 107, 59, 25, -18, 21, 287, -56, 160, -44, -130, 112, 204, 66, 83, 194, -72, 46, 163, 142, 53, -168, -206, 74, -95, 67, 312, 104, 279, -216, 117, 137, -77, -22, 68, 30, -212, 29, 81, -48, -169, 87, -46, -162, 133, -168, -101, 1, 74, 176, -8, -103, -20, -341, 124, -246, 171, -43, -36, 30, -164, 162, 197, -10, -262, -11, -117, 174, -141, -28, 181, -47, 55, 54, 298, -93, -77, 74, -23, 8, -22, 142, 146, 130, -67, 23, 128, 113, -2, -72, 8, 102, -23, -103, 21, 176, -167, -57, -140, -197, 226, -56, 10, -237, 66, 30, -150, 107, 15, 247, -66, -120, 265, -227, -5, -327, -166, 282, -215, -351, -185, -35, 26, 146, -32, -31, 253, -82, -16, -71, 51, -108, 119, 33, 64, 32, -71, -63, 34, 61, -21, -31, -31, -121, -410, 34, 35, -113, 135, 79, 69, 162, 153, 81, -11, -191]
6811a91K24j47k7K15j77L1P9j8N0j05J99%j47O6j01J56j65M27K18o36L30k77J22
6834A26j24J09j49L3K23j71K07m30L59j76j32J60p0J23k3l7k2k05O2N52p34L34
6856A5k6o8J01K06k24m6J83j67Pl3K15j09R3J02m42K20J06P4l32J28m4J12k59
6879a88L39k25K13j84n3J83R3J30m60J79O7p1k35jJ67j11J09P3k04J32j37K38
6901E4P3J11j18k09p5O5N8J99L0j04L3r6j89L38o1o9L9Qo7j5j81J20K44l07r0
6926b09K3R1J93m13K99J02k2j8j53J74R3R4l42P4L6K11l21K45n4p7LJ6J16l7j99
6951g5K9j31mQ2J11j17l7L03m23J71J38j32j18K45q6l3J00q6K44j54o8LJ13o5
6975A0J59j93nPJ13l33L66j28m08N04j36K45n84L57P2M6k30J30J0k93N05m00L66
$$ y = [-191, 33, -114, -141, 74, -103, -72, 7, -11, 39, -66, 133, 133, -14, 52, -49, 107, -58, 369, 587, -49, 281, 4, 126, 2, 111, -38, -5, 218, 47, 254, -176, 183, 7, -125, 35, -35, 88, 65, 28, 6, -199, -137, 415, -319, 15, -11, -79, 22, 228, 4, -42, 141, -26, -19, -52, 163, 54, 147, 249, -193, 27, 133, 207, -125, 3, -41, 71, -188, 151, -74, 139, -45, -98, 85, 178, 308, -152, 27, 94, 23, -212, -213, -46, -157, -48, 25, -179, -47, -184, 54, 127, 238, 120, -89, -164, -99, -41, 158, 188, 84, 117, 21, -168, 170, 109, 40, 79, 87, 20, 5, -176, -56, 188, -119, -209, -186, -95, 98, -315, -16, 86, 64, 46, -107, 67, 160, 254, -88, -14, 22, 233, -88, 157, 103, 26, 29, 45, 161, 124, -75, -46, -177, -181, -99, 12, -105, -142, 161, -262, -91, 47, -85, -203, 42, -44, -77, 23, -63, 181, 27, -41, -38, 75, 10, 169, -24, -29, -22, 91, -242, 124, -4, -412, 92, -44, 201, -383, -26, 46, 92, -138, -8, 2, -291, 214, -186, 180]
6998A80k99J06R8m50J63K33j21J21k30M04k47O9Q2j4j7R7j34j32K38o8L9n9j41
7021h2K1n7L88k83P8j38J12M0k14q2J85P5k9Q6r5K6K74m0j60j06N0j17p8r1J74
7046f3Q8j07K36Pj87j38kJ15O0J56k66J42j45J19j7J10r3L13J4m76Q5j4M14k78
7070G3l1L9k37J9J68l8J21P9Jj49Nm03L80J23k35M61m09k4J77J12j03l7k43L98
7094B47j47j01R3k53J68n8k11K67j77L93k17k4O5l10m3J51J66p7J81K75m05J0
7116gK10m4k77J78k58J08K43j15Nj87J60K23j57k21K92l18J10M0j17L30k53mJ0
7139d9p2R6L42l20k36MK33j59r9M51q6j33J5Q6J49l28k14L31p4P6q4r8L30l16
7163a55J72j44K74l44K26J30l98K05j10N2J8K6j08L32o5K7k69J63k12L14J53m46
$$ y = [180, -119, -13, 85, -365, -202, 31, -90, 31, -199, 205, -42, 27, 109, 95, 78, 175, 41, -91, 147, 79, 118, 59, -82, -61, -118, 270, -13, 65, -73, 39, 79, -135, -217, -32, 43, 14, 100, 5, 31, 305, 265, 105, -1, 49, -68, -146, -237, -63, 25, -82, 154, 161, -26, -164, -166, -51, 9, 165, -101, 41, -104, 15, -2, 108, 15, 328, 342, -134, -49, -63, 351, 73, 42, 81, -156, -137, 31, -7, 114, 193, 194, 45, 50, -353, 27, 150, -85, 376, -33, -57, 120, 232, 129, 92, -151, 247, 100, -1, 92, -161, 7, -51, -262, 5, -172, 221, 4, -20, 45, -265, -308, -157, 9, -68, 113, 388, -17, -7, 203, 159, -118, 60, -198, -90, 153, 38, 43, -144, 16, 239, 82, -139, 153, -165, -55, -15, -132, 198, -55, -59, -49, -121, -25, 317, -3, -239, -235, -2, -161, -260, 191, 105, -28, -13, 73, 222, -106, -320, 11, -63, 13, -71, -169, 161, -155, 17, -127, 147, -197, 29, 159, -239, -34, -144, -92, -74, -48, -156, 176, 111, 138, -131, 32, -180, 134, 287, -159]
7185a59K18J27l02j03M37K5m63Q0Q6L0m0jP9J85j98j09K86m89L09M1r6kK18J79
7209C38m37K62r0l37J12L67k30j52K97j22k36J99j17N2J54j91j10N27m39L37J29
7230C13l28l52M7J44O1L57k00n3L48k65k6k66J99J35n8j30M09j91q0k28J11K60
7252B07k51K6l46M30k5jp3J9J01l23K25K26j92j45O7j77M61n87L78l39K75J93
7274A49j48K90p61O60j37j49l1Q3n2j35R6J8L28k87K8J34j28k0J58j91J88K05
7296B98k00j16J23j38j17K76q4k00J99j21l5j9K47j56J77r5K28J60k52m8k58L76
7318B45p5j31K27l38J7k05J23j67L49j61L28l80J73K25l72M73n35J17JJ60j93
7339a19P7K27k29K9j71J10J03K0k34K51J77r4J02m11Q9N1rj37K15J44m1p4j4k51
$$ y = [-159, 59, 186, -116, -219, 218, 243, -220, -140, -54, -24, -64, -65, 14, 199, 1, -108, 178, -311, -2, 39, -57, -59, 159, 338, -99, 163, 73, -264, -152, 215, -15, -167, 130, 8, -228, -29, -146, -94, 60, -131, -241, 286, -153, 184, 313, -15, -367, -320, -176, -115, 242, 42, -11, 337, 72, 46, -220, -21, 114, 56, -74, 335, 144, 64, -164, -53, 207, -44, -18, -364, 66, 41, 40, -33, -14, 87, -236, -11, 215, 23, -122, -55, -232, 229, -358, 20, -319, -44, 149, 1, 291, -470, 190, 53, -96, -127, -44, -96, -231, -135, -117, 211, -76, -48, 86, -42, -62, 96, -95, 93, 298, 98, -18, 105, -33, -150, 126, 42, -158, 41, -80, -115, -134, 113, -43, 134, 39, 267, 427, 175, 127, -131, 245, 170, 39, 266, -72, -55, -260, -137, -304, 45, -116, 212, -168, 5, 230, -142, 331, -204, -87, -86, 74, -119, -42, 185, -44, -15, -186, -76, 27, 47, -187, 64, 241, 147, 249, -162, -73, -22, -31, -168, 47, 191, 150, 76, 62, -189]
7363a89M9J74j10J95P8k44P4n9K77M3k98J4Qo4J53l87K75j1K07j80j27O3r3K84
7387A32l53J64O4k23J58J6k13O9N7L33j33k41K23q4L6L52k70j64L05j34k64K48
7409G8j83R6k05J81J69n0l22J44n4M7K73j34J09O2r3r5J73j62J05j51j47J36L77
7432C54n06M74r9j8j9l47J86j23p7J13L03m6j46Q0K38l37o1j50K81j41j05L18
7454A72k08K62n9k98J68j14K18j17j7L3K44k03k21L02j46K90k02k00mL5J01L2
7476F8N7l3j08j04M5n1J49n9M7j39P8J40k42J63l6O2L5j98J86k71L86j79J19Q9
7500B04j67R7j22j40N0J71J53J03k32k68J82n3KJ25M4m48J59jK60k05J68J00l23
7523a41J98j53J86k8P2k50L23k69K47j57n1OJ0J17j73K15o1l4j47J11J53l06R3
$$ y = [-189, -140, 34, -76, 119, 197, -47, 27, -32, 245, 288, -10, 4, 12, -52, 101, -286, -11, -22, 185, 5, -122, -59, -152, 132, -221, -57, 7, -216, -58, -42, -255, -186, -129, 204, 71, -170, 53, -31, 5, 357, 87, -77, 228, 94, -170, 78, -105, -9, -214, -33, 136, 86, -236, -92, -146, -99, 174, 40, 149, 211, 118, 23, 196, 34, 139, -12, -159, -23, 354, -152, 322, 223, 205, 186, -161, 25, -98, -175, -62, 241, 195, 49, 129, 367, 30, -31, -181, 100, -41, -146, 172, -36, 226, 167, -131, 37, -77, 141, 24, 7, 40, 284, 81, -140, 162, 16, 306, 104, -96, -100, -65, 36, 68, 125, 92, -16, -120, -75, -126, 23, -36, 11, -128, -50, 90, -152, 11, -25, 37, 72, -126, 60, -211, 175, -4, 115, 204, 37, 134, 12, -128, -78, 93, 246, 349, 117, -151, 31, -22, -20, 105, 149, -299, -140, -141, 119, -86, 82, 182, -141, 57, -96, 90, 62, 134, -116, 207, -62, 185, 28, -23, -17, -7, 110, -63, 152, 91, 57, -90, 21, 174, -132, -39]
7546c9k5j0j10M9J42K25k40J06N5k34l0L59n66K16J08K84j41l29M56k71j84J25
7568e4l26L61L58k38K3j58q2J88j41M6R6j80rJ09M2k8Q7N7r9j28K08k14j62K31
7592a3l9K49j90L1j63P7k0j18j1R1K65n5l7L8l03K56OK6j96J45m8J24j50M9K02
7617B16l0m31K86M6j05Q3r6l2P4J13j65J17j04J33J5k0m4N6r6j77L34r7j20N8
7641A4k23K30o9m6q1K77k00k07L77O5j47n8K53j81k19K15k51K15j40K55J62k75
7663c4K34l55N2J7O2L32k44l8j57J03m6N0n7J49o2O5J3M1L7j51j81J16R5J26q1
7688H6L05k61j61j44P8J35o0p6L12j85o9L14l84J02N8K32O6k47j65K78n20L71
7710F5K54n18M49n42M37L9k12k31Q3K19J85k95R4L0l43P7O6oL70K9r4r2j80KJ08
$$ y = [-39, -64, -74, -184, -135, 7, 232, -8, 98, 153, -81, -111, 248, -318, -102, 6, 290, 149, -180, 276, 5, -179, -54, -380, -19, 339, 101, 124, -34, -116, 72, -69, -23, 73, -107, -116, -7, 35, 7, 94, 151, 52, -76, 132, -82, -244, -13, -52, 197, 7, 38, -125, -48, -68, -186, -197, -106, 159, 104, 67, 105, -198, 58, 64, 90, -106, 39, -9, 115, -35, 14, 216, 186, -245, 41, 87, -18, 65, -31, -63, 11, 124, -41, 76, -28, 105, 120, 100, 56, 112, 16, -161, 173, 76, -44, 14, -209, 21, -48, -94, -175, 102, -98, -305, 72, 137, -10, -68, 185, 4, -215, 0, -251, -36, -176, 79, 241, -34, 200, -155, -103, -86, -24, 308, 64, 26, -131, -28, -74, -24, -81, 68, 6, 71, 84, 125, 162, 11, -170, -54, 41, 167, 86, 391, 130, -31, -175, -97, 38, -22, -98, 214, 29, -40, 274, -110, -8, 50, 282, 348, 101, -64, 214, -306, 65, 319, -199, 250, -292, 145, 184, -28, -259, -176, 43, 228, -67, 27, 57, -286, -209, -143, -149, 221, 250, 156, 64, -116, -114, -6]
7735fJ90k63k23J15l1M29j27l24K6L03P1j54J37n2j35J23m6r1K3n4n8K3J29N3
7759E8J54k30L3j54k26K87J60q5J93k67L63l18j97R8N6Q6j92K58j36lk4J36M7
7782I7j0J10j53K77m03j14K49J65j82k71K95M0j7j42L00k56j41N0k32M98m28P7
7804a91O0M84l73J06l61M42m49O87n98J64J45M6O0k90K37K20l23l53M46o6J63
7825B56k58l06J02J02M58m78O6J27k76L53j91N44o96O38k48k80O11p51J02j23
7845b48K47M20k62k56J82L85k68K0m02n24J032n32J88P1K34Nl8p79L47J56K2M32
7867D32p14j24L54K28O9r92R78m00l91K15Q98p24R1N46o70Q41n86R38r85m62J33
7888c25r09J295J391j622N42K86J02MQ19j161k28K52p82p25R58M65n31J94q65
$$ y = [-6, 184, -79, -302, -187, -218, 211, 84, -240, -214, 89, 160, 6, 143, 91, -44, 79, 33, -58, -35, -89, -147, -124, 5, 58, 212, -18, 15, -139, -365, -78, 82, -3, 190, -77, 286, -32, -229, -131, -75, 11, -181, 77, -59, -62, -86, 50, 97, 87, 197, 44, 321, -82, -196, 53, 218, 36, -235, 60, 100, 83, -59, 241, -15, -156, -106, -338, 160, -268, -191, -131, 353, -20, 86, -275, 167, -282, 405, -193, -29, 116, 162, 222, -68, 169, 389, 66, -287, 159, 93, 256, -2, -308, -206, -104, 354, -124, -58, 69, -207, 146, -45, 499, -197, 441, 193, -87, 524, -227, -125, -248, -1, 419, 157, -99, 83, 468, 200, 220, -182, -706, 326, -206, -18, 53, 287, 292, 254, -525, -178, -22, 0, 432, -282, -406, -52, 176, 245, -747, 231, -169, -560, -345, 553, -171, -80, 466, -204, 637, 51, 989, 4, -458, -325, -1234, 61, 1452, -170, 372, 658, 760, 764, 1583, 422, 194, 446, -336, -1061, -103, 362, -169, 25, -840]
7907h40J079m77m07J198j139P61l60J98L5k31Q29m30L76j296R45k81L52m57M71
7926C26k53Q4L3j77l36M81K51k7n17j08l75O62R84j200J79M51M89p49m13L37L50
7947D72p74P71l02l43m31L76O95o58K8l4P9L61k82j80L06K8J56l88L99O24j112
7968b09Q97o72p3Q29j076N20k40K36q9l07j08L46j3J87K1k76M0k73L20k2n8J45
7990A25k02Qj49j08L59o9N5O03j044L48j32K91j98oJ7J04k5p8O5J6l7J11j36J7
8014f5o0o3L40l34K1N3K20k22J73k2q0N1l26K79j20M7K36j32j10J29kq3K71j87
8038A4J86j45p4O7O2l7N2k45j68K17K73j26l34J21L04l12mM0n6L61N4j60J05k02
8062gJ34l81l8K47%j10J17j96j32L68o6J60j84q3N1m9J05Q2j64J90o8N8l5k06
$$ y = [-840, 239, -238, -645, 553, -586, 175, -185, 13, 48, -183, 646, 216, 592, -704, 241, -40, 312, -145, 326, 73, 157, 190, 13, -323, 158, 409, 382, -135, -243, -618, 44, 1028, -172, 7, 458, 947, 198, -215, 122, 472, -302, 469, 167, -176, -607, -231, 464, -194, -166, -200, -121, 240, -42, -222, 84, 112, 268, -120, 279, 903, -209, 688, 16, -57, 772, -304, 216, -24, 212, 123, -184, -292, 54, 41, 228, 249, -27, 13, -260, 60, 38, -20, 125, -77, -69, -218, -326, 33, -36, 19, 622, -422, -74, -206, 85, -113, -119, -102, 2, -23, -101, -36, -20, -57, 54, -82, -65, -125, -188, 152, -182, -161, -108, 112, -110, 63, 41, -39, 12, -314, -35, -155, -108, 128, -4, -114, 15, 13, -70, 201, 14, 200, 55, -19, 48, 110, 73, 125, -120, -288, -71, 202, 76, -258, -137, 167, -145, -149, -109, -165, 196, 250, 90, 195, -7, 127, -254, -292, -45, -45, -155, -38, -234, -366, 2, -64, 96, -88, -171, -120, -169, -64, 18, -146, 44, -24, 34, -1, -207]
8086b07M7R7K76j16l44Q7M87k74L05l29J38j60N6j07K38m28P9L67n84M33r7j13
8108a49K43l08K15J67m03K93L3L1Qj49jn5J84j72K78j38K16j28J1l6o7m2n0p7
8132i6J67L15k53j2l74K13L4J40lj15J39p8j5N7l06J75M7k42K53k79N14m15L50
8155B16k46Oq1J07J11r6K87k03M1n7p7j5Q1q8L3K90k76k3L2k65L39m5J90m05K79
8180A35J4k98L4j7K18J62k00m53O34l18M7
$$ y = [-207, -160, -63, 213, 97, -247, -160, 327, 53, 358, 29, 167, 7, 63, -44, 194, -234, -155, 212, -372, 61, -36, -149, 94, -214, 1, 168, -235, 58, 91, 122, 130, -19, -20, -75, 109, -63, 215, 77, 293, 165, 176, 140, 73, 31, -19, -96, 71, 386, 133, 121, -253, -40, -6, 134, 131, 16, 155, 77, 62, 119, -187, -12, 35, -207, 46, -233, 281, -134, 216, -30, -24, -105, 2, 113, 17, 304, 101, 142, 85, 8, -7, 74, -14, 19, 309, 33, 10, 42, -223, 116, 71, 261, -144, 135, 149, -149, -115, -132, 86, 248, 48, -405, 229, -89, -42]
8191d2
$$ Imaginary data points
##PAGE= N=2
##DATA TABLE= (X++(I..I)), XYDATA
0@%%%%%%%qJ6j6J7k5L2m0N6p2Q8j12J37j61K00k41K82l37M00m65N38o25P24q34
30d46R56j091J241j406J591j795K019k265K532k829L153l505L892m313M773n274
46b767N821o424P083p804Q598r471J0435j1505J2702j4050J5574j7313J9325k1680
60a1476K4479k7872L2084l7482M4677n4800P0200r6691J54484m96379L36100P82839
72G20163q13622k28960J31232L54211J37433l86089k18570L50484J23450l9176
82A30556k40414j14094L02278K01470l34812k35707K95545K72151l32859j71515
92b27401K59123M0612r6600K4311q1224M5717J08287o5773l0676q973m805J36098
104I8696o3062j49533J30237O0186j01298J4088j9585L1656O0708j44917L3751
$$ y = [0, 0, 0, 0, 0, 0, 0, 0, -8, 8, -8, 9, -16, 16, -24, 32, -40, 48, -64, 73, -88, 112, -129, 153, -184, 216, -249, 289, -336, 388, -446, 510, -581, 660, -746, 845, -950, 1069, -1196, 1336, -1493, 1660, -1845, 2047, -2266, 2507, -2767, 3054, -3370, 3713, -4091, 4507, -4964, 5471, -6034, 6668, -7382, 8192, -9121, 10204, -11476, 13003, -14869, 17215, -20267, 24410, -30390, 39810, -56881, 97603, -398776, -62676, 720163, -93459, -322419, -191187, 163024, 300457, -85632, -304202, 46282, 169732, 130556, -109858, -223952, 78326, 279796, -55016, -290723, 4822, 276973, -55886, -227401, 31722, 72334, -24266, 45, -81179, -35462, 72825, 7052, -23624, -32597, -37402, 98696, 35634, -113899, 16338, 76524, -24774, -10686, -30271, 1385, 62093, -82824, -49073]
115d9073J42670j63053P045J44397j46377J1526J26777j07409O600M3413m7482
126c0966Q1455l3382r5801J17687J6945j11593N3130N0609r0707L680J04996q0551
138a4498q6222J45665k822j35093Q2392M3127n5481K0925l1956K3011P5347r2969
150b8574k0585J05547n2495l1517P3593o5749k3303J05948o2993o7712R4904j8101
162H963m5294L9039k8399K3767J5591o7034N6442J9450n6867M6113j6965j3691
174a8885N9412n0853n293M0733l5145K2850r822k6421M6552l6059r241M0370m1066
187b2868J2705Q976k7803M2889k6970j7699N5925m1907K421M1994m8962K7716
199F417J8375n4757M8636N545n5315M6879n718m1052N1566j7668m2691M8823o943
$$ y = [-49073, 93597, -69456, -62411, 81986, -64391, -52865, 73912, -33497, -26897, 16516, -30966, 50489, 17107, -78694, 38993, 55938, -55655, -2525, 48084, -42623, -38943, 66053, -14498, -100720, 44945, 42123, -92970, -10578, 32549, -22932, -2007, -33963, -10952, 64395, -28574, -49159, 56388, 3893, -27624, 45969, -19780, -43083, 62865, -128, -67840, 27064, 8963, -36331, 2708, -25691, -1924, 13667, -53367, 3075, 22525, -34342, 11771, -5194, -18885, 40527, -10326, -15619, 25114, -10031, 12819, 2997, -23424, 23128, -12931, -22172, 18198, -22868, -10163, -1187, -28990, 13899, -13071, -30770, 25155, -16752, -14331, 27663, -21299, 6417, 24792, -29965, 18671, 24216, -31099, 15780, 10062, -30990, 20576, 2908, -39783, 9040, 2097]
212B097k8201K9826j7717k441L1716l2888J0250K7917m1363K2928K4673l9503
224a2706J1462J3111k890l872k5560L5110J491n0405M2797n500k9993M3050l6480
237b0385m01M5777n5629K5391L0419o0174M5434J1507m9892M9352j0413k9085
249a8099M0174j9243o293J5640k5772J8168P469l1394J1441R887o860J34j1856
262a6604J1320J6930k3072k040K7288j2925r968K4383j2636q095K1393j3093o02
275B279M536j4412K1200j1140k1877L1758j7161j0501K5283k5546J1153Q965k2885
288a8348L4860k2298j6034N6632m2935p895N2330n0138J2920L4150n3090K5018
300E172J4519l5489K8175j3394j6835L3261j9912j0237J6342p068P939n420q166
$$ y = [2097, -26104, 3722, -13995, -16436, 15280, -17608, -7358, 20559, -20804, 2124, 26797, -12706, -1244, 11867, 8977, 5105, -20455, 14655, 16146, -34259, 8538, 3038, -26955, 16095, -20385, -20786, 24991, -30638, -5247, 25172, -35002, 10432, 21939, -27953, 21399, 10986, -18099, 22075, 2832, -3461, 12179, -13593, 4575, 12044, -19350, -7909, 1978, -4882, -4748, -16604, -5284, 11646, -11426, -13466, 13822, 897, -9071, 15312, 2676, -5419, 15974, 2881, 2279, 6815, -7597, 13603, 2463, -19414, 12344, -4817, -15318, 9965, -15581, -4428, 4537, -18348, 16512, -5786, -21820, 34812, -8123, -16018, 36312, -13826, -906, 33244, -19846, 5172, 19691, -15798, 12377, -1017, -17852, 15409, -4503, -14740, 1602, -5466, 2473, -2947, -11113]
313a1113J9783n724n445R115p057R718L531k0580J5650J1763k9836J0752J8253
326A8810l0075J0424J1285k8875K4414K533l3568L0476O86j7282K0549k2073J4109
339A413K5738m4246J7909K0216k5801K2912j9633p738M0451l8216P90K4820l8354
352a9739L1429L357m8568M2919K851k9621K4990j5853M982K3643k9387O448J5020
365A2471p951Q810j6384J865K5473k3304o514J6613r898M618k245j6484J9165
378F235N694k7480J0305J4508j2783Q377p558j2033M0602j1052m1604L7893J4681
391B5785k4550R58q275K1041R513m1267J3296J7592j1552O382k6278Q826L6652
404B8123l6546n213J8434q758K5648k3643k4706N6909j2802l4861K8078k104J580
$$ y = [-11113, 8670, 2946, -2499, 6616, -441, 9277, 12808, -7772, 7878, 19641, -10195, 557, 18810, -11265, -841, 10444, -18431, 5983, 8516, -25052, 5424, 6110, -11172, 9377, -12696, 1413, 27151, -17095, 814, 21030, -4771, 18141, -1492, -9230, 31221, -6995, -6205, 18615, -19739, 11690, 15047, -33521, 9398, 12249, -17372, 7618, -8235, -3253, 20390, -8997, -2549, 12471, 4520, 13330, -3054, -1189, 24284, 980, -5534, 11079, 1181, 5799, 3554, -12930, 6235, 11929, -15551, -5246, 9262, -3521, 4856, -2702, -14735, 25867, 14815, -26789, 11104, 25785, 1235, 2193, -6082, 14959, 24472, -16795, -3499, 14093, 2541, 8923, -17355, -8529, 28123, -8423, -13636, 4798, -3960, 21688, -1955, -26661, 30248, 17446, -17415, 10663, 8559, 10139]
417A0139K824k6298K1799J5322l0982p19J4575K740o670j6237J1850J6561j8130
430c226m100J1945k759N360j140j5578K1336O953k7026J5582M677j3662K1439
443A9801k0466j3006M0233k6031j3980L0009k4145M771J4697k2045J6129o536
455e69o099K5670k6604N750K1357k8371K0947j801k1454M0186k7561k1106N0731
468C1076k6091j5683K2261j9611J7630J957l1397K4660O853j8412O974R08O107
481G232m221q287J7464o005n778J2925j5731L756K1715k1960j2573K5868j883
494A2522k1144Q469O113l930J623j5196R727K6592l3961j0453M0381j2412j4528
507f197J3840o551M729K574k691L032j3031R853Q400j7266J0148m969j1073K3999
$$ y = [10139, 12963, -13335, 8464, 23786, -7196, -7915, 6660, 9400, 2730, -13507, -1657, 14904, -3226, -7326, 4619, 1860, 7220, 6080, -9498, 11838, 18791, -8235, 7347, 12024, -1638, 19801, -665, -13671, 26562, 531, -13449, 16560, -7585, -2814, 11883, -10162, 5967, -569, -6668, 19002, -7602, -1852, 19505, -8866, 12081, 10280, -11174, 29012, 1451, -19655, 31076, 4985, -10698, 11563, -8048, 9582, 11539, -19858, 4802, 11655, -6757, 217, 1125, 7232, 3011, -5276, 12188, 6183, 405, 13330, -2401, 1355, 23070, 1110, -11463, 14405, 12522, -8622, -153, 5960, 2030, 3653, -11543, -1816, 24776, -9185, -19638, 20743, 8331, -6197, 7643, 1092, 5821, 8395, 5704, 8736, -4295, 5558, 13958, -3308, 6840, 1871, -9202, 14797]
521A4797j5817p638K2690k4529M877K8131l0815k154K6570j1173p161N692L641
534G111K983r916l62J1199m566o237L648r31k426J32L313K679j4701m351L1834
549A9409j0407l0991K9448K579j9929K6611j2210j7755K7502q194j796N919k2445
562a2259K1810O893k6921J4693J061o921M434j0727J9441q792k3767L8647j3156
575D436k2657L7773j9985q248K7272k6884J1474J7041l1617J4782P646j5919J7831
588A2945r865j5179J7603K349l768j0126m987K1050m180j4475J0848j776j451
601a012P806o782K026N562j1323O340J0965j5910M06J1650j0855J514N670r705
615c648N244J29p297R135l556k010M576r871J0369O076j5120Q573l6m314J4167
$$ y = [14797, -1020, -8658, 14032, -10497, -5620, 22511, -8304, -10458, 16112, 4939, -2222, 3470, 7111, 10094, 178, -184, 11015, 6449, 212, 3860, 2929, 503, 635, 3948, 6627, -8074, -12425, 19409, 9002, -21989, 7459, 10038, -9891, 16720, 4510, -13245, 14257, 6063, 4267, 10186, -12259, 9551, 16444, -10477, 4216, 5277, -1644, 2790, -7937, 11504, 2712, -21055, 17592, 4436, -18221, 19552, -433, -8681, 18591, -8293, 3181, 20222, -11395, 3387, 11033, -4886, 12945, 3080, -12099, 5504, 7853, 4085, -6041, -11028, 10022, 5842, -8633, 2215, 439, -1012, 6794, 12, 2038, 7600, -3723, 2617, 13582, -2328, -1922, 9728, -1127, 387, 6057, -3648, 1596, 1725, -5572, 3563, 7, -2003, 2573, -7298, 3071, 9147, -5973, 2600, 2564, -1750, 12417]
630A2417j3003k246J3248j5507P268J1375k1639L989J0946p678J743k531l578
643e196O709L39m173K74M601k510l059O983K28l874Q16j559O019o3p744J510K886
660B187K881q156k283J5101j3004o802J8370j2225J316Q332j9130J8430N314k4247
674a3916J9394k33j2185J7603j4004J169J4197j9816P687O355j0009R477j4544
687h825K644K1055k3480J124J2746j3380J3778m039j5063K1230n030j0327J4974
700G407q727r25Q805q434K129K587m080K785m235Q70N323o994j549O520l336r69
716b823J928m278O969J526j3767J0935R746j8433O681O415r995J3497p289j3955
730a2843K0581k437j1395M818n125J0293j24j6619J1763L247n258K734r058J2832
$$ y = [12417, -586, -2832, 10416, -5091, 2177, 13552, -8087, -4098, 6848, -830, 913, -1618, -5196, 1513, 1852, -2321, -2047, 2554, 44, -3015, 3968, 4196, 322, 1138, -421, 5598, 5535, -2209, -699, 2187, 5068, -3088, -5371, 9730, -3274, -10076, 8294, -3931, -2615, 5717, -13413, 5017, 10331, -13916, 5478, 5245, -6940, 10663, -3341, -2172, 12025, -7791, -104, 6251, -3758, 5719, -8825, -6181, 14874, -8606, -7482, 5264, -8116, 5662, 1623, -13440, 7790, 2760, -7567, 7407, -1320, -2245, 6560, -1874, 255, 2842, -1238, 1547, -2688, -1818, 3505, -3489, -5038, 1482, -1854, -2823, -895, -5173, 1796, 3322, -10445, 490, 10236, -8197, -1516, 4899, -5096, 8401, 1112, -12843, 7738, 5301, -6094, -1276, -6401, 3892, 3768, -12851, -1088, 2159, -3099, -365, -9423, 3409]
744C409L446k0770J7057L754j5923J4094n773n652J5781j3338l285J4156r488
757b532k011M316k933L583j837m778L894L221k051m260J456O431k108m873L581
772i01K297l181K185J065o399O226J724r720P671j398p579J2962p959q251J6212
787D954p597l979Q000p254N425K046q100P885k799k50N377j0585P709L607j2573
802h134J0485k118p860J2453r452l200J3707j2078j658J1951p566j400L205j358
816c023L030j54l610J169M371m12n627J835M192j366l388p65K361O70q3l621k600
833g021R607k688j0784J1813l33q474J0831p258j335J2728j3053J032J1308j1529
847e156L110K998n094O649p145J13P549q412L183l47m389J1594r385n640J5740
$$ y = [3409, 6855, -13915, 3142, 6896, -9027, 5067, -706, -6358, 9423, -3915, -7200, 6956, -2532, -4543, -227, -3160, 423, -1414, -6192, -2298, 923, -1128, -5388, -3932, 2499, 391, -4482, -901, 1396, -1785, 400, 1465, -4934, 1292, 3016, -6704, 967, -431, -8010, 4952, -3007, -11258, 4954, -2643, -6622, 1378, -5876, -451, 1595, -6505, 1380, -1419, -1669, 3708, -6877, 832, 4439, -8134, 2351, 233, -7627, 4826, -4626, -7826, 5881, -6197, -7855, 4096, -3470, -4870, -1665, -3023, 7, -147, -3757, -2588, 1783, 1371, -4256, -2421, 1771, 405, -2983, -3748, -1387, -717, -800, -4421, -7021, 2586, -102, -10886, 927, 594, -7880, 2951, -4307, -5642, 7086, -5967, -4935, 6373, -5156, -2046, 952, -4142, 2507, -4638, -4525, 3024, -5388, -2205, -2552, -6941, 4653, -4732, -10372, 5368]
862E368q598k703Q809r042M998N291j0799M960M512o118J182K245j982o67J048
877a496qj591k66N91M87O70k210r89L050L007m662l614R928j471q021Q074k883
894a404k044Q457j0991J338J1758j3915K146Q260r726L922O35l980P207n903j009
909e249N593l752L749m014k004J1839r134l867J1227p325J529L838j0569Q737
923E98M266j3188N151N563o203J023J253k085J471J068k321J247J877k505J03
938b682K874l64j795m42L569j943k682N621m573j965Q033q508O35Q948j2075L534
954c815Q051j1597O476J912q669J0150k027n280O162l632K481O98m904P180o024
969b838j645J0507j1202J629P586j1039O908K210j0315R989p54p971P393k78l003
$$ y = [5368, -3230, -5933, 2876, -6166, -1168, 4123, -6676, -1716, 2796, -3322, -2140, 105, -1877, -2544, -1496, -1504, -3095, -3361, -2770, -2283, -1613, -3823, -4812, -1762, 1245, -3417, -7031, 2897, 1426, -6595, 1479, -1404, -3448, 5009, -5982, -4644, 7114, -6801, -4655, 3605, -6121, -2199, -1564, -5544, 1663, -4240, -5249, 344, -3408, 341, -3673, -5677, 6162, -2972, -6839, 4388, -2937, -1408, 2430, -8139, 598, 4864, -8324, -3173, 2390, -3813, -2790, -1537, -3622, -2151, -1083, -3404, -2157, -280, -2785, -2682, 192, -172, -1967, -2409, 1160, -783, -3465, 2156, -2417, -4382, 3651, -4857, -4222, 4726, -7349, -3815, 4236, -7361, -885, 1027, -7642, 2508, 481, -4799, 1363, -2269, 212, 910, -3994, 3186, -2838, -4483, 6024, -5178, -3549, 4037, -7002, -94, 2116, -8199, 1790, 1036, -6935, 458, 180, -2823]
984b823K735k175O73K457K69k627l238O515J312o490J878J006j298K443j746k313
1000c422L023K64l818L743K627p938K359P301n833k66K418l974O082r7q699O563
1016C33L687o209l01J372K648m05n303J084K663K912k505p105O477N346p907J513
1032a700L212m264K874K113l308J690p20l403O058J717q980J309N946k454J09
1047A99k019k164O556k204l818K675J61K509l024k687Q208m546j976N763q453
1062d820N849N686j2477O349J541p589J1683n426q404J0248l165N62K672q673
1076e964O116J727l945N577o534J446O141p290O202j109r744J2245j431p189O784
1091C032m894J095N700q201J233N338l319j224j24K353J335l487L74N54J727K026
$$ y = [-2823, -88, -2263, -1590, 867, 1136, -1491, -4729, 1786, 3098, -3392, -1514, -508, -1806, 637, -1109, -3422, -399, -135, -3953, -210, 2417, -5521, -3162, 4139, -1694, -1960, 458, -3516, 2566, 2469, -6230, 333, 4020, -2189, -2490, -1118, 1530, 1125, -4178, -3094, -431, 2481, -24, -7129, -652, 4694, -3213, -1700, 1512, -2752, 122, 2235, -1073, 617, -103, -3506, 2552, 4269, -4711, -3402, 2544, 90, 199, -1820, -3984, 2572, 368, -3450, -775, -614, 1895, -1129, -3816, 4392, -154, -2130, 3633, -4820, 1029, 6715, -5762, 587, 2128, -5461, 6222, 796, -7608, 2640, -525, 37, 2709, -5964, 152, 1879, -2066, 3511, -3023, -1577, 4564, -2726, 3476, 2367, -7377, 4868, 3437, -3752, 3032, -1862, -767, 4933, -3268, -2035, 3303, -16, -1240, -1364, 989, 2324, -1163, -789, -235, 1492, 3518]
1107C518m980O53L284k007M73J260k713j180L126J225l233L84k22j651N861j884
1123A914o436O245o56j980M516l676j660M440j650K65J49k050J915k20N63j284
1139C95j602M171k514k699N311k123k592L098j465Q49K270l699p65M180q14l447
1155a446L407N45l900L054P84k304K999l677j552O010k116k630O54LL122k742
1171B11o56K512l714L988M32n320O902l548m003J0093n919m181Q285n317N85M317
1187D667p281L881J844m572L132j619R95J299m247M286o24l420N880m420j130
1202a329O710n505N6M377n892K365M223n744L12K560j582J091m7k321P24K241
1218B239j140j358P22P64R5N1O29j509j26K829j866k044M129k320j487M331m214
$$ y = [3518, -1462, -809, 2475, 468, 941, 2201, -512, -1692, 1434, 2659, -574, -190, -412, -2063, 3798, 1914, -4522, 1723, 1067, -913, 3603, -73, -1733, 2707, 1057, 1322, 1471, -579, 1336, 1116, 1679, 395, -1207, 2964, 450, -2249, 3062, 939, -1653, 1445, -20, 829, 3099, -600, -1365, 2815, 2001, -1446, 1961, 2506, -1394, 1660, 2444, 140, 3139, -538, -2090, 3920, 1804, -826, -172, -169, 2953, 211, -445, 2067, -1647, 2341, 2773, -2547, 4355, 807, -3196, 6897, 978, -3203, 5082, -235, 350, 4667, -2614, 1267, 3111, -1461, 1671, 52, 1047, 2346, -1901, 2385, 1761, -1659, 4221, -199, -1329, 5381, -124, -68, 4309, -1583, 782, 5005, -739, -427, 2133, 551, 1642, 1595, -726, -2, 2239, 1099, -259, 463, 1227, 1322, 1373, 2002, 493, 367, 3196, 1330, -714, 3415, 1095, -392, 3939, -275]
1235b75O5M678n645R86L752m511K090J546l631K035L54j07L09j758J649R6l33
1252A300J872m316J861M258n515M92K851k928J883M64l292K656J121l267P09K589
1268B738k123r04K858j405j067K547j763K14J915l080R76K258k171p13P76J850
1284B906j537k333K874p37j146L049m413J470M605o909K398L888n443K713J639
1299C024l815L356j712q61K736k112J89J19M76J165l867J452M051n117N62K571
1315B217k432K675q96l452M529J28l748J581J939j762p27J671o58rP28k564J699
1332I19K081l778K53L127j484j764J76K274l6k338J289m52J356J473n495K967
1348E68M025n687J518K310l680L357j189l105M614j676k402K709p29M7p29N40
$$ y = [-275, -210, 4468, -1177, -191, 3561, -950, 1140, 2686, -945, 1090, 1444, 1337, 1646, -112, 1537, 1633, 1300, 3172, -1144, 717, 4975, -540, -48, 2803, -125, 1758, 2222, -1070, 1586, 2707, -560, 149, 2738, 615, -289, 2569, 1164, 97, 2644, 881, 1095, 3010, -70, 906, 3164, 993, 280, 1056, 2906, 1369, -964, 1910, 1173, 27, 3076, -1337, 133, 4738, -2171, 227, 4115, -1328, 1385, 3024, -791, 2565, 853, -8, 2728, 616, 805, 924, 1400, 2565, -1302, 150, 4201, -916, -354, 2217, -215, 2460, 1564, -1888, 2641, 2769, -979, 602, 2541, 779, 52, 1723, 1065, 1056, 1784, -780, 919, 3000, -778, -525, 2602, 1118, -646, -470, 1804, 1768, -570, 719, 267, 1623, 3096, -2399, 568, 4593, -1094, 424, 2734, -946, 2411, 1222, -1883, 2731, 1055, -1347, 1362, 633, 680, -49, 491]
1364D91J392k421P30J606k294K216k39k761L762m64l506K612L75j447R34j40j176
1381c30J775M55l229J543J789k480P68J312k584K020L62j830J173P8j92J02j63
1398E69J068k092P47K067l646J710J541l642L103m78l572M764q03l447L595j301
1414A83m80J856j836L42P34l63K68j184J274M8k215K775k45k837K851l97k182
1431a408K300o99j584K931j061k436L077L31l057J767R60j606J617j407n66K214
1447A373o75j492L49O66O01k160J082J516k915J959O51k764L602j550l125N388
1463B506k377k484M431k729j80K258k383J506Q5j971J737m21N79q50k224M083
1479A566j121k106K932k714L11L388l567L64K352k584J423M40j645N38N60O30
$$ y = [491, 1883, -538, 192, 1798, -496, 1720, 1481, -1280, 2482, 2018, -1488, 1124, 1499, 52, 986, 846, -330, 1445, 1900, -1329, 214, 2003, -477, 291, 1603, -981, 1039, 1401, -429, 744, 822, 630, 732, 569, 1637, -455, 292, 2359, -1287, 423, 1964, -1678, 1425, 947, -2625, 2139, 1336, -2111, 1484, 183, -297, 1559, -277, 65, 799, 436, 704, -480, 794, 842, -1373, 1402, 1157, -1680, 1171, 774, -1408, 892, 193, -1391, 1540, 479, -1957, 1120, 1451, -1606, 161, 1121, -485, 1132, -275, -841, 1373, 698, -794, -445, 221, 822, -1338, -256, 1260, -1655, 304, 955, -1809, 1793, 243, -2882, 2506, 129, -2355, 2076, -653, -833, 1425, -958, 548, 633, -1338, 399, -22, 557, -293, -2517, 1566, 445, -1661, 1271, -1443, -1132, 2256, -1311, -947, 1405, -1179, 244, 684, -961, -423, 137, 767]
1495G67j294l67J652j586N04N46k213K745j34l051K291M72p32K45o84J37Q24L18
1513D40m28j575J308O21q99J377j768j763M262r91k511J986j236M52J696k234
1529a263l76J987m62q43P31k21m54O65M23r71L46Q89p45m39M55j56k2Q77j467
1548a046j686L806k22k872J622q46L0L348l560j275L795j923O15Q25k796J828
1564c57O2L5Q64l375K095J364k364K591k400j166N164l915p77M160m307J350K149
1581A173l923L058N46l180K675j080k47J666k378J330o76m53L709l655q63L604
1597A306l046J533J346m821L034J539k602J633j77j489J426M57n54o83m37Q10
1613g25K25K86m04j284K098j75j849J721j19j822J623r2q46J069j7j806J871P38
$$ y = [767, -527, -894, 758, -828, -324, 222, -1991, 754, 620, -2431, -140, 332, -400, -155, -839, -702, 122, 440, 12, -1563, -255, 366, -533, 844, -924, -2687, 1575, 584, -1927, 59, -1177, -725, 971, -1263, -1639, 348, -114, -957, -226, -447, -901, -236, 187, -784, -438, 451, -294, -733, -278, -434, -456, 421, -1046, -2732, 1074, 852, -2020, -398, -1244, -1214, 2134, -1426, -2701, 1094, -829, -214, 611, -2185, -357, -295, -260, 604, -2771, -676, 688, -1676, 915, -1485, -2651, 2513, -1402, -2179, 1981, -2326, -976, 1173, -2750, 308, 854, -2326, 349, -731, -978, 688, -1690, -360, -1036, -1489, 2220, -1435, -2298, 1306, -1740, -207, 1139, -3682, -648, 891, -1711, -78, -255, -1744, -318, 139, -415, -1098, -1535, -725, -500, -214, -618, -1902, 196, 21, -1828, -107, -226, -2048, -425, -517, -1363, -294, -311, -2117, -246, 492]
1631D92k177P05J151j166K81J081j109j27J70q4j2J180j487o51J628kj082O76
1649e33q55R8K206j328j209Q58K11J83J10J06j295J81K143j924o81K876k222n83
1667a658K716k387J23J429k444K148L62k172J652j42q52P30q86K027p18k004K310
1684B34q52M04P67l794L281J941m732K064J219k483K619q35j675K000j170K63
1700g49P76k83k2r99J161J311l148R55J532j544J084r31p65K994j831j832K242
1717d9N01j709N34N39q46Q37K5j093Q23Q13j734P07Q14j496L99J225k17p94o57
1736a378J390q2j20j92j109J849m7k476K126K97k126K496p81j127J707j119n85
1753a277J747p31q16P53P60j122p89J815k21j626J265m62j49J505j753j8J967
$$ y = [492, -1685, -980, 171, -995, -714, 367, -742, -869, -699, -783, -795, 385, -1102, -1753, -125, -127, -1209, -533, -1388, -1290, 916, -412, -1621, -763, -552, -369, -259, -153, -1448, -1267, 876, -1048, -1729, 1147, -1075, -1658, 1058, -1329, -1206, 223, -2221, -73, 289, -1883, -231, -373, -1225, -495, -1381, 646, -72, -2076, 234, -618, -214, 553, -3241, 40, 1981, -2751, -687, 532, -1951, 668, -167, -1842, 158, -1012, -749, 27, -256, -278, -1277, -116, 1195, -1953, -998, 534, -1010, 74, -857, -1622, 1372, -459, -2291, -49, 452, -1257, -723, -184, -1030, -193, -168, -1261, -438, 375, -1359, -652, 162, -1334, -935, 290, 73, -721, -1378, 12, -70, -190, -382, -1491, 358, 311, -2165, -39, 258, -1868, 628, -153, -1280, 427, -692, -1277, 470, -261, -1077, -324, 436, -686, -1475, 340, 119, -1507, -242, -704, -853, 652, -1101, -1119, 848]
1770H48j459l04P81q1k39J32m0m85J112j1j501J370N69k291K065J59k045J423
1788CM3r24N63K82j79j33P7L41j174J219O78j930J355M4j438J873r40j188K252
1807H24j294j13J332j444L47J210j379l83P21O89o12o19J249o65q86K124j544
1824d43l7J262j294k99J022l22n34J085Q4j081N83M95q80P16p76k74J551j152
1842b94p65J791m18o70O17j99P9m00M86k6p34J621p88j306K090r97j346K322q30
1861B33j101J325p98L66K21j029P09P15p60j55K64P79q87K55N16r98O96N97j465
1880e17Q64N58j501Q02P61j180r7J135l90j057R50J00p59J037l84p96J414p90
1898A50q05J371m78k92N18m00K98J7m5j06Q6J48m69l48J574j402o11K180j383
$$ y = [848, -611, -915, -134, -215, -454, -322, -362, -847, 265, 254, -1247, 123, 692, -1599, 466, 625, -1420, 3, 46, -878, -315, -33, -212, -345, -268, 73, -1101, 118, 796, -1134, 221, 265, -1173, 700, -240, -1428, 824, -470, -583, 749, -695, -348, 862, -517, -900, -179, 510, -102, -721, 528, -137, -1023, 1101, -443, -480, 782, -512, -811, 211, -111, -645, 440, 524, -557, 26, 521, -359, 357, -419, -693, 858, -294, -1059, 732, 314, -356, 261, 62, 141, -259, 227, 201, -533, 1088, 300, -1006, 1084, 87, -1259, 1063, 233, -868, 457, -341, 25, 246, -783, -74, 641, -119, -274, -10, 769, -118, 137, 653, -345, 351, 948, -517, 347, 905, -596, 206, 967, -213, -310, 825, 435, -622, 328, 428, -331, 706, 322, -474, 940, 150, -655, 716, 238, -54, 464, 64, 362, 379, 334, 228, 314, 462, -7, -355, 1219, -183, -794, 1386, 3]
1917Cp07J908j058p0Q21r88J11R55p26j71M00P5k32l21L51j01J90k14l34Q66l26
1938D32q88J092M56j405L65J270j073k90R72p84k77J429j272j41J287j022n4Q35
1956I32o95K41j55j86N92o73N52j42m98R30n67m04J208j699J150J113k025P07
1974C81J196j916J011K07j282J372l71m62j44L45N87j361M47J104j128O27K91
1991I04j296J244j87o95J263r99n98J425m7p69R5J41J45K55m56q16K99J535j304
2010A39n69J683j113j52J249r59j20Q34p91J96K54n69L23o5J16k84N4O10l75n18
2030e7K91k1O54q5j313Q10J197j284K08J02j009R19R85j675J82Q72q5k69p6j52
2050A94K65k85P78q20n13J487j091K20J006j740Q91N62j679J244N07j928K325
$$ y = [3, -704, 1204, 146, 76, 897, -91, 20, 975, 249, 78, 478, 553, 321, 0, 351, 250, 440, 226, -108, 758, 432, -456, 636, 1092, -313, 52, 1322, 249, -41, 931, 147, -130, 1299, 27, -114, 1173, 151, 97, 932, 237, 478, 323, 137, 729, 56, 608, 466, -32, 898, 331, -73, 1135, -564, 586, 1699, -326, 381, 1577, -339, 672, 879, -403, 969, 598, 136, -8, 337, 924, -437, 10, 1114, -14, 613, 904, -392, 852, 665, -30, 1233, 234, -364, 1061, 1014, 245, 340, 481, 626, 881, 425, -391, -92, 1443, 139, -430, 1253, 140, -12, 1237, 278, 158, 992, 201, 397, 651, 82, 405, 340, 456, 172, 226, 836, 461, -57, 234, 213, 867, 782, -531, 279, 1476, 192, 400, 502, -507, 412, 1397, -278, -96, 776, 691, 422, 346, 194, 459, 174, 952, 132, -381, 1106, 15, 235, 1241, -499, 392, 954, -725, 519, 1026, -902, 1423]
2067A423o45j812K319k57j193O59n80Q25p7r19Q12r77P77J074k412J339N85j782
2085h41K035n86j466J723m90l70R83j523Q12J018j173Q7j42L88N4q48Q66Q5j163
2104e51J485n92q93K008j402n47J746j073k42R38n32J28n38N76M0l74k53j95Q52
2123E81K76j349N05M23k99J8K00n20J41P86p58P69Q7j446M41J258q50o22P09j25
2143B25j45O7j00L08O8J7k86p8N15r34P1R07o55R7O30j147J089J39j350J120R3
2164F51j124P94K69k33p97N28K98l27K10J19j353J339O10j875J254K9j157J559
2182G94n39p54R17m66M34K21q45M21J07j75J6l74O12k14n52J043o88q53J817r65
2202d3n46J461j269J5Q80j088N66N38k43l85n55P84K59l20J30n80P0R13o49l26
$$ y = [1423, 778, -1034, 1285, 1028, -165, 494, -86, 739, 662, -257, 555, -422, 355, 1429, -983, 356, 941, -841, 1194, 608, -858, 865, 375, 5, 988, -535, 277, 1295, 122, 209, 67, 455, 509, -339, 527, 612, -551, 934, 342, -551, 1457, 55, -492, 1254, 181, -61, 877, 345, 473, -65, 511, 551, 177, -76, -271, 581, 857, -492, 13, 436, 137, 155, 355, -165, -24, 762, 4, 773, 860, -586, -145, 1113, 263, -359, 350, 225, 80, 147, 47, 355, 423, 440, 154, 76, 591, -343, -272, 635, -20, 77, 707, -440, 649, 788, -562, 558, 651, -473, 321, 590, 357, -440, 88, 386, 59, 269, 388, -965, 374, 984, -891, 363, 392, -765, 794, 255, -499, 418, -48, 386, 607, -238, 183, 290, 115, 131, -243, 369, 155, -397, 646, -42, -895, 922, -43, -589, 872, -397, -382, 498, -590, -24, 514, 271, -114, -669, 115, 374, 54, 184, -396, -326, 587, -62, -388]
2222c88O87o81M98M22j088L50O35o59L5L67p50M45M84l62o29Q24J26n43J68M02
2242C43p38K98K81l80J59J45l90m8O29q70N80L03p60J19J047j040O4O03q30O19
2262A34J52n60k08Q26p1j174J093N2p60L48J96l71P62l59r31R73Q7o97K88M76
2282B56o42R8M59j2m50M24q25N89N14r14j15J115o65m87O41k71J50r7j52K56R1
2303c7j09k97K31N78r17Q0P91p79J57L83n63M90Q8q54O85L74q12L26N27n12m0
2324b10R3o9p2K04Q5m86O22l10k49L71j43l10P6L21k56k1k8r0K38J99k15K12L32
2347B94j411R33N90r77J59M39p40N85j66k21L28K80k58j30J18k1n79N57M89j039
2367g70L90M18n30M38j14m84O29j40l89J08O94o24o2L91l80J77N62m07n26O84
$$ y = [-388, 299, -382, 116, 538, -550, -200, 435, -224, -189, 178, -572, -127, 357, -5, -634, 190, 316, -227, -59, 343, -395, -97, 184, -196, -37, 108, -282, -330, 299, -571, 9, 312, -448, -329, 718, -322, -258, 345, -485, 134, 286, -274, -482, 344, 273, -901, 192, 244, -516, -168, 28, -343, 419, 60, -871, 102, 189, -508, -220, 256, -386, -288, 171, 159, -291, 133, -692, -103, 411, -503, -618, 497, -168, -655, -14, -285, -135, -232, -384, -128, -37, -146, -443, -212, 366, -551, -471, 320, -459, -302, 81, -482, 8, 96, -758, -73, 301, -511, -185, 342, -170, -210, -117, -186, -258, -54, 31, -455, 167, -143, -392, -21, -164, -474, -398, -77, -333, -354, -382, -472, -234, -35, -250, -38, 294, -1117, -184, 406, -571, -412, 27, -713, -128, -294, -515, -187, 93, -165, -295, -177, -198, -777, -220, 269, -770, -380, 38, -492, -54, -168, -652, -23, -163, -552, -444, 250, -374, -436, -45, -425, -248, 314, -93, -619, 65]
2387F5n07J43P52o47n37O18j03k82K22K21n05M02J41m68N86J02j191L62Q85r33
2407f74M82N22q88L79Jo32N23J43n47M79K96k38o51Q02k20k31M36k23l21N80K6
2428D4o56L93M35q30O67R3r12J86L48L3k04K37j89R4p1K9P3pk93M12J33j01o62
2451g48O46L21q39L27M46j150J090q4m10L56J26q32P91P3q74P01l22K67k94O3
2471c46j8p8L45l3q9M39o25m92J230k45m99N57p29R5P22o11J55K67o44M25K8L00
2493A54l75k17Q60o79j25N83m61K4M14o67J78O99q91K43J08n0R8k35k30K72L95
2514I8l2n54N69O8q35P21K36r13K71N22n42K90j31l99N69j43j56J69O96p97P8
2535b15K23q9K1K35k13q1J3p1k26Q00m39l63O28J70j109R47l21k35L07m6k84Q08
$$ y = [65, -442, -299, 453, -194, -731, -113, -216, -498, -276, -55, -560, -158, -17, -485, 101, 203, -988, -626, 259, -674, -192, 330, -558, -179, -178, -810, -287, -144, -691, -212, 84, -154, -805, -3, -223, -454, -18, -241, -562, 18, 44, -612, -219, 216, -614, 53, 146, -766, -580, -232, -199, -403, -166, -355, -261, -332, -303, -230, -237, -530, -118, 15, -86, -748, -102, 219, -620, -293, 153, -997, 93, 9, -401, -45, 81, -751, 40, 113, -761, -60, -382, -115, -409, -346, -364, -442, -97, -130, -219, 220, -405, -897, 333, 88, -411, 146, -583, -488, 234, -377, -222, 45, -599, -174, -146, 154, -221, -438, 422, -257, -382, 201, -260, -236, 178, -489, -311, 388, -503, -260, -152, -202, -104, -339, -569, -297, 98, 66, -488, 81, 149, -686, 35, 271, -642, -371, 151, -391, -101, -232, -631, -62, -205, -361, -192, 504, -293, -215, 8, -81, -60, 175, -38, -119, -106, -177, -403, 397, -42, -405, 223, 393, -716, 231, -90, -325, -18, -64, -348, 460]
2557D60m68m51L75j05K67m14N6K72j32M08O6j025O28J08k17L83l37m31J000p35
2577b92j23N55l33M13j97m40O47k10j08J11k71O00n15j85P36o28k4M96o89L32
2597a25M96q92P15k46l28L06j29O0M62m32j31L15j69L03k59j46M50n58P44L6r57
2618d85M93M23p02M23j57k18K99J95l65J02l4O2j52J24m4k79M76l5o78Q40q3k97
2640i2M43l01o35R05k62k92L37L0j7J63n97M6N42l9j89j15J96l9j30N27n00k99
2662c18R55k96n91N77n93M87L56n88j85M37k2r7j05M0j40J69NK2r7J86k49r6P15
2685E72n95O4K87q04L75Q16p95N0L39m83N34l89k53L37R6q8J92j22Q1m46M69M50
2707F87o15J2Q6k24N20k08m99O98J97p90M30n2K07l16j31j8K85Q5k60p4K90k2
$$ y = [460, -8, -459, -84, -189, 78, -336, -280, -8, -140, 268, 334, -691, -63, 45, -172, 211, -126, -557, 443, -292, -415, 140, -193, 220, 23, -417, 230, 20, -88, 23, -248, 352, -163, -348, 388, -240, -264, 232, -457, -125, 371, -521, 194, -52, -380, -74, -203, -143, 319, -113, -244, 71, -98, 205, -54, -200, 250, -308, 436, 472, -485, 8, 431, -271, 152, -5, -223, 76, 271, -94, 8, -26, 36, -116, 8, -36, -315, 161, 126, -552, 288, 205, -92, 351, 50, -585, 320, 58, -234, 103, 133, 116, 279, -318, -272, 270, 231, 42, -73, 123, 84, -46, 481, -19, -318, 637, 341, -250, 327, -266, 221, 577, -11, -196, 241, 219, 122, 17, 57, -83, 86, 91, 113, 16, 202, -47, -143, 572, -23, 41, 328, -476, -101, 715, -80, -30, 309, -174, 360, -29, -282, 55, 151, 63, 255, 133, 214, -232, 237, 687, 72, 84, 170, -54, 466, 258, -241, 457, 654, -136, 294, 242, 449, 133, 2, -16, 269, 354, 94, 20, 310, 288]
2729B88j64K00k06j49J77K69m57j7L61l99N28j04m36K57K4j35j05J77K1K0N3j39
2751F4QQ9j1j96L59N7m27N53m43m05O36Q2n21M40j26j36J53Kj82J88Q9k36J07
2774A44j87J70l43P15l90k22L45k48K47j62o1R9L46l86J01P2k74l6J79J41k48
2795BK77lk17O9L11o93K86L21k90J48k13P8J48J92m37K32k49J77n2K00k90q0L06
$$ y = [288, 124, 324, 118, -31, 146, 415, -42, -59, 302, -97, 431, 327, -109, 148, 172, 37, -68, 109, 130, 150, 203, 64, 72, 161, 150, -46, 313, 370, -57, 496, 53, -352, 284, 366, -155, 285, 159, 23, 176, 178, -4, 184, 273, 37, 144, -43, 127, -216, 499, 109, -113, 232, -16, 231, 69, 8, 107, 453, 67, 168, 240, -34, -70, 109, 250, 2, 279, 276, 59, 128, 439, -254, 32, 353, 63, 211, -2, 76, 224, 416, -21, 211, -38, 139, 87, 287, -3, -83, 223]
$$ [...]
8191d1
##END NTUPLES=NMR FID
##END=
