##TITLE=1H_Pr nCl
 200.13MHz,CDCl3,
 8 sc
 
 12.11.2025
##JCAMPDX= 6.0         $$ Bruker NMR JCAMP-DX V2.0
##DATA TYPE= NMR FID
##DATA CLASS= NTUPLES
##ORIGIN= UXNMR, Bruker Analytische Messtechnik GmbH
##OWNER= pz
$$ XWIN-NMR		Version 3.5
$$ Wed Nov 12 15:26:58 2025 Russian Standard Time (UT+4h)  she@DPX200
##.OBSERVE FREQUENCY= 200.1313
##.OBSERVE NUCLEUS= ^1H
##.DELAY= (6, 6)
##.ACQUISITION MODE= SIMULTANEOUS
##.ACQUISITION SCHEME= undefined
##.AVERAGES= 8
##.DIGITISER RES= 18
##SPECTROMETER/DATA SYSTEM= spect
##.PULSE SEQUENCE= zg30
##.SOLVENT NAME= CDCl3
##.SHIFT REFERENCE= (INTERNAL, CDCl3, 0, 14.3821)
##AUDIT TRAIL= $$ (NUMBER, WHEN, WHO, WHERE, WHAT)
$$ ##TITLE= Audit trail, XWIN-NMR		Version 3.5
$$ ##JCAMPDX= 5.01
$$ ##ORIGIN= Bruker BioSpin GmbH
$$ ##OWNER= she
$$ F:/spectra/data/she/nmr/H-C/1/audita.txt
$$ ##AUDIT TRAIL=  $$ (NUMBER, WHEN, WHO, WHERE, WHAT)
(   1,<2025-11-12 15:25:32.87 +0400>,<she>,<DPX200>,
      <created by zg, POWCHK disabled, PULCHK disabled
       configuration hash MD5:
       00 E9 B6 7A A2 85 ED C7 34 08 36 98 17 FE 4E 26
       data hash MD5: 16K
       D1 BF 9B A2 22 7B 01 2C 7B 08 1A D9 4B 48 BA 71>)
$$ ##END=
$$ 
$$ hash MD5
$$ DB 20 81 39 C7 04 5D 59 18 14 47 FA 19 81 47 2F
##$RELAX= 
##$RELAX= 
##$RELAX= 
##$RELAX= 
##$RELAX= 
##$RELAX= 
$$ Bruker specific parameters
$$ --------------------------
##$DU= <F:/spectra>
##$EXPNO= 1
##$NAME= <H-C>
##$PROCNO= 1
##$TYPE= <nmr>
##$USER= <she>
##$AMP= (0..31)
100 100 100 100 100 100 100 100 100 100 100 100 100 100 100 100 100 100 
100 100 100 100 100 100 100 100 100 100 100 100 100 100 
##$AQSEQ= 0
##$AQ_mod= 1
##$AUNM= <au_zg>
##$AUTOPOS= <>
##$BF1= 200.13
##$BF2= 200.13
##$BF3= 200.13
##$BF4= 200.13
##$BF5= 200.13
##$BF6= 200.13
##$BF7= 200.13
##$BF8= 200.13
##$BYTORDA= 1
##$CFDGTYP= 0
##$CFRGTYP= 5
##$CHEMSTR= <none>
##$CNST= (0..31)
1 1 145 1 1 1 1 1 1 1 1 1 1 1 1 1 1 1 1 1 1 1 1 1 1 1 1 1 1 1 1 1 
##$CPDPRG= <>
##$CPDPRG1= <>
##$CPDPRG2= <>
##$CPDPRG3= <>
##$CPDPRG4= <mlev>
##$CPDPRG5= <mlev>
##$CPDPRG6= <mlev>
##$CPDPRG7= <mlev>
##$CPDPRG8= <mlev>
##$CPDPRGB= <>
##$CPDPRGT= <>
##$D= (0..31)
0 0.7 0 0 0 0 0 0 0 0 0 0.03 0 0 0 0 0 0 0 0 0 0 0 0 0 0 0 0 0 0 0 0 
##$DATE= 1762946732
##$DBL= (0..7)
120 120 120 120 120 120 120 120 
##$DBP= (0..7)
150 150 150 150 150 150 150 150 
##$DBP07= 0
##$DBPNAM0= <>
##$DBPNAM1= <>
##$DBPNAM2= <>
##$DBPNAM3= <>
##$DBPNAM4= <>
##$DBPNAM5= <>
##$DBPNAM6= <>
##$DBPNAM7= <>
##$DBPOAL= (0..7)
0.5 0.5 0.5 0.5 0.5 0.5 0.5 0.5 
##$DBPOFFS= (0..7)
0 0 0 0 0 0 0 0 
##$DE= 6
##$DECBNUC= <off>
##$DECIM= 32
##$DECNUC= <off>
##$DECSTAT= 4
##$DIGMOD= 1
##$DIGTYP= 9
##$DL= (0..7)
0 120 120 120 120 120 120 120 
##$DP= (0..7)
150 150 150 150 150 150 150 150 
##$DP07= 0
##$DPNAME0= <>
##$DPNAME1= <>
##$DPNAME2= <>
##$DPNAME3= <>
##$DPNAME4= <>
##$DPNAME5= <>
##$DPNAME6= <>
##$DPNAME7= <>
##$DPOAL= (0..7)
0.5 0.5 0.5 0.5 0.5 0.5 0.5 0.5 
##$DPOFFS= (0..7)
0 0 0 0 0 0 0 0 
##$DQDMODE= 0
##$DR= 18
##$DS= 0
##$DSLIST= <SSSSSSSSSSSSSSS>
$$ [...]
##$SUBNAM0= <"">
##$SUBNAM1= <"">
##$SUBNAM2= <"">
##$SUBNAM3= <"">
##$SUBNAM4= <"">
##$SUBNAM5= <"">
##$SUBNAM6= <"">
##$SUBNAM7= <"">
##$SUBNAM8= <"">
##$SUBNAM9= <"">
##$SW= 18.0517328524113
##$SWIBOX= (0..15)
0 0 2 0 0 0 0 0 0 0 0 0 0 0 0 0 
##$SW_h= 3612.71676300578
##$TD= 16384
##$TD0= 1
##$TE= 0
##$TE2= 300
##$TE3= 300
##$TEG= 300
##$TL= (0..7)
0 120 120 120 120 120 120 120 
##$TP= (0..7)
150 150 150 150 150 150 150 150 
##$TP07= 0
##$TPNAME0= <>
##$TPNAME1= <>
##$TPNAME2= <>
##$TPNAME3= <>
##$TPNAME4= <>
##$TPNAME5= <>
##$TPNAME6= <>
##$TPNAME7= <>
##$TPOAL= (0..7)
0.5 0.5 0.5 0.5 0.5 0.5 0.5 0.5 
##$TPOFFS= (0..7)
0 0 0 0 0 0 0 0 
##$TUNHIN= 0
##$TUNHOUT= 0
##$TUNXOUT= 0
##$USERA1= <user>
##$USERA2= <user>
##$USERA3= <user>
##$USERA4= <user>
##$USERA5= <user>
##$V9= 5
##$VALIST= <valist>
##$VCLIST= <CCCCCCCCCCCCCCC>
##$VD= 0
##$VDLIST= <DDDDDDDDDDDDDDD>
##$VPLIST= <PPPPPPPPPPPPPPP>
##$VTLIST= <TTTTTTTTTTTTTTT>
##$WBST= 1024
##$WBSW= 4
##$XGAIN= (0..3)
0 0 0 0 
##$XL= 0
##$YL= 0
##$YMAX_a= 74272
##$YMIN_a= -85658
##$ZGOPTNS= <>
##$ZL1= 120
##$ZL2= 120
##$ZL3= 120
##$ZL4= 120
##$ABSF1= 10
##$ABSF2= 0
##$ABSG= 5
##$ABSL= 3
##$ALPHA= 0
##$AQORDER= 0
##$ASSFAC= 0
##$ASSFACI= 0
##$ASSFACX= 0
##$ASSWID= 0
##$AUNMP= <proc_1d>
##$AZFE= 0.1
##$AZFW= 0.1
##$BCFW= 1
##$BC_mod= 2
##$BYTORDP= 1
##$COROFFS= 0
##$CY= -3
##$DATMOD= 1
##$DC= 2
##$DFILT= <>
##$DTYPP= 0
##$F1P= 0
##$F2P= 0
##$FCOR= 0.5
##$FTSIZE= 0
##$FT_mod= 4
##$GAMMA= 1
##$GB= 0.15
##$INTBC= 1
##$INTSCL= 1
##$ISEN= 128
##$LB= 0.25
##$LEV0= 0
##$LPBIN= 0
##$MAXI= 10000
##$MC2= 0
##$MEAN= 0
##$ME_mod= 0
##$MI= 1.114404
##$NCOEF= 0
##$NC_proc= 0
##$NLEV= 6
##$NOISF1= 3.799351
##$NOISF2= 2.8
##$NSP= 1
##$NTH_PI= 0
##$NZP= 0
##$OFFSET= 14.38212
##$PC= 1
##$PHC0= -2983.125
##$PHC1= 9.192339
##$PH_mod= 1
##$PKNL= yes
##$PPARMOD= 0
##$PSCAL= 0
##$PSIGN= 0
##$REVERSE= no
##$SF= 200.129724274929
##$SI= 16384
##$SIGF1= 3
##$SIGF2= 2
##$SINO= 400
##$SIOLD= 16384
##$SREGLST= <1H.CDCl3>
##$SSB= 0
##$STSI= 0
##$STSR= 0
##$SW_p= 3205.1282051282
##$SYMM= 0
##$S_DEV= 0
##$TDeff= 0
##$TDoff= 0
##$TI= <>
##$TILT= no
##$TM1= 0
##$TM2= 0
##$TOPLEV= 0
##$USERP1= <user>
##$USERP2= <user>
##$USERP3= <user>
##$USERP4= <user>
##$USERP5= <user>
##$WDW= 1
##$XDIM= 8192
##$YMAX_p= 0
##$YMIN_p= 0
$$ End of Bruker specific parameters
$$ ---------------------------------
##NTUPLES= NMR FID
##VAR_NAME=  TIME,          FID/REAL,        FID/IMAG
##SYMBOL=    X,             R,               I
##VAR_TYPE=  INDEPENDENT,   DEPENDENT,       DEPENDENT
##VAR_FORM=  AFFN,          ASDF,            ASDF
##VAR_DIM=   8192,          8192,            8192
##UNITS=     SECONDS,       ARBITRARY UNITS, ARBITRARY UNITS
##FACTOR=    0.0002768,     1,               1
##FIRST=     0,             0,               0
##LAST=      2.2672688,     0,               0
##MIN=       0,             -85658,          0
##MAX=       2.2672688,     74272,           0
$$ Real data points
##PAGE= N=1
##DATA TABLE= (X++(R..R)), XYDATA
$$ [...]
1520A16J0j60r5j5Q3K21k72R1M65k21n07L33K04j94M4k96N18m41j94K46Ol9K99
1543B02j31k29M07k29k08J77M38l63m72K77N83n23j29N04R6m82j55J06R4j71o4
1564b72L21p6l6Q8j34J2M3j13q5O54j07l83J37J11k14k39M11J76n4m31j3m6J73
1587g7K28k19R4j47J48n3j47J00J36o7rL70k93m43O77l12k3N4J2k0q2k95L83j65
1611a50L8J95Q7j53J59k28p5Q6L44l37j03K70P6n04K43L34k77m8m4L37l95J1J59
1634B5J26r0k9j26o5L07k02q6K32M40n53m8K29o5l20J66J07J44k36j70L80j27
1656C9n0j02J28o7K60k03o6m3K78k99p8M09j28p8m2Q1n6n8m3J32J74o4m12K17
1680g1Q5J35k78J37P8j64l5N2K86j80j56J19N5J5l52L56L30n75J10M0rQ6k69J5
$$ plain form
1520 116 126 -34 -129 -144 -61 160 -112 -21 444 223 -284 49 253 59 103 -193 325 -116 -310 -64 -58 -97 202
1543 202 71 -158 249 20 -188 -11 427 64 -408 -131 452 -71 -200 304 400 -82 -237 -131 -37 -208 -272
1564 -272 49 -27 -63 25 -109 -97 -54 -167 -252 402 295 -88 49 160 -54 -293 118 294 240 -191 -204 -250 -77
1587 -77 151 -68 26 -121 27 -26 -173 -73 63 -4 -13 357 64 -379 298 -14 -37 17 29 9 -73 -368 15 -150
1611 -150 -112 83 170 17 176 -52 -127 -41 303 -34 -137 133 209 -295 -52 282 5 -43 -87 250 -145 -134 25
1634 25 151 61 32 -94 -159 148 -54 -140 92 532 -21 -69 160 95 -225 -59 48 192 -44 -214 166 39
1656 39 -11 -113 15 -52 208 5 -61 -104 174 -125 -203 206 78 0 -42 39 -17 -75 -118 14 188 124 -288 -71
1680 -71 14 149 -129 8 86 -78 -113 -61 225 45 -111 8 63 78 -274 82 412 -163 -53 -13 -22 64 -205 -190
1704a90M37m1k39j64L00K04q9n1n8M3n18K94j26K80n1k15J45K98k43K6P3k45J83
1727E3p6O3K5Jk81K89J62l14J41Mm7k6k91K53J46k20j42K29J33k84J99J86k73
1750g0k3q1K95o6k24nJ37NJ10o2o4J07r9m7l0K22J49m90K14K55k14P1k42K24j19
1775d7j93J08J29p6P6p8n6K79r2m20L12L0n3n7kK49Lk06K06L1l02K64k65K60O8
1800A68l11J79J21k06rq0J34J09k10P3J18j8l0r8J93k65J62M8j5M3L2l85K44J15
1824A12j00m13K74K97k56L4O5k7j75K88j35L03k59j70K81q3J42k93K76n1j78L2
1846c6k42M25J16l15q8R9m0M4k3K19k74M6MM3J9m7qL8J11k43J35n4K55j28p7J22
1872A01P6m7l27J33M9K03l42R3M12m33K70k3M0J4j77O0Q4ql50O0p2J89J9k8o0
$$ plain form
1704 -190 247 206 -33 -197 103 307 218 167 109 152 -366 -72 -198 82 31 -184 -39 259 16 42 115 -130 53
1727 53 -23 40 65 66 -215 74 236 -78 63 67 20 -6 -297 -44 102 -118 -260 -31 102 -182 17 203 -70
1750 -70 -93 -174 121 55 -169 -174 -37 -32 78 16 -48 59 -40 -87 -117 105 254 -236 -22 233 19 90 -152 72 -47
1775 -47 -240 -132 -3 -79 -3 -81 -137 142 50 -370 -58 -28 -81 -138 -140 109 112 -94 112 143 -159 105 -160 100 168
1800 168 -143 36 157 -49 -58 -138 -4 105 -105 -32 86 68 38 -60 133 -132 30 78 63 106 138 -247 -3 112
1824 112 12 -401 -127 170 -86 -52 13 -14 -189 99 -36 267 8 -162 119 36 178 -115 161 110 -68 -36
1846 -36 -278 147 263 -52 -140 -41 -81 -37 -60 159 -115 -69 -65 -22 -3 -50 -58 -20 91 -152 -17 -71 184 56 -21 101
1872 101 177 130 -197 -64 -15 188 -154 -61 351 -82 188 165 205 219 42 102 186 178 -172 -112 -184 5 24 -4 -64
1897f4Q2l7O8j2K6k9j97K33k07L63l48J62L6l02K14J93J8k50J5K4o0O4j63K12
1921D1R0j24r0r8L05J5j72N1k01K03P6P0j76l8j03L43q8j0k48L2L53l76j27L10
1945C8J20m1k03L2K16m9l05l0L50j60n5P4j01K57k79J19J1P8r9jJ06n1L7k41K74
1970I7l3P8l28J75J40k98J65O7J28k71J29k78K55o4l3K56j84o4%j22M81l43n0
1993i7K06J86k11l11K22J27J99m31J86l55L20j95m6J87J0J89l51P2P9rm1K00m7
2016H9j91K11O8k03N0J09L9j68N0%j82O3j3K8L6n5j17K35J11Jk98l3K30k85L04
2041G9l88L57k32J81m4R3o3J56j32j15J74k5J13l40K66J02k31Q5R0m1p3p6K1j3
2065e6K03J3j60n0N3j21L5R7r2P8j82K00N6j33L7K78k70j01n0L76k62r2M69m66
$$ plain form
1897 -64 18 -19 49 37 63 34 -163 70 -137 226 -122 40 76 -226 -12 181 199 -51 -36 -12 -72 -8 -171 41
1921 41 131 7 -83 -181 124 139 -33 18 -183 20 96 166 -10 -48 -151 192 104 94 -154 -122 231 -145 -272 38
1945 38 158 117 -86 -54 162 113 -192 -222 128 -32 -87 -13 -114 143 -136 -17 -6 72 -27 -28 78 27 64 -177 97
1970 97 64 142 -186 -11 129 -169 -4 63 191 -80 49 -229 26 -38 -71 185 1 -63 -63 -185 296 -47 -97
1993 -97 109 295 84 -227 -5 122 321 -110 76 -279 41 -154 -200 -13 -3 186 -165 -93 -14 -23 -64 136 89
2016 89 -102 109 177 -26 24 133 172 4 54 54 -128 -65 -78 -50 -14 -69 -186 49 160 161 -137 -170 60 -225 79
2041 79 -309 48 -184 -3 -47 46 -17 139 7 -108 66 41 154 -186 80 182 -49 36 126 85 12 -64 -43 -56
2065 -56 147 160 0 -50 3 -118 -83 14 -78 0 -182 18 74 -59 -22 256 -14 -115 -165 211 -51 -143 326 -140
2089a40j01J15L67j66k18k8l3M9K57k45J74J20k33J7Qq3R6k57L60Q0j73P4j03
2112f3j03K50j22O2j47K38J12k87j42R0L37k12q0J18j53mQ6Oj05J36p8J43j88
2135a06N4K91m31K38m0J25r1oj51L2j04L97k08l24M54j13l7m8J73N1l20K53n8
2158C1j16Q4P0j64J31J3J5j86J7o0J0J69K07k91L0J38k4j48p0J80O1j48k97K39
2182a09J33J78j25j58J22k5r3N7q2Q2j38k00K33J47j21O0L50m47J69p4k03L01
2204E7l2q5K26r5J3J8j54J13j7k38P3K30o8j93K33k03K3J45l24M03j8k33O8K05
2228A47j33%lm1J10o9J59j93J06k53J55Q6J31m12J50k4j33L11j37N3J78k67P6
2251cL0K5j4j06P4j08R4k03O2J28P7j07J89r3k92J63K1P3o5J54j14K11k32k21
$$ plain form
2089 -140 -241 -126 241 75 -143 -171 -204 -155 102 -143 31 151 -82 -65 -57 -140 -44 -301 59 139 -34 40 -63
2112 -63 -166 84 -38 24 -123 115 227 -60 -202 -112 225 13 -67 51 -102 -106 -20 -14 -119 17 -61 82 -106
2135 -106 -52 239 -192 46 6 131 40 34 -117 -85 -189 208 0 -324 130 17 -20 -68 105 156 -164 89 31
2158 31 -85 -1 69 -95 36 49 64 -122 -105 -165 -155 14 221 -70 -40 98 74 -74 -144 36 97 -51 -348 -109
2182 -109 24 202 77 -81 41 16 -77 -20 -102 -20 -158 -358 -125 22 -99 -39 311 -136 33 -41 -244 57
2204 57 25 -60 166 71 84 102 -52 61 44 -194 -121 109 41 -152 81 -122 -99 46 -278 125 107 -126 -58 147
2228 147 14 14 11 -30 80 11 170 -23 83 -170 -15 71 202 -210 -60 -84 -217 94 -43 10 188 -79 -3
2251 -3 27 52 38 -68 6 -102 -8 -211 -149 -21 56 -51 138 45 -247 -84 -63 10 -55 99 -15 196 -36 -257
2275b57N25l15kJ61k89K47j16P1j49J36n1q5N9L93l42P3L8r6j1P1n0l4j0Q5j76
2300a24O8Q5k0n9K68k38r5j35N23p1k44P0%n2Lm8J20Q3o1m2j19j26kK31J6Qq4
2327d5k04J55K64k30K9k6KJ32q9K9K80j96k00p7L00O7k44k20J79J75Rj68M6jk6
2352e9j41K37J39j58j76L63j49m8K7J02j44J48k38J40Rq8r3jK26p8k67K99m4j62
2376a56K00J4K9J5J1l34K53j1j62K15P7j23k9r6J61j6R8j66L3J57k47J1P5j73
2400a64J88J06r8J7J48l25K39p9j29rRK50j80n4r8K57K9O3k72J56m7L9p8J54j87
2425f5q0J27J41j87KJ4L7Q5k17J75k1l6l1J04l01J87K97l95L56J06j48l4o2O8
2449A22k27K7J67J49j69q3N0j08No3R3K19k65n1J22L6j09p5K6O5J5J7j51L41L8
$$ plain form
2275 -257 268 -47 -49 112 -177 70 -46 25 -124 12 -39 -124 -65 328 -14 59 97 1 -10 61 11 -23 -33 52 -124
2300 -124 -56 29 9 -50 218 -20 -115 -250 273 202 -42 28 28 -24 -21 -69 51 134 73 31 -88 -214 -216 15 31 39 -45
2327 -45 -249 -94 170 -60 -31 -57 -55 77 -12 17 297 101 -99 -176 124 191 -53 -273 -94 81 90 -78 -32 -33 -59
2352 -59 -200 37 176 18 -158 205 56 8 35 137 -7 141 -97 43 52 -36 -129 -130 96 18 -249 50 6 -156
2376 -156 44 58 87 102 113 -221 32 21 -141 74 151 28 -1 -97 64 48 146 -20 13 170 -77 -66 9 -164
2400 -164 24 130 32 49 197 -128 111 32 -97 -106 -97 153 -27 -81 -179 78 107 170 -102 54 7 46 -32 122 -65
2425 -65 -145 -18 123 -64 -62 -48 -11 74 -143 32 11 -25 -56 48 -253 -66 231 -164 192 298 150 116 54 122
2449 122 -105 -78 89 238 69 -14 36 -72 -67 -130 -37 182 -83 -134 -12 24 -85 -160 -134 -69 -54 -37 -188 153 191
2474A91k56J09q5J97j27j14J56Q8r3k44J06J52q4o7L52k74J29l25K12j41Nr8K98
2497H7K19n42K87j16O2j63J42m6l7oO4J90j27L8K13k95J38l32J01J58m0Kj12J72
2521E7K41k78k14J89pn8J14n4P3P0o2l4M1j03R6L2Q3k68P1J37j72J3k36M08j50
2546a1O8k17j7K33j04P6l55M24k08J65m1k3N3J6j24QN3K2j62J46K18k29J19j16
2570fo9J61k3r7Q9%r9J76j57p6n4J86p1J87j20Q1k5m4q2R0j0j7j71k4J35o1kM5
2598e8O7L8K12k29k24L42Op8p9R3j3k04K12j75K52N7q1k40R9P4m3l7L9K02j64
2623F8j14P2Kl7R5k01K97j0k03K07k34l5N3J56j01j09M5k40M01k40J53J09j08
2646B6M2k11l9K43m2j41J69N6j60rJ64j03J74k4jj74L1J41j22j0j2k5j7K67k45
$$ plain form
2474 191 -65 44 -41 156 29 -85 71 159 66 -178 -72 80 -4 -71 281 7 136 -189 23 -118 -113 -211 87
2497 87 306 -236 51 -65 -3 -166 -24 -70 -107 -113 -49 141 14 52 265 -30 108 -224 -123 35 -5 -3 -115 57
2521 57 298 20 -194 -5 -12 -70 44 -10 63 133 71 37 78 -25 71 103 186 -82 -11 126 -46 -33 -269 139 -11
2546 -11 57 -160 -177 56 -48 28 -327 97 -111 54 13 -10 43 59 -65 -57 -4 18 -144 2 220 -9 110 -6
2570 -6 -75 86 63 -34 55 55 -44 132 -25 -101 -155 31 -40 147 27 108 83 39 -43 47 37 20 -151 -175 -40 -101 -103 -58
2598 -58 9 47 259 30 -194 148 154 76 -3 90 77 -127 85 -90 162 219 138 -102 -3 71 28 -9 30 232 68
2623 68 -46 26 28 -9 86 -115 182 172 -31 176 -58 -93 -40 116 15 -94 -49 -289 112 -128 25 134 26
2646 26 68 -143 -182 61 19 -122 47 103 -57 -66 98 -5 169 145 144 -30 1 142 20 10 -2 -27 -44 223 -22
2671b2j61M1L62j95K0K9oo4m7K07k42O6p6p8K32j55J49J14k30R0j45K09o3P7j19
2696gj90L49j15k5j36NK66k93J97J1J6r0j05K33Q4k41J32Q4k92P1P9L9j25L0M6
2721B3j91K89M5l95M8J50J81l47L00j02K4J9N8L2q8j14J61j04J06k11J00j36K30
2744G8j82K6K03M7o5l02J90O0J07k30K10k94K00j55J53J96j49l81L25l5n2J17
2766F7k10j42J39j16R3K37j21J33j50o6Q7K23k93M92l66K85k83K19l24J48j17
2787f5J5Q9k01K25j7j23J71j14K53l85J57K7k26R4M31m57r2J14N0J3J03N3j6k03
2811a04r0M07k56R5k70K38Q0m7k57L40j7j13J00R5n7K7j35j66L32k90J79j01Q
2834bq0k9Q8k89L04JJ32J3j22p8l7R9J46m01K28R9Q7l09j12L00%j59J18J21j05
$$ plain form
2671 -22 -183 -142 220 25 45 74 68 4 -43 164 -78 -12 -88 -166 66 -89 60 174 -56 34 -111 98 35 112 -7
2696 -7 -197 152 37 12 -124 -119 147 -146 51 62 78 -12 -117 116 200 -41 91 175 -117 -46 33 72 -53 -23 23
2721 23 -168 121 166 -229 -181 -31 150 -197 103 1 25 44 102 134 46 -68 93 -11 95 -116 -16 -152 78
2744 78 -104 -78 125 172 107 -195 -5 55 162 -68 142 -152 48 -107 46 242 93 -288 37 2 -50 67
2766 67 -143 -285 -146 -262 -169 68 -53 80 -70 -136 -49 174 -119 373 7 292 9 228 -96 52 -65
2787 -65 -50 39 -162 63 46 -77 94 -20 233 -152 5 32 -194 -100 331 -126 -218 -104 -54 -41 62 115 99 -104
2811 -104 -194 213 -43 52 -218 20 100 53 -204 136 119 6 106 201 144 171 36 -130 202 -88 91 -10 -2
2834 -2 -82 -111 -23 -312 -8 -7 125 138 16 -62 -99 0 146 -255 -27 72 159 -150 -262 38 38 -121 -3 118 13
2859A3j05K63k68K06l56K12K09q9q2J95r2O5l18K92q3J1M4j54o1J3l7m1K00k85
2883b48J64P2N2K6q8Mk5J3j9L2J86mk13j27L29j73j8J37j23M7k78K93M9%j97K04
2909I5k30K17J20j77j4M8r6r7K51q0L6lj73k8J57nq5j45J80J05l50M71J68k85
2933H0m6j15K03o8j41L3J73j57oJ11q0J03K8k21rJ11M6n1j31K15p5J26K9k82J88
2958F4L08l96J2p0k5J03K5J2j64J87l4r3Q3R7r1J5k53J78P2j02L9m7K42p0J06
2983A98j04j09j8J83j8m2j8L5k16J05J23j9j55J50op6k40j1L92j88M3J55j50%
3007A4P7j28QK9j08L6K52j74j10K93p3J9o8j99J78j86j3K08m4j41L26m6q1K01
3031B70k58J3J13o5k66J49M6k9pR1K6q3L4j7k46J00J11KO5J0j82l2p1J07k7O5
$$ plain form
2859 13 -92 171 -97 109 -247 -35 174 85 3 198 106 171 -147 145 62 73 117 -37 -98 -85 -122 -163 37 -248
2883 -248 -84 -12 40 66 -22 -18 -43 -30 -49 -17 169 165 -48 -175 154 -19 -37 100 -23 24 -254 39 88 88 -109 95
2909 95 -135 82 202 25 11 59 -37 -134 117 37 73 70 -103 -131 26 21 -64 -209 -29 76 -274 197 365 80
2933 80 34 -81 122 54 -87 -54 119 -38 -44 67 -13 90 118 -103 -112 -1 45 -6 -137 78 3 129 158 -124 64
2958 64 372 -24 -12 -82 -107 -4 21 33 -131 56 22 -71 12 109 18 33 -220 -42 30 -72 -33 -80 162 92 198
2983 198 94 -15 -33 150 132 90 72 107 -109 -4 119 100 -55 95 89 13 -227 -238 154 -34 9 164 14 14
3007 14 91 -37 -29 0 -108 -72 180 6 -104 189 116 135 67 -132 46 -140 -153 55 11 -130 196 150 69 270
3031 270 12 25 138 73 -193 -44 2 -27 -34 57 83 0 34 17 -229 -129 -18 -16 49 59 -123 -155 -226 -119 -146 -81
3057h1K25J1j18l20J97J44j05J87k09J15p4n9Q9J49K5k84J59j2j06j24K11k1L7
3080C6j13j08K37K94j55j51k1j36K9O1p3J82j08r3j7J47Q6r0K08k08j20L0Q2K13
3104B12l25j97L53m5J9Nk12K43j64J31j11P4j51K70m7j47N2J40j47o9J21J14k37
3127a18J18K4Rj46J50q4J8m2n0k7J47J57j70P7n9R9o8L1j86L5J57k5O6l06J84
3152iN0J31k40J79j56m6K91k41J72j75J94k04l1k8K65j52R2j93r6K60r1N8nN8
3176H3j32j7J72q3Q5q9J19m5j2j57k9r2J98p3J39k37J15m3j1J43J90k52P3j2p6
3201d3J03j81j05K33o3j28K09k0m5JK24j55J1l4K41j95P3N7k00nJ65j9r0j59K28
3226A03p7K4O7j44q5O0L0N7j16QR2m9J32J7N3k43J9M1j72rM75j89j02M5k1RQ9
$$ plain form
3057 -81 144 155 37 -283 -86 58 -47 140 -69 46 -28 -87 2 151 176 -108 51 39 -67 -191 20 -1 36
3080 36 -77 -185 52 346 191 40 19 -117 -88 -27 -100 82 -26 -119 -136 11 97 7 215 7 -113 -83 -1 212
3104 212 -113 -310 43 -2 17 22 -190 53 -111 20 -91 -17 -168 102 55 -92 -40 100 -47 -116 5 119 -118
3127 -118 0 24 33 -113 37 -47 -29 -71 -121 -148 -1 156 -14 63 4 103 35 66 -120 -85 72 47 113 -193 -9
3152 -9 41 172 -68 111 -45 -91 200 -41 131 -44 150 -54 -85 -113 152 0 92 -101 -197 63 -28 30 25 83
3176 83 -49 -66 106 23 108 19 138 93 81 -76 -105 -197 1 -72 67 -170 -55 -98 -109 34 224 -28 45 33 -43
3201 -43 60 -121 -226 7 -56 -184 25 5 -40 -39 185 30 41 7 248 53 126 183 -17 -22 143 124 34 -125 103
3226 103 26 50 117 -27 -112 -52 -22 35 -81 -73 19 -30 102 119 172 -71 -52 -11 -183 -192 283 94 -8 37 16 25 114
3253A14K6k57J69q8n9o1O7K00j49L7k57L21k09K19j87j00P3K49kj12J4K1K05k47
3277a3m4J66j16J0m6Oj59j9J70j29J47j57L01k48K25J42k97J11k7j37j11K56n3
3300b2m2K6p1J80p9J5l0j3J6j00J29M0l2Mq4n5J92J1j12J00m7j80N4J18r9J12
3326C1J44j3j68J23j77J39J61j45K10m46J82k58J63j90K88k38K32n8o0J57k24
3347a47K47q6j08J34J07q6L8j39J53L8k65J84Q8j97J63r3Q0p9o7M0K21j72n4j0
3371a0j85O8J07j77K36p7J42J5k22r9L36r7k6J79l04L1O4J97k40N7L2o4K57k85
3395f5R7L2K1k00M9o0K59j83J57n5k7J77k01j05p1K40p4L5k7N2j67J44j42j6J11
3420a9k03J36P5J8N0l97K12N6pL1l8Q7R7k11K8RJ46k8J24j06j60O4J70n1j64j68
$$ plain form
3253 114 140 -117 52 -36 -95 -156 -89 111 -38 -1 -258 63 -146 73 -114 -214 -141 108 106 -6 8 29 234 -13
3277 -13 -57 109 -7 3 -43 -37 -196 -215 -45 -174 -27 -184 117 -131 94 236 -61 50 23 -114 -225 31 -22
3300 -22 -64 -38 -109 71 -8 7 -23 -36 -20 -120 9 49 17 21 -63 -118 74 85 -27 73 26 -154 -100 18 -81 31
3326 31 175 162 -6 117 -60 79 240 95 305 -141 41 -217 -54 -244 44 -194 38 -20 -80 77 -147
3347 -147 100 14 -94 40 147 61 99 -40 113 151 -114 70 158 -39 124 31 111 32 -35 5 226 54 0 -10
3371 -10 -195 -127 -20 -197 39 -38 104 119 -103 -202 134 37 11 190 -114 -83 -19 178 -62 -5 27 -37 220 -65
3395 -65 32 64 85 -115 -66 -126 133 -50 107 52 25 202 1 -104 -175 65 -9 26 -1 51 -116 28 -114 -130 -19
3420 -19 -222 -86 -11 7 57 -340 -128 -72 -79 -48 -86 1 98 -113 -85 -76 70 42 166 60 -100 -36 134 83 -81 -249
3446b49L73j59J19K8p8J49k98r2K58M7o1R4k46L7L20j58k07k9J98m4O9J72l65
3469a22o8K65R2n7j75J42j8P1m55L01O6K0j08j66K87k55J11J83R0k03o5J24Qj21
3493e3K31k86L0J72q3k44K12O8j37L51j92j05K6oN1K13j75j09Q1o2q0QJ72R5j87
3518iK54k69K86j38M0k40J90K32n36K08p1j30L2K36J45Rj68j08R5R2j88J98j29
3541C1O2k45K06m8l5R5j77R4Q7n5Q8K2j0j95J48L5l09L73j97j03J45mo6O9q1K17
3567A47ok41J47q2o7J7J53r5l0o1J7J40lk8p8J6P6O8%j44Q7L2j02PR2l7R2k36
3595a19R4k51L20j24M1R5p4j43R4N0p5J61j0K0O1j46q1mP1l0n6J03n2P2m2l4J05
3622D6J06k59K89l70K27J24l9k30K20R0m49J86j9N9J45j32J07k2k86r3N19j85
$$ plain form
3446 -249 124 -35 84 112 34 183 -115 -207 51 98 37 131 -115 -78 242 84 -123 -152 46 2 71 243 -122
3469 -122 -190 75 167 110 -65 77 59 130 -325 -24 42 62 -46 -212 75 -180 -69 114 204 1 -64 60 68 -53
3493 -53 178 -108 -78 94 11 -233 -21 47 -90 261 69 -36 -10 -16 35 248 73 -36 45 -17 -97 -89 83 178 -9
3518 -9 245 -24 262 124 164 -76 114 346 -190 18 -53 -183 -151 85 230 239 71 -37 58 150 -38 160 31
3541 31 93 -152 54 6 -29 66 -111 -17 70 15 103 125 115 -80 68 103 -206 167 -30 -133 12 8 -58 11 -70 147
3567 147 141 -100 47 -35 -102 -85 68 -27 -57 -118 -101 39 36 8 -70 -54 22 90 90 -54 33 65 -37 -30 62 25 117 -119
3595 -119 -25 -276 44 -80 -39 56 -18 -161 -67 -17 -92 69 59 79 140 -6 -87 -91 -20 -50 -106 -3 -55 17 -25 -59 46
3622 46 152 -107 182 -188 39 163 124 -106 114 204 -245 -59 -78 -19 126 -6 101 79 -207 -300 219 34
3644C4k59L25j27L5N1r3q8J91j70r0k5K35p3NP7R1Ol04l8K82m3Jj3Pk58J57K4
3671f0P0j49K6J1J76L3j06j7Kk5Q8k4r4K40k88o2K56j80q0K10R0j46j19K95k99
3696a52K09r0l1L8Q7J0R8j15M0r2J15j11j23J61j66J56q8K32r0N8j80Q9j51N7
3720c9l5R6r2J1J66o9j11J93k72QK11lp1m8K4K30j38j63j7P5J01K6j17p5J21j17
3746a05J38J30k08L8J27j30l2K14j81J00n5j83L37o4j5k38r1P8J16n0J71j01j0
3769a4k1k1q5J03N7J21j69l43M27j03q4P3K04q0l0rJ23j3O5k54L0M5J36k27J77
3794A08n3j09n3N0O0N5k66J65j73L06r2kJ26j25p2nQq2J86k01K71kk58j4K18k09
3820a63N2L07j92n8l9J9J4K87j25p4r2J08K34l11K07j64O5j89J95J03j08j41K09
$$ plain form
3644 34 -225 100 -27 8 59 -34 -122 69 -101 -191 -216 19 -54 -49 28 119 125 -179 -217 65 22 23 10 17 -241 -84 -60
3671 -60 10 -139 -113 -102 74 107 1 -16 -14 -39 49 25 -69 171 -117 -179 77 -103 -183 27 117 -29 -148 147 -152
3696 -152 57 -33 -64 -26 61 71 169 54 94 2 117 6 -117 44 -122 34 -54 178 88 146 -34 55 -96 -39
3720 -39 -74 22 -70 -59 107 38 -73 120 -152 -144 67 64 -7 -55 -31 199 61 -102 -119 -44 57 83 -34 -109 12 -105
3746 -105 33 163 -45 -7 120 -10 -42 172 -9 91 36 -147 190 126 111 -127 -218 -140 -24 -74 97 -4 -14
3769 -14 -35 -56 -141 -38 19 140 -29 -372 55 -48 -132 -59 145 65 35 26 149 136 201 -53 -23 22 158 -69 108
3794 108 55 -54 -107 -57 3 58 -208 -43 -216 90 -2 -4 122 -3 -75 -80 -72 -154 32 -169 102 100 -158 -172 46 -163
3820 -163 -111 196 4 -54 -93 -74 -60 227 102 28 -64 44 278 -33 174 10 75 -114 81 184 76 -65 144
3843A44l72K97j38K70j22j15P6n0r1K27k19J4L2LJ27OJ5Lm2k70N31l85j70L28
3867I9j60K63l75J80kk38L11j68n8K26k8o5J42j27m0J16k91K05J12r8j07J0P2
3890b1J15L6q4J20j65J11n7M6j45j03J78j26j00K90Q4j61J16j83r3L62j37n6P0
3913I7m5j38p0J23j4J16J69r7p3j53R9L5o9mm0J3J66k9j91j3m1K6k3J02r0J40
3939dN5j38J64k98K44k2m2R1j18J7J47j58J10J58k86J55Pr3L62j98j53J1o3K60
3963B08j75J36Nk71o1J9K46k66L10j47j9j20m5J00J71k37L27k98L09K2j86j18
3985i0l7P8j41O9J05R5J13L1n3p7l33L36NQ6j42j36K65l22K73j93K29j93oK77
4009B39l31K98j98k05K97p5n1k36J68O9L1kJ71k17J6P1j22o5K00j10J29k28J00
$$ plain form
3843 144 -228 69 -69 201 79 -36 40 -10 -101 126 -93 -79 -47 -44 83 89 104 107 65 -205 326 -59 -229 99
3867 99 -61 202 -173 7 5 -233 78 -90 -148 78 50 -15 127 0 -40 76 -215 -10 102 4 -103 -93 -21
3890 -21 94 130 46 166 1 112 55 101 -44 -147 31 -95 -195 95 179 18 134 -49 -142 220 83 27 97
3913 97 52 -86 -156 -33 -47 69 238 141 68 -85 14 49 -20 -24 -64 -51 115 86 -105 -118 -159 -133 -156 -54 -144 -4
3939 -4 51 -87 77 -221 23 1 -41 50 -68 -51 96 -62 48 206 -80 75 82 -11 351 153 0 11 -52 208
3963 208 33 169 174 -97 -158 -139 107 -159 151 4 -15 -135 -180 -80 91 -146 181 -117 192 214 28 -90
3985 -90 -127 -49 -190 -121 -16 79 192 223 170 93 -240 96 101 187 45 -91 174 -148 125 -68 161 -32 -38 239
4009 239 -92 206 8 -197 100 25 -26 -262 -94 -25 6 4 175 -42 -26 45 -77 -142 58 -52 77 -151 -51
4032e1Rm7j4M6K64j29k03J46n5K28q6o8m5j28J21N2j4J48k64J26J27k06O3j54
4056a34K49k71J30k6L17l66K19j34n5J27j22QJ38j02j37P4K3J33j75K46j03J50
4078A89j85P7N2q2J0P1j85K0M1q0L25k61j77K87O5j69K33j85q9K5j6j8K64r7k3
4103I2r6j42L00j12J13k29j14P7p1J87m5J21j59J33k68M42l82J35L8J17j68M9
4125A8Q8r4O2J19Qk69p0K03K05k86j15L03n0j13m3l2K72l61R7j1K9j46J27K31
4149A72m54J60O0q3J15p2Q6J17m9P9j66oQ4K2J56j62M4j32L0J01k95J73J13k78
4173a85J92j7R9k60K5R8L17n40O5R7N7K62j71j50J52o3k7J31j9NJ06k70M3k6J20
4198D1k18lJ80j69pJ81J32o4n7R4o1k70M39k10K6L3k27P7J74J17P6m55L89N5k70
$$ plain form
4032 -51 -42 -89 -103 -57 207 78 -125 21 -34 194 108 40 -5 -133 -12 40 26 174 -90 36 163 -43 20 -134
4056 -134 115 -156 -26 -52 265 -101 118 -16 -71 56 -66 -58 80 -22 -159 -85 -62 71 -104 142 39 189
4078 189 4 81 133 51 61 132 -53 -33 8 -72 253 -8 -185 102 167 -2 231 46 -43 -18 -34 -52 212 115 92
4103 92 -4 -146 154 42 155 -74 -188 -111 -182 5 -40 81 -78 55 -213 229 -153 -18 20 137 -31 18
4125 18 106 12 74 193 201 -68 -138 65 270 -16 -131 172 122 9 -34 -66 206 -155 -58 -69 -40 -186 -59 172
4149 172 -282 -122 -62 -145 -30 -102 -16 101 52 131 -35 -41 43 65 221 59 103 -29 1 102 -193 -20 93 -185
4173 -185 7 -10 89 -171 -146 -48 269 -271 -206 -109 -52 210 39 -111 41 -22 -49 82 63 68 174 -96 -53 -79 41
4198 41 -177 -180 0 -169 -176 5 137 73 16 110 49 -221 218 8 34 67 -160 -83 91 208 284 -171 218 273 3
4223CP3R0r9p4K52r5k81K33k7k51K41k30K26K0j90m7J59j1p4K06j25J54Q1l28
4247i4J12K1o0J11K4j92Q2q4k6M0N5p1m7l6L12J38p3m8p7P1k23J50j27M8q4K01
4273A23L0j22J18l26L72j55RM4j15l9M4J24Q3k53J07j88K62j63P5j44o9K80k07
4296a10n7K00J28j04J24j42J17k10o1K06n0Ql45K10L3L0J17j71j78L55j49L16
4318B67k20m8k5J40j56m8J30m6lj24J28j15p8J10J34Nl2k9Rj67R5Q2J46k83Q1
4343d7J41Q5k66K56o7k31L16j56m1Q3K1n4k33K64p9J8MQ8p3n7M2j15R1K01j69
4368B2P7j21J13j10Qj06K51j60J27l21J39Q3n0OO4L4k32J39N6N8k11L9Nj09J82
4393a7J42k44L66k94m9Q7l3J73K8p7j76l6K28j86L9M0j54lK29J22j56P5j17lj49
$$ plain form
4223 3 76 166 67 -7 245 150 -131 102 75 -176 65 -165 61 81 -109 -156 3 -8 -82 124 -1 153 234 -94
4247 -94 18 39 -21 90 114 -78 4 -80 -106 -66 -11 -82 -129 -165 147 285 212 164 87 158 -65 85 -42 6 -78 123
4273 123 153 31 149 -177 195 40 49 93 -22 -61 -17 107 190 -63 44 -144 118 -45 30 -114 -183 97 -110
4296 -110 -167 33 161 57 181 39 156 -54 -115 91 41 49 -296 -86 -53 -23 94 -77 -255 100 -49 267
4318 267 47 -1 -26 114 -42 -90 40 -6 -9 -133 -5 -120 -198 -88 46 51 19 -10 -1 -168 -73 9 155 -128 -47
4343 -47 94 179 -87 169 102 -129 187 31 -10 73 94 40 -193 71 -8 10 14 102 29 -28 14 -101 -10 191 22
4368 22 99 -22 91 -19 -11 -117 134 -26 101 -220 -81 2 -48 -42 22 56 -176 -37 19 77 -134 -95 -90 -199 -17
4393 -17 125 -119 247 -47 -96 -9 -42 131 159 82 -94 -130 98 -88 -49 -9 -163 -166 63 185 29 104 -13 -16 -165
4418a65k6K94k17J90k19p2M9K10p6k01L35M7l5j75J27k55K74k10n6L56k68J63
4440G0Oj35o5K30L2l2k6j54K15n4j32l7O6N6J82m64K61n0K09m0m7p4M7k0M0k11
4466a27J21J06J5n8j37K46m21K28j1q6K01k03O9m0K71l91K60M5q1R9m5j67M9q2
4490a39J69j03J58N1m3j39r1J20J67r4k30J7K65j07K27k17K1j21P6J31j87lp8
4513a50Q9J16N8j79J35j57J66j53Q2M9q2Q9k34K08k0m2k6L2m6R1k09K90q0r4J02
4538C5P0j64o8K32o4O4j33J8l5K20l13OQ9l8K56j09k27L35j18j21jL15k49j60
4562a60J87K2Nq7j1P4q7R2O0J9j36N7j64R6J65j46r9J41j87K78j36j81J76J34
4586A12p0m3J20n1m0n0m3K8L5K19k92j01K33N2r7K93l09m9N1L9J7Q4m9j64J1j
$$ plain form
4418 -165 -191 103 -114 76 -143 -215 -166 44 -32 -233 102 149 114 -61 66 -189 85 -125 -181 175 -93 70
4440 70 76 -59 -124 106 138 106 80 -74 141 87 -45 -82 -16 40 222 -242 19 -31 178 138 91 17 64 44 84 -127
4466 -127 -6 100 115 57 -80 166 -255 -27 -38 -124 77 -126 -57 -97 174 -217 43 88 7 106 61 -106 -57 -139
4490 -139 30 -73 85 136 93 -46 -137 -17 150 56 -174 -157 108 1 228 11 32 -89 -13 118 -69 -72 -150
4513 -150 -61 55 113 -66 69 -88 78 -75 7 56 -26 63 -171 37 17 -25 -51 -19 -65 26 -183 107 27 -67 35
4538 35 105 -59 -127 105 41 105 -28 -10 -45 175 -138 -132 -43 -81 175 66 -161 174 56 -65 -66 249 0 -160
4562 -160 27 49 54 -33 -44 30 -57 35 95 114 -22 35 -129 -33 132 -14 -113 28 -159 119 -17 -198 -22 112
4586 112 42 -1 119 68 28 -22 -65 -37 -2 217 -75 -176 57 109 12 305 -4 -53 -2 37 54 138 89 -75 -64 -65
4612f5J47P9k79N2M96k74l83K87l9j19K4O0J29j93J8M6pL21k40j41O1M2M6k04
4636a36J21K39l51J78Q0n5k42L7K38q5J29j47K6m2o1J86j94O9j56K02k12L05K01
4659C30m46M4J05l2j8J85k3j52J38M3k1j42q0N6mJ0n1J64p5M5j13j14J08Q0p7
4684d0J53p0M8J33l02J76Kj97J06n1j43J25J56j03mJ0j96Q1l5K04j2J66p7P4l45
4709a41K0L27j78q5L8Kj69J34J34p8k47L31j14j38K88q1p3j36L72m76L48n1p7
4732e0K68k37L7P3P0j94J25j51j18N1J84J5l0J14j26n6q9J84Jj07J61j27N5J87
4756B40l28J84K9l73K18k9K9K29o4k98L16k12L7j04L6J91m5j1j66L15m5R5l97
4779a53K37J43k28J44j03k24K07L1j43k9K30l51K57N1N2J1j43J73l68M8K13n8
$$ plain form
4612 -65 82 161 -118 -66 430 156 -227 60 21 -98 -74 -14 115 -78 -60 -14 -21 300 60 -81 -20 22 68 -136
4636 -136 -15 224 -127 51 131 76 -166 -129 109 24 153 6 32 -10 -71 115 -79 -10 -166 36 -176 129 330
4659 330 -116 -72 33 1 -17 168 145 -7 131 174 153 11 -69 -13 -17 -7 -58 106 31 76 -37 -151 -43 37 -40
4684 -40 113 43 91 224 -78 98 100 -97 9 -42 -185 -60 96 -7 -11 -1 -197 -116 -151 53 41 207 130 204 -141
4709 -141 -121 206 28 -57 -19 -17 -186 -52 82 4 -243 88 -26 -164 124 43 -30 -166 206 -270 78 27 -50
4732 -50 218 -19 18 91 161 -33 92 -59 -177 -126 58 73 43 157 31 -25 -114 70 71 -36 125 -2 53 240
4756 240 -88 96 125 -248 -30 -59 -30 199 135 -163 153 -59 -22 -126 -90 101 56 45 -121 194 149 244 -153
4779 -153 84 227 -1 143 40 -184 23 54 -89 -118 112 -239 18 69 121 132 -11 162 -206 -158 55 -3
4801cK7K0r7N4k8J81k91K57Pm6k32K18r3L0p5J2J62j85J97p3N0Q1Mj1Q5k32l0
4828a1O9k43K71J44k70k0Ql4R3j8R1Q8l0j21R7r3J79l3l66P1J35Lkj94Q8J45m0
4855GR9Pj67L5O7K5o9kj6J31KK1n9k39K08j4l5K4j01K34m78N2K44j57J1K87k1
4882I6k04j05J56M1nJ17j51K3n5Q5N0k01J50J47m6J7o7J61j59k39L65m2Q9o0j94
4907c1J43M3j40k3J25k44K20M7m3m5j8MM4O6Q6j50o2P8q2l3P0j93K14J43m3j39
4933C7k96K39J61jj20k7L3J73k3j90o6L02j99O6j36J03j73O0O0J71k67j9K39k09
4957h2J91k09J44J79k12k53N92k12j5k09J91L3k61J16MLo9J26m5N2r4O8N8mj04
4982a2j55J29P8j21Q6OKo7M4m0r5K65m5j66O8q3j10J47m5k1J52k98M04q3k35J23
$$ plain form
4801 -3 24 44 -53 1 -27 154 -137 120 127 81 -151 67 -26 4 -71 -59 103 -82 115 42 92 173 177 166 251 19 -11
4828 -11 58 -185 86 230 -40 -60 -52 -86 7 -11 80 168 138 17 114 21 200 167 -199 -128 7 10 8 -186 -98 47 7
4855 7 106 113 -54 -19 48 73 4 2 -14 117 119 140 81 -158 50 36 1 25 -76 158 -320 -268 -24 -181 -170 117 96
4882 96 -108 -213 -57 -16 -21 96 -55 -32 -87 -2 48 -153 -3 144 98 115 48 209 50 -189 176 134 223 163 -31
4907 -31 112 155 15 -8 117 -127 93 140 97 52 34 38 82 148 234 84 22 100 18 -15 55 -138 76 219 176 37
4933 37 -259 -20 141 140 20 -7 26 199 176 -14 -80 222 23 89 -47 56 -117 -57 3 174 -93 -112 127 -82
4957 -82 109 -100 44 223 11 -242 350 138 123 -86 105 138 -123 -7 -3 0 -69 57 12 64 -30 38 96 92 -12
4982 -12 -167 -38 40 -81 5 11 13 -54 -10 -50 -145 120 75 -91 -23 -106 -216 -69 -114 -135 17 -281 123 40 -195 -72
5008g2J61p7J59k70k41K28L2j5J77Q9j0k03O9RjJ00k87K04q6n0J43m2J71j45k32
5033a89K3K19l92M59j0kp7k0K68m39J81Q1o8J40j13j38o0J01J83j82k0j0J05P3
5057A13j42O6M2k30K42n1l3j7j08K47n4J26j89p4J10%j09K20j06L2j55J02l5j39
5081a42J57J04j10Q8k38J26j44J76Q1r7K4J56j82o5K25j14k15K41j12jJ61j58
5103c9m1M9Q2Pj05j37K1J03K0R9j40L5J13J31k57l2J09l1J05r2J94l60M8J20r3
5128i1J3k02M50r9k05J26P4J6k49J60P9j17k37L30J37o6k36Q2j65R0K0j33P3J10
5152d0L6PJ4rn3K83l56J23n5R9o2K8L7m3P6j31P4o2p5o9L41o9k49K88K8j84j65
5179a88L37j91j09R7J09r7r3K62k28J70j9j0J5K2L8k93K13k42Q2o4R4q3K43p9
$$ plain form
5008 -72 89 12 171 -99 -340 -112 -80 -95 82 171 161 -42 27 36 35 135 -152 52 -34 -84 59 17 188 43 -189
5033 -189 -166 53 -339 120 110 108 31 11 279 -160 21 102 34 174 61 -77 -137 -36 147 -35 -55 -65 40 113
5057 113 -29 37 79 -151 91 40 7 -10 -118 129 75 201 12 -62 48 48 -61 159 53 85 -70 32 -3 -142
5081 -142 15 119 9 97 -141 -15 -159 17 98 1 25 181 -1 -66 159 45 -170 71 -41 -42 119 -39
5103 -39 -80 -31 51 58 -47 -184 -163 -60 -40 59 -81 -46 67 198 -59 -91 18 -13 92 0 194 -166 -118 2 -91
5128 -91 -78 -280 170 71 -134 -8 66 82 -167 -7 72 -45 -282 48 185 119 -117 -35 -200 -110 -90 -223 -150 -40
5152 -40 -4 3 17 8 -45 238 -118 5 -50 49 -13 15 52 9 85 -46 28 -34 -109 -178 163 94 -155 133 161 -23 -188
5179 -188 149 -42 -151 -54 55 -42 -135 127 -101 69 50 40 55 77 115 -178 35 -207 -125 -189 -95 -178 65 -14
5203a4m6m0o2N3M5K36k87N9m5L3Q3l03K60K4R0k8m8j30J82N4j42L3J81j97l9N0
5229BKP6p5LLo3k5L06o0p4j60J51lj85M4q3K78j07j58K2O4ql3J31K37m26K59l84
5257b66M3R7K42q8j61K09k6%K37k27j0j39MO1m4K31j16l61J69nL22k02O5J20k30
5282g5K34M2k07K8N4j45K16j07%n2J4J6o4L3Oj48K94p3j63k2K44j33K15k91P3
5307a1K79l62L67m32K25j2j63J68j25M3P3j8J41k8j72J81k19k1J41k19J49m2O5
5330Hk49K05j23K13L4Q9l2j27j0L2N4r9L2o6j37K21j24K9J50l1kj15K07j18J00
5355A41j08N8n8O1r7J58j50K3J17J04j00lk04J23P4j14j33N1J16L5j39n1R7qL3
5380B6j18J44n6j15j2K47R3k12N7J3R3p9j94J36m0l9L63k11k0r5L5qP7o5K25l00
$$ plain form
5203 -14 -60 -100 -162 -109 -64 172 -115 -56 -101 -68 15 -288 -28 -4 86 58 10 -120 62 116 -26 7 188 -9 -48 2
5229 2 4 80 5 8 11 -52 -77 229 169 95 -65 86 83 -102 -58 -141 137 30 -128 -106 -42 -50 -83 48 285 -141 118 -266
5257 -266 -223 -126 116 28 -133 76 50 50 287 60 50 -89 -85 -24 -68 163 47 -314 -145 -150 172 -30 35 155 -75
5282 -75 159 201 -6 22 76 -69 147 40 40 -12 2 18 -46 -13 -7 -155 139 66 -97 -119 125 -8 207 -84 -11
5307 -11 268 -94 273 -159 66 54 -109 59 -66 -23 50 32 173 145 -27 154 -65 -86 55 -164 -15 -57 8
5330 8 -241 -36 -159 54 88 177 145 18 8 40 94 -5 27 -39 -176 45 -79 -50 100 69 67 -48 159 41 141
5355 141 33 91 33 94 -3 155 5 28 145 249 149 146 -58 65 139 25 -108 -57 59 94 -45 -96 1 -7 26
5380 26 -92 52 -4 -119 -131 116 209 -3 54 67 160 81 -113 23 -17 -56 307 96 76 -19 16 8 85 20 245 -55
5406e5r9J03J95m7j40p1oj1J3K5J52p8K2k77K29Q0K01j55r8K23O1k17k8L4P7M0
5432A73k22M9j61J31l2R7J42l56K71q8pJ46n1p7lP8p3j97O2PK63l7k4j6J06r6
5458H5Pj8Q4j94J18j5J22k69p5j9K20l07J67J87j82lk01K12O1J97k05J84n0P8
5482A84k10J14K1l58K17J68k73K09j42L8K32k42O1P4J80m08J7L06j16k1j66K40
5504A25j37j67P2j26L21Lj79K52j52k2P3j7J06p8J66l60pJ27q9J27J32j61q5K7
5528d9l6K09j57k19J98K7j8n3J4J13k02j18O2R1K02j81p8p8M10k15J35nM2j22
5552b8l0J18o0o7K97M4k60J18q3k1j57J75nk11J44r1K44Pk55J1j08M53l36L5R5
5577B9j07K63j98m4J10k9k1J05k80n1K64O9p9p3mJ27k77K66j12K9J3L7L7j74K00
$$ plain form
5406 -55 -154 -51 144 97 -43 -114 -120 -131 -118 -93 59 -19 3 -274 -45 35 236 81 -17 206 267 50 22 56 133 173
5432 173 -49 0 -161 -30 -62 35 177 -179 92 4 -3 143 92 15 12 90 17 -180 -118 -111 152 115 91 75 181 85
5458 85 92 74 158 -36 82 67 189 -80 -155 -174 46 -261 -94 93 -89 -92 -293 -81 -20 177 -28 156 106 184
5482 184 -26 88 109 -249 -32 136 -137 72 -70 -32 200 -42 19 93 273 -135 -118 188 72 51 -115 125
5504 125 -12 -179 -107 -233 88 91 -88 164 12 -10 63 46 152 74 240 -120 -127 0 -89 38 170 9 -76 -49
5528 -49 -85 124 -33 -252 -54 -27 -45 -98 -84 29 -173 -291 -229 -138 64 -117 -195 -273 137 -78 57 52 94 -28
5552 -28 -58 60 0 -67 230 274 14 132 49 28 -129 46 41 -170 -26 -117 127 134 -121 -110 -218 235 -101 -66 29
5577 29 -78 185 -13 -57 53 24 3 108 -172 -223 41 110 31 -42 -46 81 -196 70 -42 -13 0 37 74 -100 100
5602A00P5j90o8M3J29k0k2k27K49q2J59O0k07m8J3NP9k4l8j3n0j08K91r5n2l5
5628g6K04r2j31O4J29q8J20k15j9Q0o4P5k22L28j21M4OJ24m6j3j6j44rJ54j66
5653i4J94r7Jq4J22q7r2K28k62J87J20k26j38K94P9j35R3k97O7K28o6j12kP9J62
5678A62j69J26n8k69J21QJ74l45Q9K5K40j0L2n1j7o5P3o5Mq6O4J95l95M00m04
5703b21J82m3J10k7m2P2j02P3n3J26j35R6O4j4j60J44j20K41j96j13N4J08r4k0
5727g0R8j01J45J63j40j63L8l3L06l07l8J85m9J72j23J4j37J14m8j20J15l1J8
5750Hr7Q9J22k06O8R8oj29J46j46J64r4k1J05k7k13K66j23J28J3R8j27k34J95
5774G7lp8j07P8J14J33j84j40J9J89l6q9mK0N5Ml8L3j4L8n8Q4k7j45j33K54j6
$$ plain form
5602 100 175 -15 -83 -40 89 69 47 -180 69 -13 146 206 -1 -49 -36 -31 48 24 -14 -27 -77 -185 106 11 -41 -76
5628 -76 128 36 -95 -31 98 10 130 -85 -104 -24 -88 -13 -235 93 -28 16 22 146 100 87 71 -73 -82 72 -94
5653 -94 100 3 4 -80 42 -45 -137 91 -171 16 136 -90 -228 66 145 10 103 -194 -127 101 35 -77 -79 0 162
5678 162 -7 119 61 -208 -87 -79 95 -250 -161 -136 104 94 126 75 58 -7 66 1 5 -81 -17 178 -217 183 -221
5703 -221 -39 -82 28 1 -41 31 -71 2 -51 75 -60 36 100 86 -74 70 -50 191 -5 -118 -64 44 -50 -70
5727 -70 28 -73 72 235 95 -68 -30 -63 243 -64 -102 83 34 206 83 97 -40 74 26 -94 21 -10 8
5750 8 -89 0 122 -84 -16 82 76 -53 93 -53 111 17 -4 101 74 -139 127 4 132 145 243 116 -118 77
5774 77 74 -4 -111 -33 81 214 30 -110 -91 98 62 -27 -31 -11 44 48 10 43 29 67 9 93 66 -79 -212 42 26
5801B6r7K33k09K40o7q1k65J8K06k59L16k37kq9K16K38l41J05J14K5j53oK97j81
5825D7M2j1K5j2j65J75Kk20j00K35M0l0j73O3j1K32k41j61K00J44Qj0P2j91M5
5850EN9J86k33K1J30k40j5P7K1J72j85l0j36J28J76J05m32M8M8J7N2M5K46k02
5874F3J01j8l13J11J83j23M2q4K9kOm5J18p9M2L6j74K88j49N0j32Q1L5l7k59K49
5900A9L3r4n1P8J58R5j37M3j39M1J33j49%l6J16o0r1p2J02O3k56L21P3j70L8q6
5926b8P7o7k9l5j94J93N7J16K2n5J91n9j95J58k4kR4j98n6R3r6K72k14J00r3J9
5952D7k25Q3Q0J03n6J0M7OJ0l5R0o9l69L01j04J69Rj32j84K64j52K39j96l6R8
5977bK01j90qJ1R9j46J12n4j57K49j2Q2l23K52l4k8m0J3j25lQ5N1j28J8Q1J69
$$ plain form
5801 26 -71 162 -47 193 126 45 -220 -202 4 -255 61 -176 -178 -267 -51 187 -154 -49 65 90 -63 -69 228 47
5825 47 89 78 103 91 -74 101 103 -117 -217 18 58 28 -145 -82 -93 139 -102 -263 -63 81 89 79 151 -40 5
5850 5 64 250 17 38 168 -72 -87 -10 11 183 -2 -32 -168 -40 136 241 -191 -143 -95 -78 -26 19 265 63
5874 63 164 146 -167 -56 127 4 46 -38 -9 -11 -5 -50 68 -11 31 67 -107 181 32 82 -50 31 66 29 -230 19
5900 19 52 -42 -93 -15 143 238 101 144 5 46 179 30 30 -6 110 50 -41 -113 -11 52 -204 117 190 20 58 -28
5926 -28 49 -18 -47 -82 -276 -83 -26 90 112 57 248 189 -6 152 128 126 220 22 -34 59 -37 235 21 121 28 47
5952 47 -178 -95 -15 88 32 42 89 95 105 70 160 91 -278 23 -81 88 97 -35 -219 45 -107 132 -64 -100 -2
5977 -2 199 9 1 12 111 -35 77 23 -134 115 103 185 -138 114 80 52 12 25 -100 -103 -18 33 -95 -77 4 173
6003A73k90K34j67k32L47o8K13j59j02l0JJ00j4l1n6n9q2j5L33k98P1L54k75J4
6027c8q0J19r8j21L34r4q7l9m3K44k1k10M3LN2K0q8O0J91L1k35O4k0m6R1j07M7
6054b8N4O4j17m9K69l51L76j15j27J19k38K09J73k36n1O2J3n8J32n0j47K65l38
6077a69K62j38J15j78J82k75J78L14m52Q4Nk9J31P4k2K9l35K24Q1p9N8p4M5m7
6101a6O6J43k98L0P0O8J12k36J12j67O8K04j68jN8Pj18k1J38j53K2N7K03j91j4
6126b5j7k14K19J49j03J32j73K0J35q9l0Rl3J0j59Q0P2O1J71m56L23J3o3j48K29
6151A13k54P5L44l71J44p3l5j75qM98m37J54L4l1j58L69q6n4j15K16p1k21K18
6174G6r0R7O9k27J40j53O5K7p5M0j25K38j16j93K42L1j65J88J61j52nj06o0J24
$$ plain form
6003 173 -117 117 -50 -282 65 -3 210 51 -51 -81 -80 20 6 -25 -81 -140 -222 -237 96 -202 -131 223 -52 -38
6027 -38 -118 1 -97 -218 116 22 -65 -104 -147 97 76 -134 -91 -88 -36 -16 -104 -44 147 178 -57 7 -13 -59 32 -75 -28
6054 -28 26 90 -27 -76 193 -158 218 103 -24 95 -143 66 239 3 -48 14 27 -31 101 51 -96 169 -169
6077 -169 93 -45 70 -108 74 -201 -23 291 -161 -77 -72 -101 30 104 82 111 -224 0 81 2 60 -14 31 -16
6101 -16 50 193 -105 -75 -5 63 175 -61 51 -116 -48 156 -12 -13 45 52 -66 -87 51 -102 -80 -23 180 -11 -25
6126 -25 -42 -256 -37 112 9 141 -32 -12 123 34 4 13 -20 -10 -169 -89 -17 44 215 -241 82 95 32 -116 113
6151 113 -141 -66 278 -93 51 -22 -57 -232 -240 258 -179 -25 9 -22 -180 189 103 49 -66 150 79 -142 76
6174 76 -14 83 152 -75 65 -88 -23 4 -71 -31 -156 82 -34 -227 15 46 -119 69 230 78 73 -33 -93 31
6198C1p5OMQ1j91K51r0K3j41N9Q6j04r8K81j62n6N8j48L09j76J07j03R0p7l1J5
6224e1J14j44J0M1l7N2J7m6J22j66J27k05n0J84l0p1J13O7qL1J10on7Q6q8k7l1
6251E7Q0lj66J35j64J01j39MRJ19j6j81K83j42j12oJ72rN4k4N4p0J33j08j78K95
6277A78r8L4Qj70J1L0j56J54J13r7p2K06j53J33j08J4q0l5n3L6O8L0n9kJ26p2
6303a4Q3k32K09K5j7j17L4M3oJ71k78jK42j39Qn6Nq0K43N4m64L63j11P9j65J24
6329CK9j13J01j06N1L3K7j56N9K3p1N9j05K72k81L61k0j09P7j08N6k43K94p1p
6354E5j07J22j79J10j04l06L78J5J07j01k64J05J60k34R4K10n8J04j24J09M9j28
6376A3R6q4K1j72M8Jp5P8J6j78L29J17k12J64k60J49o2Q4pj30o2n9L25j53J64
$$ plain form
6198 31 -44 -38 -34 47 -144 107 17 40 -101 -42 44 -60 -158 123 -39 -95 -37 -185 124 -52 55 -48 42 -35 -66 -51
6224 -51 63 -81 -71 -30 -67 -15 2 -44 78 -88 39 -166 -216 -32 -62 -133 -20 47 39 70 180 174 117 203 115 88 57
6251 57 137 134 -32 103 -61 40 -99 -95 -86 33 17 -164 119 -23 -135 -141 31 22 76 52 106 36 169 61 -117 178
6277 178 80 114 122 -48 -37 -7 -163 -9 104 7 -65 141 -12 121 13 27 -53 -88 -141 -105 -37 -7 -66 -68 58 -14
6303 -14 69 -163 46 71 54 -63 -29 14 8 179 -99 -100 142 3 11 -45 -40 -120 123 177 -287 76 -35 44 -121 3
6329 3 32 -81 20 -86 -35 -2 25 -131 -72 -49 -120 -61 -166 106 -175 186 166 57 134 26 82 -161 133 62 55
6354 55 -52 70 -109 1 -103 -409 -31 -16 91 -10 -274 -169 -9 -243 -149 61 3 107 -17 92 141 13
6376 13 109 25 46 -126 -78 -77 -152 -74 -58 -236 93 210 -2 162 -98 51 -11 73 66 -64 -126 -185 140 -13 151
6401A51j63J01R7k28J68j47J24l33P6K22j80M20l19j5J08j75o8lJ12J90j1k71
6423a44J97q5p5J89k2q4K10j87j88K88r4j1o6J13q1J69Q5j92J27m43L99l16K0
6446a91K67j04K24k11j5O1m3R3j8R0l5n9j38R0n7p2Pm2J1J60q5J48m7n5J4l23
6472c30K70m8K73j86k35K95j96J29J4lM4p9q2P5j22J01N0J17j1l8J9k9J04n0j56
6497g4K3J04qq4KqN3j77K0R8Q0j33k0M5N1L6k0r4j29R7K38l20J62J67N1j35m8
6524b3q4O3kKP7j65Q7J34o8J9M7l0l4j4J64P9l18M14l10N7k4k41K49j87L6K8j2
6551e6N0%j35k6K40J6K05j51j77NL7n6L8j02j45K84j31L0L0p3Q4Q9j12N2o4Q9
6577B1n3J82j44R3N3j45R9q8j15Q1R2N4q9O8q1Q3M4q2r0J53k55J87k3J81j84O4
$$ plain form
6401 151 -12 89 186 -42 126 -21 103 -230 -154 68 -112 308 -11 -26 82 -93 -161 -164 -52 138 127 -144
6423 -144 53 -32 -107 82 60 -24 186 -1 -189 99 5 -6 -72 41 -40 129 214 22 149 -294 105 -211 -191
6446 -191 76 -28 196 -15 -30 31 -12 81 63 153 118 59 -79 11 -46 -118 -111 -153 -142 18 -67 81 34 -21 -7 -330
6472 -330 -60 -108 165 -21 -256 39 -157 -28 -14 -17 27 -52 -134 -59 -181 -80 -30 87 76 38 57 28 132 82 -74
6497 -74 -51 53 45 -39 -37 -45 8 -169 -149 -51 29 -104 -124 -79 -28 8 -12 -106 -235 -138 100 -220 -58 109 160 25 -23
6524 -23 -107 -44 -46 -44 33 -132 -45 89 21 40 87 57 23 9 173 252 -66 348 38 95 71 -170 79 -108 -72 -44 -56
6551 -56 -6 -6 -141 -167 73 89 294 143 -34 -29 8 -48 -10 -112 -257 27 -104 -74 -44 -117 -33 56 -56 -4 -68 21
6577 21 -32 150 6 99 152 7 106 18 -97 -16 76 130 41 109 28 111 155 73 -17 136 -119 68 45 226 42 106
6603A06j66J0j4J00j98J30J83k39P6J81k21j04J5O1J65j49K02l3p1j79J56j42
6625a31J90J55j64J07j27Q7j84K43k95l8J69RK21l43K94j59o6K39j14o5J38q4
6647H2k79p6J97J9j34J32j16j2Q2J01n2N8K17l64L60j39k07N0J13l8J49k64J10
6670a1O6Km1m4N9j47O1J94m1l17L80l19J53K64l49M9k21L9J94l1P9L8J88k24o0
6695c9K21l15N9P9qJ65m7j32P4j87J34J89k60J09k15J20k1K3K58l87K5j91M55
6718A09o4Mj91L02j35j31K18j65N1N6J27k25n6J64m4jj14J93%k3N3K4l90J35J50
6743D7Rj39Q4q7J46J07q4j12pJ7N3M2k2J25j13r2j79J58j04J97m5L2R0jj10o7
6769e5J3Q0q5j2k0J61k49M5m0Q4NM5P5k16K72o5qj3J4j17lM3J10j50M6q4J71q0
$$ plain form
6603 106 -60 -50 -64 36 -162 -32 151 -88 -12 169 -52 -156 -141 -80 85 -64 138 105 34 -145 11 -131
6625 -131 59 214 50 157 30 117 -67 176 -119 -157 12 21 242 -101 193 34 -32 207 93 28 166 82
6647 82 -197 -273 -76 -57 -191 -59 -175 -187 -105 -4 -56 2 219 -145 215 76 -131 -81 32 -6 143 -121 -11
6670 -11 55 57 16 -28 31 -116 -55 139 98 -219 161 -158 -5 259 -90 -41 -262 -223 -29 -60 19 57 245 21 -39
6695 -39 182 -133 -74 5 -3 162 115 -17 57 -130 4 193 -67 42 -173 -53 -74 -51 207 -180 -155 -346 109
6718 109 45 49 -142 160 25 -106 112 -53 -2 54 181 -44 -100 64 20 19 -95 98 98 75 128 152 -238 -103 47
6743 47 56 -83 1 -86 60 167 83 -29 -36 -19 34 76 54 179 66 -26 -205 -47 -151 46 1 33 123 122 12 -55
6769 -55 -42 38 -47 -59 -79 82 -167 -122 -162 -78 -73 -28 47 -169 103 38 30 17 31 -86 -89 -46 64 -86 -40 -124 47 -33
6797c3J51R1k57k6L61m76L00L1j59J98K7k84J77j74J16k5p1M0K5L6N6j70L7O0
6821C1J2o3l9K22k14J00q4r1p1K40o4N3j62J15o8J91j54R3Qk23J07K63r9pL4m1
6847H9r1o3k2l9J3J18o0M2J00j89j35K21Q1j61P3o7L4N5k9o4K14j22n3L4q1L59
6873B57k48N7p0J70j30j72L03j62J9L8l0j4R5n4%j57P2k3l6J98l01K38r5LJ48
6898A06j06K16j96j20K04j57PK25j63%m5o2L7nJ54k2k49J92M7n3j38M66j80j90
6922c2J72k67m2N80m44j03M9K84n8j6k63KK80k50O0j38L31r9J01l77K95q1N8j35
6946i3J96j20Q7j93J07k8J89j77j27K71k13J25J0q2K38l17J98L2j10m3O6l0k2
6969c6L0r6J13K77k71j74O1J51j01K04m6l8k68K24j57Q4O0J64j03j40J12J4Jk06
$$ plain form
6797 -33 118 209 -48 -74 287 -189 111 142 -17 181 208 -76 101 -73 43 18 -53 -13 12 48 104 -66 -29 31
6821 31 43 -20 -59 163 -51 49 -35 -126 -197 43 -21 32 -130 -15 -83 108 -46 47 55 -168 -61 202 103 96 130 89
6847 89 -2 -65 -87 -126 -113 5 -55 -13 87 -102 -237 -16 65 -96 -23 -90 -56 -1 -30 -94 120 -2 -55 -21 -102 257
6873 257 9 66 -4 166 36 -136 167 5 24 62 32 18 113 59 59 -98 -26 -49 -85 113 -188 50 -45 -42 106
6898 106 0 216 20 -100 104 -53 -46 179 16 16 -29 -91 -54 -59 95 73 -176 16 63 10 -128 338 158 -32
6922 -32 140 -127 -169 411 -33 -136 -87 197 139 123 -140 -138 142 -108 -48 -186 145 46 147 -230 65 -16 42 -93
6946 -93 103 -17 70 -123 -16 -44 145 -32 -159 112 -101 24 34 -48 190 -127 71 103 -7 -50 16 -14 -36
6969 -36 -6 -102 11 288 17 -157 -96 55 -46 158 112 74 -194 30 -127 -43 17 181 78 -62 50 64 65 -141
6993a41l3M24k44J95l10qK33k39K42r6KL8l4j56K30o0o5J10k50J43LM7j77K07
7017F1k40L82j84KJ36k37J42l49N23j71l9o1K5m1N2PJ69l86L04M4k49K63k59L31
7041B25k04j29m5K53j54P8j57J53j28K39M6k58J32j22J33p7Q2j02q6J75k6K8K4
7064H0p7N9O0k14J04J84l3j86J0O7j37J79N5k69R9Q8j52N9J26p0N8K4Pk23L74
7089B72l01O5l7%n6J42n4J89n05K78P2j35N2O8O1j18J9r1L21m52K9K48n9k2R0
7114G6L6L2k63J73m3O2p6o3j34J62M8J96k03kq9J30j89L19l1k8M6j51l2k76N05
7139B05m3k32J86P5n4j78K91l02j59L14j81J15o6M8lq2l1P1Rj30J94j12J40n5
7163B0k3K8%m6k9l0J27Kk62K37r4J4o3N7j5J51r5J81j75nnk9p3J07j18K12j34
$$ plain form
6993 -141 -174 250 6 201 -109 -117 116 -123 119 23 25 63 29 -127 103 43 -22 88 -162 -19 -16 31 -146 61
7017 61 -179 203 19 21 157 -80 62 -287 236 65 26 -35 -10 -51 1 8 177 -209 95 139 -110 153 -106 225
7041 225 21 -108 -153 100 -54 24 -133 20 -108 131 177 -81 51 -71 62 -15 67 -35 -121 54 28 56 80
7064 80 3 62 122 -92 12 196 163 -23 -13 54 -83 96 151 -118 -19 69 -83 -24 102 32 90 114 121 -102 272
7089 272 -29 36 -1 -1 -57 85 31 220 -285 -7 65 -70 -18 50 111 -7 12 -79 242 -210 -181 67 8 -14 76
7114 76 112 144 -119 54 11 73 -3 -66 -200 -38 10 206 3 1 -88 42 -147 172 141 113 159 8 -24 -300 205
7139 205 162 -70 116 191 137 -41 250 -52 -211 103 -78 37 -29 19 16 -66 -97 -26 -17 -147 47 -65 75 20
7163 20 -3 25 25 -21 -50 -80 47 49 -213 24 -70 -56 -119 -62 -77 74 -21 160 -15 -20 -25 -54 -127 -20 -138 74 -60
7190f0J82J45l49O9l8O1j25K32k15J11j33k19K40J70k3n8l1k3J10k9j51Q2K66
7213B14k95j9K07qO1j24k2J4M4qj51j7J50j88J56rj82L65k58j47nK66j83K48k85
7238a76K58j19l4O7k53K60J11j39j78J02J90j12j45J32Q5j02J71r3P2j93O2N2
7260A8j3l6p0J20L4o7K4l3k4J26j99R1J20k4J26m7q0j06j18K60p0J12Ql0k07k6
7286a11R0J57k49J19J55k14L3j6r0K26k5j74J87j27n2P6r7P9MJ85q1j0Oj99RJ51
7312C2k7n3Q1k2J19n7m1j2J0j00L2P4J17k29j60K34N6j05j4K7L9J14o9k30K63
7337G9k1m0J5J0j46Q7J89j85N2q2M4%O0ro7j08P3k6J41rr2M0K2k66J82l2J46J29
7365A86q5J52l92m1K05P6m3O8j99j78Q2J09M8j10R2M2K45j86R9j43j31L9o8Q1
$$ plain form
7190 -60 122 267 -82 -13 -51 10 -115 117 -98 13 -120 -339 -99 71 48 -10 -41 -64 46 17 -134 -52 214
7213 214 -81 -100 107 99 160 36 14 28 72 64 -87 -104 46 -142 14 5 -177 188 -70 -217 -222 44 -139 109 -176
7238 -176 82 -37 -71 -4 -257 3 114 -25 -203 -101 89 -23 -168 -36 49 -53 118 25 97 -96 -34 18
7260 18 5 -31 -101 19 53 -14 10 -23 -47 79 -120 -29 91 67 193 146 66 -40 -158 102 32 144 152 122 -85 -111
7286 -111 -21 136 -113 6 161 -53 -20 -36 -126 100 75 -99 88 -39 -91 -15 -112 -33 -29 156 75 65 71 -128 -119 32
7312 32 5 -48 33 11 130 73 32 20 30 -70 -38 36 153 -76 -236 -2 54 -51 -65 -38 1 115 46 -184 79
7337 79 58 18 33 43 -103 -16 173 -12 40 -42 2 2 62 53 -14 -122 -49 -75 66 57 -35 5 27 -239 -57 -89 57 186
7365 186 101 253 -139 -180 25 101 58 126 -73 -251 -169 -60 -12 -122 -30 12 257 71 170 27 -104 -65 -133 -52
7389e2lJ51j00J6n7R7r7J96m71L67K05m07J8K0O2K16j38k07K75j08K23j02J02
7412B06k87L4j53K14J1m5N2j11K17p3J0j90J91j40j12Q8J00j84M0J50l3m7%J47
7436H5j36M2J73k90J45r4J5K13n9qj14j3R7j03m9K05m18J85o7K3J59J27j65J80
7460A33M9l44K58m7k24Q0K41l2p9j01o7K1Q5J19j31J0Q2j30JQ1Q1J7j62J65L4
7485A40k81P2Q7p1o3m1J38k51K92J00o6j8J23j03Pn9Q4j6j23j48j8L77j22p8n0
7510h8J23r7p4K79J5j54k10J66j7K41k40r1K31p2mR0j10R7j49J68k40K8Nm8J23
7535b8N6N5j95Kp3K20j0Kj96J55M8R3k69M22k47M1L0j30kj29O3J83N0j83o2L2
7561g2K07K0k9j39K2K2L1o3j28L2Q5j1J83j06j0j29o5J78K8k4k5MO6q0j92L39
$$ plain form
7389 -52 -55 96 -4 12 -45 52 -45 151 -320 47 252 -155 -137 -117 -55 161 23 -184 91 -17 206 104 206
7412 206 -81 -47 -200 14 25 -20 32 -79 138 65 75 -115 76 -64 -176 -88 12 -172 -132 18 -15 -62 -62 85
7436 85 -51 -9 164 -126 19 -75 -60 153 94 86 -28 -41 56 -47 -96 109 -309 -124 -191 -168 -9 118 -47 133
7460 133 182 -162 96 49 -175 -95 146 114 35 -66 -133 -112 -27 92 -39 -29 53 -77 -76 5 86 103 -59 106 140
7485 140 -141 -69 18 -53 -116 -157 -19 -270 22 122 56 38 161 58 65 6 90 74 -49 -197 -215 162 40 -38 -88
7510 -88 35 -62 -136 143 158 4 -206 -40 -57 184 -56 -147 84 12 8 98 -12 85 -64 104 -136 -108 -103 -151 -28
7535 -28 28 83 -112 -110 -183 37 27 29 -167 -12 36 129 -140 282 35 76 106 -24 -26 -155 -92 91 141 -42 -104 -72
7561 -72 135 155 126 -13 9 31 62 -1 -129 -97 -12 -23 160 54 44 -85 -150 28 56 32 7 11 77 -3 -195 144
7587A44pj67J05j43o6L4M9K94l61Q7l0J04J2j15L76l55J6l9QM3n2K3o3Q0Kk3q0
7614a24K4J77k62L9J4J57M7j46nj12J60J2J49k77J3K22k60mM1N9P9J34l10P4J19
7639B0j61j4J26J57k32JM63n04l7J60J00k67M02q7j28J6J31k13m1J21j52O3L2
7662d4r8L48k19j24K04J5j84lJ38n7O0k03K00j16L4J34k18J20J11k47r7K65k07
7685a88K6L16o5k0j17R7J36p4k95J00J31J8K9m6n8kK46l60L2K56j58l4j27N0P4
7710c3o5J02j45J68j43K18j56K12j57j62O2jL89l26J33k6J72k88J22J9j16N3N
7733C7j57O4L04m44L79l64K86J51m55J6K10pj31J1R6o2L9o0j2lJ54M7j14N4P8
7758A17M6j31l1k38J18j1J26J00j44k5L0L5J71q3j07L0j51J25J17j8k39L17j94
$$ plain form
7587 144 137 -30 75 -68 -134 -100 -51 243 -118 -31 -61 43 55 -60 316 -39 -23 -62 -54 -11 -63 -40 -103 -23 -21 -44 -124
7614 -124 -100 77 -185 -146 -132 25 72 -74 -79 -191 -31 -19 130 -147 -134 88 -172 -176 -135 -76 3 137 -173 -99 20
7639 20 -141 -155 -29 128 -104 -103 360 -144 -181 -21 79 -188 214 127 -1 15 146 -67 -108 13 -139 -76 -44
7662 -44 -142 206 -13 -137 67 82 -102 -105 33 -24 36 -167 33 -83 -49 85 -133 -13 98 -149 -246 19 -188
7685 -188 -162 154 89 69 -48 49 185 111 -184 -84 47 65 94 48 -10 -12 234 -126 -94 162 4 -30 -157 -107 -33
7710 -33 -98 4 -141 27 -116 102 -54 158 1 -161 -99 -100 289 -37 96 70 242 -46 76 95 -21 32 37
7733 37 -120 -56 248 -196 183 -181 105 256 -199 -183 27 20 -111 -100 -4 -66 -27 -87 -99 -102 52 99 -15 39 117
7758 117 163 32 1 -237 -119 -130 -4 96 -48 -73 -43 -8 163 80 -27 3 -148 -23 94 76 -163 154 -40
7781d0j19J22M5j76K74n1J21Km61J61J17o7J28j5k11P7n2K45k68N4J70q3K9j30
7805a28Q9o9J58k00K73O5j29k46J21K13k23K5K0j18j3J70K0j69L17k17K22j47
7827C4j2j03N0J15r7n4lo9K84r6q3m3m4N5k3J18K5j03k2Jj4J63j75J22o3R5j29
7854g1K66N2J4j69j3L0Q1l59J95J3n9J41J7l75L59rPk83L1K24o7l63J39J40j5
7879g4mJ48j42K20j18o9J30n6r0P0J74l09J58Kj17J5j40K35m3k41J50L14p4k50
7903a11Q1j16J73J5k0l33L74j53K33j51k9Q1o7P8j06R0j51M4J4O7Jj64K15p0Q8
7928H3j14j34Q9j40K41K2j77m7N9J20J17p6j54R6K12J8m13J90Q2J73r6k03J35
7951H3k31J16Q7K5q5j26K28m0n5m21L97j6N2L5L7K6qj63J30j70R1J96q7p2L41
$$ plain form
7781 -40 -159 -37 8 -168 106 55 176 178 -283 -122 -5 -72 56 41 -170 -93 -145 100 -168 -114 56 -27 2 -128
7805 -128 -39 -108 50 -150 123 188 59 -187 -66 147 -76 -51 -31 -149 -162 8 28 -141 176 -41 181 34
7827 34 22 -81 -31 84 -13 -67 -70 -139 145 49 -34 -77 -121 -66 -89 29 54 -49 -71 -70 -84 79 -96 26 -37 58 -71
7854 -71 195 247 261 92 79 109 190 -169 26 39 -20 121 138 -237 122 113 120 -163 -132 92 25 -338 -199 -59 -74
7879 -74 -78 70 -72 148 30 -39 91 35 -55 15 189 -120 38 40 -77 -62 -202 33 -10 -251 -101 213 139 -111
7903 -111 -30 -146 27 42 22 -311 63 -90 143 -8 -37 44 -23 55 -51 39 -112 -68 -54 13 14 -150 65 -5 83
7928 83 -31 -165 -76 -216 25 47 -130 -177 -118 2 119 43 -111 -15 197 215 -198 -8 74 247 151 -52 83
7951 83 -148 -32 55 80 -5 -131 97 57 2 -419 -22 -38 14 49 86 112 104 -59 71 -99 -8 188 101 29 370
7976C70n22Q1l9J69jO3J1n8l4q5O3O0M9j38O8j54RR5L3j91j19K12K1J84o4q8p
8003a2j12j2K72k55R0J92j37j1j37K55k09n9J43m2J7k21J99J54j55J24j31J08
8025F1J13L6o8j13j63J41j1j2j20L82j84J42j29J23l27J51l3k4P7J20k06j09L39
8048A86j07j20Pn1j40J87K45j74k09K97k56J58N3R7j68J3P7p4K4j42M1p4K44j16
8072bK0o8J27j75j33K38j48K43p1M4j34J27J25j31L1k12M8P3l6mO0J09M9l49J88
8097A9k01K00n6K24k12q5J81J4j46j86N71l15r1O8K33n5j24N2k10n9J75J45k35
8120i3n4J90j37R1O8j37K2Q5K7j34K00J22k69p2K9N1J04p2m9p0k35J77J94j22
8144h4M6P7j21K76k65j97J87k2R8j79J31rJ64o0R4j37q1K30J08l09j56J54J28
$$ plain form
7976 370 -152 -71 -110 59 58 121 132 74 40 -45 18 78 127 -11 57 -97 -88 7 40 -151 -270 -58 -37 147 83 -5 -12
8003 -12 -124 -136 136 -119 -29 163 26 15 -122 133 -76 -135 8 -34 -17 -238 -39 115 -40 84 -47 61
8025 61 174 210 142 29 -134 7 -4 -16 -136 246 62 204 75 198 -129 22 -11 -35 42 162 -44 -153 186
8048 186 79 -41 -34 -85 -225 -38 207 33 -176 121 -135 23 76 173 5 18 95 21 45 -97 -56 -130 114 -2
8072 -2 18 -50 77 -98 -231 7 -141 102 31 75 -59 68 193 62 93 -119 -71 2 -34 -38 22 131 180 -169 19
8097 19 -182 18 -38 186 -26 -111 70 84 -62 -248 323 8 -83 -15 218 163 39 91 -119 -178 -3 142 -93
8120 -93 -147 43 -94 -3 65 -72 -50 35 62 -72 128 250 -19 -91 -62 -11 93 21 -28 -98 -333 -156 38 -84
8144 -84 -38 39 -82 194 -71 -268 -81 -103 -5 -184 -53 -62 102 42 136 -1 -82 148 256 -53 -209 -55 73
8167G3k21K06K5N1j26O2Oj32N5p4LJ76j24k71K93j35L08j23Pj11n9j15J95K52
$$ plain form
8167 73 -148 58 83 134 8 70 76 -56 -1 -75 -72 104 -20 -291 2 -133 175 52 59 -52 -111 -226 -31 221
8191B21
$$ Imaginary data points
##PAGE= N=2
##DATA TABLE= (X++(I..I)), XYDATA
0@%%%%%%%%%%%%%%%qJ6j6J6j6K2l0L2l8M6n0N8p2Q2r0J04j20J36j54J76k00K25
37A19k53K83l15L51l92M34m79N32n87O46p15P87q67R57j053J160j281J416j563
56h20J733j930K154k413K724l103L572m177M984o122P866j0901J7691o3764K5985
71b6521J00793n8877n4815J1004M8550j2562j2791P897P441j9204J1968K1807
83B4690n272k3566k4643J8337M4788j3840l8945k894K6781l409j7143O682J6976
96H542j4916p660K8112q995k8462J5035K3799m537j3264P577L380j3662l104J7797
110I642k493j2163J2670j554j2924p41K418N335L140l338k370L904k68q967n192
125a2901J7758J5485k7081r293K9429j449k7982J802K5226J855j6496N79Q819
$$ plain form
0 0 0 0 0 0 0 0 0 0 0 0 0 0 0 0 0 -8 8 -8 8 -8 14 -16 16 -22 24 -26 32 -40 42 -48 56 -64 72 -82 94 -106 119
37 119 -134 149 -166 185 -207 227 -252 280 -307 339 -376 411 -456 501 -552 608 -673 743 -820
56 -820 913 -1017 1137 -1276 1448 -1655 1917 -2260 2724 -3398 4468 -6433 11258 -52506 -26521
71 -26521 74272 15395 -39420 -28416 20134 7572 -5219 2678 10119 -9085 2883 24690
83 24690 19418 -4148 -28791 -10454 34334 20494 -18451 -21345 5436 2027 -15116 -8434 8542
96 8542 -6374 -14034 14078 5083 -23379 -8344 15455 10918 -2346 5231 8611 -5051 -8155 9642
110 9642 7149 -5014 7656 6102 -6822 -7563 -5145 190 3330 -8 -2378 1526 1258 -7709 -12901
125 -12901 4857 20342 -6739 -16032 13397 11948 -16034 -14232 10994 12849 -3647 -3068 5751
138E751j3539k758K4244m052j8828N978J3644k36j5949q750J5159J4426q672j3758
152g340p89J0431j033j6732J3851J8981k4039j4487K7443J3401k7477j6522K8559
165D247K4962k3798k0071J7068O201o687p72J284L521m913q320O448M815r977
179e992o371Q308J3634o794k1886J1535J9749j3326q911J4408Q033r483q812P517
193A609R127q362k909N903k959K21j610r034M872O767o267m362L402M393k125
208a334q182N659R396m917p19K236k375M270m42m818N097K851n768k984K278M610
224D858n560r192J1211O133j3902j221R780m16o467r41R887L722j2997j391J2532
239F036N66p211n030N824J0402r252j1490J0492P415q883o285O234R479p552j1738
$$ plain form
138 5751 -7788 -10546 13698 9646 -9182 -3204 10440 10204 -5745 -14495 664 15090 6418 -7340
152 -7340 -8129 2302 1269 -15463 -1612 17369 -6670 -21157 6286 19687 -7790 -24312 4247
165 4247 29209 5411 -14660 2408 8609 1922 1150 2434 5955 1042 -7278 -830 3985 -5992
179 -5992 -12363 -4055 9579 2785 -19101 -7566 12183 -1143 -10054 4354 12387 2904 -5908 1609
193 1609 10736 2374 -535 5368 2409 2630 1020 -8014 -3142 3625 -2642 -7004 -3602 791 -1334
208 -1334 -9516 -3857 5539 622 -97 2139 -236 4034 3592 -1226 3871 6722 954 -2030 248 4858
224 4858 -702 -9894 1317 7450 -6452 -7673 2107 1691 -4776 -5717 4170 7892 -5105 -6496 6036
239 6036 6602 -609 -5639 185 10587 1335 -10155 337 7752 -1131 -7416 -1182 8297 745 -10993
254a0993J1849Q721j1647l572P226M344m007q143N386P988q197m855O161K336
268B597k593o643K736J0353n413q997P330O300l319n447R15Q960j073r997M091
283b00O254l684l712j679M015L033q560j641P171m39l720j872K444O430l912n374
299e446P012K987l290j149P27M854q41p657L791N341n449l725N74L636J012q653
315f276J34R047k901n923J971M915K482o451k144J0625O43q591J129N738J952
330F350n210n846P639M060r705k176O063J081l925n155M976O451p714l895Q086
345A080K566l751l699L367P168m642o737O572L457m608k722Q39M978j895p978
360f005L755O668m419m412J598N175J154p754P62Q390k338n013J604L052P24m052
$$ plain form
254 -10993 856 9577 -2070 -5642 1584 5928 1921 -6222 -836 7152 -1045 -5900 261 2597
268 2597 4 -6639 -3903 6450 1037 -7960 -630 5670 2351 -3096 -2181 6779 5706 -4291 -200
283 -200 6054 2370 -1342 -3021 994 4027 -4533 -6174 997 558 -3162 -5034 -2590 3840 -72 -5446
299 -5446 1566 4553 1263 114 841 5695 4854 -2803 988 6329 880 -2845 -2271 1365 2377 -6276
315 -6276 -6142 2905 4 -5919 -3948 967 3449 -3002 -5146 5479 6122 -2469 -1340 4398 6350
330 6350 1140 -4706 2933 6993 -2712 -4888 1175 2256 -1669 -6824 -1848 4603 -3111 -7006 1080
345 1080 3646 -105 -3804 -437 6731 2089 -4648 1924 5381 773 -1949 -1110 3868 1973 -6005
360 -6005 -2250 4418 -1 -4413 -2815 2360 3514 -4240 -3478 4912 2574 -2439 -835 2217 2941 -1111
376a111k488O502J29o053K08K565J983j997m735N109M284o376j456N373J820l128
392F29l928M354N252o458l473M874R51j465k572q39M267j399n268K762M463j234
408I16l967p12P292R50q816K213P613k306l696N93K843k3n324M73N318j802l435
425a870j205O37M289k358n582N221M169m433j989L489K719l901k622P916K962
440G442q869j473N061N26j460k727J85L243j421l343J09J710J745l383k13P258
456D390k071q749M012P668k318m766J363N270k064n980K539L127j931K35j335
471f10m38K726l133m269N016M622l412m179L057M683n514m045Q876K731p737l86
487b012L819j2k356k443K389L281q91k224l331K102M438m632k022Q249K01q218
$$ plain form
376 -1111 -3599 2903 3032 -3021 -2813 -248 1735 -262 -4997 112 4396 -1980 -3436 1937 3757 629
392 629 -3299 1055 6307 -151 -3624 1250 2201 736 -1836 -2675 1592 193 -5075 -2313 2150 916
408 916 -3051 -3763 3529 4479 -4337 -2124 5489 3183 -513 80 2923 2900 -2424 -1951 3367 1565 -1870
425 -1870 -3075 -2438 1851 -507 -6089 -868 3301 -1132 -3121 368 3087 -814 -3436 4480 7442
440 7442 -1427 -2900 2161 2687 1227 -1500 -1315 1928 507 -2836 -2727 -1017 728 -2655 -2868 4390
456 4390 2319 -6430 -2418 5250 2932 -1834 -471 4799 2735 -3245 -706 2421 490 725 -610
471 -610 -1048 1678 -1455 -5724 -708 3914 502 -3677 -620 4063 -1451 -5496 3380 6111 -1626 -2012
487 -2012 1807 1795 -561 -3004 -615 2666 1775 -449 -3780 -1678 2760 -1872 -3894 4355 4556 -3662
503c662Q51N783m50m797J476N809k659n242K101O18j352K297j087o19L107k116
519E8m819J383N211J329m610J081M418n296k271O542J12m736J546L503j164m614
535b327j189K746Q40J430L50m540n93M025k278j006M656K77l859J249L651k085
551A347n751L773P048m196l969K653q50k611J459J061N19L26j173j653n74K646
567E5J51l173M248M298o424l115N799Q64m450N22N227J54o238r54L388n27k46
584d21Q67j552J460R93m157q36M612J342l190m89M743q76o538J905N841k467k241
601a004K314q0j846j707R86J616P11j08j425j381K727k12l992L144M361l116k395
618a407K060O20k640n52M134Q63m555J77K080j269l25Q3n83K183J084k767j546
$$ plain form
503 -3662 -2811 2972 2522 -2275 -799 5010 2351 -2891 -790 -172 -1524 773 -314 -933 2174 58
519 58 -4761 -3378 1833 3162 -1448 -367 4051 -1245 -3516 3026 3138 -1598 -52 3451 2287 -2327
535 -2327 -3516 -770 70 1500 1850 -2690 -3283 742 -1536 -2542 2114 2391 -1468 -219 3432 1347
551 1347 -4404 -631 6417 2221 -1748 905 55 -2556 -1097 -36 483 809 -364 -2017 -2591 55
567 55 206 -2967 1281 5579 -845 -3960 1839 2703 -1747 -1225 4002 4156 -2082 -3036 352 -175 -421
584 -421 446 -1106 354 1347 -2810 -3646 966 2308 -882 -1371 3372 2496 -4042 -2137 3704 1237 -1004
601 -1004 1310 1230 -616 -2323 -1337 279 990 882 -543 -1924 803 591 -3401 -257 4104 988 -1407
618 -1407 653 1273 -1367 -1919 2215 3078 -1477 -1300 780 -489 -814 -731 -1314 869 1953 -814 -2360
635b360J900J933j413j000L434j21m741J592K862j873j611J615J058p53k441O91
651a228R23l13P74j00o14J464r66k402K409K463j953j364J966J006k690j569L144
668I50J053l127O40J377r39q74p04R37J607n14j067m00J172J067j870o43L380
685B045m00k722J049J421j112j160O60J482n52j918P23P94q99J44m68P48J163
702I98j134j330J600Q43p31r91R52J589j833j290J838P96j913J25N29L91l66j486
720a413Q77J012m74m25k10R08O56j726n3K122n76j265M61J112m87j460P8J713
738H50l73j361O09L66j20k73l99Q11P46j400q9J060K03m81r98J223J166j791o29
757h80J260K72o70p40M35J174j120r65J109N02n85k61K60Q02O2j286M68J475q77
$$ plain form
635 -2360 -460 1473 60 -940 2494 2373 -2368 -776 2086 213 -1398 217 1275 522 -1919 -1228
651 -1228 -305 -618 156 56 -558 906 -60 -2462 -53 2410 457 -907 1059 2065 -625 -2194 950
668 950 2003 -1124 -484 893 -46 -920 -1624 -687 920 406 -661 -1061 111 1178 -692 -1335 2045
685 2045 1645 -1077 -28 1393 281 -879 -219 1263 711 -1207 -484 310 -589 -445 -913 -165 998
702 998 -136 -1466 134 977 246 -745 207 1796 -37 -1327 511 1307 -606 -481 48 439 73 -1413
720 -1413 -536 476 2 -423 -633 275 931 -795 -848 1274 698 -567 -106 1006 519 -941 -863 850
738 850 477 -884 -275 91 -29 -302 -701 110 856 -544 -633 427 630 149 -849 374 1540 -251 -880
757 -880 380 652 -18 -758 -323 851 -269 -1234 -125 377 -208 -469 -209 593 655 -631 -163 1312 435
776D35p26K59N67K8j180J62J035k78q52J96L90J77o99l70J175K25r95j87R36K7
796C25k28o29Q74O49r84m08N70K60m00o83K57R46q76l02N53K12k01n26N6J108
816E73k67r30P50M01k38m28o0O91n4q91K64O46k81n96K3L37N00j129L8Q53qm42
838b48k0M38L67n31l44M46N16p48j05M70J41k68p69N78M88n40n91N67L27j50m94
859d70K16Q07k88o84O44K47k18m04j20O89j2j060N47M31j95m04J2K69K78p58J39
880c34N09J89k81l34J61K98j69n40Q61R2n23k44K18P07m59p19O27K28o36R1J39
901a19K09R1l71P2N43m44j93J40L64M05p81l37J092k34r65L81K90m8l70J7M62
922B04j20o54L24O17l00k4k90J27O19l02m58K95L39l54k74K65L28n11j42M61n6
$$ plain form
776 435 -291 -32 535 563 -617 -455 580 302 -550 -354 36 213 -486 -856 319 544 -451 -638 298 325
796 325 97 -532 342 991 7 -401 169 429 29 -654 -397 549 -327 -629 -76 136 -65 -591 -535 573
816 573 306 -624 126 527 289 -139 -199 492 438 -453 -189 457 176 -420 -397 -60 440 -689 -651 202 194 -248
838 -248 -268 170 537 6 -338 108 624 -124 -229 241 382 114 -655 -77 411 -129 -720 -153 174 24 -470
859 -470 -254 553 265 -419 225 472 254 -150 -270 419 407 -653 -106 325 130 -274 -262 7 285 -473 -334
880 -334 175 364 83 -251 -90 208 39 -501 360 452 -71 -315 -97 610 151 -568 59 287 -349 -258 -119
901 -119 90 181 -190 -118 425 -19 -212 -72 292 697 -84 -421 671 437 -528 -147 143 95 -275 -258 204
922 204 84 -570 -246 371 71 47 -243 -116 503 201 -257 38 377 23 -251 14 342 -169 -311 150 94
943I4j83J69j89k79K84k93M14K09p1l41l8M07M33p28k74O81J07n86o7J96Km09
965d62L4O33r8l59J00J74k4J62l46K32K45l59j5K9L66j27n68M68M29p48l81Q11
987A96J89l50n14M51K57l15j11L12K32j47J25m36M99M3p73o7O82K57o51k11P00
1008C68k16n59l9P50n8k94LJ00K10j77k61J79L14k08n48Q5M72P3o02M67L82l78
1030F3o64N75M22p23p3K44M54n45m4K96J2M4R1k41K57K05m89l55N88J80k82k96
1052b81L89M7o07M9N04R8n24N03k46m6l5J2K94j61K41l3l48L00l6n66L00P77n19
1075A12n93N82P9l57l64N40K92l86J15K32m51K10J65j31J11J63k95l18L33J76
1095B15l02j97P63l07m32j72N15m02j6K22M62j4n87J70J25J21J71l08j09L19l1
$$ plain form
943 94 -89 80 -109 -388 -104 -397 17 226 155 -186 -224 183 616 -112 -386 295 402 -184 -251 -55 -53 -462
965 -462 -428 205 107 -252 -152 22 -2 160 -186 46 291 -68 -83 -54 312 185 -383 85 514 -234 -615 196
987 196 385 35 -479 -28 229 -86 -197 115 347 200 325 -111 388 431 -342 -409 273 530 -121 -332 368
1008 368 152 -407 -446 304 246 -48 -45 55 265 88 -173 6 320 112 -436 -351 121 194 -408 59 441 63
1030 63 -601 -26 396 -327 -400 -156 298 -247 -291 5 17 61 152 -89 168 373 -116 -471 117 297 15 -281
1052 -281 108 155 -452 -403 101 199 -325 178 -68 -114 -149 -137 157 -4 237 204 -144 156 120 -446 -146 631 112
1075 112 -481 101 180 -177 -541 -1 291 -95 20 252 -199 11 176 45 156 319 24 -294 39 215
1095 215 -87 -284 479 172 -260 -432 83 -319 -335 -113 349 335 -252 -82 43 164 335 27 -82 237 206
1116B06q06L49N07k08k21Q4N65p65k80N45K65k86P7K50j77q9j11J84l5K56k03
1137A07l61J70N47o29l54O47K42m37o8K61q5l15j23O71M2l53R1j26K8J42k62L1
1159a34L22P7n99N7N44k57k20Q1M71k75m20J74J45k4J00Q5J5P6m45K74O1l04K65
1182F9n3j44M05m06l93M64L84m34l97M80K9q3k35O32q3l74J79P4Q2r3j93ML10
1205B24p5k86k7L20j92k45R4M46n22r9M98J39l37l1pM28l26p5J14j04J31j00r4
1228a26K56O0k03l65N60n4l03m7K22J62m03R3M21k30L0R6q8J12p1l41L96R9k29
1251D7j95K74qk67Jk58P18k11n11L00L24r8l00J04M30l79r5L68k46P0k3l8K57
1274B64k21q6K1J86J2l23j39L03K55n30O1J61J4J6J82o7K55k70k40M30k97j48
$$ plain form
1116 206 -600 -251 256 48 -173 -89 476 -289 -569 -24 241 -45 32 282 105 16 -95 89 54 310 107
1137 107 -254 -84 463 -166 -520 127 369 -68 -136 125 40 -275 -398 273 315 -38 53 -73 -45 97 -165 -134
1159 -134 188 265 -334 -277 267 10 -210 -129 342 67 -353 -179 -34 -58 42 127 142 218 -227 47 108 -196 69
1182 69 16 -128 277 -129 -522 -58 326 -108 -505 -25 4 -79 -314 318 235 -139 40 114 196 103 -90 -86 224
1205 224 149 -137 -164 156 -36 -281 -187 259 -263 -362 136 275 -62 -93 -100 328 2 -73 41 -63 68 -32 -126
1228 -126 130 190 -13 -378 182 128 -175 -222 0 162 -241 -148 273 43 73 169 81 193 122 -219 177 276 47
1251 47 -148 126 118 -149 -148 -406 312 101 -410 -110 214 116 -184 -80 350 -29 -124 244 -2 68 45 7 264
1274 264 43 -43 -22 164 176 -147 -286 17 272 -258 -197 -36 -22 -6 176 109 364 94 -146 284 -13 -161
1296a61p6P3M36l6n36NL89k09qK2K53K31o35L09K68l6l31l09L79J30l14NM08j37
1320A20m97K28K1K16k08j54L08m2m6j30J42K60k21k10J80K28l20J46J08J56l00
1341a5m09K42J93r0l08L74N9Nl20J67J67K40l49J78J96k01j16n1K00M5k06j30
1363a29K35nj88n2J18J75k50l72M46J66m56K32k1K76j97k43M53N6j62j66M21k43
1385I4k41k98M93K2q0j41K29p6j11j6J1M08k02k28J29J63J25l82k4K83j46k42
1407b30K15K62k05j57RR4J55k71j99M25J1j81M8K07J82k01k24L94l19k0n2R0k5
1430HJ59k27k79M18k82j2o8K91J58k39k35M17q5k03K22lm7r6K8P5p1j39K00j38
1454a48J07J40k38P0J92l57n0Q2N18j04k72J35K67m60j31M95j61j70O4pn2K05
$$ plain form
1296 -161 -237 -164 272 236 -300 -295 94 -115 -123 -101 152 383 -252 57 325 289 -42 -351 28 158 -156 -151 257 120
1320 120 -377 -149 -128 88 -120 -274 34 -8 -54 -184 -42 218 -3 -213 -33 195 -125 21 129 285 -15
1341 -15 -424 -182 11 -79 -387 -13 46 51 -269 -102 65 305 -44 134 330 129 13 -38 162 207 1 -129
1363 -129 106 101 -87 -139 -21 154 -96 -468 -22 144 -312 -80 -101 175 -22 -265 188 244 82 -84 337 94
1385 94 -147 -445 48 70 -10 -151 78 2 -109 -125 -114 294 92 -136 -7 156 281 -101 -125 158 12 -230
1407 -230 -15 247 42 -115 -106 -12 143 -128 -327 98 109 -72 -24 183 365 164 -60 334 15 -5 -57 33 8
1430 8 167 -60 -339 79 -203 -215 -283 8 166 -73 -308 109 24 -179 43 40 -7 -103 -75 0 -71 -210 -10 -148
1454 -148 -41 99 -139 -69 123 -234 -284 -202 316 212 -60 75 342 -118 -249 246 85 -85 -21 -28 -80 125
1476A25j27r3J75oj71l8L88m9m60L56J04Ln11K23K24k54R5k6K28J53m34N8j90
1499b27Q2J13j37J85J68n00K29J32J60l59j64P15k42k41j63K82k9r3O5J36r8p4
1521f0j63P6L04o0j36j99K89J86o01K34K30K61m88K3K85k24j90M31Rk55j01R3
1543e6r7j0J1j05L69M9k92r9J32L41k69k44M99J17k59m02M65k90J47j23O2J24
1565G0k4j20k42K20Q9j05J49K65j25k33J18K33p8l34J71L49m38k84K48M0n9J6
1587g4J04n6Oo0P5k01K55J04j60j42L98m36j29M25K47k52J5kj27k05j4L20P8j91
1611b2kJ48r9M3j22J0K50N0m26J26K74j48m41N73J94k11k52Jj0p6j09L04j8k50
1635b13L2Q6l5L4J98k15o3K74r9l52L43L0j08M7j90O29n74J50J70j69j36J56K38
$$ plain form
1476 125 -2 -95 80 74 -97 -135 253 204 -256 100 204 207 -304 -81 143 -111 -16 -42 186 339 -95 -37 -227
1499 -227 -145 -32 -169 16 184 -316 -87 45 205 -154 -318 397 155 -86 -249 33 4 -89 -24 112 14 -60
1521 -60 -223 -147 157 97 -39 -238 51 237 -364 -130 100 361 -127 -104 181 -43 -233 198 207 -48 -149 -56
1543 -56 -153 -163 -152 -257 112 161 -131 -230 -98 243 -26 -270 229 346 87 -315 150 -140 7 -116 -54 70
1565 70 46 -74 -316 -96 -7 -112 37 302 177 -56 62 295 217 -117 54 403 -35 -319 -71 -31 -90 -74
1587 -74 30 -26 -20 -80 -5 -206 49 153 -7 -149 249 -187 -316 109 356 104 119 117 -10 -215 -229 91 169 -22
1611 -22 -24 124 25 68 -54 -44 206 256 -170 -44 230 82 -359 214 408 197 -55 -54 -64 -140 -249 55 37 -213
1635 -213 -181 -95 -130 -96 102 -113 -176 98 -1 -353 -10 20 -88 -41 -231 398 -176 -26 144 -25 -161 -5 233
1658B33p6n9l91J17J03J18N6J34o5k21J70k13M62l70K9J88k33l4J18J1j18j45
1680a86J98m7o5K85k59j78L05P9j93O9P7r5k15J88J48K8k46j73M31l7l60J87K1
1703c8J65j30Pj2J97k02J28j49J83J12n39J13K9L31l15K65j34R5k18q5K22k5l4
1726c4qO4Qq7L0R7Q7K2j88o4J91M1k75K01K15k56JN6J4p6Rj86kJ29LN4N2j62Q9
1755B5j60K33K7k77K00J82m20N9pK61p2n1k77L98k02J43j19p0J30k29L83j85L3
1778EO8L1n9K1P9j34m6J07q5M0M6M8j68k5j06J45n0O6j55L8J35J25l58L40P4l85
1804b03K72k26J54qn2O5j18r1jJ88p4l8O5M8q5M3J20R9j50o0P3j39J96n1n3R0
1830F4j35Rq0L9RJ08P6J68j86j69K06j20j2q2N8J32Q4j09l15P4K03J46l29K11
$$ plain form
1658 233 157 98 -293 -176 -73 45 101 235 170 -51 119 -94 368 -2 27 215 -18 -52 66 77 -41 -186
1680 -186 12 -35 -100 185 -74 -252 53 132 -61 8 85 -10 -225 -37 111 139 -107 -280 151 114 -246 -59 -38
1703 -38 127 -3 4 -8 189 -13 115 -34 149 261 -278 -165 -136 195 -120 145 11 106 -112 -197 25 0 -34
1726 -34 -42 22 30 -57 -27 70 157 179 -9 -73 118 159 -116 85 300 44 45 101 115 39 48 -138 -140 -11 -8 46 98 -64 25
1755 25 -135 98 125 -152 48 230 -190 -131 -138 123 51 0 -277 121 -81 62 -57 -127 3 -226 157 -28 5
1778 5 73 104 45 66 145 11 -35 72 -13 27 73 121 -47 -72 -178 -33 -83 -17 -172 -134 1 126 -232 108 182 -203
1804 -203 69 -157 -3 -11 -63 2 -116 -207 -208 -20 -94 -132 -67 -19 -104 -61 59 158 8 -52 21 -118 78 27 -26 64
1830 64 -71 -62 -142 -103 -94 14 90 258 72 -97 109 -11 -23 -105 -47 85 169 60 -255 -181 22 168 -161 50
1854E0J49j79r7j08Q8P8j44K07j04J19R7j64J05k15J04k49J93J43k69R0J26P8
1876I8k2l8L8l4j56j24L46k32J17L1nJ28m5j33N3O1r9O8K5M0j5k46J21J87o9k25
1902a30M6J89J3p7j90K25K3j55O5p2N3J56j89RJ20q8j90L05j3j11j76P6J40j27
1926i8j39L33jk84N9l5Q5J43k18O1n5J99M2m2k89L60k49N3L3L2j26J84J03k61
1950a10l0n1L20k40r3L04r3J43j68K4K32k02j10L9J39rjj61L42k63N8m1j76K9
1974a18R1j92J37J08j30j10J98MJ73j59jk3J60j99K21n5k01Oj2J6K05m75L88P5
1998A07p5m3O3O7k1j73O9RJ62o1k30M7P6l1j1J35k03j37J77L0j6r4j19K81M6K0
2024G5j80J24N2Q0J9r8K37l13L5m0l0j06L05j82J83j57PK00k43n5J15L3K6r2l
$$ plain form
1854 50 199 20 -77 -185 -97 -19 -163 44 -60 59 156 -8 97 -118 -14 -263 -70 73 -196 -106 20 98
1876 98 76 38 76 42 -114 -238 108 -124 -7 24 19 147 102 -31 22 83 -16 52 77 117 102 -144 -23 164 95 -130
1902 -130 -84 105 118 41 -149 76 99 -56 9 -63 -10 146 -43 -34 86 -2 -192 113 100 -11 -187 -111 29 -98
1926 -98 -237 96 95 -189 -130 -165 -80 63 -155 -94 -149 50 92 50 -239 121 -128 -75 -42 -10 -136 48 151 -110
1950 -110 -140 -191 129 -111 -204 100 7 150 -18 6 238 36 -74 -35 104 95 94 -67 275 12 70 29 -147 -118
1974 -118 -27 -219 -82 26 -104 -214 -16 -12 161 2 1 -22 138 -61 160 105 -96 -90 -102 -86 119 -356 32 107
1998 107 32 -11 52 119 98 -75 -6 3 165 104 -126 -79 -3 -34 -45 90 -113 -250 -73 -43 -59 -153 -272 9 55 75
2024 75 -105 19 71 151 170 72 309 -4 31 -9 -39 -145 160 -22 161 4 11 211 -32 -87 28 61 87 -5 -8
2049hj85J82p6J09j86J23J59k61nK74j45q6N3j0n1r5L07j34q6O3N7k3K7m3l1Q1
2075A0J87L0k29r3L2J84j21J43j10j81j38L01J32l22L38k39m3J11J25n4q9J46
2097A20o5j88N1J07j0k18L29k02q8MR6m6O8j16K23j03J06L2mp4j9OJ28j57K28
2122B08l39J8K56k99J17m7J38l32K33K5j85j05M32p7j66J86J45l24J94l6M6j99
2144a11L48k79N6L3j23N6J06k54L7J44j5N2L4k92J12Q5j38K62M7j33K3R0j51j26
2168a37l3K06K6k30K05j49J51J5j68K22l23L51p7r1L6R2j97J05Mj13J51K14j06
2191A54j58j51L64j06k09k1K44j76j47J44p5L6Q4J68n8j12K36k62O5r9R0j27p9
2214a95L35j44m28M11K50l75Q9nK22j80J79j60j58K70k08M9K9p2N0kj1J50k7j04
$$ plain form
2049 -8 -193 -11 -87 22 -164 -41 118 -143 -148 126 -19 -105 -52 -62 -113 -208 99 -35 -121 -58 -1 -24 3 -40 -71 10
2075 10 197 227 -2 -95 -63 121 0 143 33 -148 -286 15 147 -175 163 -76 -119 -8 117 63 -26 120
2097 120 55 -133 -82 25 15 -203 126 -76 -164 -160 -64 -110 -42 -158 65 -38 68 100 96 22 3 9 137 -20 208
2122 208 -131 -113 143 -156 -39 -86 52 -280 -47 -22 -207 -312 120 43 -123 63 208 -116 78 42 88 -111
2144 -111 237 -42 14 47 -76 -20 86 -168 -131 13 -2 50 84 -208 -96 -11 -149 113 160 27 50 140 -11 -137
2168 -137 -170 36 62 -168 37 -112 39 54 -114 108 -215 136 59 -32 4 96 -101 4 8 -105 46 260 154
2191 154 -4 -155 209 103 -106 -127 117 -59 -206 -62 -137 -101 -17 151 93 -19 217 -45 20 -79 11 -116 -195
2214 -195 140 -4 -432 -21 229 -146 -57 -62 160 -20 159 -1 -159 111 -97 -48 -19 -91 -41 -43 -54 96 69 -35
2238c5MK10m92K34R4L1j62j0K20j42K3p4mJ86j7j11J32q1j69j08J19K56j05J65
2262A64k40Q0j03M9n1P3q0K30n2p5J19r4j58J84m4k21K68q2J6J20j32R9J39r9
2286A10l85M34j43m5oJ31J81k37l2l7q4K20L0Mj28Q1o4l6Q0k19J20K53k90l3o
2311a01K54j97J20L7p4J3p2J86J14k66K98j34o3l9Q6k88J68Q2l27Q3P9J04r9N3
2335A7O5l0K97n25M0J72J87j14o3R8Q1k43j62J72K38j59k56K97m3m06J66Q5o6
2358a52K58r1K24j82M6j14K03k7k90N9j37L41p2j95J58P2l33K09j29P1J22l27
2380b86P5M54m45K18J25K3j64k53L85k14L1Po5J29j71J07N7q5J30J29j55K2J29
2403A83k58j85J24Q3J19k7J07k66j63L15QJ6j19n4k2L16j69k45K78j45K05n7j35
$$ plain form
2238 -35 -31 179 -313 -79 15 46 -116 -126 94 -48 -25 -99 -103 83 66 -45 87 6 -163 -271 -152 104 -1 164
2262 164 -76 4 -99 -50 -101 -28 -108 122 70 -5 114 20 -138 46 2 -219 49 -33 -17 103 -29 70 209 110
2286 110 -275 159 16 -29 -35 96 277 40 8 -29 -113 107 137 141 13 94 30 -6 74 -145 -25 228 -62 -95 -101
2311 -101 153 -44 76 113 39 52 -20 166 280 14 312 178 115 76 162 -126 42 124 -203 -120 -41 63 -36 17
2335 17 82 52 349 -176 -136 36 223 109 46 144 225 -18 -180 -8 230 71 -185 112 69 -337 -171 -86 -152
2358 -152 106 15 239 57 103 -11 192 165 -125 -66 -203 138 66 -129 29 101 -232 -23 -152 -81 41 -286
2380 -286 -211 243 -202 16 141 164 0 -253 132 -82 -51 -44 -109 20 -151 -44 13 -72 58 187 32 54 183
2403 183 -75 -260 -136 -53 66 39 146 -120 -283 32 40 56 -63 -117 -139 177 8 -237 41 -104 101 44 -91
2426i1J94K4k37J16K39k28j3j63L23l5j09mJ93j60M9k85J53K11j61k29J81J39
2448A07j53n3J58m5j7j74J28L02l19O1j11K47m1M1k00m3J32o9l34M11L28n03Q1
2471f6J84p6l3n2J95l00N2K83j36J27k47p9J22J94j79p3m3K01j14l3R1K51m25
2494a56o1K40J86m36J02K46J8k12M0N4Q6j01M3n1m6K20j35r1J83Ql60J02J59M3
2518H1k66M21k28J22j72K24j87K51m9j61k33J74K2m2R4k55L47k95J98N3l17J34
2540h4P2j5O1J12r1k25j4K18R9Nk67J97j41J37K20k62Lq4K94k01K22l80L91m66
2564a99K03J16k96J67L6qJ6m1J17j48j36J64j5J8J61q4j65J8M25n02j18L13r6
2587e4LP8k13K90j50q7Q5J48M9k87K12j72Q1j23J27Q9Nj88K73j05K11l75Q0K79
$$ plain form
2426 -91 103 127 -110 6 245 17 4 -159 164 129 20 16 209 49 98 -187 -34 177 16 -213 -32 107
2448 107 -46 -99 59 14 -3 -177 -49 253 -66 -5 -116 131 90 131 -69 -112 20 -49 -383 28 356 -147 -66
2471 -66 118 42 9 -43 152 -148 -96 187 51 178 -69 -148 -26 168 -11 -84 -127 74 -40 -73 18 269 -156
2494 -156 -217 23 209 -227 -125 121 139 -73 -33 21 107 6 49 -2 -48 172 37 -54 129 137 -223 -121 38 81
2518 81 -185 236 8 130 -42 182 -5 246 197 36 -197 -23 -1 -43 51 -204 143 -152 46 99 -218 -84
2540 -84 -12 -27 34 146 55 -170 -184 34 133 138 -129 68 -73 64 284 22 25 -59 235 34 256 -124 267 -199
2564 -199 4 120 -176 -9 27 19 35 -6 111 -37 -173 -9 -24 -6 155 71 -94 -76 349 -153 -271 42 -54
2587 -54 -51 27 -186 104 -46 -133 -48 100 149 -138 74 -98 -17 -140 -13 76 81 -107 166 61 272 -103 -23 256
2611B56l03o8M0LJ76j07m2J81j09k1r8K51k86J43Pm3M06l90m8J68K7K4k05r5K07
2636G4n0Q9n6q6r7L01k05j3Q9j32k5l6J35k62P2J86m2Q0r2J27n2k08J11P6P4k19
2662a61K70j66j10L07j48Q8p2l2j5J2J8P6j21p5J35P0k76K99j85L9Q1R3k39J45
2686C3p5j78K62Q1pp7Q8j01Q5l15J71K35m14J12J77Pn2n1R4j69Qm7J44P8o3p2
2712d6oJ93n1k48o2L00r1K06O9j86M0oj27J12k0k66K30j78o4K92j06j19K43k97
2736a88J45n5K14ok98J00J17p6J08j03Q6m49M13j04L61k05n1m0j05N0J01J8O2
2759I5n6k0m4P4K15m07J80n9M1k74L31J8M2k8J8J24q0j17P0j49k38R0R1k2o0j63
2785c28K52J60o7k2L90n25k0K97k59J76k06J92p5J62k08J89j63J27j47k2P2R4
$$ plain form
2611 256 -47 -115 -75 -72 104 -3 -45 136 27 6 -92 159 -127 16 23 -20 386 -4 -52 116 143 167 -38 -133 74
2636 74 24 113 57 -29 -126 175 -30 -43 46 -86 -111 -147 -12 -274 -202 -16 -58 22 -70 57 5 -203 -92 -16 58 -161
2662 -161 109 -57 -167 140 -8 80 8 -24 -39 -27 -9 67 -54 -129 6 76 -200 99 -86 -47 34 127 -112 33
2686 33 -42 -220 42 123 116 39 127 26 111 -204 -33 202 -212 -100 77 84 32 -19 75 -94 -86 -133 11 89 26 -46
2712 -46 -52 141 90 -158 -220 80 -11 195 264 78 118 112 -15 97 77 -189 41 -137 -201 91 -15 -134 109 -188
2736 -188 -43 -98 116 110 -188 -88 29 -47 61 -42 44 -405 8 -96 265 60 9 -31 -136 -86 15 33 95
2759 95 39 19 -25 49 264 -143 37 -22 19 -255 76 94 136 108 126 250 170 53 123 -26 -264 -174 -83 -105 -165 -328
2785 -328 -76 84 17 -5 385 -140 -160 137 -122 54 -152 40 -35 127 -81 108 -55 72 -75 -97 -25 69
2807F9mk9k32J15J60k2j61j20L91q3k50J68l7K47k51k5p0K53k07J07L2m6k9J9
2831eJ26k30n7K42k79K13J26k66J30J2j55K86p6L2m9j47Q8J25J37k76j11ML32
2854B02k74M2N5k7j14L81k93j34J38J22J02j4k97J42K36k16j04K3Q6pl6k22K91
2877H2j7P9l22J41J30k7k04J38J84m86K56m9k09J73L36p8j64Q9Rr3J04j60J40
2900E2k88K73K7l65K49N8N7j59rK6m1j18K05J50j69o5K72j46J32n1k20J09K7j50
2924a44N1J4J84r6j04n9K48j14l5Ll9J18K0k05L45l12j9K68j35L3m2N0j88J67
2948IJ59j99J58j94M9j35J44O5j36K0J32k1m15K91J8J23j50K9K00l4j16o6K19
2971A50k2o6k01J1Q8j62J32K24J8j53j40O8j44K54jp1JJ71j15r1J14k9J95k35
$$ plain form
2807 69 65 36 -196 -81 79 57 -104 -224 167 84 -166 2 -35 212 -39 -64 -134 119 -88 19 51 5 -24 -5
2831 -5 121 -109 -166 76 -203 10 136 -130 0 12 -143 143 67 99 50 -97 -9 116 253 -23 -134 -130 202
2854 202 -72 -30 25 -2 -116 265 -28 -162 -24 98 200 186 -111 31 267 51 -53 -30 56 49 13 -209 82
2877 82 65 144 -178 -37 93 66 -138 0 184 -302 -46 -95 -304 -131 205 127 -37 52 61 -32 72 -88 52
2900 52 -236 37 64 -301 -52 6 63 -96 -105 -79 -120 -238 -33 117 -52 -117 155 9 141 90 -130 -21 6 -144
2924 -144 -93 -79 105 9 -95 -154 94 -20 -55 -52 -91 27 47 -158 187 -125 -144 124 -11 22 -20 30 -158 9
2948 9 168 -31 127 -67 -18 -153 -9 56 -80 -60 72 51 -364 -73 -55 68 -82 -53 147 113 -3 -69 150
2971 150 128 62 -139 -128 -40 -202 -70 154 172 19 -121 -53 -197 57 56 -15 -14 157 42 -49 65 36 231 -4
2995dj2j61J59M6p4J05j68Q6j30J11Q9QL7P3J72l33j9J53j47k17K14K58l71r4
3019b19K24r0j19K66r4k2j56M5J21k04K23k08L67j1o4J00j38J07j05m6j30J80
3041B7J60j32j00J03j94O8R0k1k55J03O4R4k04K19j21K4K31r3J32k3k89p9L75
3064A79k64r1J67j15L9N1N7j07J05J12l60M05j42k19L24j58j07L10r8l83K54J90
3086A49r9L3k21J29j40p5M46j50m8q7J58k22J77p8P8K0J39q9j13OQ5P0l54O9J22
3111Ej45J84M5L2k44o1K44J4o3l46L36nl6or7J16Q0l9K15j20j89o8R7l6R8M3n8
3138dJ42j98L5L0j71J65Mj66J2L43m2l5L4k4k13K31l35J86J1j48R0J2m5K24k65
3163a27L22j64o8j0k4J32M6j95R7J83k88K71l5j95P9m2L14k81MK6N9J95k68J8
$$ plain form
2995 -4 -16 -177 -18 28 -46 59 -109 -23 -153 -42 47 55 92 165 337 4 -15 138 -9 -226 -12 246 -125 -219
3019 -219 5 -85 -204 62 -32 -54 -210 -165 -44 -248 -25 -233 134 123 59 159 21 128 23 -23 -153 27
3041 27 187 55 -45 58 -136 -68 22 1 -254 -151 -87 7 -197 22 -99 -75 156 63 195 172 -117 -196 179
3064 179 -85 -176 -9 -124 -85 -34 23 -84 21 133 -227 178 36 -183 141 -17 -124 186 88 -295 -41 149
3086 149 50 83 -138 -9 -149 -224 222 72 24 -63 95 -127 50 -28 50 70 209 120 7 13 98 168 -186 -117 5
3111 5 -140 44 89 121 -123 -184 60 74 11 -335 1 -4 -40 -46 -143 -27 53 14 229 109 -80 -148 -51 -87 11 54 -4
3138 -4 138 -60 -25 5 -166 -1 3 -163 -151 192 150 115 149 125 -88 143 -192 -6 5 -143 -53 -41 -86 138 -127
3163 -127 195 31 -37 -47 -71 61 107 -88 9 192 -96 175 140 -55 24 -18 296 15 19 45 104 299 31 49
3187D9K00l15J37K3k01N8n5l0J96k5j87J57n8jo4L44k56n8m2K44r7R1j55j20K04
3212C9J32j76j0o3k2J36j11p6N7J1R4J35r6P7j30o8j32K20n0n4L46k27q5j80L79
3237A46j29r5L04Kk00j78J23L6j50L03r8q8k10K63M5J63m50J89q3K38P6j00J39
3260B46l92J43r1P2l9K53j27J25j67l7N0J8R8j92J56j97J7m1J96K8r2r0J83m1
3284G9k71Q4m7J72j7P5m6J40k02p3l5J82j44K9K23m34L53r3r0J75Jk05L45j64
3308C7j93l5J70r7J17o0K73n9j09N7n0l19O8o9L62o2j13L5J56R5k73n0J73pL5
3333H2l35K61l6j6O4O1j75J4J07O0j42R6k47K88k3J22j12o5j48J94K7k42L9P5
3357e1R8j77J69j12J50j84P5J95j83N2l9j48J68O4j22R9q4j60K96Q1R8l84K5L8
$$ plain form
3187 49 249 -66 71 94 -107 -49 -104 -134 62 37 -150 7 -51 -52 -116 228 -28 -86 -128 116 19 110 -45 -165 39
3212 39 171 -5 -15 -78 -100 36 -75 -151 -94 -83 11 146 50 127 -3 -71 -203 17 -33 -87 259 32 -53 -233 146
3237 146 17 -78 226 228 28 -150 -27 9 -141 162 64 -24 -234 29 74 237 -213 -24 -107 131 207 107 246
3260 246 -146 -3 -94 -22 -61 192 65 190 23 -14 36 54 152 -40 116 -81 -64 -105 91 119 27 -63 120 79
3284 79 -192 -108 -155 17 0 75 29 169 -33 -106 -141 41 -103 -74 149 -285 68 -25 -115 60 61 -144 201 37
3308 37 -156 -191 -21 -118 -1 -61 212 153 44 101 51 -268 -200 -269 93 31 -82 -47 109 204 -69 -119 54 47 82
3333 82 -253 8 -28 -44 20 81 -94 -80 27 87 -55 41 -206 82 59 181 69 4 -144 50 77 -165 -126 -51
3357 -51 47 -130 39 -73 77 -107 -32 163 -20 32 -7 -155 13 77 -45 54 -30 -190 106 187 285 -99 -74 -36
3381c6K9jj34J21J93k81J52P8K3k86L53l93J40Q7j62K02k00K10p9J98l79Q8P6
3404a%N3k10K27K54n7l12J40j18Q0l5n3P9j35J69o2j25m2J89k5l1K20l00l1J15
3429a1j69O5J57j88J10M6j52Q2KK23k67J44j99J07J51r5j93L85k11k6o3K84k89
3452a07O8J51j20j24J28J15j46J38j47M03k06k11J01K7kj57J03J0l4R1j9n9p0
3475f7K17l6M9k12N7j63L99j16j40Q4j61k2N2J93j8k0j72J57k16N5J56p9k49K21
3499c1J04j23l5Q5O4o8L4O5k35K7K24k08j38K31j23K38j37j18J19N0N3j74j4M1
3523f9M95l76J52j85p6q5J81j5j11J51p6L8J8r5l21J74K75q2j80pL47p1L9l2l74
3548b85K83j5j0P1J72k86k3L2j17L17M5k41p5O3rJ70j9J50k10q5L47l69J4Q7J28
$$ plain form
3381 -36 -7 -8 -142 -21 172 -109 43 121 144 -142 211 -182 -42 45 -117 85 -115 95 16 214 -165 -77 -1
3404 -1 -1 52 -158 69 323 266 -46 94 -24 56 21 -32 47 -88 81 19 -106 -148 41 16 -15 205 -95 -126 -11
3429 -11 -180 -115 42 -146 -36 10 -142 -60 -58 165 -102 42 -157 -50 101 6 -187 198 -13 -39 -102 182 -107
3452 -107 -39 112 -8 -132 -4 111 -35 103 -44 359 153 -58 43 70 68 -89 14 24 -10 81 62 3 -67
3475 -67 150 114 163 -49 8 -155 244 128 -12 72 -89 -111 -59 134 116 96 -76 81 -135 -80 76 -3 -252 -31
3499 -31 73 -50 -85 0 64 -4 30 95 -140 -113 111 -97 -235 -4 -127 111 -26 -144 -25 25 78 -96 -110 -69
3523 -69 426 50 202 17 -59 -144 37 22 -89 62 -14 24 42 -53 -374 -200 75 -7 -187 -194 153 82 121 89 -285
3548 -285 -2 -17 -27 44 216 -70 -93 -61 -178 139 184 -57 -132 -69 -78 92 73 223 13 -72 275 -94 -80 7 135
3573A35m7k05L67l43K63k05j69K33j05j10K73PJ15j48pj70jJ8Q2J33j78j32L2
3596a62J37J40k26k4nJ10J20r8o7O6L5J37r1l7o9l5R7J39k80K5o2P9J1K64k93
3621h9J9J52nj3p9l2J40j31Q5M7p3q7J41j87K36p9J3J45l30J26J07j90L7O1k33
3646b19K87n7OJ25k81L37l77K43n0j76J85m7k1PO4j7R1j68J48j67J73j79O1J5
3670a7j81K21j21J51N4r6Q9j88J14j58M9MR0P7j28o5K54j56j8J78j07q0J18op1
3695Gj3Q3k7j34o0K99l61K15P7k13L1k18K08J64k10k7O7n7m2K69m9l4R4R2k13
3720e2q5R5Q6j3j00j2m4L59k58l0n4K16J6P1l91K41j07k08K51J14j77k0N4K02
3744A54j15k22J5K99j70Q8l6Q1k05M4j8n1p4J86J38j40J36Qj25j62K02k5j6j4
$$ plain form
3573 135 88 -117 250 -93 170 -35 -204 29 -76 -186 87 94 209 61 54 -116 -117 -99 -17 116 -62 -194 -162
3596 -162 -25 115 -111 -135 -140 -30 90 -8 -75 -9 26 163 72 35 -34 -69 28 167 -113 -88 -150 -71 -60 204 -89
3621 -89 -70 82 77 64 -15 -47 93 -38 47 94 21 -66 75 -112 124 45 58 203 -127 -1 106 -84 -47 14 -219
3646 -219 68 11 17 142 -139 198 -179 64 14 -162 23 -24 -45 -38 26 9 100 -68 80 -87 86 -93 -32 -17
3670 -17 -198 23 -98 53 107 11 100 -88 26 -132 -83 -79 11 88 -40 -105 149 -7 -25 153 46 -34 84 78 7
3695 7 -6 77 50 -84 -144 155 -206 9 86 -127 -96 -314 -106 58 -152 -179 -112 -169 -211 58 9 -25 69 161 -52
3720 -52 -137 -42 44 31 -69 -81 -125 234 -24 -54 -108 108 124 195 -196 45 -62 -270 -19 95 -82 -102 -48 154
3744 154 39 -183 -168 131 -39 49 13 94 -111 -67 -85 -136 -210 -24 114 -26 110 118 -7 -169 33 8 -8 -22
3768b2J11j58N4K4j60L7K73o2k66K72j27j57J26k60L69j16J94l5j01j67J56mj79
3791a98J60J11Q2q0j01O8J12l26K44K3Q5j87J11k52J46JR0k52J34P9l4l7J03j7
3815F5j50O9O6K0p7l6J63j34j67L11K6M6l54J64N8K6%j89P6j3O9jp9R5l4K2j34
3842i2L2J27q8j91J81l9J0r7J45M9j26J87k68K79j90J67l5k16J37r6L74j55k7
3865F8kj10KMK28l21Q0jk4J9p9J25K24m7k45O8K0p0K21j57j07L17j78p6l0j53
3891b24Q7J67k31R4K48q0k31J11K47R3k28r7O7j02R1j64K26j21J41q8j53R6k13
3914b64L42j45k6l9M0J06k2J09j50J22J33l73L7L59k19r5k7R0o1j33J1J60K8j60
3938a77NK59k30Q3R2L5j8k9M9J1j42K83l27p0P6P1L2L5n0m1J37k39k25J59K30
$$ plain form
3768 -22 89 -69 -15 9 -151 -114 159 97 -169 103 -24 -181 -55 -315 54 -62 132 97 -4 -171 -15 -19 -198
3791 -198 -38 73 155 75 -26 42 154 -172 72 95 180 -7 104 -148 -2 -1 89 -163 -29 50 16 -21 82 65
3815 65 -85 -16 50 70 -7 -43 120 -14 -181 130 156 202 -152 12 70 96 96 -93 -17 -30 39 38 -41 54 20 42 -92
3842 -92 -60 67 -21 -212 -31 -70 -60 -157 -12 37 -89 98 -170 109 -81 86 51 -165 -28 -124 250 95 68
3865 68 66 -44 -42 -38 190 -131 -51 -52 -76 -57 -136 -11 213 166 -79 -11 9 -61 160 3 -104 213 35 -41 -71 -224
3891 -224 -137 30 -201 -107 141 61 -170 -59 188 281 53 -44 23 -79 12 -152 74 -47 94 6 -147 -51 -264
3914 -264 78 -67 -93 -132 -92 14 -8 101 -49 73 206 -167 -130 229 10 -85 -112 -22 -83 -216 -205 -45 -17 -177
3938 -177 -172 87 -143 -60 32 67 49 20 69 80 -62 221 -106 -176 -100 -29 3 38 -12 -53 84 -155 -380 -221 9
3963IkK87l64J0J13j13N7K4p8J86j48k24J74J91k35r6j6M89l56P0l0K41k41k3
3987g5o4J88j57j03K09J13p2n9J1K66l21K6N4k25K54k4N3k45J08k9L6r5J43k9
4011c7N2r6Q8J7J21j38j06L0l2J86k75JK74J1l17L56n3k38L04j72k20J35J70Q6
4035A47k90J80n5J53k33K96k40O6jJ1j07K4O2j19j5J88j25M0p8k5J51o0j5m0N0
4060c5K5N3J36j14r7J95l0j75J73l57J38J50Q3j65O8j95j02L07rn7L7j17K64l65
4084a89M6J12j36J72K47l34J00O6j74J08j47O8R0j73R7R1k48J46r9K77J1k13J17
4107C5j52J31J12o1L8j7p8q3qJ01j85L2J44j92J30j33L31r5j93K58q8mj25J16
4131A4k09R1K01n9J24K1n9j76M0j6K3j7J18j74k9K34n1oJ17P2k28J84l61J39J36
$$ plain form
3963 9 7 294 -70 -60 53 -60 -3 21 -57 129 -19 -243 -69 122 -113 -209 -225 264 -92 -22 -52 189 -52 -75
3987 -75 -139 49 -108 -211 -2 111 39 -20 -9 257 -64 -38 16 -209 45 21 74 -171 -63 -92 -56 -151 -8 -37
4011 -37 15 -81 7 24 145 7 -99 -69 -101 85 -190 -189 85 96 -221 135 82 -156 148 -24 -244 -109 61 147
4035 147 -143 37 -18 135 -98 198 -42 24 23 34 -73 -49 13 -106 -121 67 -58 -18 -96 -121 30 -30 -45 -85 -35
4060 -35 -10 43 179 65 -32 163 133 -42 131 -226 -88 62 145 -20 48 -147 -249 58 49 -8 29 -88 176 -189
4084 -189 -143 -31 -167 5 252 -82 18 84 -90 18 -129 -61 29 -144 -47 44 -204 -58 -157 120 131 -82 35
4107 35 -117 14 126 65 103 86 8 -75 -83 18 -167 -135 9 -183 -53 -186 145 50 -143 115 27 23 -102 14
4131 14 -195 -104 97 38 162 183 124 -52 -12 -28 -5 -22 96 -78 -107 127 76 70 187 259 31 215 -146 -7 129
4156A29l02M78k77r5n0J13j79K53j51J02j1N5O2k42J38J44k02l5J65j07L9o8M8
4179GL0j6j50L82j02j66K9P2l06J72j25J38O8j1j47K28j26m1J48k1Pjm7P9j03
4204bP0m2M2J00l47O9J39K51m77J50J17k9j08m3P1k55M20O9m83K29o3PK21M8j97
4229d3n5J00r8N8N0J60j44k27K80j7O3l24J53L8j06K69j23O9j32j10K92r3mo9
4253a3N4j13P7O7j35j6n2K21Rj18l6N6PK32m8j36j92K46m1O9Q9l03P9l2L7J65
4279A73k89K03j75J00mN1j76K63k5j50J56l18p5J42L38k37R3K5k88K50Nk2j09
4302f9k6mJ38pm0R6r2j4j11J7L23k86j15K13O1q0N9j0Q5k47O5L2pQ3k57J64K81
4329B52m65J28m0N4J02N6o1m8L7p9J01j87K40p7j46J59M2k55q0K86l0j42O5m3
$$ plain form
4156 129 -173 305 28 -67 -117 -4 -183 70 -81 21 10 65 127 -115 23 167 -35 -70 95 -12 27 -41 7
4179 7 37 21 -129 253 151 -15 14 86 -220 -48 -173 -35 33 22 -125 103 -23 -64 84 63 70 69 22 101 -2
4204 -2 68 26 68 168 -179 -110 29 280 -197 -47 70 41 -67 -110 -39 -294 126 195 -288 -59 -122 -115 106 154 -43
4229 -43 -98 2 -96 -38 12 172 28 -199 81 64 127 -197 -44 -6 -112 157 34 103 -29 -139 153 60 56 -13
4253 -13 41 -72 5 72 -63 -79 -131 90 99 -19 -55 1 8 240 192 56 -136 110 69 138 227 -76 3 -29 8 173
4279 173 -116 87 -88 12 8 59 -117 146 121 -29 127 -191 -266 -124 214 -23 70 95 -193 57 62 40 -69
4302 -69 -95 -99 39 32 -8 88 -4 -18 -129 -112 211 -75 -190 23 84 4 63 53 138 -109 -44 -12 -19 64 -193 -29 252
4329 252 -213 -85 -125 -71 31 87 26 -22 15 -64 37 -150 90 13 -133 26 68 -187 -267 19 -11 -153 -88 -131
4353a31K87j93k0J13j57O8K2J20j16K01m28J38J29j74jM7l6P6J33q7J4O2J47j85
4377B9k9K65j70k08K73M4k42k14K29j2j9NJ7J76j69l5R1p4m0J22j26J11j85L29
4401A68k75J85j4k3r6M5r6J32P8J3L5lj79N9l8lJ85l21K24j13J17j63Nj15J98
4426EM9j69J81o2p5Q1L3M9k37J10Q4r1l9R9j41KJ87j93M67m07j18J96J52k45J79
4451I7J04k66K1L2j08J06k3J30j38J1j16J13j29J82Lr4K89m54K89K9J22k73K3
4474e0j1K56l05J51k7j0J00l44K47o3J24j02j15J82j63L87k34r6J78j99J27L6
4496F9k63J99j42K48O1O5j80j47L24k32k6j5J10j06J37J0l3j4Njj05J05J23j69
4520B3P0n2M5k10J50k20J43j73J13J23J15j35j60K52n1J51l46J57K18j14j77J30
$$ plain form
4353 -131 156 -37 -57 56 -101 -33 -11 109 -7 194 -234 -96 33 -141 -142 -95 -131 -55 78 -9 5 67 214 29
4377 29 0 265 95 -113 160 204 -38 -252 -23 -35 -54 -49 -32 144 -25 -60 31 -43 -83 39 -87 24 -161 168
4401 168 -107 78 64 41 -55 -10 -106 26 104 117 152 149 -30 29 -9 -12 173 -148 76 -37 80 -83 -78 -193 5
4426 5 54 -115 66 4 -71 10 43 92 -145 -35 49 -42 -81 18 -123 -121 66 -127 340 -67 -185 11 163 -82 97
4451 97 201 -65 -44 -12 -120 -14 -37 93 -45 -34 -150 -37 -166 16 19 -75 214 -240 49 78 200 -73 -50
4474 -50 -61 195 -110 41 14 4 104 -240 7 -56 68 -34 -149 33 -130 257 23 -73 105 -94 33 69
4496 69 -194 5 -137 111 172 237 57 -90 234 2 -24 -39 71 -35 102 112 79 65 70 69 -36 69 192 23
4520 23 93 41 86 -124 26 -194 -51 -224 -111 12 127 -8 -168 84 33 184 -162 -5 213 99 -78 52
4542E2J30j68k3P3j09p7K16j64L17k78p8K71k59j26L71NJ0k29J69k71K71k03K60
4565A60k53r2K17j88J71j30L24k26J32k1n5j40M6J41p7N0r8j48Q2L39l38j02J52
4588e4r9K75k97J42J86l80K99j93J91p3o2J03l1j54J10O3m3J0j44Q7j6NJ17m6
4612dJ18j4j75K60j97o5P3O7r2N3J41j10mj04P6J50k52J72Nj92J39k6L8j97M4
4637i6Q9r0K19o3j65n5L35k49O3Q5p7J15j71j86J68j94L28Jk4L9K6q4j47K34j3
4662H8j62j83L36k23M6R3j36J09J68j48M3j01O4j7j2r1O1p6O3J57n0j4n9O5P2
4687I3n4J1P3j3R0j85P0j03r7J06j91L60l23K02J17J19m00j24K75QM6l7J90k68
4711c5j32J10J29j68J37k1J33k50K01m0O4j84K8p9J5K30Q7j91O5j68J3L3p0N0
$$ plain form
4542 52 182 14 -9 64 -45 -122 94 -70 247 -31 -109 162 -97 -223 148 153 163 -66 103 -168 103 -100 160
4565 160 -93 -185 32 -156 15 -115 209 -17 115 94 39 -101 -55 86 9 59 -39 -187 -105 234 -104 -206 -54
4588 -54 -153 122 -175 -33 153 -227 72 -121 70 -3 -65 38 7 -147 -37 26 -17 -7 -151 -64 -80 -75 42 -4
4612 -4 114 100 -75 185 -12 -77 -4 63 -29 24 165 55 51 -53 23 173 -79 93 98 -94 45 19 57 -140 -96
4637 -96 -7 -97 122 59 -106 -161 174 -75 -12 73 -4 111 -60 -246 -78 -272 56 57 33 72 98 14 -133 101 88
4662 88 -74 -257 79 -144 -98 -5 -141 -32 136 -12 31 -70 -6 -23 -35 -126 -65 -141 -78 79 29 15 -44 21 93
4687 93 39 50 123 110 200 15 85 -18 -115 -9 -200 160 -163 39 156 275 -125 -249 26 34 80 43 233 -35
4711 -35 -167 -57 72 -96 41 20 153 -97 104 64 128 -56 -28 -107 -92 138 225 34 99 -69 -56 -23 -93 -43
4735d3Mk7N3J65j42N9j22pQ1lL7j60K34j29L5J40M4j91j86P6K12j48J65k39K59
4760A67l00R9n2J25k5J72j11j48J64j03j15L32k35J20p4k24J93r0J70O6k13O0
4782b2J3j8%J47j62R5nm1J39k28J94p2l1J08jK7o1L1k10J33qK20k59J27R1k7N
4809A85Lj35m5J9k19K61k60l8L93k44J10m8L5j4p2J08k28L61q8K8k37K58j16k00
4833a83K21q0k24J97lM7j28L40l2o0n1J65q0j58o4J16J40Nk22P7j5o8O6j02J71
4858G5j37J03p1Jl0K1M0nN8j45K30K4pk07L1l4L00k83j51J25K5m0J88l27K16P4
4884G4k61L79j88q1L2O2J00%L0l07L14l61L99k78L4QL9O7j47K59j91N1J34j09
4908E9o5L5J26j8j35j35Q5L2j35K77k30J86k42r9K70k8q1P7R1j46K70l26J13p
$$ plain form
4735 -43 -39 -66 -13 152 10 69 -53 -60 21 18 55 -105 129 0 35 175 219 28 -158 -82 130 -18 147 -92 167
4760 167 -133 -34 -86 39 14 186 75 -73 91 -12 -127 205 -30 90 16 -208 -15 -105 65 131 -82 -22
4782 -22 -9 -27 -27 120 -42 53 48 7 146 -82 112 40 9 117 116 143 82 113 -97 36 28 248 -11 116 207 180 185
4809 185 188 53 8 27 -192 69 -191 -229 164 -80 30 -18 17 3 -69 39 -189 172 84 112 -125 133 17 -183
4833 -183 38 -42 -266 -69 -72 -25 -153 187 155 95 44 209 129 -29 -93 23 163 168 -54 23 8 -60 6 -96 75
4858 75 -62 41 -30 -29 -59 -38 2 -3 55 -90 140 164 157 -50 -19 -53 247 -36 -187 -62 -37 -77 111 -216 0 74
4884 74 -187 192 4 -77 -45 17 117 117 147 -160 154 -207 192 -86 -52 -44 -5 62 -85 174 -17 34 168 59
4908 59 -6 29 155 137 2 -133 -48 -16 -151 126 -104 82 -160 -259 11 -17 -98 -21 70 -76 194 -132 -19 -26
4932b6J0j44K44Qr7k7l3K36j43p7L3q8L19l32M0K39l50K28O1j15o8j21K24K08
4956B29k01j6J09R1k03J28l4J82k25k29J79o2p8J97k8k61J22N8Q7Pp2p2k4n0K76
4981A10k03R1L3M0J85j80j14J01j27m6J61p1j1L6J02j17p1J2J33M1k49K65J9j40
5005@k9j03J4K11J4j57J17k64J71n7J42k18K83k65J1M5j24M96j63l0o2J9k1K00
5029B30k11k6K6M9K1k82O1J59j48qJ89N8k21K09J36k84Q1J55j90J07j35K28j16
5052H8p1M8k37J30k6J10k31L95j57N7M6k34N8l4K47o8p2k2QN5j66N7l9Q7r4N3
5078a2N6j49P8k50J96l4L4L3l8R3k00K48r0Q0n3k9J7n4K13j24K1j2m5J06N2j33
5104Dn0N8Lj1J59k93J22K5p1J03j48j8n4M19k26R3j89R4r5K12jj67K42k08O2O3
$$ plain form
4932 -26 -16 -160 84 92 -5 -32 -65 171 28 -49 -16 -104 215 -117 -77 162 -188 40 101 -14 -82 -203 21 229
4956 229 28 12 121 212 9 137 103 285 60 -169 10 -52 -130 67 39 -222 -100 -42 45 52 -20 -92 -116 -166 110
4981 110 -93 -2 31 71 256 76 -38 63 -64 -110 51 -20 -31 5 107 -10 -81 -69 64 105 -144 121 140 0
5005 0 -29 -132 -118 93 107 -50 67 -197 -26 -83 59 -159 124 -141 -130 -85 -209 287 124 94 32 51 30 230
5029 230 19 -7 19 68 89 -193 -132 27 -121 -129 60 118 -103 106 242 -42 39 194 4 111 -24 204 88
5052 88 17 65 -172 -42 -68 42 -189 206 49 106 152 -82 -24 -58 189 121 49 27 35 90 -76 -19 -58 29 -65 -12
5078 -12 44 -105 -27 -277 -81 -115 -81 -48 -86 7 -193 55 -35 45 -8 -37 -20 -74 139 15 36 24 -21 85 137 4
5104 4 -46 12 15 4 163 -130 -8 17 -54 49 -99 -117 -171 248 22 115 -74 20 -75 137 136 -31 211 3 65 128
5130A28j61j23p3L04j60QR3K5M7J15j37k33O9Q1n5K7J0NJ96k00J13J31l2j86P6
5155F8j54j24M21j31j27P1Pj20J13j12p7K82j8q3l51M39j13J5N6K7j31J14K8q
5179I2J2J30j21J2l03K59O4q3r1Q9k11K55j73j48K46l4k4n3J51J31K1l45J06J16
5203I8k15M2L4M9j00P8J37R3k51Q0m1j02N8no9q9J04J4j1k2J63J82M5j77j97p
5229a09m0J39K62o8j89j59M0K60Jj76j50j62L63K43l20J04J34k82L8KpJ86M3j86
5253c3K52j14o7k15J61J9J04l0r7Q4p8J8N8j19q5J89k5p9L7O9j96LJ72j79P9N4
5279a8r1K44j51k32J48n1K03q3R8P6J11O0j39k01J14J0KQ1j61j57K06q5K9K13
5303B26m30K93P1l69K14j05J52N7n0R6k52K06r5r3L1Kn3K62r6k41J63J06k41J88
$$ plain form
5130 128 -33 -156 -229 75 -85 -77 16 41 88 203 66 -167 -98 -17 -72 -45 -35 -30 166 -34 79 210 178 -8 68
5155 68 -86 -210 211 80 -47 24 31 -89 24 -88 -165 117 99 16 -335 104 -9 6 62 89 -42 72 100 92
5179 92 104 234 113 125 -178 81 145 62 -29 60 -151 104 -69 -217 29 -5 -29 -82 69 200 221 -124 -18 98
5203 98 -117 -75 -41 8 -92 -14 123 216 -35 45 4 -98 -40 -45 -114 -203 -99 -85 -96 -118 45 227 272 95 -102 -109
5229 -109 -149 -10 252 184 -5 -164 -124 136 137 -39 -189 -351 12 255 -65 39 173 -109 -71 -69 -76 110 153 -33
5253 -33 219 105 38 -177 -16 3 107 77 -20 64 -14 4 62 -57 -142 47 22 -57 -20 49 -147 -144 28 -151 -72 -18
5279 -18 -109 135 -16 -248 -100 -151 52 -31 67 143 254 314 175 -26 88 98 100 181 20 -137 69 -16 13 226
5303 226 -204 89 160 -209 5 -100 52 109 59 155 -97 109 14 -79 -48 -46 -99 163 67 -174 -11 95 -146 42
5327D2K8r0j5L3J01j67R8N5j42k1l3p5K33r4J75r7L07m13R6K2k10J82P2J86k86
5352a3J44k92K94j0j0j50J58k7J34k69p5Q8J71k22k8j1j00K20k17K91k17j3J38
5375a6J3l4O5j70J22Q9j24M9N1P9r7L1j28j11O0J19r5M6k4K17k42J58n9j02J13
5400A0M9L5k2j24q5L73k80O8L7k15K09O3n3k05J84k92L31r6J33k61K23r5Q5J9
5424I1l26K81k29J08j47K23J0k7o5O3nK57j53j8j88J32K3j86J25p3J66J17j68
5447A1P6J44k13P3k89K24L5K8m0r1m4J26k30O5j3J31J2j94K35k3k18J52M4j06
5471a05kq7K77k31J99P9j08J6j32J63j86K22K7j97J57j06l8%J81J49j47k19J13
5494B5Q0m3p1j82K29j34P0j00J29J00j07J5L3j11l3k45J95J30jP5N9LL4j40j55
$$ plain form
5327 42 70 -20 -35 -2 99 -68 30 85 -57 -78 -111 -186 47 -47 128 31 338 -75 21 43 -167 15 87 273 -13
5352 -13 131 -161 133 123 113 -37 121 94 228 -41 -116 -28 143 -79 -107 -118 -218 2 -215 76 -141 -154 -16
5375 -16 -3 -37 28 -142 -20 69 -55 -6 45 124 27 58 -70 -181 -121 -2 -97 -51 -75 142 -100 58 -1 -103 10
5400 10 59 94 72 -52 -137 236 -44 24 61 -154 55 118 65 -140 44 -248 83 -13 120 -141 82 -13 72 91
5424 91 -235 46 -183 -75 -222 1 11 -16 -81 -18 -23 234 81 63 -125 7 30 -156 -31 -104 62 179 11
5447 11 87 231 18 91 -198 26 61 89 49 -42 -86 40 -190 -125 -138 -7 5 -189 46 23 -195 -43 1 -105
5471 -105 -107 -194 83 -148 51 130 22 38 -94 69 -117 105 132 -65 92 -14 -52 -52 129 278 131 -88 25
5494 25 105 62 -9 -191 38 -96 -26 -126 3 103 -4 11 44 -67 -100 -345 -150 -20 -21 54 113 116 150 10 -145
5519a45K70k08M8LQ4j47o8p7L01j85MJ11j48J72J99k98K48k46J43k23J61P7N4
5542A30j28l23M80j70j68R5o0K39j1j4n6J15o9m0J29j73nJ74j93j8j50J39j85
5565b62J44J92r8l4J75m4j85j1K27j15L7N2K77m02m0K01k46K8L12l39J80j04l3
5588h8J27P9Q5m28J01J47j03j28L16p7j15R8k04K52r4j16K7J68j45K74k80L0n4
5611a28JQ7j15K07r6q9K70j62j76L37l22K92r8K5j3k07J39O3P8J8m4J6q3Pj78
5636a71P6K2J13J48k46K0J67k09J8N5J89j05j41K8n3O6J48q9Qm4k5J3M4k8J44
5661A48j56J06K1J21l38M7N0q4Q4Q9k31J82j54pn0K4L11n2J0j42J36l91K79O3
5685F6m2l31L46q5Q7N1k47J06J00k8l9J82Pk62P4j19O8p4L3J75j99K2K01k71K58
$$ plain form
5519 -145 125 -83 -35 -32 52 -95 -163 -240 61 -124 -120 -9 -157 15 214 -84 164 -82 61 -162 -1 76 130
5542 130 2 -321 159 -11 -179 -84 -144 95 84 70 14 129 60 20 149 -24 -29 145 -48 -66 -216 -77 -262
5565 -262 -118 74 -24 -58 117 73 -112 -123 104 -11 26 78 355 -47 -87 114 -132 -104 208 -131 49 -55 -88
5588 -88 39 118 203 -225 -124 23 -80 -208 108 31 -84 14 -190 62 -32 -148 -121 47 -98 176 -104 -74 -128
5611 -128 -127 -40 -155 52 -44 -133 137 -25 -201 136 -186 106 8 33 20 -187 -48 15 93 111 67 83 0 7 -171
5636 -171 -95 -73 40 188 -58 -38 129 -80 -62 -7 182 77 -64 -36 -89 -23 125 36 44 0 -25 -12 32 4 148
5661 148 -8 98 119 240 -98 -51 -1 -85 -1 88 -143 39 -115 -122 -172 -148 163 111 121 -21 115 -276 3 66
5685 66 24 -307 39 -46 41 92 -155 -49 51 23 -16 166 173 -89 -15 -134 -66 -140 -107 68 -131 -109 92 -179 79
5710G9j45k7O9J06M1j29p1m5K98k92Mm0K73j04j66J2P4P1J75k89J99p7m25J35
5734b74J66J16K1m1J40n8J69k85J48r9L8k66K05q6J66j57J34j43J55k09K65k8
5756G7j39m8K90k00R2p6Kn9J05Qq2J68m5m6K1j44J5pj62R8R1O6PR9k07q9J74J16
5784A25j31j18Q0K10r0L2r6J88j04k0j9J9L0m4P4l73J73J52p5L0o7K7K6Q0j66
5809e7J12n6K23j59l0j72K16mn3l3j17j46M17Nn3j98J15n5M1l7Mo5K22K1j56K3
5835Hn6J66k5n6Q9k28R1J26q9j41K19j28P0K5j82P2J66j80J12l5j22m2L56l74
5859a58J61o3J05o3J72j5l40mJ83m1j56J57J21j47P6P5j77P3K9L1K0k7l6n5k29
5884c08L19Q4j54m1K95j78j71L22k18Q5j22J05J75l25rQ6R4J19j02l0N9k58J53
$$ plain form
5710 79 -66 -93 -24 82 123 -6 -77 -122 176 -116 -112 -152 121 17 -149 -137 -63 8 183 -106 93 16 -409 -274
5734 -274 -108 8 29 -12 128 70 239 -46 102 3 41 -225 -20 -106 60 -97 37 -106 49 -160 105 77
5756 77 -62 -110 180 -20 72 -4 -2 -61 44 52 -30 138 93 47 68 -76 -61 -68 -230 -132 -41 25 32 131 -76 -165 9 125
5784 125 -6 -124 -44 166 76 108 12 200 96 76 57 76 106 62 136 -237 -64 88 13 43 -24 3 29 109 -57
5809 -57 55 -1 222 63 33 -139 77 73 20 -13 -130 -276 141 146 93 -105 10 -45 -4 -41 -37 -102 120 141 -15 8
5835 8 -48 118 93 37 126 -102 -11 115 26 -115 104 -24 46 71 -111 -39 127 -53 59 24 -98 -140 216 -158
5859 -158 3 -60 45 -18 154 139 -201 -205 -22 -63 -219 -62 59 -88 -12 63 -114 -41 -12 19 39 12 -24 -79 -308
5884 -308 11 95 -59 -100 195 17 -154 168 -50 35 -87 18 193 -132 -141 -55 39 158 56 26 85 -173 -20
5907b0Ql9K76k63j35O0J1r8L12j18J21j69O0o9J10j51J34J99k31j43K69Rk63R5
5931c5k19K03m6M5l1Q0l0L2Q8K4j69J2J20L3k62K20J85l45K47n1j86J87j48N0
5955DO4J35k16N7L3l41J47k5N1j04L02j13J38k63K97k32jP8Q5l47J80r3L87j07
5979A16k02K08j12m8p5J43N1M2L9J12k91K02k36j86K04O7L4j89K3Q1j05K24k6
6002G6q7K47l57K24K7q9j74j6K23k31J84p8Rq6K3J05N9j63rr7K87j8r6Q2N3k60
6028a62o7J37J20J67j35j72M4O1J41L3l4p6r5j52K28J10k26J56k42K70mj89K0
6051f7k58L90m4Q0k4L9k44J59j1o7R6l19K47Pk1P2m3k7k1M7j24K59Jk30J10r0
6077h3P5J66k52J91K2j76J80j99L1RJ79r4J3k7l20L16L1r9J1p2Q1n7R7J41k38
$$ plain form
5907 -20 -12 -51 225 -38 -173 -113 -102 -200 112 -6 115 -54 6 -63 47 -104 30 229 -2 -145 124 133 -130 -35
5931 -35 -254 -51 -97 -52 -83 -3 -33 -1 87 111 -58 -46 74 107 -155 65 250 -95 152 101 -85 102 -46 4
5955 4 68 203 -13 44 77 -264 -117 -142 -91 -195 107 -6 132 -131 166 -66 -67 11 96 -251 -71 -164 223 116
5979 116 -86 122 10 -38 -113 30 81 123 162 274 -17 185 -51 -237 -33 34 68 -121 -98 -17 -122 102 76
6002 76 -11 236 -121 103 130 41 -133 -149 74 -157 27 -51 -42 -128 -105 0 59 -104 -113 -210 77 59 -37 45 98 -162
6028 -162 -229 -92 28 195 60 -112 -68 -7 134 167 133 57 -38 -190 38 148 -78 78 -164 106 102 -87 -67
6051 -67 -325 65 21 101 77 116 -128 31 20 -47 49 -270 -23 -16 -37 35 -8 -35 -56 -9 -133 126 127 -103 7 -83
6077 -83 -8 158 -94 97 119 -57 123 -76 -45 -36 143 49 62 35 -285 31 62 -37 -26 -98 -17 -74 23 164 -74
6102g4J70O6p8m6Q8l18J20J68O6j46PM6l7j28qK6J49m7j74L43l07J60j75J63j45
6127a11O4j70K45j94J66k28L90k95qJ62mJ1j76N3M8J95n6k77J36o7K49k60J29
6150BM7L2JK0j83M1o9J61j21L6K67m80K62Qr6J75j52R1r5M8K4O2j98N6J85O5l73
6177a84K06k36K74k10M14l67n9J18J8j97M64l27k4j24K86m4j38M22l60N2L6J4
6199C4o6p0K7j02J65j12J15J51Mk02k57L48M0q8l5Q4j7K9J47k01P3J31q3k25Q0
6224c0j18j21N18k93J06k50J94Nm7p0L6J00k21M26k58r2P2J78j42j3n0k28K92
6247fRj61J24K98m31K70L8k36K13l2kK3j90J97j74j23J42PM5K5K4j90N5L14k40
6272aj27R5N1J26l95L26J72m02j6K61j01m3n2J11k14K22k6J62q3k26K67k84L78
$$ plain form
6102 -74 96 162 84 38 126 -192 -72 96 162 16 23 69 32 -96 -104 -78 71 24 -150 193 -114 46 -129 34 -111
6127 -111 -47 -217 28 -166 0 -228 162 -133 -141 21 17 28 -148 -95 -47 148 92 -185 -49 -116 133 -127 2
6150 2 49 81 82 102 -81 -40 -109 52 -69 -33 234 -246 16 24 -72 103 -49 42 -53 -5 19 81 -117 -61 124 189 -184
6177 -184 22 -214 60 -150 264 -103 -162 -44 -26 -223 241 -86 -110 -234 52 8 -130 292 -68 -16 20 34
6199 34 -32 -102 -75 -177 -12 -124 -9 142 146 -56 -313 35 75 -13 -48 36 19 48 195 -6 67 198 115 -110 -30
6224 -30 -148 -269 249 -44 62 -188 6 11 -36 -106 -70 30 -191 235 -23 -115 -43 135 -7 -20 -70 -298 -6
6247 -6 3 -158 -34 264 -167 103 141 -95 118 86 84 107 -83 114 -60 -183 -41 -34 11 36 60 -130 -75 239 -1
6272 -1 -128 -33 18 144 -251 75 247 -155 -171 90 -11 -54 -106 5 -209 13 -13 149 66 -160 107 -177 201
6295B01k5k48K08l25J96o7N2j64K51J14j21j20N9j58l0L53j59q0K52j46o3N0r6
6318f6O8j36Q8Q1j57L30M6k48j0l3L32k07j62O5j27r5K82p0K13m2k29K85m04K59
6342F3k24PJ18Q5jn7J8k00K93q8m8j34K71p2l6N8j53J51O5j22L98m29K8K11k5
6367A77l85J62J61n6l2j5J14J1j6k99J8O8K19r1l7m9K68k93J76k35M2J6J39l8
$$ plain form
6295 201 176 -72 136 -189 7 -60 -8 -172 79 193 72 -48 11 -147 -177 176 17 -63 189 43 -20 30 -66
6318 -66 2 -134 -46 35 -122 208 254 6 -4 -37 295 88 -74 -9 -136 -231 51 -19 194 152 -77 208 -196 63
6342 63 -161 -154 -36 49 48 -9 9 -191 102 14 -34 -168 103 31 -5 53 -100 51 116 -6 392 -37 -9 202 177
6367 177 -208 -46 115 59 27 12 126 137 121 -178 -160 -92 127 36 -1 -50 218 -75 101 -134 -92 -76 63 25
$$ [...]
8191A5
##END NTUPLES=NMR FID
##END=
