##TITLE=1H_Pr Pu-n
 200.13MHz,CDCl3.
 8 sc
 
 16.12.2025
##JCAMPDX= 6.0         $$ Bruker NMR JCAMP-DX V2.0
##DATA TYPE= NMR FID
##DATA CLASS= NTUPLES
##ORIGIN= UXNMR, Bruker Analytische Messtechnik GmbH
##OWNER= pz
$$ XWIN-NMR		Version 3.5
$$ Tue Dec 16 14:27:50 2025 Russian Standard Time (UT+4h)  she@DPX200
##.OBSERVE FREQUENCY= 200.1313
##.OBSERVE NUCLEUS= ^1H
##.DELAY= (6, 6)
##.ACQUISITION MODE= SIMULTANEOUS
##.ACQUISITION SCHEME= undefined
##.AVERAGES= 8
##.DIGITISER RES= 18
##SPECTROMETER/DATA SYSTEM= spect
##.PULSE SEQUENCE= zg30
##.SOLVENT NAME= CDCl3
##.SHIFT REFERENCE= (INTERNAL, CDCl3, 0, 14.3821)
##AUDIT TRAIL= $$ (NUMBER, WHEN, WHO, WHERE, WHAT)
$$ ##TITLE= Audit trail, XWIN-NMR		Version 3.5
$$ ##JCAMPDX= 5.01
$$ ##ORIGIN= Bruker BioSpin GmbH
$$ ##OWNER= she
$$ F:/spectra/data/she/nmr/H-C/1/audita.txt
$$ ##AUDIT TRAIL=  $$ (NUMBER, WHEN, WHO, WHERE, WHAT)
(   1,<2025-12-16 14:26:07.79 +0400>,<she>,<DPX200>,
      <created by zg, POWCHK disabled, PULCHK disabled
       configuration hash MD5:
       00 E9 B6 7A A2 85 ED C7 34 08 36 98 17 FE 4E 26
       data hash MD5: 16K
       4B 83 BA 42 99 57 C5 4F A8 C3 7D 3D 37 27 62 7D>)
$$ ##END=
$$ 
$$ hash MD5
$$ 58 6E EB 38 2F B4 6A 3A 41 4A 6A 69 D8 FB 42 9D
##$RELAX= 
##$RELAX= 
##$RELAX= 
##$RELAX= 
##$RELAX= 
##$RELAX= 
$$ Bruker specific parameters
$$ --------------------------
##$DU= <F:/spectra>
##$EXPNO= 1
##$NAME= <H-C>
##$PROCNO= 1
##$TYPE= <nmr>
##$USER= <she>
##$AMP= (0..31)
100 100 100 100 100 100 100 100 100 100 100 100 100 100 100 100 100 100 
100 100 100 100 100 100 100 100 100 100 100 100 100 100 
##$AQSEQ= 0
##$AQ_mod= 1
##$AUNM= <au_zg>
##$AUTOPOS= <>
##$BF1= 200.13
##$BF2= 200.13
##$BF3= 200.13
##$BF4= 200.13
##$BF5= 200.13
##$BF6= 200.13
##$BF7= 200.13
##$BF8= 200.13
##$BYTORDA= 1
##$CFDGTYP= 0
##$CFRGTYP= 5
##$CHEMSTR= <none>
##$CNST= (0..31)
1 1 145 1 1 1 1 1 1 1 1 1 1 1 1 1 1 1 1 1 1 1 1 1 1 1 1 1 1 1 1 1 
##$CPDPRG= <>
##$CPDPRG1= <>
##$CPDPRG2= <>
##$CPDPRG3= <>
##$CPDPRG4= <mlev>
##$CPDPRG5= <mlev>
##$CPDPRG6= <mlev>
##$CPDPRG7= <mlev>
##$CPDPRG8= <mlev>
##$CPDPRGB= <>
##$CPDPRGT= <>
##$D= (0..31)
0 0.7 0 0 0 0 0 0 0 0 0 0.03 0 0 0 0 0 0 0 0 0 0 0 0 0 0 0 0 0 0 0 0 
##$DATE= 1765880767
##$DBL= (0..7)
120 120 120 120 120 120 120 120 
##$DBP= (0..7)
150 150 150 150 150 150 150 150 
##$DBP07= 0
##$DBPNAM0= <>
##$DBPNAM1= <>
##$DBPNAM2= <>
##$DBPNAM3= <>
##$DBPNAM4= <>
##$DBPNAM5= <>
##$DBPNAM6= <>
##$DBPNAM7= <>
##$DBPOAL= (0..7)
0.5 0.5 0.5 0.5 0.5 0.5 0.5 0.5 
##$DBPOFFS= (0..7)
0 0 0 0 0 0 0 0 
##$DE= 6
##$DECBNUC= <off>
##$DECIM= 32
##$DECNUC= <off>
##$DECSTAT= 4
##$DIGMOD= 1
##$DIGTYP= 9
##$DL= (0..7)
0 120 120 120 120 120 120 120 
##$DP= (0..7)
150 150 150 150 150 150 150 150 
##$DP07= 0
##$DPNAME0= <>
##$DPNAME1= <>
##$DPNAME2= <>
##$DPNAME3= <>
##$DPNAME4= <>
##$DPNAME5= <>
##$DPNAME6= <>
##$DPNAME7= <>
##$DPOAL= (0..7)
0.5 0.5 0.5 0.5 0.5 0.5 0.5 0.5 
##$DPOFFS= (0..7)
0 0 0 0 0 0 0 0 
##$DQDMODE= 0
##$DR= 18
##$DS= 0
##$DSLIST= <SSSSSSSSSSSSSSS>
$$ [...]
##$SUBNAM0= <"">
##$SUBNAM1= <"">
##$SUBNAM2= <"">
##$SUBNAM3= <"">
##$SUBNAM4= <"">
##$SUBNAM5= <"">
##$SUBNAM6= <"">
##$SUBNAM7= <"">
##$SUBNAM8= <"">
##$SUBNAM9= <"">
##$SW= 18.0517328524113
##$SWIBOX= (0..15)
0 0 2 0 0 0 0 0 0 0 0 0 0 0 0 0 
##$SW_h= 3612.71676300578
##$TD= 16384
##$TD0= 1
##$TE= 0
##$TE2= 300
##$TE3= 300
##$TEG= 300
##$TL= (0..7)
0 120 120 120 120 120 120 120 
##$TP= (0..7)
150 150 150 150 150 150 150 150 
##$TP07= 0
##$TPNAME0= <>
##$TPNAME1= <>
##$TPNAME2= <>
##$TPNAME3= <>
##$TPNAME4= <>
##$TPNAME5= <>
##$TPNAME6= <>
##$TPNAME7= <>
##$TPOAL= (0..7)
0.5 0.5 0.5 0.5 0.5 0.5 0.5 0.5 
##$TPOFFS= (0..7)
0 0 0 0 0 0 0 0 
##$TUNHIN= 0
##$TUNHOUT= 0
##$TUNXOUT= 0
##$USERA1= <user>
##$USERA2= <user>
##$USERA3= <user>
##$USERA4= <user>
##$USERA5= <user>
##$V9= 5
##$VALIST= <valist>
##$VCLIST= <CCCCCCCCCCCCCCC>
##$VD= 0
##$VDLIST= <DDDDDDDDDDDDDDD>
##$VPLIST= <PPPPPPPPPPPPPPP>
##$VTLIST= <TTTTTTTTTTTTTTT>
##$WBST= 1024
##$WBSW= 4
##$XGAIN= (0..3)
0 0 0 0 
##$XL= 0
##$YL= 0
##$YMAX_a= 126783
##$YMIN_a= -158442
##$ZGOPTNS= <>
##$ZL1= 120
##$ZL2= 120
##$ZL3= 120
##$ZL4= 120
##$ABSF1= 10
##$ABSF2= 0
##$ABSG= 5
##$ABSL= 3
##$ALPHA= 0
##$AQORDER= 0
##$ASSFAC= 0
##$ASSFACI= 0
##$ASSFACX= 0
##$ASSWID= 0
##$AUNMP= <proc_1d>
##$AZFE= 0.1
##$AZFW= 0.1
##$BCFW= 1
##$BC_mod= 2
##$BYTORDP= 1
##$COROFFS= 0
##$CY= -3
##$DATMOD= 1
##$DC= 2
##$DFILT= <>
##$DTYPP= 0
##$F1P= 0
##$F2P= 0
##$FCOR= 0.5
##$FTSIZE= 0
##$FT_mod= 4
##$GAMMA= 1
##$GB= 0.15
##$INTBC= 1
##$INTSCL= 1
##$ISEN= 128
##$LB= 0.25
##$LEV0= 0
##$LPBIN= 0
##$MAXI= 10000
##$MC2= 0
##$MEAN= 0
##$ME_mod= 0
##$MI= 1.114404
##$NCOEF= 0
##$NC_proc= 0
##$NLEV= 6
##$NOISF1= 3.799351
##$NOISF2= 2.8
##$NSP= 1
##$NTH_PI= 0
##$NZP= 0
##$OFFSET= 14.38212
##$PC= 1
##$PHC0= -3704.214
##$PHC1= 13.19234
##$PH_mod= 1
##$PKNL= yes
##$PPARMOD= 0
##$PSCAL= 0
##$PSIGN= 0
##$REVERSE= no
##$SF= 200.129724274929
##$SI= 16384
##$SIGF1= 3
##$SIGF2= 2
##$SINO= 400
##$SIOLD= 16384
##$SREGLST= <1H.CDCl3>
##$SSB= 0
##$STSI= 0
##$STSR= 0
##$SW_p= 3205.1282051282
##$SYMM= 0
##$S_DEV= 0
##$TDeff= 0
##$TDoff= 0
##$TI= <>
##$TILT= no
##$TM1= 0
##$TM2= 0
##$TOPLEV= 0
##$USERP1= <user>
##$USERP2= <user>
##$USERP3= <user>
##$USERP4= <user>
##$USERP5= <user>
##$WDW= 1
##$XDIM= 8192
##$YMAX_p= 0
##$YMIN_p= 0
$$ End of Bruker specific parameters
$$ ---------------------------------
##NTUPLES= NMR FID
##VAR_NAME=  TIME,          FID/REAL,        FID/IMAG
##SYMBOL=    X,             R,               I
##VAR_TYPE=  INDEPENDENT,   DEPENDENT,       DEPENDENT
##VAR_FORM=  AFFN,          ASDF,            ASDF
##VAR_DIM=   8192,          8192,            8192
##UNITS=     SECONDS,       ARBITRARY UNITS, ARBITRARY UNITS
##FACTOR=    0.0002768,     1,               1
##FIRST=     0,             0,               0
##LAST=      2.2672688,     0,               0
##MIN=       0,             -158442,         0
##MAX=       2.2672688,     126783,          0
$$ Real data points
##PAGE= N=1
##DATA TABLE= (X++(R..R)), XYDATA
$$ [...]
1773G37J54j137O30Qj157Q86l84n48O51o18j90J222j141M70N40o82Q14P7l36R51
$$ 737 891 -246 384 392 -765 121 -263 -811 -160 -778 -968 254 -887 -417 123 -559 255 332 -4 947
1793I47n57m22J188q07j30L98p63M24K8j192P69m7p05O48l29l73J016p28L17P53
$$ 947 390 -32 1156 349 219 617 -146 278 306 -886 -117 -164 -869 -221 -550 -923 93 -635 -318 435
1813D35p69M54N93j034R10q5m10R03n90l90J013j029j42O40j104O71j31j121J211
$$ 435 -334 120 713 -321 589 504 94 997 407 17 1030 1 -141 499 -605 66 -65 -1186 25
1832B5k53q44J077m65j66Q63q11K85J071j116N40O82r09N23p7m72O75n97l56O85
$$ 25 -228 -1072 5 -460 -626 237 -574 -289 782 -334 206 888 -21 502 425 -47 628 31 -325 360
1852C60o54r3M90j006O45L05r76Q04M9o20R72m77L4Q64p98N64L10r83M86L12o80
$$ 360 -294 -387 103 -903 -258 47 -929 -125 -76 -696 276 -201 -167 697 -101 463 773 -210 276 588 -92
1873i2M78k14n92Q22q52k93R29p21n7N62o53M63K03m89Q73q5o40O72j99j26N00
$$ -92 386 172 -420 402 -450 -743 186 -535 -592 -30 -683 -220 -17 -506 367 282 -358 314 115 -11 489
1894D89o23M07M02j081M30J56o04N86m05l96R77p05n2R46r39L86J18n11O50k60
$$ 489 -134 273 675 -406 24 180 -424 162 -243 -639 338 -367 -419 527 -412 -26 92 -419 231 -29
1914b9m11Q21j20o18O16o02K71M15o61M99L53p11L29J29k68M87k47k76O78j002
$$ -29 -440 381 261 -357 259 -343 -72 343 -318 181 534 -177 152 281 13 500 253 -23 655 -347
1934c47J02N89n80N0o3l60P00k41o19J060m81p3N35m13K56N09p17M35L81p61M99
$$ -347 -245 344 -236 -186 -249 -609 91 -150 -769 291 -190 -263 272 -141 115 624 -93 342 723 -38 461
1955D61J92p63O72p76k12N56o85K04M03q87O08Q4m73N31j48j91Q72n39J52N76
$$ 461 653 -110 562 -214 -426 130 -555 -351 52 -835 -227 -143 -616 -85 -233 -424 448 -91 61 637
1975F37m46K92L28r93P94o7q32N09k42m46M35k20l22N52o64O08j6n94P65j02l51
$$ 637 191 483 811 -182 612 545 -287 222 -20 -466 -31 -251 -573 -21 -685 -77 -93 -687 78 -24 -375
1996c75J017l21n12R43m99Q8L48o00K64K4o92M68k53n00O07q64L53N47n58K70
$$ -375 642 321 -191 752 253 341 689 89 353 377 -315 153 -100 -600 7 -857 -504 43 -515 -245
2016b45L74p54M41O30o32N27j51J02O57q97j45N66p12L70M48j163L72M99q51P04
$$ -245 129 -625 -184 446 -186 341 190 292 949 52 -93 473 -239 131 579 -584 -212 287 -564 140
2036A40n16o08J111j65l76N80m93K24O30q54N42J15m18P57l42n94O77m72K7M02
$$ 140 -376 -984 127 -38 -414 166 -327 -103 527 -327 215 330 -88 669 327 -267 410 -62 -35 367
2056C67o80K22M15p59N86j67o12Q17k62n48R11n00J10N22p25L50L57n64M00j1
$$ 367 -313 -91 324 -435 151 -16 -628 189 -73 -621 290 -210 -100 422 -303 47 404 -160 240 229
2076B29o00Q88l08m92P02n78M2N65p70O9L77p72R45k11p09M85L6j72O40m22J9
$$ 229 -371 517 209 -283 419 -159 -117 448 -322 -253 124 -648 297 86 -623 -138 -102 -274 366 -56 -37
2097c7P77q52M17J27p47N80J64p86N90J54o25L64k69o2M05p64N45K52o79N89n4
$$ -37 740 -112 305 432 -315 265 429 -357 233 387 -238 126 -143 -205 200 -564 -19 233 -446 143 89
2118H9l26N78k83l19Q51m34q8L41l85M02l66m51N54M4o78Q09o25k98P79l48J2
$$ 89 -237 341 58 -261 590 156 68 409 24 426 60 -391 163 207 -471 338 -287 -585 194 -154 -142
2139a42K78n46M53K38m39L90l3j88O14p64Q6P37p29O6L38n83L24k11l24L41n7
$$ -142 136 -410 43 281 -158 232 199 11 625 -139 -53 684 -45 21 359 -224 100 -111 -435 -94 -151
2160a51j31M09n20J95M20o49M60M48q01M48Q7m13Q33n43k45N38j36l11L09n66
$$ -151 -282 127 -393 -198 222 -427 33 481 -320 128 215 -198 635 92 -153 385 249 -62 247 -319
2180c19J19J97n09M95ol66L47J53o86P92k89R1N92o83K62L26l32J27J04n39O61
$$ -319 -200 -3 -512 -17 -23 -389 -42 111 -575 217 -72 19 611 -72 190 516 184 311 415 -124 537
2201E37n42k86O03n35k30M62m65K77J38n10N14J33l29P15m63j12N22l10j19N85
$$ 537 -5 -291 312 -223 -453 9 -456 -179 -41 -551 -37 96 -233 482 19 -93 429 119 0 585
2221E85o46J21L47q40O28k78n36P17l19l01O91o15J08N12n80N71j71k16N85k4
$$ 585 -61 60 407 -433 195 -83 -619 98 -221 -522 169 -446 -338 174 -406 165 -6 -222 363 339
2241C39l86N41m33l8N32m74k64O60q01L97N6n89O38m61m01P60k84k5M42l82J26
$$ 339 -47 494 61 23 555 81 -183 477 -324 73 129 -460 178 -283 -684 76 -208 -233 209 -173 -47
2262d7M74m01J69J78m10L49j64k08L62j79l77P05j071K77L67n34L32J45l83O29
$$ -47 427 26 195 373 -37 312 148 -60 302 123 -254 451 -620 -343 24 -510 -178 -33 -416 213
2282B13p7m24N35l56K43K95n52M78J10q10N87Lm02K95j90l06N24l89j27M90p15
$$ 213 136 -288 247 -109 134 429 -123 355 465 -345 242 245 -157 138 -52 -358 166 -223 -350 140 -575
2303e75L45L53o05P22n1j96M81l29j14L76m19N6L54q87N54R9p37L71L47m24J64
$$ -575 -230 123 -482 240 189 -7 474 145 31 407 -12 44 398 -489 65 164 -573 -202 145 -279 -115
2324a15K6k38O07l42k26Q62m63K83O9m67M14K8n41N31n78k50N55o07J47L34o18
$$ -115 -89 -327 280 -62 -288 574 111 394 463 -4 410 438 -103 428 -150 -400 155 -452 -305 29 -589
2345e89L30N34q18M74J64k24N83k48l79R02o35K39K33o63J85J10m00K80j81o32
$$ -589 -259 275 -543 -69 95 -129 454 206 -173 729 94 333 566 -97 88 198 -202 78 -103 -735
2365g35Q24o24J21M03l51L6M02k11L12K47l47L14j37l42P51m44q7L01p19J83K13
$$ -735 89 -535 -414 -11 -362 -326 76 -135 177 424 77 391 254 -88 663 219 132 433 -286 -103 110
2386A10q53N14K17n49N36k05k15O38j86j81N26k36R8M56n41R4J25l91L71k32l47
$$ 110 -743 -229 -12 -561 -25 -230 -445 193 7 -174 352 116 214 670 129 223 348 -43 328 96 -251
2407b51M25m05k4M39o51K39J30k54J88M5j14O20k67l28M37p5MM37o22K44Q0n25
$$ -251 174 -231 -255 184 -467 -228 -98 -352 -164 -119 -233 387 120 -208 229 154 158 595 -27 217 297 -228
2429b28N08lo85L85k50J21J75j98Q3N14q84K30L88l14M80k26j24L67l01k59O61
$$ -228 280 277 -408 -23 -273 -152 23 -175 -92 422 -462 -232 156 -158 322 96 -28 339 38 -221 440
2450D40m66j78L72m98K68R4l91O30j47n24P64n93J67K55j32k1K35m21M07kl57
$$ 440 -26 -204 168 -330 -62 32 -359 271 124 -400 364 -229 -62 193 61 40 275 -146 261 259 -98
2471i8J30j47r9L71k03l20N07l35K32J4p2J16Pj47L54j87k17M12l15o7M42o50
$$ -98 32 -115 -214 157 -46 -366 141 -194 38 52 -20 96 103 -44 310 123 -94 318 3 -64 378 -272
2493b72J19K65n05L17j38j40J88J4p5O66m44J02K75m40L24J38l75K53m3m36N00
$$ -272 -153 112 -393 -76 -214 -354 -166 -152 -227 439 -5 97 372 -68 256 394 19 272 229 -207 293
2514B93j24j78M0l88o9O55o16J98K99m54N06j63J8L15n4k25M07l79R2J64m30J20
$$ 293 169 -9 31 -357 -426 229 -387 -189 110 -344 162 -1 17 332 278 53 460 81 173 337 -93 27
2536B7J19l43J96K2m81N20k86r7L69l53K18J26k36L16J06l62O06j50l45M41l80
$$ 27 146 -197 -1 21 -460 60 -226 -323 46 -307 -89 37 -199 117 223 -139 467 317 -28 413 33
2557C3J34Q6l48R7k7l15K3K32k94N59m13o9M57k71K16K42n24L39K76m39J83K25
$$ 33 167 253 -95 2 -25 -340 -317 -85 -379 180 -233 -302 155 -116 100 342 -182 157 433 -6 177 402
2579D02m91J82P7l06M97m67k64M31m29K95J87m21K80K36l04L60k96m1M44k27j59
$$ 402 -89 93 170 -136 361 -106 -370 61 -368 -73 114 -307 -27 209 -95 265 -31 -72 372 145 -14
2600a4L28l76Q7K71m57M36l04l57M12P3k47P6k32N3L11j73J50J32k01J57Jk03
$$ -14 314 -62 25 296 -161 275 -29 -386 26 99 -148 -72 -304 -251 60 -113 37 169 -32 125 126 -77
2622g7M95k67m42O18k88l29N75o19K80K02m75J06K34m79O03k06M9J91j70J90Q5
$$ -77 418 151 -291 327 39 -290 285 -334 -54 148 -327 -221 13 -466 137 -69 -20 171 1 191 276
2643B76l48L77l6n16M34j76k8J99k60j0J4j41L8J47JK71k75J8O3K21l57K27K4
$$ 276 -72 305 269 -247 187 11 -17 182 -78 -88 -74 -215 -177 -30 -29 242 -33 -15 48 269 -88 139 163
2666A63J6p7j97M0L71m78J75P4l23J51M8l12M11k37k0K39j51J25P8k03L24q7j10
$$ 163 179 102 -95 -55 316 -162 13 87 -236 -85 -37 -349 62 -175 -195 44 -107 18 96 -107 217 130 20
2689B0M77l13l93L99k22P0l3j83k30M95l00J21J0k56M55p5k09M13j98J60K7m55
$$ 20 497 184 -209 190 -32 38 5 -178 -408 87 -213 -92 -82 -338 117 42 -167 246 48 208 235 -220
2711b20L39L9j25j2Q9k97K19k99J44jok22K45j68L96J02l88K11nq9M50k87J6L22
$$ -220 119 158 33 21 110 -187 32 -267 -123 -124 -130 -352 -107 -275 121 223 -165 46 41 -48 402 115 131 453
2735D53m38k7J89l37M9J50k38K75j50j28J77k05J00L00m43J03O21m70J43K57m29
$$ 453 15 -12 177 -160 -111 39 -199 76 -74 -202 -25 -230 -130 170 -273 -170 451 -19 124 381 -48
2756d8K89j13k09L07m05J75J61l01p9M62o42L80j25r1L85l5j91K19k03J21L6j45
$$ -48 241 128 -81 226 -179 -4 157 -144 -223 239 -403 -23 -148 -239 146 111 -80 139 -64 57 93 -52
2778e2J70j47j01j2K81j74K6nj71K62k89M6K11j80J8J94k43L02K7j08J00j77n5
$$ -52 118 -29 -130 -142 139 -35 -9 -14 -185 77 -212 -166 45 -135 -117 77 -166 136 163 55 155 -22 -77
2801g7L51Kl09L35m94r4L95n00J81K40m93M16j14o5K15J41M9j81k48K87K47j56
$$ -77 274 276 -33 302 -192 -286 109 -391 -210 30 -463 -47 -161 -226 -11 130 179 -2 -250 37 284 128
2823A28p5J64l91K99p0k84K43q2k8m7k30K53nj86K98j00j10K79J49k96N42l95
$$ 128 53 217 -174 125 55 -229 14 -68 -96 -143 -373 -120 -125 -311 -13 -113 -223 56 205 -91 451 56
2845E6K86P6n02O8L86m73k9J66k82M52k87j65L14j08j74L24j64N1K21l06L84j10
$$ 56 342 418 -84 -16 370 -103 -132 34 -248 204 -83 -248 66 -42 -216 108 -56 -5 216 -90 294 184
2867A84k55K96m56rM24n39Q3K95k25M5R6m02L12n1n5K31J01k88O52m44j7J91j50
$$ 184 -71 225 -231 -240 184 -355 -272 23 -202 -157 -61 -463 -151 -202 -257 -26 75 -213 439 -5 -22 169 19
2890A9P8J07p7J09n1m79L49j84p0K13m18J39L78n59M76M3k68L41nk39L36o6p5
$$ 19 97 204 127 236 185 -294 55 -129 -199 14 -404 -265 113 -446 30 73 -195 146 141 -98 238 172 97
2913I7J27k59o6K53l62L12k7k05P0M5k23J77o6QK04n70N00K8R8k2K43l64L03m46
$$ 97 224 -35 -101 152 -210 102 75 -130 -60 -15 -238 -61 -127 -119 85 -485 15 43 141 119 362 -2 301 -145
2937a45K07M03m19k96L35l41Q3J23j76K90k38m8L07k21K27K07m26r7Q71n62J35
$$ -145 62 465 46 -250 85 -256 -173 -50 -226 64 -174 -222 85 -136 91 298 -128 -225 646 84 219
2958B19J8m79L86m1j75L0k0j99K04j13k9K75k55o1M20l29K42J6j88K37j60P3J64
$$ 219 237 -242 144 103 -72 -42 -62 -261 -57 -170 -199 76 -179 -240 180 -149 93 109 -79 158 -2 71 235
2981B35j80J84j53m14K35L7l93M40j04j10K29j44J6L86k27j2J22j95L73l27Q4
$$ 235 55 239 86 -328 -93 -56 -449 -9 -113 -223 6 -138 -122 264 37 25 147 -48 325 -2 82
3002H2L17l05j64J98p3j52K30k78l4J05j04J47Nj51K80%j73P3j17K4L58m83Q1
$$ 82 399 94 -70 128 55 -97 133 -145 -179 -74 -178 -31 -26 -177 103 103 -70 3 -114 -90 268 -215 -134
3025a34L50l15J45k1j29J50k78L05j08j62R2P5j94L54j46O9O0Q9k62J40Q3l11
$$ -134 216 -99 46 25 -104 46 -232 73 -35 -197 -105 -30 -224 130 -16 53 113 202 -60 80 163 -148
3047a48K04j8j16K27l72K48J32k51J40j55k14L89n8q4J52j32j24K13l47K41M3
$$ -148 56 38 -78 149 -223 25 157 -94 46 -109 -323 66 8 -76 76 -56 -180 33 -314 -73 -30
3068c0j16L35j17r7J03k08q7K71q4j02K40j86Q4L5m46N28j01k04L04k62j9L07
$$ -30 -146 189 72 -25 78 -130 -217 54 -30 -132 108 -78 6 41 -405 123 22 -182 122 -140 -159 148
3090A48j96K06J82n40L31r2k05K36rj16J82k05m7L14k56K0K48m96K01K54l24K43
$$ 148 -48 158 340 -200 131 39 -166 70 61 -55 127 -78 -125 189 -67 -47 201 -295 -94 160 -164 79
3112G9k09n6J75P2p9K62k08q1J79l05K49J65k92M0M0l53M03j95K5O1m6N1K32l72
$$ 79 -130 -186 -11 61 -18 244 36 -45 134 -171 78 243 -49 -9 31 -322 81 -114 -89 -28 -74 -23 209 -163
3136a63P0J67r8K09j22k21K76j80J7L21k06j6K49m26J24P7l15K60pk33M07l20
$$ -163 -93 74 -24 185 63 -158 118 -62 -45 276 70 54 303 -123 1 78 -237 23 16 -217 190 -130
3158a30J11J86j99K01q3q4l4J9J08Mr4j88K89r9J18J11k11k8K8j58J92q7l04O37
$$ -130 -19 167 -32 169 86 2 -32 -13 95 99 5 -183 106 7 125 236 25 -3 25 -133 59 -28 -332 305
3182C05j19k68J42j67J23n8k54K22J24k18M11lk85L23l44J3N8j41J02K01j45R7
$$ 305 186 -82 60 -107 16 -42 -296 -74 50 -168 243 240 -45 278 -66 -53 5 -136 -34 167 22 119
3204A19J29l04J80j31q2J81l6j67K86mn12K53K6K03P6l80J71J27m06M37l25K32
$$ 119 248 -56 124 -7 -89 92 56 -111 175 171 -341 -88 -62 141 217 -163 8 135 -271 166 -159 73
3226G3Q8j10J24k33k87L67J68k59Q6N5k53L93k20j33J97J10l53M33o29L09J5R6
$$ 73 161 51 175 -58 -345 22 190 -69 17 72 -181 212 -8 -141 56 166 -187 246 -383 -74 -59 37
3248C7n2nj39Q2M9K47k9k60L64l30L0L6R0k63M12l48J96nN6j60r7j69L34J94n82
$$ 37 -15 -20 -159 -77 -28 219 190 -70 294 -36 -6 30 120 -143 269 -79 117 112 168 8 -89 -258 76 270 -312
3273c12L18P3j03K66n10Q6L52k54Q6l9o0K24j04j81K44k24J08O5mk73K15n2jM06
$$ -312 6 79 -24 242 -268 -182 170 -84 2 -37 -97 127 23 -158 86 -138 -30 35 31 -242 -27 -79 -80 326
3297C26m81Q1J62k38J68n3m12M83l26K12K42j0p2Rj7j5O2j4q8n9p6K93j48k52
$$ 326 -155 -74 88 -150 18 -35 -447 36 -290 -78 164 154 82 91 74 59 121 107 19 -40 -116 177 29 -223
3321b23K94j87o1K89o9J17k00M7j75K24j58K79o4j71K37m24K90K65k42J78l49
$$ -223 71 -116 -177 112 43 160 -40 7 -168 56 -102 177 113 -58 179 -245 45 310 68 246 -103
3342a03j01K63k87K02M7j87J80K9l1q3J90k62K57j25j35J46r9j08L15q0j48K49
$$ -103 -204 59 -228 -26 21 -166 14 43 12 -71 119 -143 114 -11 -146 0 -99 -207 108 28 -120 129
3364A29k16K14L8k62P0K06l29K74nl93L53q9k23M69l96L9R9o8J14K6O5j47Ll15
$$ 129 -87 127 165 -97 -27 179 -150 124 119 -274 79 -10 -233 236 -160 -121 -22 -90 24 50 115 -32 -29 -344
3388c44M25l9k71nJ64Q4K0k81K90K57k08k8r0N9K9j27O4J1j38J88P8j78J34P4
$$ -344 81 42 -229 -234 -70 14 34 -247 43 300 92 64 -26 33 62 -65 -1 10 -128 60 138 -40 94 168
3412A68k10R6o2J29J15l20J94q9o2J71j15k08N33l49P0qL1n0J78j88j73K73l07
$$ 168 -42 54 -8 121 236 -84 110 21 -41 130 15 -193 340 -9 61 53 84 34 212 24 -149 124 -183
3435a83J15L86l68L0k54J92J92k21P5K78k74j17K26k4J76l69NK91j84r7L1k8o0
$$ -183 -68 318 -50 -20 -274 -82 110 -111 -36 242 -32 -149 77 53 229 -140 -135 156 -28 -125 -94 -122 -182
3458a82J60j11J10O9k19J53Q0j96K58K2j23N9k58j1L24r2j64K46j41q8O6J01O1
$$ -182 -22 -133 -23 46 -173 -20 60 -136 122 144 21 80 -178 -189 135 43 -121 125 -16 -104 -38 63 124
3481A24k03m4L09m41j4L92l51K89r5j36J66P9J9J92k01L6J15n11J51K20k71R6
$$ 124 -79 -123 186 -255 -269 123 -228 61 -34 -170 -4 75 94 286 85 121 236 -275 -124 96 -175 -79
3503g9Qj7K25k77j76M50l37J03K03j63Q1J27k05R9Q5k74K40m2j95N6j8K3J19r
$$ -79 -71 -88 137 -140 -316 134 -203 -100 103 -60 21 148 -57 42 127 -147 93 51 -144 -88 -106 -83 36 27
3527B7m1K03k89J7J42r7R4m1k0J66j6m95M02l96L82J22j65P1j06j6k6P4j67L23
$$ 27 -14 189 -100 -83 59 -38 56 15 -5 161 145 -350 52 -344 38 160 -5 66 -40 -56 -82 -8 -175 148
3551A48k01j50K82L0n6J86l57J87P5j29K78l17r0K18j98o6K41p5j56j5Q2N1J96
$$ 148 -53 -203 79 109 53 239 -118 69 144 15 293 -24 -114 104 -94 -160 81 6 -150 -165 -83 -32 164
3574A64l50L69j15m0O3j39o1K88k77j10K96j98K28k80O0rN8j78LO1K12l8q4K61
$$ 164 -186 183 68 28 91 -48 -109 179 -98 -208 88 -110 118 -162 -102 -111 -53 -231 -228 -167 45 7 -77 184
3598A84j89q7J99Rk76K34j67m7K04r1J70n9k95J46R1j38P4j0PJ47l2l83M22P1
$$ 184 -5 -92 107 116 -160 74 -93 -140 64 -27 143 84 -211 -65 26 -112 -38 -48 -41 106 74 -309 113 184
3622A84j13q3j65Q3P0K99k42L1j10k6Q1k6N4r7J2OJ6K2N2k8K7L5j64J71k9J34
$$ 184 71 -12 -177 -94 -24 275 33 64 -46 -72 9 -17 37 -60 -48 -42 -26 -4 48 20 47 82 -82 89 60 194
3648A94J14m03K82J1k76R2q4n2J9O8j92L81l32J84L62k43k9j02o2K2J88k05L64
$$ 194 308 -95 187 198 -78 14 -70 -122 -103 -35 -227 154 -178 6 368 125 96 -6 -68 -46 142 -63 301
3671C01N0l59J76j99j07N6o4J22K09k89J77j20k19K18K90m36M79l29J02m2J02
$$ 301 351 -8 168 -31 -138 -82 -146 -24 185 -104 73 -47 -266 -48 242 -194 285 -44 58 16 118
3692A18j12KL9J74j36k40J14l2K4R7q0L9O7k44K59j69k3K03Qm30O47l50J08k0
$$ 118 6 8 47 221 85 -155 -41 -73 -49 48 -32 7 74 -170 89 -80 -103 100 108 -322 325 -25 83 63
3716F3j51J55j23J49j52O7j58l6J08M6k8J59k27K10L9k78R2J13j81K62j81p8L97
$$ 63 -88 67 -56 93 -59 8 -150 -186 -78 -32 -60 99 -128 82 121 -157 -65 48 -133 129 -52 -130 267
3739B67m02K02p1J8L6n1N1m6r7p3R5j83M82l35J66n8m4N4j06J16j1J56o1k16K30
$$ 267 -135 67 -4 14 50 -1 50 4 -93 -166 -71 -254 228 -107 59 1 -43 11 -95 21 10 166 105 -111 119
3764A19j48J07L4l41K28N1l9k2j02j81L60o7R1q6q0q5M37l18J90j17P2J35k83
$$ 119 -29 78 112 -229 -1 50 11 -11 -113 -294 66 -1 90 4 -76 -161 276 -42 148 31 103 238 -45
3787d5j57K58k46K07o0J8M1j50m7R5L0j50K88j35K4lR3J04Ll65L22k57J05Q4k67
$$ -45 -202 56 -190 17 -43 -25 16 -134 -181 -86 -56 -206 82 -53 -29 -32 61 165 168 -197 125 -132 -27 57 -210
3812b10j43L61M7K9j34J24r9J84j49K35j50p3j97K86j18k7j49R9O2rJ89l58M1
$$ -210 -353 8 55 84 -50 74 -25 159 10 245 95 22 -175 111 -7 -34 -183 -84 -22 -31 158 -200 -159
3835a59J83Q1l67K45j51K4N6N9JJ96k64L12j55k01J95J42k24L82m61R5Q8m20J74
$$ -159 24 105 -262 -17 -168 -144 -88 -29 -28 168 -96 216 61 -140 55 197 -27 355 -106 -11 77 -343 -169
3858a69J03P1j32Jj7J32k4o9R7p0Q0J22j02q8K78k25K04k36M5R5k67K49k22M2
$$ -169 -66 5 -127 -126 -143 -11 -35 -104 -7 -77 3 125 23 -65 213 -12 192 -44 1 96 -171 78 -144 -102
3882a02J1J51j58K4J30Pj23pn2O0M9k0P3j50r3L57l43J23j0qK2j61J64q4J06J7
$$ -102 -91 60 -98 -74 56 63 -60 -67 -119 -59 -10 -30 43 -107 -200 157 -186 -63 -73 -81 -59 -220 -56 -140 -34 -17
3908a7J73j01K2P0p4q5J5N5j22r7l5K29J89j32j08m3k8N2k24L53j50j7J04j95
$$ -17 156 55 77 147 73 -12 3 58 -64 -161 -196 33 222 90 -18 -61 -89 -37 -261 92 -58 -75 29 -166
3932a66K40j3l1q2J34m8N1j46m3J02J46k21M4L0k20L29j1k08M2R9r9J22j25J62
$$ -166 74 61 30 -52 82 34 85 -61 -104 -2 144 -77 -33 -3 -223 106 95 -113 -71 28 -71 51 -74 88
3956H8j63R0J74l57R7K82k69J19J76k86J5M2j82J86P6j52J36j0l5J53j88M3J22
$$ 88 -75 15 189 -168 -71 211 -58 61 237 -49 -34 8 -174 12 88 -64 72 62 27 180 -8 35 157
3979A57j20K9J98k37k40N40k67Pl12M10j26l55M41k43J63k9N1j99K55k11J08J18
$$ 157 37 66 264 27 -213 327 60 67 -245 165 39 -316 125 -118 45 16 67 -132 123 -88 20 138
4001A38r8k19L42k74R3J4R3j50j46L92j17o3Qm6j1j28K54m3J07m6j7n0K9Q2j24
$$ 138 40 -179 163 -111 -18 -4 89 -61 -207 185 68 5 13 -33 -44 -172 82 39 146 100 83 33 62 144 20
4026B0R8j21M4l1k73J49K2R8j30l5K7J04J4M6K1P9k81Q9J49j5k84K57J01L4J7
$$ 20 118 -3 41 10 -263 -114 -92 6 -124 -159 -132 -28 -14 32 53 132 -149 -60 89 74 -210 47 148 182 199
4051A99j76p9K02k73K9K33l07K98N1j5j72K04p2r9j61RQ2Q0Q3O5q2M7k51L5K91
$$ 199 23 -56 146 -127 -98 135 -172 126 177 162 -10 194 122 23 -138 -129 -47 33 116 181 99 146 -105 -70 221
4076B21j85j34k5O4j26L43j84r3P8RP8J2k8j01j05K12R4j90q3J9J95k79M32k73
$$ 221 36 -98 -123 -59 -185 158 -26 -119 -41 -32 46 58 30 -71 -176 36 130 -60 -143 -124 71 -208 224 -49
4100d9jJ1k02J80R1O3j24J06l0N0j96P0P5q8n8P7M4j07J9JM8m5N2K9p8K21q8j03
$$ -49 -50 -39 -241 -61 30 93 -31 75 45 95 -101 -31 44 -44 -102 -25 19 -88 -69 -68 -20 -65 -13 16 -62 159 71 -32
4128c2r6J47k97L79jm7k33J70M0K3P0l3Q5k34k3n9J33K1m9pJ49kj25pj68J91k9
$$ -32 -128 19 -278 101 100 53 -180 -10 30 53 123 90 175 -59 -82 -141 -8 13 -36 -43 106 104 -21 -28 -196 -5 -34
4155c4N1j32K0J36k50J49M8Q9j16j2N6J9j28J87j49L5L7j99J08j07J61J55k11
$$ -34 17 -115 -95 41 -209 -60 -12 77 -39 -51 5 24 -104 83 -66 -31 6 -193 -85 -192 -31 124 -87
4178h7kQM4P7L7r3L06l08L2J39O4l42P4K47m32J95J66k31J47l9j5q5K27n8j63
$$ -87 -89 -81 -37 40 77 -16 290 -18 14 153 217 -125 -51 196 -236 -41 125 -106 41 2 -13 -98 129 71 -92
4203i2K23J9j45j75m1J86k31K26j34N6J60j74M4K82l14M0l7LM2j25L58j84J33
$$ -92 131 150 5 -170 -211 -25 -256 -30 -164 -108 52 -122 -78 204 -110 -70 -107 -104 -62 -187 171 -13 120
4226A20j30J00k09J14j0q1K98k81MRl8O5J59o7K36k58k53K53n1J67k3j05J84m3
$$ 120 -10 90 -119 -5 -15 -96 202 -79 -75 -66 -104 -39 120 53 289 31 -222 31 -20 147 124 19 203 160
4250A60k79K25P6p4J12k73J53k36K41k34jK54k62J74p3K0M4j74J90m9l0j00K95
$$ 160 -119 106 182 108 220 -53 100 -136 105 -129 -130 124 -138 36 -37 -17 27 -147 43 -6 -36 -136 159
4273A59o8k36L72n39O22m27J68J3j16l6J04k65K19J32j70K08j70j7J68O2l9Pk05
$$ 159 91 -145 227 -312 310 -117 51 64 -52 -88 16 -249 -30 102 -68 140 -30 -47 121 183 144 151 -54
4296e4j2j21K76L9J8j70J06j08J16Nl27l3N06k11j64J92m8k6Qk2l8J94M8k12q2
$$ -54 -66 -187 89 128 146 -24 82 -26 90 95 -232 -265 241 30 -134 58 10 -16 -8 -30 -68 126 174 -38 -120
4321a20P4L1R2j66J23r0O8J6J74l97J34K88l25P0N2m3m7J8J64K5j49r4m3K18j77
$$ -120 -46 -15 77 -89 34 -56 12 28 202 -195 -61 227 -98 -28 24 -19 -66 -48 116 141 -8 -102 -145 73 -104
4346a04K79%q8l39M29l53P4J79k53M17k32K26j50l8J14j86p6L05m7j06p1J15J74
$$ -104 175 175 87 -252 177 -176 -102 77 -176 241 9 235 85 47 161 -25 -101 204 157 51 -20 95 269
4369B69j62k70J46J35l94J06J92j94R1L6n0j08K96j45Q7J11n6o1j18L68k77J90
$$ 269 107 -163 -17 118 -276 -170 22 -172 -81 -45 -95 -203 93 -52 35 146 90 29 -89 279 2 192
4391A92l51J53j88K07J49p5j7j03j33J77j93K21R4j76j4m9L7K69j72J9J6r8J21
$$ 192 -159 -6 -194 13 162 87 70 -33 -166 11 -182 39 133 -43 -57 -106 -69 200 28 47 63 -35 86
4414H6nj02J23r9k12J53Q5j3J0j59J99Q0l27L23j82r8K16J8j15J39k60j34M05
$$ 86 81 -21 102 3 -209 -56 29 16 26 -133 66 146 -181 142 -40 -138 78 96 -19 120 -140 -274 131
4437A31k23L5M13k62j89L40m01J38j89K29P7rj8J68k34RK03l75R1P2m0m4j19J6
$$ 131 -92 -57 356 94 -95 245 -156 -18 -207 22 99 90 72 240 6 15 218 -157 -66 6 -34 -78 -197 -181
4461a81J51j31J79L6j12L5J15o5Q4Q7k06r7M07k22O3l6K4j22J25p6k00K36K3k10
$$ -181 -30 -161 18 54 -58 -23 92 27 111 198 -8 -105 302 80 143 107 131 9 134 58 -142 94 117 -93
4485i3K02j27Lp8j1P6J24J49m44K41j30J73j60K45j91M6l2o8K45l65L28J11k95
$$ -93 109 -18 -15 -93 -104 -28 96 245 -199 42 -88 85 -75 170 -21 25 -7 -75 170 -195 133 244 -51
4508e1R9L7j81j64J79N7n3J05k06KQ6N0J68Qk34K24jj74j21K85N9k24J1n0Q6j6
$$ -51 48 85 -96 -260 -81 -24 -77 28 -178 -176 -90 -40 128 136 -98 126 125 -49 -170 115 174 -50 -39 -89 -3 -19
4534a9m9J74q9o2r0k37K90Q4K3L3j41M0O3K75j24k11m7J66n5q3J62j79J19J4J04
$$ -19 -68 106 17 -45 -135 -372 -82 2 25 58 -83 -43 20 295 171 -40 -87 79 24 -59 103 -76 43 57 161
4559A61j9o9l16M94j72k1j7M2J38m37J04J95r7o0L1j16J35J47j94j56L53o5Q1
$$ 161 142 73 -243 251 79 58 41 83 221 -216 -112 83 -14 -74 -43 -159 -24 123 -71 -227 126 61 142
4582A42k68J1L12k41K9m9j80L24n2L0P2k97K6K33q2L1L7J20j94M5K22k64mO6Q6
$$ 142 -126 -115 197 -44 -15 -64 -244 80 28 58 130 -167 -141 92 10 41 78 198 4 49 271 7 3 69 155
4607A55j25n3j8L4L9L7m5o6L0j55P2J31J80j19j15J22K2k58P2M4R1j26J82j7j8
$$ 155 30 -23 -41 -7 32 69 24 -42 -12 -167 -95 36 216 97 -18 104 126 -132 -60 -16 75 -51 131 114 96
4632I6J31k2k42o7j50J12K20k63K53j19J13k8j06O7j14K77r9k08R6l9L0r8J77
$$ 96 227 205 -37 -104 -254 -142 78 -185 68 -51 62 34 -72 -5 -119 158 59 -149 -53 -92 -62 -160 17
4655A7r8J60m0p6K5m7lN6j61L94l00P3P7k05l0K19k17K24j18J99j51J14j90M1
$$ 17 -81 79 39 -37 -12 -59 -62 -6 -167 227 -73 0 77 -128 -158 61 -156 68 -50 149 -2 112 -78 -37
4679c7P2j34J48P0J66l94J19j54J22r0n7M18l19N7L7J08Ok62L45j49J15k92R4
$$ -37 35 -99 49 119 285 -109 10 -144 -22 -112 -169 249 -70 -13 24 132 138 -124 221 72 187 -105 -11
4702a1r5KJ2Q0N9j88J85r7j48P9K7K24J1r5j17L5K2jr9L10l39M5K2m1l0J63J1
$$ -11 -106 -104 -92 -12 47 -141 44 -53 -201 -122 -95 129 140 45 -72 -37 -15 -16 -115 195 -144 -99 -77 -118 -148 15 26
4729B6l8L8n4L0kr6o2J52J45q8j32K2J6J83k17J15q4O4k11K76P9k48JJ46mK10
$$ 26 -12 26 -28 2 0 -96 -158 -6 139 51 -81 -59 -43 140 -77 38 -46 18 -193 83 162 -86 -85 61 57 267
4755B67j42k01k42J40K14o8K28j47j05K7J63k55k9J46P6j84l8J39p5K62%k22J0
$$ 267 125 -76 -318 -178 36 -32 196 49 -56 -29 134 -121 -150 -4 72 -112 -150 -11 -86 176 176 -46 -36
4778c6K5J23k7j81n7O3m4P1N5o0j45M03m28M27l07Q3j2K2O5k19K51O8l87J82L05
$$ -36 -11 112 85 -96 -153 -90 -134 -63 -8 -68 -213 190 -238 189 -118 -35 -47 -25 40 -179 72 140 -247 -65 240
4803B40j67j68J15p2M5j81K65j13k6J29Q3j93N5l5O8m9K15j84R3k0j03Nr5O1j6
$$ 240 73 -95 20 -52 -7 -188 77 -36 -62 67 150 -43 12 -23 45 -4 211 27 120 100 -3 2 -93 -32 -48
4828d8mj01N7K62Jj18j24K9j53K75Rj41N7k1M5j25k04J94K87O9l34K46k20J31
$$ -48 -52 -153 -96 166 167 49 -75 -46 -199 76 85 -56 1 -20 25 -100 -304 -110 177 246 -88 158 -62 69
4852F9j92Q2L3p4K06l14K37j04J40k04J9K14j40O9N7n7L6j11K4J47j28k1j87L55
$$ 69 -123 -41 -8 -82 124 -190 47 -57 83 -121 -102 112 -28 41 98 41 77 -34 -10 137 9 -12 -199 156
4876A56l4j01O1k7q7P1p0m0j2O3K77k9k89J15n8N4n2n8J06r3Q2n8k01J60J75k25
$$ 156 122 21 82 55 -32 39 -31 -71 -83 -20 257 228 -61 54 -4 50 -2 -60 46 -47 35 -23 -224 -64 111 -114
4902a14J12n9j66K37r9J4P5J06M7k15Q3r3K31j04J53j96k2j3k8J16O1j22oJ30
$$ -114 -2 -61 -227 10 -89 -75 0 106 153 -62 21 -72 159 55 208 12 -10 -23 -51 65 126 4 -2 128
4926A28l3k44P0j0J30j36k33L50kk40K91NP3k05J53j51P9j4O6j96J87L5j65J39
$$ 128 95 -149 -79 -89 41 -95 -328 22 20 -220 71 76 149 -56 97 -54 25 11 77 -119 68 103 -62 77
4950G7r3q1K15j51J30n1j1MkK50m01J63RJ7k9J77j14r6k1m5M0o6n9J40R1k2O7
$$ 77 -16 -97 118 -33 97 46 35 39 37 287 -114 49 58 75 46 223 109 13 -8 -53 -13 -79 -138 2 93 71 138
4977A38q2j90K10j76J09j38J07q4K44K7j45J5P9j95L13k0k68JM6J79j30J90j71
$$ 138 56 -134 76 -100 9 -129 -22 -106 138 165 20 35 114 -81 232 212 -56 -55 -9 170 40 230 59
5000E9j27N9J00j36J96l62K30j62K6J43JqJ83k07J31j36j35K55k05K09k18K26
$$ 59 -68 -9 91 -45 151 -211 19 -143 -117 26 27 19 202 -5 126 -10 -145 110 -95 114 -104 122
5022A22j41L0j3j16J83J38k81J52r6K72j32N2n3j51KJ61n0j72J85j01o7M0rJ46
$$ 122 -19 11 -2 -118 65 203 -78 74 -22 250 118 170 117 -34 -32 129 79 -93 92 -9 -76 -36 -45 101
5046A01j03n8J41k6l05K08J01n7k23Q4q7L69l30L51j30J22j88j4q6O6j05l97P83
$$ 101 -2 -60 81 55 -250 -42 59 2 -221 -137 -224 145 -185 166 36 158 -30 -44 -130 -64 -169 -566 217
5069B17k70l97J527j061MJ03k5k63k76N90m86M15n24J69J13N91p1n78o1N40o48
$$ 217 -53 -450 1077 16 20 123 98 -165 -441 149 -337 78 -446 -277 -164 427 356 -222 -283 257 -391
5090c91Q40n29m5N18n98N52k39p9k56O0L04l3O6j29R9r7n7R0Mq7J39l7k79K58
$$ -391 449 -80 -125 393 -205 347 108 29 -227 -167 137 104 170 41 140 43 -14 76 80 -7 132 95 -184 74
5114G4j42K2R3pj08J38J50k64m9J58k46J0K88k90J21K84k67j21K28K17k74k2N
$$ 74 -68 -46 47 40 -68 70 220 -44 -93 65 -181 -171 117 -173 -52 232 -35 -156 72 289 15 -7 -2
5137bN1J09k66K18j76K2J76r2o4qN2o9J26J37k17k12J87Op9J80r1j34K10J7k8
$$ -2 49 158 -108 110 -66 -44 132 40 -24 -32 20 -49 77 214 -3 -215 -28 -22 -101 79 -12 -146 64 81 53
5162E3k49M58k39r0j9J97j44J5Q7q6j1J4N3k42J43o7N3J26l7n8M3j86J25m5k9
$$ 53 -196 262 23 -67 -86 111 -33 -18 69 -17 -28 -14 39 -203 -60 -127 -74 52 15 -43 0 -186 -61 -106 -135
5187a35M0J41l3K03j94j15J07O2K6l00K31l5JJ09k11J5j04Q3J58J0N1l16K14M2
$$ -135 -95 46 13 216 22 -93 14 76 102 -198 33 -2 -1 108 -103 -88 -192 -109 49 59 110 -206 8 50
5211E0j1J2o6K4J6Kk37K52P6k65N14k33j92q3J97k79J29J33q3j06J08L1P8l8o3
$$ 50 39 51 -15 9 25 27 -210 42 118 -147 367 134 -58 -141 56 -223 -94 39 -44 -150 -42 -11 67 29 -34
5236c4k0K95j26ml64N8K18N3L9j54K3k74L07J16r1Pq0J63j39R5k38K24L9j4k25
$$ -34 -54 241 115 111 -253 -195 23 76 115 -39 -16 -290 17 133 42 49 -31 132 -7 88 -150 74 113 99 -126
5261a26R2L0N3j43j04K68r9P7r6o1J07n9m7K47p9k20J75j39L02l50J00L0k00M27
$$ -126 -34 -4 49 -94 -198 70 -29 48 -48 -109 -2 -61 -108 139 60 -160 15 -124 178 -172 -72 -42 -242 185
5285A85j13p3j46J12J94l24L55k04k17L50p5j61J78pJ66k65J29k54K99j78j51
$$ 185 72 -1 -147 -35 159 -165 190 -14 -231 119 44 -117 61 54 220 -45 84 -170 129 -49 -200
5306b00K71nl15K77o6mm3R5J17j8l5n4J3k69J88J5L34k02j48P2M2j25R7q1p6l0
$$ -200 71 66 -249 28 -38 -42 -85 10 127 109 74 20 33 -236 -48 -33 301 99 -49 23 65 -60 37 -44 -120 -150
5332a50J82J74q1k29J18n3Q4R6q8J15q7m9j80J86l5j67K1O9JJ91j77J91r0q3J09
$$ -150 32 206 125 -104 14 -39 45 141 53 168 81 32 -148 38 3 -164 -143 -74 -73 118 -59 132 42 -41 68
5357F8Q1j71J28o5M3k26J73J16j06j76l3O7R8N8r6J9K9q0N1K71n4j64J59k42J52
$$ 68 149 -22 106 41 84 -142 31 147 41 -135 -168 -101 -3 55 -41 -22 7 -73 -22 249 195 31 190 -52 100
5382A00l9j03K80k07j00p0J5MK42j27L7j59O8J9K22k33n0J18J82m3k28J71j63
$$ 100 61 -42 238 31 -69 -139 -124 -120 122 -5 32 -127 -59 -40 182 -51 -101 17 199 156 -72 99 -64
5405f4J26k5k90J97P0o0q8J40R1R0m5j69Oj55K08j11N1K10k32K4Q7L9L1l97K02
$$ -64 62 37 -253 -56 14 -46 -134 6 97 187 142 -27 -21 -176 32 -79 -28 182 -50 -26 61 100 131 -266 -64
5430f4l9J04N8j76O9K4J11j18J1J36m7P8j09j06J29l1j61L5P3L9j79J33j28K89
$$ -64 -103 1 59 -117 -48 -24 87 -31 -20 116 69 147 38 -68 61 30 -131 -96 -23 16 -163 -30 -158 131
5454A31j91J33N4l20J46R0J07m10M63k14O8j0K4K81l60O9J24l04J60k10J04l6
$$ 131 -60 73 127 -193 -47 43 150 -260 203 -11 57 47 71 352 -8 61 185 -119 41 -169 -65 -101
5476a01K27j31L3j53J89k33L11k82L11j63K2M8k20J43j7J02k05N4j18J59k54R6
$$ -101 126 -5 28 -125 64 -169 142 -140 171 8 30 78 -142 1 -16 86 -119 -65 -183 -24 -278 -182
5498a82L52k80O5J43j04K7J14j49L8O4k02j18L24k98L20j40R7k25K19k04L13m5
$$ -182 170 -110 -45 98 -6 21 135 -14 24 88 -114 -232 92 -206 114 -26 71 -154 65 -139 174 129
5520A29r8o9m3K62l43L42k44R8j90J43O0p9r9M5R7m3J71qK2j11l7R8q1k44L13
$$ 129 31 -38 -81 181 -162 180 -64 34 -156 -13 47 -32 -131 -86 11 -32 139 131 153 42 5 103 22 -222 91
5545I1J02l19J57RJ18j30N0O4l18J81p7K96m64L64J01m20L69l8p0L1L9m32L82
$$ 91 193 -126 31 40 158 28 78 142 -176 5 -72 224 -240 124 225 -195 174 136 66 97 136 -296 86
5568H6l2j10J1J89n9j02R8J59l48K10P0k36J35l7q0m4R9Q8k24Q5J58j31k4K26
$$ 86 54 -56 -45 144 85 -17 81 240 -108 102 172 -64 71 34 -46 -90 9 97 -127 -42 116 -15 -39 187
5592A87l81J34K22k39J30p2q8k5l9J85k7qN3j6P1J14j67J30l87O5J84j63Q6j6
$$ 187 -194 -60 162 -77 53 -19 -107 -132 -171 14 -13 -21 32 16 87 201 34 164 -223 -158 26 -137 -51 -67
5616f7k19K59J06k4k30J11N1j29J76o2O1n8J44O9k98K20P3M7j10P3l48K91j58
$$ -67 -286 -27 79 55 -175 -64 -13 -142 34 -28 33 -25 119 188 -110 110 183 230 120 193 -155 136 -22
5639b2J75j27j34L01k48K61k21J98l80J98j7R8k07J22J93R2l55J61k65J73O9p1
$$ -22 153 26 -108 193 -55 206 -15 183 -197 1 -16 82 -125 -3 190 282 -73 88 -177 -4 65 -6
5661fQ5J6k3j90J60j14M3j02J30j29L78k40N1L7r5rK4R3p8R5m4l9j73J25m2k6
$$ -6 79 95 72 -118 42 -72 -29 -131 -1 -130 248 8 59 96 1 -8 16 109 31 126 82 43 -130 -5 -47 -73
5687g3N6J69p4j5J77j45O1j17j69o7K05k0l5L4J39j21j08K02l2j44J06Q9l09L78
$$ -73 -17 152 78 63 240 95 156 39 -130 -197 8 -12 -47 -13 126 5 -103 99 67 -77 29 118 -191 187
5711A87j64O1k54j53L94j94K32m8j86O7n5K69n8j08r1K24o5k57N0J59M8j59J19
$$ 187 23 84 -170 -323 71 -123 109 61 -125 -58 -113 156 98 -10 -101 123 58 -199 -149 10 58 -101 18
5734A8M5q7j69M76k05K0J39j96j07M3l4K26j49MJ70k41k9P3l25L76R1j86K2K04
$$ 18 63 -24 -193 283 78 98 237 41 -66 -23 -57 169 20 24 194 -47 -76 -3 -328 48 139 -47 -25 179
5758A79o1k57K64j50o8LO0L4K7O2l17K78l65K44N8O2k4j21K25j81O8rj40R2J5
$$ 179 118 -139 125 -25 -93 -90 -30 4 31 93 -224 54 -311 -67 -9 53 29 -92 133 -48 20 11 -129 -37 -22
5783b2M5j36J09k6M7q0K97l81K27n8P9nj13J49k90J35q9K66r5j54J44jr5P3k37
$$ -22 23 -113 -4 -30 17 -63 234 -147 80 22 101 96 -17 132 -158 -23 -112 154 59 -95 49 48 -47 26 -211
5808b11K03j23P0R7J42m08J13P1J08j7O7mj94J54k09j9J29R8j2j3lj65K67j4r1
$$ -211 -8 -131 -61 36 178 -230 -117 -46 62 45 112 108 -86 68 -141 -160 -31 67 55 42 39 -126 141 127 36
5833C6l9k3K49j5k51R0R1j72m6K11j85J59o2p5K2K54o1r0j69J57o7q5K8K4j35
$$ 36 -3 -26 223 208 -43 47 138 -34 -80 131 -54 105 43 -32 -10 244 183 93 -76 81 14 -71 -43 -19 -154
5858a54M1J46j14J17r0J89k68L0P4N0j87J97j97N3J41m1J7j69L4N0K13j35K02
$$ -154 -113 33 -81 36 -54 135 -133 -103 -29 21 -166 31 -166 -113 28 -13 4 -165 -131 -81 132 -3 199
5881A99j16j41N4K15k49R3k61K29J72l43L04k17r6K05N4o4j35oO4QN7n6J11m3
$$ 199 83 -58 -4 211 -38 55 -206 23 195 -148 156 -61 -157 48 102 38 -97 -103 -39 -31 26 -30 81 38
5905C8k26J11K4J49j11rJ93k1n7L5n3K35l89NJ52k78K53j20j46J57L88k63j44
$$ 38 -188 -77 -53 96 -15 -24 169 148 91 126 73 308 -81 -76 76 -202 51 -69 -215 -58 330 67 -77
5928g7J50rj52J93L1o8l1J69l34J71j14K6j41M01k00k1N1k4j10J17P4j69K36j78
$$ -77 73 64 -88 105 136 68 37 206 -128 43 -71 -45 -186 215 15 -6 45 21 -89 28 102 -67 169 -9
5952ij80J24K37j73m0J90m1k3j0j03j7j57J23l3Q7J39q7Pj71J68j45K2j9O3Q3
$$ -9 -189 -65 172 -1 -41 149 108 85 75 -28 -45 -202 -79 -112 -25 114 27 34 -137 31 -114 -92 -111 -48 35
5977C5O3O3l42K45L4j73J81j01l08K79J25j25pN2j58K24nL5r6q3j55K27j1J08
$$ 35 98 161 -181 64 98 -75 106 5 -303 -24 101 -24 -31 21 -137 87 82 117 21 -62 -217 10 -1 107
6001A07n0PpK05l12M9J09n3l75L78R7k37r5K24N5j77L24l49J53K8j80R7l8L0M7
$$ 107 57 64 57 262 -50 -1 108 55 -320 58 155 -82 -177 47 102 -75 249 -100 53 81 -99 -2 -40 -10 37
6026C7M7j8k17N8K2l2J59Lp0R6n3k12nK95k65J38N2k24L10n11N20k02O3K27l1
$$ 37 84 66 -151 -93 -71 -103 56 59 -11 85 32 -180 -185 110 -155 -17 35 -189 121 -390 130 -72 -9 218 187
6051A87k50J16RJ0l1j07J87j03jj58J67j52K63o0O5r9j49J65k00J06O1L8j34J24
$$ 187 -63 53 62 72 41 -66 121 18 17 -141 26 -126 137 77 142 43 -106 59 -141 -35 26 64 -70 54
6075E4j01q6N8P4o4N5J3j49J44K2r0L43k33nj1J22M7k89P2J04j18qL3j0j81J80
$$ 54 -47 -133 -75 -1 -65 -10 3 -146 -2 20 -70 273 40 35 24 146 193 -96 -24 80 -38 -46 -13 -23 -204 -24
6101b4n3n0J17J50j68m4J32j81J91K7p2n8p2j97K62q8j06pK86p0J99k24J45j15
$$ -24 -77 -127 -10 140 -28 -72 60 -121 70 97 25 -33 -105 -302 -40 -128 -234 -241 45 -25 174 -50 95 -20
6125b0L6M8o8K1q3J69j72Q3J6j31M6L4K36k79o3O2J69N9k28K20k05J96j26J55
$$ -20 16 64 -4 17 -66 103 -69 14 30 -101 -55 -21 215 -64 -127 -65 104 163 -65 155 -50 146 20 175
6149A75r4Jj8Q6j25J60k17L7K9Q1l4j12J65j25j34j0J76pPn1J09l27J89J4J10
$$ 175 81 82 64 150 25 185 -32 5 34 115 81 -31 134 9 -125 -135 41 34 41 -10 99 -228 -39 -25 85
6174H5l15K54n8J42k96L00k32J56o9Jn3K14j23k26M18l61R2J62j82j47J77J89
$$ 85 -230 24 -34 108 -188 112 -120 36 -33 -32 -85 129 6 -220 198 -163 -71 91 -91 -238 -61 128
6196A28o3k18K25j59M7j09L14l64J29J93n2m0j34L12k32K0L6L7j78J35P8j49K70
$$ 128 65 -153 72 -87 -40 -149 165 -199 -70 123 71 31 -103 209 -23 -3 33 70 -108 27 105 -44 226
6219B26J09m94K4J55n6Q1O4J23l20P3oJ49j90j4m7L05k35k8q0J59o4N9O0K4J83
$$ 226 335 -159 -135 20 -36 45 109 232 -88 -15 -21 128 -62 -76 -123 182 -53 -81 -161 -2 -66 -7 53 77 260
6244B60k29n0J04K1p3k29K69j56nr8J15K17j43M0J43k41J09Q5j89J01O8o9M2p4
$$ 260 31 -19 85 106 33 -196 73 -83 -88 -186 -71 146 3 43 186 -55 54 139 -50 51 119 50 92 18
6268A8j3m8J50L1N3l02K06m1p7j1r0K21j48j57K03Qj2rj76O2J38k55J43k2Q1o3
$$ 18 5 -43 107 138 191 -111 95 54 -23 -34 -124 97 -51 -208 -5 3 -9 -18 -194 -132 6 -249 -106 -128 -47 -110
6294a10K70j55j9J58j42%M1k5Jk30P9L57j76m3J37m54J55R0j08K3K18j68j17J27
$$ -110 160 5 -14 144 2 2 43 18 19 -211 -132 225 49 6 143 -311 -156 -66 -174 -151 67 -101 -218 -91
6318i1M6j90L19j4k99J31Q9J16%L7j02R7k54J20q6Q2Q8M5j53K7o5k13M16j52j31
$$ -91 -45 -235 84 70 -229 -98 -9 107 107 144 42 139 -115 5 -81 1 89 134 -19 8 -57 -270 146 -6 -137
6343a37K65j20K20k43l5O5J49j48k38J13m4J74j32J45o4K5M0k1nj26J35J26k44
$$ -137 128 8 228 -15 -50 15 164 16 -222 -109 -153 21 -111 34 -30 -5 35 14 9 -117 18 144 -100
6366a00J04L6j63J95j54J0Q7K68j81j98J77q2RK58k29k49K33j03k4J92l63J33
$$ -100 4 40 -123 72 -82 -72 15 283 102 -96 81 -1 8 266 37 -212 21 -82 -106 86 -277 -144
6388a44K13j31q9J07P7J32j39p2p0K19j70O6j88J4J96L2j09m0K01K3m51L78j4
$$ -144 69 -62 -151 -44 33 165 26 -46 -116 103 -67 -1 -189 -175 21 53 -56 -96 105 128 -323 55 41
6411D1j22J56P8k31J20J21j06j41M03k91j62J85J4R5j56J24j84pP0j1R7k54R0
$$ 41 -81 75 153 -78 42 163 57 -84 319 28 -134 51 65 160 4 128 -56 -63 7 -4 93 -161 -71
6434g1N6k6N0m3l53M54L0j05L8p2J43J17k44L5J02m35K4L23l9K5l2L2j39J94J41
$$ -71 -15 -41 9 -34 -387 67 97 -8 30 -42 101 218 -26 9 111 -324 -300 23 -16 9 -23 9 -130 64 205
6459B05m5l67J03lJ50o1P9j09k3J17J62j23k79L3K70p9k83JM41l87K22j2p7J43
$$ 205 160 -207 -104 -107 43 -18 61 -48 -71 46 208 85 -194 -161 109 30 -253 -252 189 -198 24 12 -65 78
6483G8p6J09j10J18k52L9K31m6oj27K1j75J84j57o8Q2O1%k0j8J98j7M8j12J19
$$ 78 2 111 1 119 -133 -94 137 91 85 -42 -21 -196 -12 -169 -237 -155 -94 -94 -114 -132 66 49 97 -15 104
6508A04L9j16k81M60P1m80J79J47j59J0l5J66j35K51j24p3m3n8j19L29j31o0O7
$$ 104 143 27 -254 206 277 -203 -24 123 -36 -26 -61 105 -30 221 97 24 -19 -77 -196 133 2 -58 9
6531Iq8K12q5k8k32K47J0PpJ44k96N7K24l22L59j02j74K62k66j31K02J57M1j62
$$ 9 -79 133 48 20 -212 35 45 52 45 189 -107 -50 174 -148 211 109 -65 197 -69 -200 2 159 200 38
6555C8Q2j12k23L08k50J60O3Pk04J33L1j05K45m19k6K55M6J17o7J16j53r4O5K37
$$ 38 120 8 -215 93 -157 3 66 73 -131 2 33 -72 173 -246 -272 -17 29 146 79 195 42 -52 13 250
6579B50k66j8P6k27N3J80N3k89J26oK3K91l54R7J7nJ25oj74K24l87J59K00k62
$$ 250 -16 -34 42 -185 -132 48 101 -188 -62 -68 -45 246 -108 -11 6 1 126 120 -54 170 -217 -58 142 -120
6603a20J75LM5j98J75j47o1K51j92K38Jk65m4l0J58K63l60R9J57K8O5R9l13O0
$$ -120 55 58 103 -95 80 -67 -128 123 -69 169 170 -95 -139 -169 -11 252 -108 -9 148 176 241 340 27 87
6627H7m5j74K20j14n8k0K1K04k2j12nn1M5J83k63O3J22k70L06J44l04p0L0O2J6
$$ 87 42 -132 88 -26 -84 -104 -83 121 99 -13 -18 -69 -24 159 -104 -41 81 -189 117 261 -43 -113 -83 -21 -5
6652eR8K1M5j20j07PK2J18l7m4j17J75o4M1J7J30k21K13j74J99j08P6k86K33O3
$$ -5 93 114 159 39 -68 -61 -39 79 42 -2 -119 56 -8 33 50 180 -41 172 -2 197 89 165 -121 112 175
6677A75k49K18k58J65Kq3K14k67j13L09j87J90k49J18R0j91J69Ko2K02l24j37
$$ 175 -74 144 -114 51 53 -30 184 -83 -196 113 -74 116 -133 -15 75 -116 53 55 -7 195 -129 -266
6699b66J9J52l7K05j5j9k56K55o6J0j17q9Q1K17o7o4J75j90j03J31L0j23J81n4
$$ -266 -247 -95 -132 73 58 39 -217 38 -28 -18 -135 -224 -143 74 7 -57 118 -72 -175 -44 -14 -137 44 -10
6723a0J10N0j6j69K1J12K8K6j19J31j87j96K79j63N0n2L4L7k8j36J59j69R9L17
$$ -10 100 150 134 -35 -14 98 126 152 33 164 -23 -219 60 -103 -53 -105 -71 -34 -62 -198 -39 -208 -109 208
6747B08j29j41o3J74l7n3j56Q0J03O7j90J06K4J19K0n7M0l36K39P5l62K58O7M3
$$ 208 79 -62 -125 49 12 -41 -197 -117 -14 53 -137 -31 -7 112 132 75 115 -221 18 93 -269 -11 56 99
6771I9lK18j60k15J46k20J95J30k75P6j3l7P7j06J31Lp6k23L72M9l49J79j50L74
$$ 99 96 314 154 -61 85 -135 60 190 -85 -9 -22 -59 18 -88 43 46 -30 -253 119 168 -181 -2 -152 222
6795B22k65Q7j97J57j06K04M0j07J36j27K8j87J79r9rK47k34j27L39o0l7j40M6
$$ 222 -43 44 -153 4 -102 102 142 35 171 44 72 -115 64 -35 -44 203 -31 -158 181 121 84 -56 -10
6818a0K8J9j0J79j07k00L9m1Q7J23o1k7o9O4m2M0p5M3K18j47j7j22J69R8k67J9
$$ -10 18 37 27 206 99 -101 -62 -103 -16 107 46 19 -50 14 -28 12 -63 -20 198 51 34 -88 81 179 -88 -69
6844f9K66q7k92J40J35Jj3mn5j68J81Q3k15J90j76Nj00L18j29l1R3j61K08k9n7
$$ -69 197 110 -182 -42 93 94 81 77 22 -146 35 118 -97 93 -83 -78 -178 140 11 -20 73 -88 120 91 34
6869C4jp0J56J3o4j85K22R6j59N2k23J11P5Nr6m4K04k48J77j36j72M27j85J99
$$ 34 33 -37 119 132 68 -117 105 201 42 94 -129 -18 57 62 -34 -78 126 -122 55 -81 -253 174 -11 188
6893A88j80M0Ok64J73n1O6J67k3j40J57j05j08J13k48L61k96K31j30K74k94K7
$$ 188 8 48 54 -210 -37 -88 -22 145 122 -18 139 34 -74 39 -209 152 -144 87 -43 231 -63 -36
6915c6q2K20k02P2M8r7O7J15m2M2j46Q6j07j7J81j12N6j05r7J23j85J57J38m06
$$ -36 -118 102 -100 -28 20 -77 -10 105 63 105 -41 45 -62 -79 102 -10 46 -59 -156 -33 -218 -61 77 -329
6939c29L59K07l56J90j20m2K89k57J14o3K57l91K85N9k24o4K40k9o4m8J28j04
$$ -329 30 237 -119 71 -49 -91 198 -59 55 -8 249 -142 143 202 -22 -86 154 125 61 13 141 37
6961C7j00k4Q8k4J9j35L8J35J17o8q0J81L2j83J50m3k1p6j04J25k4q7J26o3J50
$$ 37 -63 -87 1 -23 -4 -139 -101 34 151 83 3 184 216 33 183 140 119 43 -61 64 40 -47 79 16 166
6986A66n0Po6n9J40j10j11J83k20K5P5J66k33j72J68P9J32k17J43j07J3K35j53
$$ 166 116 123 57 -2 138 28 -83 100 -120 -95 -20 146 -87 -259 -91 -12 120 -97 46 -61 -48 187 34
7009C4Q6j52j28N06l72P2M3l75J99L26j38q4j0L2O4J6N5k1k37Q9J99j58j34J01
$$ 34 120 -32 -160 346 -26 46 89 -286 -87 239 101 17 7 39 103 119 174 153 -84 5 204 46 -88 13
7033A3J35k36O6N2j12j50K57J32m4l3k6L5k08J55k7q5R3r3J23Nj78O0J4k53L19
$$ 13 148 -88 -22 30 -82 -232 25 157 113 80 54 89 -119 36 9 -76 17 -76 47 52 -126 -66 -52 -305 14
7058A4j23J46k9O1N2o2p0N5j6j33J24%j47J10K64k91l1J98P4j83ON9q8R5J18j48
$$ 14 -109 37 8 69 121 59 -11 44 28 -105 19 19 -128 -18 246 -45 -76 122 196 13 19 78 -10 85 203 55
7084E5R2j94R7J23k46J62N9j56O2p3q9j1K80j53J55k24j49R9J52P6j73J00Q2m4
$$ 55 147 -47 50 173 -73 89 148 -8 54 -19 -108 -119 161 8 163 -61 -210 -111 41 117 -56 44 126 82
7108H2k55J10Po0P6L1M7K7l2j83K23m3L0kK0l5M5j72Q5R5j84K14r7r2K41k17L30
$$ 82 -173 -63 -56 -116 -40 -9 38 65 33 -150 73 30 60 58 78 43 88 -84 1 96 -88 126 29 -63 178 -39 291
7135B91j76j17j13J60J45l9r6k53L64l93O2jJ34j8J21pq3m7j1L7L4J87j17L1l53
$$ 291 115 -2 -115 45 190 151 55 -198 166 -227 -165 -166 -32 -50 71 64 -19 -66 -77 -40 -6 181 64 95 -258
7160b58L13j45J41k12J44J17o1N7k09R3J00j78L5j65L32R8l24J13k49J07n7K55
$$ -258 55 -90 51 -161 -17 100 39 96 -113 -20 80 -98 -63 -228 104 202 -122 -9 -258 -151 -208 47
7182D7j9K09k13j46N2O7j0L3q6J00mJ24N4k04o1J47K4k29Q1j12N1mJ41J16k35
$$ 47 28 237 24 -122 -70 -3 -13 20 -66 34 30 154 208 4 -57 90 114 -115 -34 -146 -95 -99 42 158 -77
7207g7J61m6l3J91k87K2M9J79k96L7J55K9j93J96j59J55j23O3Lj49J30p2J59j56
$$ -77 84 38 5 196 -91 -69 -20 159 -137 -100 55 84 -109 87 -72 83 -40 23 26 -123 7 -65 94 -62
7231f2p6P9K35j69n1P4k31L4R4K91k92k46M91o5j08l4J41k22J47j11J5R1j13K10
$$ -62 -138 -59 176 7 -44 30 -201 -167 -73 218 -74 -320 171 106 -2 -36 105 -117 30 -81 -66 25 -88 122
7255A22l06J68q0j8L4R3r1L02j77q1j17L41l17J34P9q4O8koR4r1m21L71m2L8j55
$$ 122 -184 -16 -96 -114 -80 13 -78 224 47 -34 -151 190 -127 7 86 2 70 68 62 156 65 -356 15 -27 11 -144
7281a44L39j68k84K38pJ72l09J86J7p0J84k20L0P4R2j06j82m9J81J38l32K23J19
$$ -144 195 27 -257 -19 -26 146 -163 23 40 -30 154 -66 -36 38 130 24 -158 -207 -26 112 -220 3 122
7304A22r5m1J44M9l44J55O4L8N5j83P9r5P5K6j20O0m1J09j09L06l44R2%j60J29
$$ 122 27 -14 130 179 -165 -10 54 92 147 -36 43 -52 23 49 -71 -11 -52 57 -52 254 -90 2 2 -158 -29
7329b9R3j32K2J40L6n0j55j48J82J29j11J29m6o0N5j18n4k21L39J9P3q9Q7q0O7
$$ -29 64 -68 -46 94 130 80 -75 -223 -41 88 -23 106 60 0 55 -63 -117 -338 1 20 93 4 91 11 78
7354G8j92J4P1J66jm11J83J50Pj23J8j29J03J82j46o5J90j02q3O3K1m4k89L02
$$ 78 -114 -100 -29 137 136 -275 -92 58 65 -58 -40 -169 -66 116 -30 -95 95 -7 -90 -27 -6 -50 -339 -37
7378c7Q5j73J79p6n3J07j68J86J33l29K11J48l01j09M17k03M2l0M5k42J54R6j4
$$ -37 48 -125 54 -22 -75 32 -136 50 183 -146 65 213 -88 -197 220 17 59 29 74 -168 -14 82 68
7401F8M4j19Q1k43L00k4k34P0kK32p4k75M32k39j26J11j09k9K06J52l67L8N0J82
$$ 68 112 -7 74 -169 131 107 -127 -57 -59 173 99 -176 256 17 -109 2 -107 -136 70 222 -145 -107 -57 125
7425A25j81j6j43K59l8k3j2n8J44J36j47M0J44k47L8Q2Qr8K8k73J90J8Q2J29k68
$$ 125 -56 -72 -215 44 6 -17 -29 -87 57 193 46 86 230 -17 21 103 111 13 41 -232 -42 -24 58 187 -81
7450h1j5j52K86j05J38N6j05K4k48J66J51k78k3k4K34r5j07L16l50J63K31j87
$$ -81 -96 -248 38 -67 71 127 22 46 -202 -36 115 -163 -186 -210 24 -71 -178 138 -212 -49 182 -5
7472ej7M6k04Q4J74j30J96l5k74J01J94N2j88k16K55Kp2M2O6r5k1M4J56k99J01
$$ -5 -22 24 -180 -96 78 -52 144 109 -165 -64 130 182 -6 -222 33 35 -37 5 71 -24 -45 -1 155 -144 -43
7497d3j11J73r2k8l0P5n9K30k33%K61q3J4j61o8M59m57J99K06k12j2l6J74j28
$$ -43 -154 19 -73 -101 -131 -56 -115 115 -118 -118 143 60 74 -87 -155 304 -153 46 252 40 28 -8 166 38
7521C8L20n54K83K48k74j15N3k0R3l8Q5J36m20M5L0j86M28P7l65K93j26M1p0N3
$$ 38 358 -196 87 335 61 -54 -1 -21 72 34 119 255 -165 -120 -90 -276 152 229 -136 157 31 72 2 55
7545E5o3R5j13l1J25j10J48j44K51j66Q0j29Q3J26k28L00j36k34P3J77k56j8K47
$$ 55 -8 87 -26 -57 68 -42 106 -38 213 47 127 -2 81 207 -21 279 143 -91 -18 159 -97 -115 132
7568A32j77J0J82k88M0K52j83k28J66J81n7l26M11r5K16k75l8q8L54m21K75j24
$$ 132 -45 -35 147 -141 -101 151 -32 -260 -94 87 30 -296 115 20 236 -39 -77 -165 189 -232 43 -81
7590h1J40k46K04m0P4J49j50k94K03J49k09J24j62L90j30j01jn0Q8M4k55j2K15
$$ -81 59 -187 17 -23 51 200 50 -244 -41 108 -101 23 -139 251 121 20 19 -31 57 101 -154 -166 49
7613D9OJ73n20J43Q4L9J23N9l43K41j61K67o0L2j74P0%l2j3q0j09J29J14j15p7
$$ 49 55 228 -292 -149 -65 -26 97 156 -187 54 -107 160 100 132 -42 28 28 -4 -17 -97 -206 -77 37 -78 -155
7638a55J55k1L4J36k01L2j9R0O9k02Q5L6p9J61k68L13q3R5l95L36p7j56J12K4
$$ -155 0 -21 13 149 -52 -20 -39 51 120 -82 3 39 -40 121 -147 166 83 178 -217 119 42 -114 -2 22
7662B2L4j11K82n7o7j63j6L59j81j86o5J29j08K49p6k31J1J20J00m6N0j99J95
$$ 22 56 -55 227 170 103 -60 -76 283 102 -84 -149 -20 -128 121 45 -186 -175 -55 45 -1 49 -150 45
7685D5o6Q2l9j46P2J05q5lL0Q5O5k4k24o4L33L6p9k70J10p4K84k09K45m14m3J25
$$ 45 -21 61 22 -124 -52 53 -32 -35 -5 80 145 121 -103 -167 166 202 123 -147 -37 -111 173 -36 209 -205 -248 -123
7711a23J28j3L7j69J91j21P1L5k45K28L5%k29J96P9l36L10p5J44j6k40l4j09L32
$$ -123 5 -8 29 -140 51 -70 1 36 -209 19 54 54 -175 21 100 -236 74 -1 143 127 -113 -147 -256 76
7735G6r2j23O6P0k6P3j33R6p0j19K38Pj58J39JK4o5o4J27p5K12k54J9j62L15j47
$$ 76 -16 -139 -73 -3 -29 44 -89 7 -63 -182 56 63 -95 44 45 69 4 -60 67 -8 204 -50 -31 -193 122 -25
7761b5M8l1OJ37j36j17J87k8j2Ok98K96k38J09J01NJ47k17lJ34J44k99P2q2J08
$$ -25 23 -8 -2 135 -1 -118 69 41 29 35 -263 33 -205 -96 5 10 157 -60 -63 71 215 -84 -12 -94 14
7786A4J52j32M4k29J64J46j45rq7J41o3J48j27J7n9L5L4j6j34J62k35K21l5M4
$$ 14 166 34 78 -151 13 159 14 5 -82 59 -4 144 17 34 -25 10 44 28 -106 56 -179 42 7 51
7810E1M4n4j27J27p5J65j60j33J17Q9J6k1m6j9N1M7k00K22K5j01%P2Rk17K08j6
$$ 51 95 41 -86 41 -34 131 -29 -162 -45 44 60 39 -7 -26 25 72 -128 94 119 18 18 90 99 -118 90 74
7836G4j39K89l33J59k30K08r0q0K91o1l17K89j53N5R3j61L14k48o4J19%K3j39
$$ 74 -65 224 -109 50 -180 28 -62 -142 149 88 -229 60 -93 -38 55 -106 208 -40 -104 15 15 38 -101
7859a01J32j6k1J95k24N5j26J05j18J02P5j34M6L0j6o1J4m7J10m9Lo9J74l3m4
$$ -101 31 15 -6 189 -35 20 -106 -1 -119 -17 58 -76 -30 0 -16 -77 -63 -110 0 -49 -46 -115 59 26 -18
7884a8R5Pj84L6J22j63N5j05R3J23j26k2J85L8o2j26P2k45L64j29l00K25R8o3
$$ -18 77 84 -100 -64 58 -105 -50 -155 -62 61 -65 -87 98 136 74 -52 20 -225 139 10 -290 -65 33 -30
7908c0MK0j17O3J41j81M6j41J60M1l3O6p2Q3j49Q7J38j50j25J80q6j00J71j54
$$ -30 -26 -6 -123 -60 81 -100 -54 -195 -35 6 -27 39 -33 50 -99 -12 126 -24 -149 31 -55 -155 16 -138
7932a38J84j70q8R4K0K12j27j4Lj28K33r3j2j3N7j9j34J92j65M47l16L0l7j75
$$ -138 46 -124 -212 -118 -98 114 -13 -27 -24 -152 81 -12 -24 -37 20 1 -133 59 -106 341 25 55 18 -157
7956a57K28j96L4L9j5K57k16N8o8mL5j00Qj4L4Q3l06K87j2q7J33O9k38L64j49
$$ -157 71 -125 -91 -52 -67 190 -26 32 -36 -40 -5 -105 -97 -111 -77 6 -300 -13 -25 -112 21 90 -148 216 67
7981F7J23k14K10l38L47lj64k16J54J80j28j9P1j46R4J36l88K69Q0O6l4k4k27
$$ 67 190 -24 186 -152 195 192 28 -188 -34 146 18 -1 70 -76 18 154 -234 35 115 181 147 123 -104
8004a04J64j59j53K27L9K03j49j48J30r7Q1n1k19K82J00n7q3M3n1K64k10r9P7
$$ -104 60 -99 -252 -25 14 217 68 -80 50 -47 34 -17 -236 46 146 89 6 49 -2 262 52 -47 30
8027C0o9J17j50P5k44K90m0l40K72K1K01k40K26j37o7J33R5j46mp7k89J13M68
$$ 30 -39 78 -72 3 -241 49 9 -331 -59 -38 163 -77 149 12 -55 78 173 27 23 -54 -343 -230 238
8050B38j13m9k14K22P6j50K30k36K2j45J67J34k15o5k6J6J65L6M3k4l2j06j41
$$ 238 125 76 -138 84 160 10 240 4 26 -119 48 182 -33 -98 -124 -108 57 93 136 112 80 -26 -167
8073a67J72K85k03k63k2J65J36j27n0l3K06m4lj76R5J00J07r4P6l32J45j38K86
$$ -167 5 290 87 -176 -198 -33 103 -24 -74 -107 99 55 52 -124 -29 71 178 84 160 -172 -27 -165 121
8096A21k35M6K34k16j25J22l09M00j23j55M20j84q6K07j45J19K9q0n6o6O1J31
$$ 121 -114 -68 166 -50 -175 -53 -362 38 -85 -240 180 -4 -90 117 -28 91 120 40 -16 -82 -21 110
8118A10L1j38j42k6K56j16n6N3j77J90k4J14r9o3J30j73L20j24j53J50n0L9r7
$$ 110 141 3 -139 -165 91 -25 -81 -28 -205 -15 -39 75 -24 -87 43 -130 190 66 -87 63 13 52 -45
8141d5q5O2j62K23j49J57O7m2J5J3j26J38J04o2Qk13M0r6J55J77k5j99j1r6j40
$$ -45 -130 -68 -230 -7 -156 1 68 26 41 54 -72 66 170 108 116 -97 -57 -153 2 179 154 -45 -56 -152 -292
8166b92L54j57J44k51J17J27q5L25m21K15k1%j27K66mj28k71K73j5O5k41J42J41
$$ -292 62 -95 49 -202 -85 42 -43 282 -139 76 55 55 -72 194 190 62 -209 64 49 114 -127 15 156
8189A56j83k69
$$ 156 -27 -296
8191b96
$$ Imaginary data points
##PAGE= N=2
##DATA TABLE= (X++(I..I)), XYDATA
0@%%%%%%%%%%%kJ0j6J6j6K4l2L4m2N6o5P3q8J04j22J46j69J93k24K57k91L32l78
$$ 0 0 0 0 0 0 0 0 0 0 0 0 -2 8 -8 8 -8 16 -16 18 -24 32 -33 40 -48 56 -66 80 -89 104 -120 137 -154 178 -200
34b00M26m80N40o06O79p59Q44r37J040j153J276j410J557j718J895k088K299k532
$$ -200 226 -254 286 -320 359 -400 444 -493 547 -606 670 -740 817 -901 994 -1094 1205 -1327
52a327K792l078L397l760M169m638N180n813O567p483Q628j0101J2076j4880J9208
$$ -1327 1465 -1613 1784 -1976 2193 -2445 2735 -3078 3489 -3994 4634 -5467 6609 -8271 10937
67A0937k6834M4230j58814k7961K17630q7903o2148J3432O8404M3596N2457j3399
$$ 10937 -15897 28333 -130481 -158442 59188 -28715 -90863 -77431 -9027 34569 87026 73627
79G3627m3513m622P3574J2865l5769l0896j7829K900J2434o8440n1578K8893J8060
$$ 73627 30114 25492 99066 111931 76162 45266 27437 30337 42771 -25669 -77247 -48354 -30294
92c0294l4086k3153Q578L9078K1609N417J667j3094J7508O2005J2687l1951j0628
$$ -30294 -64380 -87533 -78955 -39877 -18268 -12851 -11184 -24278 -6770 55235 67922 35971 25343
105B5343K0479K7142j0606l7555j1607j7409k1480R614n904k5546R52O346P55
$$ 25343 45822 72964 62358 24803 13196 -4213 -25693 -16079 -21983 -47529 -46577 -40231 -39476
118c9476Q15N832K6074O925k4388Q982L8739K7034ol0066n618K9308J655j7405
$$ -39476 -38661 -32829 -6755 170 -24218 -15236 23503 50537 50531 20465 14847 44155 45810 28405
132B8405j4103k3278o673J0295J851n931k0250n187K0665n467j0635J8895M983
$$ 28405 14302 -8976 -15649 -5354 -3503 -9434 -29684 -34871 -14206 -19673 -30308 -11413 -6430
145f430r604N474J6502J7543j901j0174M291o154m160J5736n982k0514n051K881
$$ -6430 -16034 -10560 5942 23485 21584 11410 15701 9547 5387 21123 15141 -5373 -10424 -7543
159g543J5558N194k6283j1997J5950J1021l642j1582M434J5468l975J483R537
$$ -7543 8015 13209 -13074 -25071 -9121 1900 -1742 -13324 -8890 6578 2603 4086 13623
172A3623j2158O11J5299j1069j7205K003J6633J0037k0820j7858J3093J2686L701
$$ 13623 1465 2076 17375 6306 -10899 -8896 7737 17774 -3046 -20904 -7811 4875 8576
185H576p824k1711K661K1241P603j102j1791j0311J4911J2755m628j1238j2143
$$ 8576 752 -20959 -18298 2943 10546 9444 -2347 -12658 2253 15008 10380 -858 -13001
198a3001P765J3522o414l055o95n045Q359L968p192r4r94M781O505r214l5J1598
$$ -13001 -5236 8286 1872 -1183 -1878 -6923 1436 5404 -1788 -1882 -2876 1905 8410 -804 -839 10759
214A0759k558l989m204l823P734q36q458k05k804L989O765r276j424O276n264
$$ 10759 8201 4212 8 -3815 3919 3083 -5375 -5580 -8384 -4395 2370 -6906 -8330 -2054 -7318
229g318K207M308j358N854n40k857O202P97J906O61j1413J531P207n103J513k696
$$ -7318 -5111 -803 -2161 3693 3153 296 6498 7295 9201 9862 -1551 -20 7187 2084 3597 901
245I01r864O527M387m537k035n443M350P054o466L249N108n995N874L742o121
$$ 901 -8963 -2436 1951 -2586 -4621 -10064 -5714 1340 -5126 -1877 3231 -2764 3110 6852 731
260G31L435j872k152O043n484l165M416k633J454k540p961P983K190q160M479
$$ 731 4166 2294 142 6185 701 -2464 1952 -681 773 -1767 -9728 -1745 445 -7715 -3236
275c236N87p39P164k527n13L214m797O050L775r558K899L253m071L183l581l733
$$ -3236 -2649 -3388 3776 1249 736 3950 -847 5203 8978 -580 2319 5572 1501 4684 1103 -2630
291b630N279n443j767L503m568K881Q49n443P533N13p327P683R94m184M368j836
$$ -2630 2649 -2794 -4561 -1058 -5626 -2745 -1896 -7339 194 707 -6620 1063 2057 -2127 2241 405
307D05J491L021n719M127J374p356N122k08n778N543k617l655O747l819j649M178
$$ 405 1896 4917 -802 3325 4699 -2657 2465 2257 -3521 2022 -595 -4250 2497 -1322 -2971 1207
323A207l273K443N26m623P601j060o498P509m82m585L447k537L51K623o104L122
$$ 1207 -2066 377 903 -3720 3881 2821 -3677 3832 3350 -1235 2212 -325 26 2649 -3455 -333
339c33J897o413N048j60n154N552k364k113O075l655l42M214l222K534Q32m195
$$ -333 1564 -4849 199 39 -5115 437 -1927 -4040 2035 -1620 -1962 2252 -970 1564 2396 -1799
355a799O518j695n313P216j957m305N095k716j432J589l955L644k94n137M763
$$ -1799 4719 3024 -2289 4927 2970 -1335 3760 1044 -388 1201 -2754 890 596 -4541 222
370B22j787l446O749l494l031O226l405k50M768k516J062j53j855O056k532m189
$$ 222 -1565 -5011 1738 -1756 -4787 1439 -1966 -2216 2552 36 1098 945 -910 5146 2614 -1575
386a575M763k466j035M661n171j790K790k821L229j038n793M490J192r61L415
$$ -1575 3188 722 -313 4348 -823 -2613 177 -2644 585 -453 -6246 -1756 -564 -1525 1890
401A890m583n08P491j598j634M95j576M895M22m219J808l108n00N824o338m414
$$ 1890 -2693 -3201 4290 2692 1058 1553 -23 4872 5294 1075 2883 -225 -725 5099 -1239 -5653
417e653L763j643J183N79n731K666L055n47K132l193J563P436l356l73L756l149
$$ -5653 -1890 -3533 -2350 -1771 -7502 -4836 -1781 -2328 -196 -3389 -1826 5610 2254 1881 5637 2488
433B488K803K719n566l11K06m11J592o949k164N497l005j394L8m551N287M614
$$ 2488 5291 8010 2444 2133 2339 1928 3520 -3429 -5593 -96 -3101 -4495 -4457 -9008 -3721 893
449H93m795n1K138L394M352l910j212L522q23M000j97r108K299M624k971j739
$$ 893 -3902 -3953 -1815 1579 5931 2021 809 4331 3508 7508 7311 -1797 502 5126 2155 416
465D16n230k234O228j62l407j794k066O819M056o365J004K382J222N550k625l317
$$ 416 -4814 -7048 -820 -982 -4389 -6183 -8249 -1430 2626 -3739 -2735 -353 869 6419 3794 477
481D77N214n13p3L94n976K013K766n336q19j525q09M934l983m049K890n56L978
$$ 477 5691 5178 5105 5499 -477 1536 4302 -1034 -1853 -3378 -4187 747 -3236 -7285 -4395 -4951 -973
498i73J842p815L608P406j491j26j967J49P104k720m482J152l13M990J75j1478
$$ -973 869 -6946 -3338 4068 2577 2451 484 633 7737 5017 535 1687 1374 6364 6539 -4939
514d939R54O039q33P60o517o641P648O431p12n745p721P860J0683l920l689m360
$$ -4939 -3985 2054 1221 1981 -4536 -11177 -3529 2902 2190 -3555 -11276 -3416 7267 3347 -342 -4702
530d702l18J3885J634j1235p89K735L772J917p548j822K555q08K959m467n785
$$ -4702 -5020 8865 10499 -736 -1525 1210 4982 6899 -649 -2471 84 -724 2235 -2232 -8017
545h017Q337P12n753J698k720K766P660m895m062L124L145O293l718p762N652
$$ -8017 320 1032 -4721 -3023 -5743 -2977 4683 -212 -4274 -1150 1995 8288 4570 -3192 2460
560B460K686j318N72o372Q62O415o063k844J528k070L924q02p592K580L890L302
$$ 2460 5146 3828 4400 -1972 -1110 5305 -758 -3602 -2074 -4144 -220 -1022 -8614 -6034 -2144 1158
576A158J984q670o18R774J808N89m181p310Q884P784o163m122l434J499O532l974
$$ 1158 3142 -5528 -6146 3628 5436 6025 1844 -5466 3418 11202 5039 917 -2517 -1018 5514 1540
592A540n065n86q38N200n23p537M884L533l329K463k053J22P931j806n009J267
$$ 1540 -3525 -4111 -4949 251 -272 -7809 -2925 608 -2721 -258 -2311 -2189 5742 3936 -1073 194
608A94J783N291p86q689L17K578J487K820q675m947Q402J075j561n69n694L526
$$ 194 1977 7268 6482 -2207 -1890 688 2175 4995 -3680 -8627 -225 850 -711 -1280 -6974 -3448
624c448O266k340j071j634K142O291m229l584M790l68L50n8o478J876N133j957
$$ -3448 2818 478 -593 -2227 -85 6206 1977 -1607 3183 2815 3165 3107 -3371 -1495 3638 1681
640A681j841m858q35Q096P47m376k462k973P113O593p455l011L175J610K889k521
$$ 1681 -160 -5018 -5853 2243 2990 -1386 -3848 -6821 292 6885 -570 -3581 -406 1204 4093 1572
656A572k760K812j243k97J444l321J724K848m353q8j16l40N716k049o080K159
$$ 1572 -1188 1624 381 84 1528 -1793 -69 2779 -1574 -1662 -1778 -2118 3598 1549 -4531 -2372
672b372K592K762P83n953J93L382o57J611j643l181K574p76k40K852l095m87L195
$$ -2372 220 2982 3765 -2188 -1995 1387 730 2341 698 -2483 91 -685 -925 1927 -1168 -1655 1540
689A540l912k63L708K21K64l417j262N628P33j504j180m287L146N442m140j820
$$ 1540 -2372 -2635 1073 1294 1558 -1859 -3121 2507 3240 1736 556 -3731 -585 4857 717 -1103
705a103J78j337L467Q87l649J09n64J807J849m366J489L969k961O05Q6k184M221
$$ -1103 -925 -2262 1205 2092 -1557 -1448 -2012 -205 1644 -2722 -1233 2736 -225 380 466 -1718 2503
722B503J52l946J200m59J696K140m261j98M86j600L928p46n422K979J616n16J680
$$ 2503 2655 -1291 -91 -550 1146 3286 -975 -1173 -687 -2287 1641 895 -4527 -1548 68 -448 1232
739A232k877N5L641j795N51O96k137L153p8l082K603r92j362K635l495j044K249
$$ 1232 -1645 -1590 2051 256 807 1503 -634 2519 2441 -641 1962 970 -392 2243 -1252 -2296 -47
756d7j063J116j028l696M949J110l815K372r43J19L474k454N26K522l002J564
$$ -47 -1110 6 -1022 -4718 231 1341 -2474 -102 -1045 -926 2548 94 620 3142 140 1704
772A704R21l086K126j123j938K950k460j780L220j942q63J340k070L061M98l539
$$ 1704 2625 -461 1665 542 -1396 1554 -906 -2686 534 -1408 -2271 -931 -3001 60 558 -2981
788b981M142K42k569L766p94j655K380k134J006J369l905J603R14l043J928j587
$$ -2981 1161 1403 -1166 2600 1806 151 2531 397 1403 2772 -1133 470 1384 -1659 269 -1318
804a318k097L960k402j696L984j812K59J837k006K858M6k493M080p94k727L466
$$ -1318 -3415 545 -1857 -3553 431 -1381 -1122 715 -1291 1567 1613 -880 3200 2406 -321 3145
820C145j831j368J928k718L07J443l850J762J001k781K394j126j197M175k041
$$ 3145 1314 -54 1874 -844 -537 906 -2944 -1182 -181 -2962 -568 -1694 -2891 1284 -757
835g57j127M113j825J93K083k112J795J0k887K838r79k932K400j719m63J935l793
$$ -757 -1884 2229 404 597 2680 568 2363 2373 -514 2324 1345 -1587 813 -906 -1369 566 -3227
852c227J072K308l339J931J313j952K494k05p19L558k133o23L254k491J1R26k434
$$ -3227 -2155 153 -3186 -1255 58 -1894 600 395 -324 3234 1101 478 3732 1241 1252 2178 -256
869b56J688r35l324L307j602k434K458j048r4J783k191J891K504k688J821Q07
$$ -256 1432 497 -2827 480 -1122 -3556 -1098 -2146 -2240 -457 -2648 -757 1747 -941 880 1687
885A687j018K436j430n17K520l433k71K816k914j055K51j715K055q43k399K579
$$ 1687 669 3105 1675 1158 3678 245 -26 2790 -124 -1179 -928 -2643 -588 -1431 -3830 -1251
901a251m64m24L061j898L99K104j477K293J325l392J257J160r62L78k607l00K323
$$ -1251 -1715 -2139 922 -976 -577 1527 50 2343 3668 276 1533 2693 1731 2109 -498 -798 1525
918A525l398k81J891k409R07P59j912K161K58q36K559p38l77K195p27Q28j17k766
$$ 1525 -1873 -2154 -263 -2672 -1765 -1006 -2918 -757 -499 -1335 1224 486 109 2304 1577 2405 2288 -478
936d78K872N03l501P79l67p68J474k444p67K370j959R02R27j300J618O05n12K074
$$ -478 2394 2897 -604 175 -192 -960 514 -1930 -2697 -327 -2286 -1384 -457 -1757 -139 466 -46 2028
954B028k198J15L594j745j741J010j028J622J26l646P82P20o21R97k420M8K365
$$ 2028 -170 -55 3539 1794 53 1063 35 1657 1783 -1863 -1081 -361 -982 15 -2405 -2357 8
971Hj524J700R43l385K479K610k596M4OM74K407k869j319K063j395J122k1l966
$$ 8 -1516 184 1127 -2258 221 2831 235 279 285 759 3166 297 -1022 1041 -354 768 747 -3219
989c219K314J756k368J845j119j722L694J9j242L76j469K623J016l359J108N25
$$ -3219 -905 851 -1517 328 -791 -2513 1181 1200 -42 334 -1135 1488 2504 -855 253 778
1005G78r97K095k344j997L733j220j412J600k172J084K468k051L79j125K02M395
$$ 778 -219 1876 -468 -2465 1268 48 -1364 236 -1936 -852 1616 -435 -56 -1181 -979 3416
1021C416k285k991K745m49J069J186m843Q32L119j673Pj330j573L484n54j125
$$ 3416 1131 -1860 885 436 1505 2691 -2152 -1320 1799 126 133 -1197 -2770 714 160 -965
1037i65J279k806J817L743l324p13J659l80K515j393l656L092O87j357N74k747
$$ -965 314 -2492 -675 3068 -256 -969 690 310 2825 1432 -2224 868 1555 198 772 -1975
1053a975J059K659k973J72M38j779L428J14l424J990O61J26K441l620r88L693
$$ -1975 -916 1743 -1230 -1058 -620 -2399 1029 1143 -2281 -291 370 496 2937 -683 -1671 2022
1069B022m32J1k165j897M323O1l367J258j641k7L992k650k097J763l0K227j59
$$ 2022 1590 1601 -564 -2461 1862 1923 -1444 -186 -1827 -1854 2138 -512 -2609 -846 -876 1351 1192
1086A192l392K166R82k87J680l434l39M885k448j765J634j869J683N20k680M45
$$ 1192 -2200 -34 948 661 2341 -1093 -1432 3453 1005 -760 874 -995 688 1208 -1472 -1027
1102a027J11L37K297k975j268L365o01L24N77l548K610K933l264j47m2K18K545
$$ -1027 -916 -579 1718 -1257 -2525 840 239 563 1140 -2408 202 3135 -129 -276 -318 -100 2445
1119B445k327j543J378r16J770P42m087J073K364q83J160j828j862L966L6j587
$$ 2445 118 -1425 -47 -963 807 1549 -2538 -1465 899 16 1176 -652 -2514 1452 1488 -99
1135i9K81j581K162J098l073Q76O03j074J907j350j407K457n55n14Q51k387J230
$$ -99 182 -1399 763 1861 -1212 -336 267 -807 1100 -250 -1657 800 245 -269 582 -1805 -575
1152e75K583j722l64q97L98K983j304k517J546p44Q20J314k804L00J516r23J178
$$ -575 2008 286 -78 -975 -577 2406 1102 -1415 131 -613 207 1521 -1283 -983 533 -390 788
1169G88r10j499K283O5n89K99j832K011J952l225Q8R92o58J491q93k203J832j47
$$ 788 -122 -1621 662 727 138 437 -1395 616 2568 -657 -569 423 -235 1256 363 -1840 -8 -155
1187a55N4M84j759O59J482j417J023l57j531K899l29k335J594K44OM81j823M55
$$ -155 -101 383 -1376 -717 765 -652 371 14 -1517 1382 1053 -1282 312 556 562 1043 -780 -325
1205c25J364j579J351q36j629J833L16j349J344j459K02K266j716p6O02p97J891
$$ -325 1039 -540 811 -25 -1654 179 495 -854 490 -969 -767 1499 -217 -293 309 -488 1403
1222A403m59k340K247m10n89J267j876N3J469j443N17M86j652J788L90k007J725
$$ 1403 944 -1396 851 441 -148 1119 -757 -704 765 -678 -161 325 -1327 461 851 -1156 569
1239E69o05k67J503j824K15J766j820J034N9j852J582L60j693J175q69j79J762
$$ 569 -36 -303 1200 -624 -409 1357 -463 571 630 -1222 360 720 -973 202 -667 -846 916
1256I16j559J74R87j647J581Q05k244J720j00j064J505j110o55K084j606l77Q30
$$ 916 -643 -469 518 -1129 452 1257 -987 733 633 -431 1074 -36 -691 1393 -213 -590 240
1273B40j508J296K23j838J625k55r43K438j142n42J486j234Q02Q61j993J070L83
$$ 240 -1268 28 251 -1587 38 -217 -1160 1278 136 -406 1080 -154 648 1509 -484 586 969
1290I69j992J442n35j278J832j351m86J828j567N34J386j673J009O24j062J519
$$ 969 -1023 419 -116 -1394 438 -913 -1399 429 -1138 -604 782 -891 118 742 -320 1199
1306A199o18j011K284j288o76J691k259O77P04k190J072J46j359J412m09q63K004
$$ 1199 581 -430 1854 566 -110 1581 -678 -1 703 -1487 -415 -269 -1628 -216 -625 -1488 516
1323E16r10m06J906j389Q22J268j620R12K80j699J483p19j141J489j480m06J620
$$ 516 -394 -800 1106 -283 539 1807 187 1099 1379 -320 1163 444 -697 792 -688 -1094 526
1340E26k025L49J115j253J106K47j281J950m60n06K004j340k9J431j677L68R66
$$ 526 -1499 -1150 -35 -1288 -182 65 -1216 734 274 -232 1772 432 403 1834 157 525 1491
1357A491k104R03j36j518J562j167p20J870j444N1J757j392Q16R13j176J297J52
$$ 1491 -613 290 154 -1364 198 -969 -1689 181 -1263 -1212 545 -847 -31 882 -294 1003 1155
1374A155j190J474q58p20J608j563k35J124j585L31N44j426J094l78q07J559l51
$$ 1155 -35 1439 581 -139 1469 -94 -329 795 -790 -459 85 -1341 -247 -625 -1432 127 -224
1391b24l34J544j104J6J428j511Q73L06j511J253j99j062J405j181m45R54r29
$$ -224 -558 986 -118 -102 1326 -185 688 994 -517 736 537 -525 880 -301 -746 208 -721
1408g21n1J080j136P01M39j071J235k93o93J403p95k70J307j473L57Q78j590P10
$$ -721 -772 308 -828 -127 312 -759 476 183 -510 893 98 -172 1135 -338 19 897 -693 17
1426A7K45j093P15m89j43J549j226o2J228r45N50M09j242R89K13r26O81p55r0
$$ 17 262 -831 -116 -605 -748 801 -425 -487 741 -204 346 755 -487 502 715 -211 470 -285 -375
1445c75M67p56J25L98j116J191P63j562Q34L52q48J292m68n16J104o96K49O37
$$ -375 92 -664 -539 -141 -1257 -66 697 -865 -31 321 -527 765 297 -219 885 189 438 1075
1463A075j553J012M2j471R49m07r77J629r20r54J579m38K88M29j165J184O46p01
$$ 1075 -478 534 576 -895 54 -353 -1330 299 -621 -1575 4 -434 -146 283 -882 302 948 247
1481B47J285q94p36J630j022m00P61j536K18J126j816K93J92l81J095j095l82
$$ 247 1532 638 -98 1532 510 110 871 -665 -447 679 -1137 -844 -652 -1033 62 -1033 -1415
1498a415J455m38K97R74j251R04J163j439R24k00q85J319m90j119M36q32K82O24
$$ -1415 40 -398 -101 873 -378 526 1689 250 1174 974 89 1408 918 -201 235 -597 -315 309
1516C09j923L81R34j188Q80J28j075J978m2p03J040k11K92J042j258L27R6q79
$$ 309 -1614 -1233 -299 -1487 -607 -479 -1554 424 382 -321 719 508 800 1842 584 911 1007 128
1534A28J637q76k347J455j57p14O50j426PJ378p17L60L61o56J549R0r65J563o21
$$ 128 1765 889 -1458 -3 -160 -874 -224 -1650 -1643 -265 -982 -622 -261 -917 632 722 -243 1320 699
1553F99m25J744j493m73J030o61k7m15j274J158q8j002P49r39J96J544j250M3
$$ 699 274 2018 525 52 1082 421 394 -21 -1295 -137 -225 -1227 -478 -1417 -1221 323 -927 -884
1571h84J305j126J092R57j550P65N08l93O27j176k04J259j073k36J99j487J322
$$ -884 421 -705 387 1344 -206 559 1067 674 1301 125 -79 1180 107 -129 70 -1417 -95
1588i5L04j884R42M27q17J355l79k96Q17l11O73L69j502J003M48j097R08n66r05
$$ -95 209 -1675 -733 -306 -1123 232 -147 -443 374 63 736 1105 -397 606 1054 -43 865 299 -606
1607f06J527j086j093J418m71k7J82j072R76M07n63Q27q12l55J787m39o48N50
$$ -606 921 -165 -1258 160 -311 -338 -156 -1228 -252 155 -408 419 -393 -748 1039 600 -48 502
1625E02r93N72J316j696J23M87o45O28n52l04J133j032J14J211j598L37J013r95
$$ 502 -491 81 1397 -299 -176 311 -334 294 -258 -562 571 -461 -347 864 -734 -397 616 -379
1643c79L28J40p04J074k34q17P62k88L48N18j608P16Q65r72L15L07r06J011l1
$$ -379 -51 89 -615 459 225 -592 170 -118 230 748 -860 -144 721 -251 64 371 -535 476 445
1662D45m76L67o85O4J071j144j72K12k71Q51m93r69J615n23p3N00m07j77R68p17
$$ 445 -31 336 -349 -285 786 -358 -530 -318 -589 262 -231 -1200 415 -108 -181 319 -88 -265 703 -14
1682a4N07K85j051J030j36r43N22o41K0R11j209j88O79m67M54j87k01R44lm71
$$ -14 493 778 -273 757 621 -322 200 -441 -421 490 -719 -907 -228 -695 -241 -428 -629 315 312 -159
1702a59Q56n77K40R05j047J93N10j126Q81j96j426P43j0n10M97r11L36P73o69
$$ -159 697 120 360 1265 218 411 921 -205 676 480 -946 -203 -213 -723 -226 -1137 -801 -28 -697
1721f97L79M21o60R68L04o80R48k03n79J007q69l42M09o86M91j87j031Q74k4j100
$$ -697 -318 103 -557 411 715 35 983 780 201 1208 339 -3 406 -280 211 24 -1007 -133 -157 -1257
1741a257P10j79j28J047p03J41R09o41N52N46o49N87k15l68O88q38o88J452j157
$$ -1257 -547 -726 -854 193 -510 -369 540 -101 451 997 348 935 720 352 1040 202 -486 966 -191
1760a91j62L33r97O45j18q72J225q6n26R15k48k15R57n52K83P74j098M97N03r94
$$ -191 -353 -20 -1017 -372 -490 -1362 -137 -223 -749 166 -82 -297 660 108 391 1165 67 564 1067 73
1780G3N91n15n18Q46r75n00J068j136K78O31q07Q25j91n22J401m16m09J205o16
$$ 73 664 149 -369 477 -498 -998 70 -1066 -788 -157 -964 -139 -330 -852 549 133 -276 929 313
1799C13J39M59p74K78O13j223N01J52r27O12k47l90Q88j115m67J326p70l7P46
$$ 313 452 911 137 415 1028 -195 306 458 -469 143 -104 -494 394 -721 -1188 138 -632 -669 77
1818G7p36Q10k7n93J147k61o27J138n50j07M66p72J47N67j206M25J76p24O41m90
$$ 77 -659 151 124 -469 678 417 -210 928 378 271 737 -35 112 679 -527 -102 74 -650 -9 -499
1838d99n06J200p57k09R48n35J20O64o39O59N1n34Q04M6r17P18m60j59N94j041
$$ -499 -1005 195 -562 -771 177 -358 -238 426 -213 446 497 -37 767 813 -104 614 154 -5 589 -452
1858d52L38M57r73M90p4m14O15k98l00Q79p25J82R49r08L93K33n13P59k27q42
$$ -452 -114 343 -630 -140 -214 -628 -13 -311 -611 268 -457 -275 674 -234 159 392 -121 638 411 -431
1878d31J073l37n47N16m21J6M49r31M78K77r04O68J74n25O35m76R9O73n45M1O97
$$ -431 642 305 -242 274 -147 -131 318 -613 -135 142 -762 -94 80 -445 190 -286 -187 486 -59 -18 679
1899F79o96J29K71n82N87k49n96O18l3l45N72o54L41K77r28P82J06q84N93J84
$$ 679 -17 112 383 -199 388 139 -457 161 128 -217 355 -299 42 319 -609 173 279 -605 -12 172
1919A72n59N22k53p4N48p86J06N47n32N26O2l85N56j63n04O09m67r0N89m47K6
$$ 172 -387 135 -118 -192 356 -430 -324 223 -309 217 279 -106 450 287 -217 392 -75 -165 424 -23 3
1940CL26r08P92p1q23P48k34m48N60l92L49K52o38N01M95l77K06J02m71O72l11
$$ 3 329 -579 213 142 -681 67 -167 -615 -55 -447 -98 154 -484 17 512 135 341 443 -28 644 333
1961C33l78P98q78k0N41q29K09L21r93O46n1k99O38j26k98N32l13L05N71r60Q90
$$ 333 -45 753 -125 -145 396 -433 -224 97 -896 -250 -301 -600 38 -88 -386 146 -167 138 709 -251 639
1982F39q4m34N43j96o91N52m48o1L38q27J52N11o45O00ro41P30n2m39J023n98
$$ 639 555 121 664 468 -223 329 -119 -180 158 -669 -517 -6 -651 -51 -60 -701 29 -23 -462 561 -37
2003c7J64P63q92L11L06p50O47k89o81R20m73o55R42p20k70R44n76QK71n55O77
$$ -37 127 890 -2 309 615 -135 512 223 -458 462 -11 -666 276 -444 -714 230 -346 -338 -67 -622 55
2024E5J52n03P94j32j74M44p63J37O93q37R0L31n84M73M1n83K13k34J74N12q62
$$ 55 207 -296 498 366 192 636 -127 10 703 -134 -44 287 -297 176 217 -366 -153 -387 -213 299 -563
2045e63L5Q17q58M43M06p29P37J42n35N01j78k93N97o51Q2M30o16K58M60j025
$$ -563 -528 289 -569 -126 280 -449 288 430 -105 396 218 -75 522 -129 -47 383 -233 25 485 -540
2065e40Q17J13r71O55m86k01J042q11J02N80p49N21K49p33N49Mn03Q90m28o57
$$ -540 277 390 -581 74 -412 -613 429 -382 -280 300 -449 72 321 -412 137 141 -362 528 100 -557
2085e57R70n78Q1N41p90K49L66q78M40J38o72R31p41K7O73o00M66K94n56K75K90
$$ -557 413 -165 -84 457 -333 -84 282 -596 -156 -18 -690 241 -500 -473 200 -400 66 360 -196 79 369
2106C69l94L62j54l59N30n9m46M03m19J67L14r67M49L54o07O73J1q71O40j1J03
$$ 369 -25 337 183 -176 354 295 -151 252 -167 0 314 -653 -204 150 -457 216 227 -644 -4 -15 88
2127H8L94o20J76N31o13L42l8q28O85j25l43N07k47l18O20p52K50K40l77N93J2
$$ 88 482 -138 38 569 -44 298 260 -568 117 -8 -351 156 -91 -409 211 -541 -291 -51 -428 165 177
2148A77m68J053n66m35Q55p04R6O20m99j85J47k98J98j5n01O42m06n0N08n90o0
$$ 177 -291 762 196 -239 616 -88 8 628 129 -56 91 -207 -9 -24 -525 117 -289 -339 169 -421 -481
2169d81O67k94K61K4l69M37J22l68M66k76QL50p36K48L61j001M80J94o69M40R
$$ -481 186 -108 153 177 -192 245 367 -1 465 189 197 547 -189 59 420 -581 -101 93 -576 -136 -127
2190a27n62P63j47l52N49m17K00N46m66L14K05o55O05k42m66O83k48m88M88m50
$$ -127 -689 74 -73 -425 124 -293 -93 453 -13 301 506 -149 456 214 -252 431 183 -305 183 -267
2210b67J83j42l59N22O0o57Q97l57j58N30k16Q4K79m07K24J66k77J98l06l11P63
$$ -267 -84 -226 -585 -63 -3 -660 237 -120 -278 252 36 120 399 -8 216 382 105 303 -3 -314 449
2231D49p01j58N30o06R5M44n93K23L21o70P57j64k92O25j02j51L55j82M6K29n94
$$ 449 -252 -410 120 -486 -391 53 -540 -317 4 -666 91 -73 -365 260 158 7 362 180 226 455 -139
2252a39M16J83p84M44k7o45P62m96j34J97k04J87O07p08J20M53l38N04j42n15
$$ -139 277 460 -324 120 93 -552 210 -286 -420 -223 -427 -240 367 -341 -221 232 -106 398 256 -259
2272b59J057m38l76L21k40j38O5l57L48L94r94M76j5n56Q92k40j69P65p51K89
$$ -259 798 360 -16 305 65 -73 -8 -365 -17 377 -617 -141 -156 -712 180 -60 -229 536 -215 74
2292G4N95p83L65J09n01J13K24n69O69k63m90O00p09L25J77n28M72K85n26M10
$$ 74 669 -114 251 360 -141 -28 196 -373 296 33 -457 143 -566 -241 -64 -592 -120 165 -361 49
2312D9j09J64L94k60j78M86n28o9K21l95K82O1n71N38j49n65P70m48m4P01n09
$$ 49 -60 104 498 238 60 546 18 -51 170 -225 57 118 -453 85 -64 -629 141 -307 -351 350 -159
2333a59J79L56l53L38O2n70O24k42k83N60o54R6N36r76J24L78n34K35K43m52N84
$$ -159 20 376 23 361 423 -147 477 235 -48 512 -142 -46 490 -486 -362 16 -518 -283 -40 -492 92
2354I2k20j34Q63l71l60N79m38L74J35n26K06j99k59J15p9k44M32n86J33N56n42
$$ 92 -128 -262 601 230 -130 449 11 385 520 -6 200 1 -258 -143 -222 -466 -34 -620 -487 69 -473
2375d73L83J58k80M15m3j11M91k55k08L48m02K44K09m92Q1j35l11Q0J10l67N77
$$ -473 -90 68 -212 203 160 49 540 285 77 425 23 267 476 -16 65 -70 -381 -301 -191 -558 19
2396A9j88k59O78m69J60N48p44O50J31l46J31R9m46K97j51j98L94n33k8N86p66
$$ 19 -169 -428 250 -219 -59 489 -255 395 526 180 311 410 -36 261 110 -88 306 -227 -255 331 -435
2417d35M7K66l47P03l95o1O88o35J20N77o49J85L29n79K02K60l17L14k98o5K17
$$ -435 -388 -122 -469 234 -161 -222 466 -169 -49 528 -121 64 393 -186 16 276 -41 273 -25 -90 127
2438A27j35l42O74o14J3M06n17M17O8m08N90j26k36m3J68R1J17n12K13k4j42K22
$$ 127 -8 -350 324 -290 -277 129 -388 29 97 -311 279 153 -83 -126 42 133 250 -262 -49 -73 -215 7
2460Gn2k05L07m3k28P25o48M26K05n49K03k1l29L65j70k99N21k29k82M64l99k01
$$ 7 -45 -250 57 14 -214 511 -137 289 494 -55 148 127 -202 163 -7 -306 215 -14 -296 168 -231 -432
2482d32O20n97N61n4k22K90Q1l31L24k66N6L59m32O2M40n74K10q0m81M64l95J5
$$ -432 188 -409 152 98 -124 166 247 -84 240 -26 30 389 -43 19 459 -115 95 15 -466 -2 -397 -382
2504c82N74m04NM43l27j21N06o05M68P3k56L14j69k04K24l04r0O18q57J41N38
$$ -382 192 -212 -207 236 -91 -212 294 -311 157 230 -26 288 119 -85 139 -165 -255 363 -494 -353 185
2525A85n52K73j4k63L81j46r0M86k46J4L42k72Q4P0o15M44J83m80K07P7m74N59
$$ 185 -367 -94 -108 -371 10 -136 -226 260 14 28 370 98 182 252 -363 81 264 -216 -9 68 -406 153
2547A53n95J32L62m23J8N94k16K18j11j03K29r8k12M63j68l39L96l95P9P3m32
$$ 153 -442 -310 52 -371 -353 241 25 243 132 29 258 160 -52 411 243 -96 300 -95 -16 57 -375
2568c75K06J42l60M08k90J7L75k68L3M48p01L86J98k89K31J05m30O86n61l14M50
$$ -375 -169 -27 -387 21 -269 -252 123 -145 -112 336 -365 21 219 -70 161 266 -164 522 -39 -353 97
2589I7m34K32J7k36J38K64o66N25J62m77M69J41l33N82m02LK38m05L46j57k25
$$ 97 -337 -105 -88 -324 -186 78 -588 -63 99 -378 91 232 -101 481 79 82 320 -85 261 104 -121
2610a21L22r5n49L47o2l37O60l28J69L03m17L02P0k98J80l4j35K48K5l53L11j81
$$ -121 201 106 -443 -96 -158 -495 165 -163 6 309 -108 194 264 -34 146 112 -23 225 250 -103 208 27
2632B7l80L27N9j98J51l25J84J11k46M17l36Q0K36J2k55K16l1L6K97l83K05k96
$$ 27 -353 -26 33 -165 -14 -339 -155 -44 -290 127 -209 -129 107 119 -136 80 49 85 382 -1 204 -92
2654i2N1K15l36o6K41m82K58K94l54K79Q6l85N24k56m7L40k50K37Rk52K39m6m06
$$ -92 -41 174 -162 -228 13 -469 -211 83 -271 8 94 -291 233 -23 -70 270 20 257 266 14 253 207 -199
2677a99J77M5k41K6Q3J9J51k29LL33m80J56K10k42N32j48L6J78m12p9K91k94Q0
$$ -199 -22 23 -218 -192 -109 -90 61 -168 -165 168 -312 -156 54 -188 344 196 232 410 -2 -81 210 -84 -4
2700dO4j23kJ04l43K33k64L8K73p6o5K69K0j62K38j02O7M8m39N24j35k81K55l21
$$ -4 60 -63 -65 39 -304 -71 -335 -297 -24 -100 -165 104 124 -38 200 98 165 213 -226 298 163 -118 137 -184
2724a84n3M25m09q4N20m90J80j5P4Q9n9j60M89n8j19R8k76K08J37m05J58J6j94
$$ -184 -237 188 -221 -305 215 -275 -95 -110 -36 53 -6 -166 323 265 146 244 -32 176 313 -92 66 82 -112
2747a12L19l81j77M67k69K6K97l96J17L08p5l4jj57L47r9l16K58p7j30J64k66
$$ -112 207 -174 -351 116 -153 -127 170 -226 -109 199 124 90 89 -68 279 180 -136 122 45 -85 79 -187
2769a87R2K39m17J17K54k90J94k9l7K77k08o5J74O2j88K49k91J35k7l00N33m00
$$ -187 -95 144 -273 -156 98 -192 2 -27 -64 213 5 -60 114 176 -12 237 -54 81 54 -246 287 -113
2791a13j29K84m22Q1L27k83K77K51n26N00l68P6L24l09J13K12l95Q5L59m67K41
$$ -113 -242 42 -380 -299 28 -255 22 273 -253 247 -121 -45 279 -30 83 295 -100 -15 344 -123 118
2812A18l20j26K92n7l20M19k64k5N99m23j62M07l83J87L40m87L74L1k95M63k39
$$ 118 -202 -328 -36 -93 -413 6 -258 -283 316 -107 -269 138 -245 -58 282 -205 169 200 -95 368 129
2833A29l74N32m68K6L7l62L31j38J32K47k63J8K01j24k2L39j60j39K37k90L22
$$ 129 -245 287 -181 -155 -118 -480 -149 -287 -155 92 -171 -153 48 -76 -98 241 81 -58 179 -111 211
2854B11R1o13M92j32j78L29m27j67M77k16J50J02j45L8K99m94M45j76k92O74l20
$$ 211 302 -311 181 49 -129 200 -227 -394 83 -133 17 119 -26 12 311 -183 262 86 -206 468 148
2875A48l04M06k10n9K7l93N88k71k70K89JR3J33k05m9R4j33M77p4k26j04K06o7
$$ 148 -156 250 40 -19 8 -385 203 -68 -338 -49 -48 45 178 -27 -76 18 -115 362 288 62 -42 164 97
2898I7j29p0k30N20k71j21P5l40M44j49j26J96M3P0L00j65l2L66m64n1L40k37
$$ 97 -32 -102 -332 188 -83 -204 -129 -469 -25 -174 -300 -104 -61 9 309 144 112 478 14 -37 303 66
2920F6p6K39m20L00j88r5P1Ok91M64j45k13K64k84N51p8k26N01k72l9J24k31k1
$$ 66 -10 229 -191 109 -79 -174 -103 -97 -388 76 -69 -282 -18 -302 249 171 -55 446 174 135 259 28 7
2943GL36m71O2k9j24P8j36J24J27j40m3K55m7j51K65k30o2M07o9o7q0nL03l46
$$ 7 343 -128 -66 -95 -219 -141 -277 -153 -26 -166 -209 46 -1 -152 113 -117 -179 228 159 92 12 7 310 -36
2967c6j86K22o5o1J73k49K22m3j58K82r4l20N81k21j2L50n21K51o7o0L2J92m13
$$ -36 -222 0 -65 -126 47 -202 20 -23 -181 101 7 -313 268 47 35 385 -136 115 48 -12 20 212 -201
2990b01J90k87L12l1p0j75L79l29K00J31l46L38j6j30j87O19k90l0p3j58N29m76
$$ -201 -11 -298 14 -17 -87 -262 117 -212 -12 119 -227 111 95 -35 -222 397 107 77 4 -154 375 -101
3012a01q1K39l83K57J24j87J31k8m49O82l46j7J76j99K39K44l46K06K4k34Q7J04
$$ -101 -182 57 -326 -69 55 -132 -1 -29 -478 204 -142 -159 17 -182 57 301 -45 161 185 -49 38 142
3034A42k40L40j69k36K28j21J24n6l76M66p6j04J23r3K9k5l9K57J12k28r3K79
$$ 142 -98 242 73 -163 65 -56 68 12 -364 102 26 -78 45 -48 -19 -44 -83 174 286 58 -35 244
3056B44l42J8J83k99K30j50k39J91L24l21J79j54j9K77k39J36O2j25p9K42k88
$$ 244 -98 -80 103 -196 34 -116 -355 -164 160 -161 18 -136 -155 122 -117 19 81 -44 -123 119 -169
3077a69K12j13Q2J59j83N1j46j40K62Q7m56K14Q2j63K61k10K48L46n04K13r6j73
$$ -169 43 -70 12 171 -12 39 -107 -247 15 102 -354 -140 -58 -221 40 -170 78 424 -80 133 37 -136
3099a36J35K7m2K32j57j88M46k41r6K96l85P6K13n04J57J33j32L34k58n1L58j96
$$ -136 -1 26 -16 216 59 -129 317 76 -20 276 -109 -33 180 -324 -167 -34 -166 168 -90 -141 217 21
3121B1l1J93m40J65K85l79K27J57l70N3J06k33M76m84K87R6k10J9J19k20L37q9
$$ 21 -10 183 -257 -92 193 -186 41 198 -172 -119 -13 -246 230 -254 33 129 -81 -62 57 -163 174 85
3143H5l13M51k76p9K97k45m5J75r5K03j08k52K82j98J26Rm6qJ88l0J33l74j7J71
$$ 85 -228 223 -53 -132 165 -80 -125 50 -45 158 50 -202 80 -118 8 17 -29 -37 151 121 254 -120 -137 34
3167C4N1j24J70q4j05O7J30L1j28J8l6N4k78L65j45k20K59j15lK47l02R9J58k82
$$ 34 85 -39 131 47 -58 9 139 170 42 60 24 78 -200 165 20 -200 59 -56 -59 188 -114 -15 143 -139
3191a39J39J58l61K30R5j89J06m4j2J2q5K18j15o4j31K89j91K5K17k29jR1k13
$$ -139 0 158 -203 27 122 -67 39 -5 -17 -5 -90 128 13 -51 -182 107 -84 -59 158 -71 -72 19 -194
3214a94K47n4k0J00l40K33O0Q5J18o9k47P8R8l12K88j73J00K00k93K26m3j78P9
$$ -194 53 -1 -21 79 -261 -28 32 117 235 166 -81 -3 95 -217 71 -102 -2 198 -95 131 88 -90 -11
3237a1J52l83L87k06Q4J68k85m3N1m3Q1L9M2l4j66j28L49j60r2K74j78J38J14
$$ -11 141 -242 145 -61 23 191 -94 -137 -86 -129 -48 -9 33 -1 -167 -295 54 -106 -198 76 -102 36 150
3260A50k07L44m74J41J09L6k20Q3K06k99M86l76J9J13j89J35P4k49Q1J56j91J24
$$ 150 -57 287 -187 -46 63 99 -121 -38 168 -131 355 -21 -2 111 -78 57 131 -118 -37 119 -72 52
3282E2j24j27L84m07J85J89k96K12M9Kr5k0n8m8J37j12J64k89R0J10j3L6q3r6
$$ 52 -72 -199 185 -222 -37 152 -144 68 117 119 24 4 -54 -102 35 -77 87 -202 -112 -2 -15 21 -62 -158
3306a58J31J16k73K23r7J36M4k77J51K85k67q6K20j19J00j54J01m0j74L2O0J93
$$ -158 -27 89 -184 39 -58 78 122 -155 -4 281 14 -72 148 29 129 -25 76 36 -138 -106 -46 147
3328A47l04K13k64K53p9j58K92j06R9J23l20l8J72N6k26L24o7j85J18j37J28j69
$$ 147 -157 56 -208 45 -34 -192 100 -6 93 216 -104 -142 30 86 -140 184 117 -68 50 -87 41 -128
3350a28J37J8k24K35J18k44L13j71l21J48K97k59J58k47J14R2P1m3J06l91K03
$$ -128 9 27 -197 38 156 -88 225 54 -267 -119 178 -81 77 -170 -56 36 107 64 170 -221 -18
3371a8K18l32J35k2j24J27J16k54N24n03R5K52k48N6K23l18J48M3k57K88k34K55
$$ -18 200 -132 3 -19 -143 -16 100 -154 370 -133 -38 214 -34 22 245 -73 75 118 -139 149 -85 170
3393A70q2q1r0k4k2J1L55k50J34j3k91J56J29r8J60k14P8Q0m12L10J10m81N51
$$ 170 88 7 -83 -107 -129 -118 237 -13 121 108 -183 -27 102 4 164 -50 28 108 -304 6 116 -365 186
3416A86k42j32K60k61J49K93m28K47m4j13K0K80k49j34K32j64J22r4R9Nj6P7k58
$$ 186 -56 -188 72 -189 -40 253 -175 72 28 -85 -65 215 -34 -168 64 -100 22 -72 27 32 16 93 -165
3439a65m3M52l65n3N8K18k45K23j02rK89l37J2J00p5K14j73j32J15j90K72O8j96
$$ -165 -208 244 -121 -174 -116 102 -143 80 -22 -31 258 -79 -67 33 -42 172 -1 -133 -18 -208 64 132 -64
3462f4J1K36l35J84K16m34K59lo3K88k36n4J41j4r1J09k50J64k04N3J59ml78M07
$$ -64 -53 183 -152 32 248 -186 73 70 7 295 59 5 146 132 41 150 -100 64 -140 -87 72 68 -310 97
3486I7k47J56j31k0K09K89n59O0N84p74L64J63k33L39k45r8L09m70J99M3l70L15
$$ 97 -150 6 -125 -145 64 353 -206 -146 438 -336 28 191 -42 297 52 -46 263 -207 -8 35 -335 -20
3508b0J01m72L71j4M8O9l71J98K48k32J21m6k08J91P5n8J48j16Q4k0p2J2K6o5
$$ -20 81 -391 -20 -34 14 83 -288 -90 158 -74 47 1 -207 -16 59 1 149 33 117 97 25 37 63 -2
3532bJ43j82n3P2P9j50J92Qk1j26n8K59K18l71K2J3k21K77L7j39J48k3l42L95
$$ -2 141 -41 -94 -22 57 -93 99 107 86 -40 -98 161 379 8 30 43 -178 99 136 -3 145 122 -220 175
3556A75k31j43K97o3o0O4N9n7J00qm8O7k58K61l55K54k6j30L9J59p0l9R3k39L31
$$ 175 -56 -199 98 35 -25 39 98 41 141 133 85 152 -106 155 -200 54 28 -102 -63 96 26 -13 80 -159 172
3581A72k38P0J08m3LR7k83K59k0j59n6J46j38k2m3J38J1J41k13J01j71K11o3j80
$$ 172 -66 4 112 69 72 169 -114 145 125 -34 -90 56 -82 -104 -147 -9 2 143 -70 31 -140 71 8 -172
3605a72J69J37O8j50R7j83L6R8m1l4j4K9O8k68J95l6p6q8J13p5J52J6k30K99k69
$$ -172 -3 134 202 52 149 -34 2 100 59 25 11 40 108 -160 35 -1 -77 -165 -52 -127 25 41 -189 110 -159
3630a59K99n1j46O4P2j42Q6k13J40o5j62K73lK0J97j29j84J07m9n3K16L7l22L20
$$ -159 140 89 -57 7 79 -63 23 -190 -50 -115 -277 -4 -7 13 210 81 -103 4 -45 -98 118 155 -167 153
3654A53L3j46K89m25j70K10K0P4P5q5j46J17j9J00j41K26j61k10K98j06Q6J46
$$ 153 186 40 329 -96 -266 -56 -36 38 113 28 -118 -1 -20 80 -61 165 4 -206 92 -14 72 218
3676B18Rk68l6J18k15J84mkj38o2L70o6l5m4k78K27K47k46R0Jk49L18N2k03J0
$$ 218 227 -41 -77 41 -174 10 6 4 -134 -196 174 108 73 29 -249 -22 225 -21 69 70 -179 139 191 -12 -2
3701bK87k95K15k4k43K25j78j53Q3k0m6J25q0K32l28J37J95l05K13K82k39q0J83
$$ -2 285 -10 205 181 -62 163 -15 -168 -85 -105 -151 -26 -106 126 -202 -65 130 -175 38 320 81 1 184
3724A84r7j87K52n42L22k45K97o5oL2K78l07J41N3k34L23J07l61K73k68Q0M4j24
$$ 184 87 -100 152 -390 -68 -313 -16 -81 -87 -55 223 -84 57 110 -124 199 306 -55 218 -50 30 74 -50
3747e0P0M4j04J41j26K8j06O9J1L4j10j02L3K9L5P4j2L5J27k79K28p7q3L07l16
$$ -50 20 64 -40 101 -25 3 -103 -34 -23 11 -99 -201 -168 -139 -104 -30 -42 -7 120 -159 69 -8 -91 216 -100
3772a00k3J2pK9K11j60j34K31j64J97j98K2L38j47J8k2k62R4k8j01K54J76k24
$$ -100 -123 -111 -118 -89 122 -38 -172 59 -105 92 -106 -84 254 107 125 103 -159 -65 -93 -194 60 236 12
3795A2N7J6q6P9p1k33M25k42K6K45k13Q5N7l93J56k10J49K15n6l6nk72L32j43
$$ 12 69 85 -1 78 7 -226 199 -43 -17 228 15 100 157 -236 -80 -290 -141 74 18 -18 -23 -295 37 -106
3819a06k35L86MqJ79k7l60M28j34p4k9L5l06K79q9k20L61j7n5J0k53J20J73l1
$$ -106 -341 45 49 41 220 193 -167 261 127 53 24 59 -247 32 -57 -277 84 67 12 22 -231 -111 62 31
3843C1L4k06J16J25l1j45J29J03j60qN8k28R4P0K02j49q5m4rK1J25j62L2J58n9
$$ 31 65 -141 -25 100 69 -76 53 156 -4 -12 46 -182 -88 -18 184 35 -50 -94 -103 -82 43 -119 -87 71 12
3868A2J68l15O8J87n4K27j57m6L1p5P6j8r4o2J16M1l37m2L15k88K30NJ27k21J08
$$ 12 180 -135 -67 120 66 293 136 90 121 46 122 104 10 -52 64 105 -232 -274 41 -247 -17 -12 115 -106 2
3893Bn9N5J21Lj28k5J0j04K06j58J67O8k49M1l02M70j9o2ll26M26k23J53j37R0
$$ 2 -57 -2 119 122 -6 -31 -21 -125 81 -77 90 158 -91 -50 -352 118 99 37 34 -292 134 -89 64 -73 17
3918A7j52J46k97J79J03J02L9k52J65R4k41K18O2p2Q2l70J86j2k1J64K7j69j66
$$ 17 -135 11 -286 -107 -4 98 137 -115 50 144 -97 121 183 111 193 -177 9 -3 -24 140 167 -2 -168
3941a68L29j46L2J06k32L9R4K30j90j07J24j18K33j91O6l52K34n6N6J39j39r8
$$ -168 161 15 47 153 -79 -40 54 284 94 -13 111 -7 226 35 101 -251 -17 -73 -17 122 -17 -115
3963a15K65k30j7O5q6l8J03L7J6j24P3r3J01n2K88l33K8kJ85j37m3R7J24j84j40
$$ -115 150 -80 -97 -32 -118 -156 -53 -16 0 -124 -51 -144 -43 -95 193 -140 -112 -114 71 -66 -109 -12 112 -72 -212
3988b12M3J54k6J78j40m1R8p8p4l8J24K9j02J01jp4J62L3j74Q0R8j80J29J32k65
$$ -212 -169 -15 -41 137 -3 -44 54 -24 -98 -136 -12 17 -85 16 15 -59 103 136 -38 42 140 -40 89 221 -44
4013d4J03J26l05J97l38J81j8p7J32J70k08J2O9j3J80j78O5O5j29K3J59k74K85
$$ -44 59 185 -120 77 -261 -80 -98 -175 -43 127 -81 -69 0 -13 167 -11 54 119 -10 13 172 -102 183
4036A83j4k89J54J64m37J61K27k45O3O1o6J73j83K8J47j42p0N9K02k50J36K1j60
$$ 183 169 -120 34 198 -239 -78 149 -96 -33 28 -38 135 -48 -20 127 -15 -85 -26 176 -74 62 83 -77
4059g7P9NNJ40p1j17j53K32J9j32O3J93k14K09m11M3K69k48J99K06k52J8K7k28
$$ -77 2 7 12 152 81 -36 -189 43 62 -70 -7 186 -28 181 -230 -187 82 -166 33 239 -13 5 32 -196
4083a96J73J17M1k26j15L01Oj86O3R2Q2j19o8L0R8j38p4K30j60m1M5j10l8J17
$$ -196 -23 94 135 -91 -206 95 101 -85 -22 70 152 33 -35 -5 93 -45 -119 111 -49 -90 -45 -155 -193 -76
4107g6L3l1R9L1k41J11K1N8p9L84k85K71l40M3J66k97L91l03R3J31k26j04K42
$$ -76 -43 -74 25 56 -185 -74 -53 5 -74 310 25 296 -44 -1 165 -132 259 -44 49 180 -46 -150 92
4130I2k25L16j19lm7j25J47J08l66J09R5k4P1P1j54J43j76J11p4k7q4RJ59K3j2
$$ 92 -133 183 64 61 14 -111 36 144 -222 -113 -18 -42 29 100 -54 89 -87 24 -50 -77 -161 -152 7 30 18
4155A8o6k7O1P4k4P0j32J93j47o3l4J06R7l01K05n3j11J81j35J76k27J40j69J85
$$ 18 -48 -75 -14 60 36 106 -26 167 20 -43 -77 29 126 -175 30 -23 -134 47 -88 88 -139 1 -168 17
4179A7J90k75K46r8k52J38l2M9L2M6M1k5J38j52j87J77M9R4l55Q9JJ99l9j26J5
$$ 17 207 -68 178 80 -172 -34 -66 -17 15 61 102 77 215 63 -124 53 102 196 -159 -70 -69 130 91 -35 -20
4204b0K31k04j0Q0k81K98j82R4P2j73J9m4K77l22L34k89L04l40J79L1M8k35J27
$$ -20 211 7 -3 77 -204 94 -88 6 78 -95 -76 -120 157 -165 169 -120 184 -156 23 54 102 -133 -6
4227fK6m5o6j14M09Ll42K00l6M2r0J3N8r3k0O5KJ35O7l14pLj30L27n1O5k13M7
$$ -6 20 -25 -91 -205 204 207 -135 65 29 71 -19 -6 52 -41 -61 4 6 141 208 -106 -113 -110 -240 87 36 101 -112 -65
4255f5n8J36M7q8lJ56j40RR6j01q9J07J12jj26Q8j3j87J44J85j53Jn4J75n0j04
$$ -65 -123 13 60 -28 -31 125 -15 -6 90 -11 -100 7 119 118 -8 80 67 -120 24 209 56 57 3 178 128 24
4281B4Kn7l1Kj45K61k03J2p0K52r0j64L72k71k3M56k34j5j41j25K76l04M8O4O2
$$ 24 26 -31 -62 -60 -205 56 -147 -135 -205 47 -43 -207 165 -106 -129 327 93 78 -63 -188 88 -216 -168 -104 -42
4306d2j8K72l47L4J89k36J67P7q0j52J28J28j98J07o8J66j91L6K57l53K53j82
$$ -42 -60 212 -135 -101 88 -148 19 96 16 -136 -8 120 -78 29 -39 127 -64 -28 229 -124 129 -53
4328e3j19L19l07K7J86J0k12P7K03j0k12J86L5k86K76l02K46pk04K27J1L4j63
$$ -53 -172 147 -160 -133 53 63 -149 -72 131 121 -91 95 130 -156 120 -182 64 57 -147 80 91 125 -38
4351c8P7L4r4n4J75j50k8J45J78k37k0O1K1m1R0l33K17n2R2P0j42j39O7K14j31
$$ -38 39 73 -21 -75 100 -50 -78 67 245 8 -12 49 70 29 119 -214 3 -49 43 113 -29 -168 -101 113 -18
4376a8J04j50j75R4L11l48L87j92P6o7J73k29J06o9L0n7l7K77j45p0m8K68l19
$$ -18 86 -64 -239 -145 166 -182 205 13 89 22 195 -34 72 3 33 -24 -61 216 71 1 -47 221 -98
4399i8J82j76j2N3N4m6k34L62j42M6j46K48n2J21k96J57O4j32k7L34k19j66L8
$$ -98 84 -92 -104 -51 3 -43 -277 85 -57 -11 -157 91 39 160 -136 21 85 -47 -74 260 41 -125 -87
4422h7J31l8kj1l2J11j96K77j46J4j75JK00l2R6l97M62k4m65K90J89j19J55l30
$$ -87 44 6 4 -7 -39 72 -124 153 7 21 -154 -153 47 15 111 -286 176 152 -313 -23 166 47 202 -128
4446a28k6K07Q1j75Jm1j21N5J04J21O1Nj95J49j87k7J95l31L01L5k24J35j17j02
$$ -128 -154 53 134 -41 -40 -81 -202 -147 -43 78 139 144 -51 98 -89 -116 79 -252 49 84 -140 -5 -122 -224
4470b24J48K04j91j23K56r4N6j74J03p3J21L6k05M21n95M41o4J19j21J19l65K74
$$ -224 -76 128 -63 -186 70 -24 32 -142 -39 -112 9 45 -160 261 -334 107 43 162 41 160 -205 69
4492F9p2J16N2k39L60m08j34L47j02nj50M8P6n7J46Q1m6m27L56RJ03k42Q0NQ3
$$ 69 -3 113 165 -74 286 -122 -256 91 -11 -16 -166 -118 -42 -99 47 128 82 -345 11 20 123 -119 -39 -34 49
4517D9j42J82N9m18K82k5J52j45Q3P6J47k40k5p2l1L0R5j37q7K49p4j90J87k0
$$ 49 -93 89 148 -270 12 -13 139 -6 77 153 300 60 35 -37 -68 -38 57 -80 -167 82 8 -182 5 -15
4541a5q8J34J16j0j56J03O8l78K59Q6j04j47K32j07n1j5L4J57j14j37K91k50L
$$ -15 -103 31 147 137 -19 84 152 -226 33 119 15 -132 100 -7 -58 -73 -39 118 4 -133 158 -92 -89
4564h9J62P1j67q4J39O7P2k41J23j21OL7j46K79r0n0m7J57K2j06k26J48L70m30
$$ -89 73 144 -23 -107 32 99 171 -70 53 -68 -62 -25 -171 108 18 -32 -79 78 100 -6 -232 -84 286 -144
4588a44J8K35k50J95J73k69K35l90K90k97J02J10NP9k11J54k09J75p3K58k24n7
$$ -144 -126 109 -141 54 227 -42 193 -197 93 -204 -102 8 13 92 -119 35 -174 1 -72 186 -38 -95
4610i5J01N2P3j65J00j27k5J97k37l5J03K23j34j61J15k1R5j14M8k34L04K3j3
$$ -95 6 58 131 -34 66 -61 -86 111 -126 -161 -58 165 31 -130 -15 -36 59 -55 -7 -241 63 86 73
4633G3q7k36J43J5L81r9k5k12O8q4J0n8m3K13l98M11r0L2j51J24l1J5J5K3r3L48
$$ 73 -14 -250 -107 -92 289 190 165 -47 21 -63 -53 -111 -154 59 -339 72 -18 14 -137 -13 -44 -29 -14 9 -84 264
4659B64k84q1P7K7j30R4K1k16M53l76J27K0j44K92n7j22j09L57k08M9J15l64J71
$$ 264 -20 -101 -24 3 -127 -33 -12 -228 225 -151 -24 -4 -148 144 87 -35 -144 213 5 54 169 -195 -24
4682b4N3m2J23K4k12J68k08j43L40k62K60O2p9r3q3M7K07j2J34m14K06o1J0n8
$$ -24 29 -13 110 134 -78 90 -118 -261 79 -183 77 139 60 -33 -116 -69 138 126 260 -154 52 -9 1 -57
4706e7J62m1k31J22L3m8K20j65m3J45j09J0q2j60J67K07k58pRJ06J12N2l2J8k73
$$ -57 105 64 -167 -45 -12 -60 160 -5 -48 97 -12 -2 -84 -244 -77 130 -128 -135 -126 -20 92 144 112 130 -143
4731a43J94J8p0Nj83K88j02j91J80m8KQ7j82J44n6J53R3k03J86l77L82n7O0k32
$$ -143 51 69 -1 4 -179 109 7 -184 -4 -52 -50 37 -145 -1 -57 96 189 -14 172 -205 177 120 180 -52
4755e2J12J24j27j21N1J39n4O2j7k86K92O3k19J56q2k04L5R9o8J52R0j8k42J04
$$ -52 60 184 57 -64 -13 126 72 134 117 -169 123 186 -33 123 41 -163 -128 -29 -97 55 145 127 -115 -11
4779a1J06k76j12M60J2k57K26l2k02K66j05j68J17J53q0j95L10k15J01l7M1l28
$$ -11 95 -181 -293 167 179 -78 148 116 -86 180 75 -93 24 177 97 -98 212 -3 98 61 102 -226
4801b26K44N0M0j55K29m18K28J41j52J39l43K56Qr3J43p3k28K90k97K25j36K07
$$ -226 18 68 108 -47 182 -236 -8 133 -19 120 -223 33 41 -52 91 18 -210 80 -217 8 -128 79
4823G9j1p0R5j14M5R8j80J86k50K08l34K79J8P2j03J09k33k7J85p8k9P2m4J5j68
$$ 79 68 -2 93 -21 24 122 -58 128 -122 86 -248 31 49 121 18 127 -106 -133 52 -26 -55 17 -27 -12 -180
4848a80K2R9J12j32J84l00K7J85k05L26l24K03J67j33j99p0K30o6r0J20J68k27
$$ -180 -158 -59 53 -79 105 -195 -168 17 -188 138 -186 17 184 51 -148 -218 12 -54 -144 -24 144 -83
4870h3J87J15l34R9o4L3J22j28N8P2k20J40rl4J8j55K49Mj64J03k4J03j66J82
$$ -83 104 219 -115 -16 -80 -47 75 -53 5 77 -143 -3 -12 -46 -28 -183 66 70 -94 9 -15 88 -78 104
4894A04k83K35R2k23R0R4q3j06K92k63O0J33j65n5J43M6m6k01K30J19l98K36k0
$$ 104 -179 56 148 -75 15 109 26 -80 212 -51 9 142 -23 -78 65 111 65 -136 94 213 -185 51 31
4917C1r5J45P6j28q5N9R3q9J1m6R1o8Jm4r1J11J41j80M5K0J20m2k26J72M9J57
$$ 31 -64 81 157 29 -56 3 96 7 18 -28 63 -5 -4 -48 -139 -28 113 -67 -22 -2 118 76 -150 22 71 228
4943B28l70J61j92L09l37K29j4P6J53k81N4j03J74J63j94oL5k13K04l62K25%J25
$$ 228 -142 19 -173 136 -201 28 14 90 243 -38 16 -87 87 250 56 50 85 -128 76 -286 -61 -61 64
4966F4J36j93k02J77q2L9L2j42J26m6J7K64k36l8m8J82m0n4J85P2j41k12K44o0
$$ 64 200 7 -195 -18 -100 -61 -29 -171 -45 -91 -74 190 -46 -84 -132 50 10 -44 141 213 72 -140 104 44
4990D4l0P3J44k03M7P9q4j37Q2k0j62L19k54J57Q8k36J07q4K67j61k0J0r1j19
$$ 44 14 87 231 28 75 154 70 -67 15 -5 -167 152 -102 55 143 -93 14 -70 197 36 16 26 -65 -184
5014a84l1K72L02k04l57K39j4m2J57k1j45J65m96N04J0j29q1N3o3O1O7O6j34J7
$$ -184 -215 57 359 155 -202 37 23 -19 138 117 -28 137 -359 145 155 26 -55 -2 -65 -4 63 129 -5 12
5038A2m4J43q6j20N1j51J49O2p4J96r6o1K3qp9L32k33p4K8n2n1N1j5j7J21J07
$$ 12 -32 111 25 -95 -44 -195 -46 16 -58 138 42 -19 4 -4 -83 249 16 -58 -30 -82 -133 -82 -97 -114 7 114
5064A14l63J85O6L84l69jL2J57J8N0o89K11l7P76n02jj96J49L26l23L80N2k11
$$ 114 -249 -64 2 386 17 16 48 205 223 273 -416 -205 -242 534 32 31 -165 -16 310 -13 367 419 208
5087B08n37O00p01M24k16L10mK54l13L06l81J20p7O4J00q4k31K35m5p7j39J71
$$ 208 -329 271 -430 -6 -222 88 84 338 25 331 -50 70 -7 57 157 73 -158 77 32 -45 -184 -13
5109a3pl3J25lj83J25j93K80o2p6o0J5j8R0l5j15Q8J36k24K50j9j50n4J16j5j6
$$ -13 -20 -53 72 69 -114 11 -182 98 36 -40 -100 -85 -103 -13 -48 -163 -75 61 -163 87 68 -82 -136 -20 -35 -51
5135e1P3N4j99R4j80L02O4q3j73l9K05n4M6l15M29j05k91J93O3j77K1K32q9N2
$$ -51 22 76 -123 -29 -209 93 157 74 -99 -138 67 13 59 -256 173 68 -223 -30 33 -144 -123 109 20 72
5159G2j55K18j37J84k48q5L23k18J33l40L65j91l9J49k7j11K1J02J13nl0l09J06
$$ 72 -83 135 -2 182 -66 -151 172 -46 87 -253 112 -79 -118 31 4 -107 -86 16 129 124 94 -215 -109
5182a09K49l25L05j05qj51R0k1K33j14q0j1J95rk04J33O4pL6k23K26j97M7Kj75
$$ -109 140 -185 120 15 7 -144 -54 -75 158 44 -36 -47 148 139 -65 68 132 125 161 -62 164 -33 14 16 -159
5207a59P3J13J16m20L16M3J07l63J93k2k9j84K59L5l5N0k56L25l4j27K7l1J1P1
$$ -159 -86 27 143 -277 39 82 189 -174 19 -3 -32 -216 43 78 43 93 -163 162 128 1 28 -3 8 79
5231G9k18q2K30Q7lj13j14P9J74N2l01K44kj53O0l06K67o6j00L5J90q1P2q0N6
$$ 79 -139 -221 9 96 93 -20 -134 -55 119 171 -130 114 112 -41 19 -287 -20 -86 -186 -151 39 -42 30 -50 6
5256FJ33q2l34K72J10j61M4Q0n9jK2N1N6r6K01k85J41Pr7K2J9j97M6K6j1p4J76
$$ 6 139 57 -277 -5 105 -56 -12 68 9 8 30 81 137 41 242 -43 98 105 8 30 49 -148 -102 -76 -87 -161 15
5283A5p5Q6j95m1K16Nj92K55j5l5nl8q3K44q1j57j0K99j77O6l4l5k46L45P3j32
$$ 15 -60 26 -169 -210 6 11 -181 74 59 24 19 -19 -102 142 61 -96 -106 193 16 82 48 13 -233 112 185 53
5309E3L9l38L68j2O5L1k95Q9n5J92m9k44R9K07j11M1j20j48N9j6Q8j1K6K1o6J00
$$ 53 92 -246 122 110 175 206 -89 0 -55 137 88 -156 -57 150 39 80 -40 -188 -129 -145 -57 -68 -42 -21 -87 13
5335A3N7m7R9k13K59j17J2j24J82M0mj24P7l79K60n8J97j12j87K60O3k73R1j10
$$ 13 70 23 122 -91 168 51 63 -61 121 161 157 33 110 -269 -9 -67 130 18 -169 91 154 -119 -28 -138
5359a38J13lj66K94j73j5J26k43K87j43N8O7j07K91k17J06j71J06m9j61P0J05
$$ -138 -25 -28 -194 100 -73 -88 38 -205 82 -61 -3 64 -43 248 31 137 -34 72 23 -138 -68 37
5381C7r0M2j31N2m4kK06j9J03m7J1j14J6l6J96k92O9R5m1O9p1p2j8l1J69J5N5
$$ 37 -53 -11 -142 -90 -134 -136 70 51 154 107 118 4 20 -16 180 -112 -43 52 11 80 9 -63 -81 -112 57 72 127
5408A27n9J36k42L6q3R6L6Q4j7j08l06L80k70J72K16q3j1j57K13j05R7l20r1K99
$$ 127 68 204 -38 -2 -85 11 47 131 114 6 -300 80 -190 -18 198 115 104 -53 160 55 152 -168 -259 40
5432D0j33K24l76J46K67j87J46k68K0J70j1J45j73m8Q8j22J86l74J91j3j0O0R
$$ 40 -93 131 -245 -99 168 -19 127 -141 -121 49 38 183 10 -38 50 -72 114 -260 -69 -82 -92 -32 -23
5455b3q5j2j2n6K03o0J49%P2j90j00j38M20j42m0K4n2P8J11L5l25L17j26k46M57
$$ -23 -108 -120 -132 -188 15 -45 104 104 176 -14 -114 -252 168 26 -14 10 -42 36 147 182 -143 174 48 -198 259
5480B59l40O0jJ03j26J64J17m89L96k31R2q9n0K9K14j17J10l14J30n3K61k69J34
$$ 259 -81 -21 -22 81 -45 119 236 -253 143 -88 4 -85 -135 -106 108 -9 101 -213 -83 -136 125 -144 -10
5503a0%j49L16j34M5P2j20q4P2OJ12l87K68R2N1j39q9J72k25K74r5J9J44j5r3
$$ -10 -10 -159 157 23 68 140 20 -64 8 14 126 -261 7 99 150 11 -78 94 -131 143 48 67 211 196 103
5528A03k44K04j9j01q2J87n3Qj49K85k35J1Q4N2p9K01l8l53L4M77l12l3L8L1q
$$ 103 -141 63 44 -57 -139 48 -5 3 -146 139 -96 -85 -1 51 -28 173 135 -218 -184 293 -19 -52 -14 17 9
5553Ij33M8M3O0j00J60l17J55N6J99k70J75j90K86q4P4o5q6N8k31R3K69k15O8
$$ 9 -124 -76 -33 27 -73 87 -230 -75 -19 180 -90 85 -105 181 97 171 106 20 78 -153 -60 209 -6 62
5577F2r4O6R2k34L4L3L1Lj68J91Oj61J76j71J18j16J15j56J46j73L07k13K12k29
$$ 62 -32 34 126 -108 -74 -41 -10 -7 -175 16 22 -139 37 -134 -16 -132 -17 -173 -27 -200 107 -106 106 -123
5601a23K53j59J15j37J53j57J55j69K5l2O1Q0j60NJ88j95M5Oj42K60k31M06k48
$$ -123 130 -29 86 -51 102 -55 100 -69 -44 -76 -15 65 -95 -90 98 -97 -52 -46 -188 72 -159 247 -1
5624aK0L4L6ml32J58J16R3j08J53k35j0pK18l3q0m1R7j33R7q0J98n1j32j14J2
$$ -1 19 53 89 85 -247 -89 27 120 12 165 -70 -80 -87 131 98 18 -23 74 -59 38 -42 156 105 -27 -141 -129
5650a29NR2J7J9r4K05q0J32j28o3k19K19J72j53J60k11K18j47K0j58J63Mj26J00
$$ -129 -124 -32 -15 4 -90 115 35 167 39 -24 -243 -24 148 -5 155 -56 162 15 35 -123 40 44 -82 18
5674A8ll70L86q6O0k2N9p1NN4L3J09k33J48O8k83K46k96R9N0K6m4j2K03k5k81
$$ 18 15 -355 31 -55 5 -17 42 -29 -24 30 63 172 -61 87 155 -128 118 -178 -79 -29 -3 -47 -59 144 119 -162
5700a62J32J40j18P8L1j81K30j61J56k4P0n5j91N5Q3n5rj21J95j43n2J96j37Q
$$ -162 -30 110 -8 70 101 -80 150 -11 145 121 191 136 -55 0 83 28 19 -102 93 -50 -102 94 -43 -35
5724c5L0j54K68k43Q3O3O9q0P6M7P4j05k40l9oK32o6N2P9Jp9k3j26J41J99k31
$$ -35 -5 -159 109 -134 -51 12 81 1 77 124 198 93 -147 -186 -192 40 -26 26 105 106 27 4 -122 19 218 -13
5750a3n7K25k42J97j49j93K67k14J65M5R3k52O8M7j8O1O6k3n7J22j74K81j68Q1
$$ -13 -70 155 -87 110 -39 -232 35 -179 -14 31 124 -128 -60 -13 -31 30 96 73 16 138 -36 245 77 158
5774A58j50p8l2j50K71k21K94mo1j20K10J07l78K85Qk25kJ39j31P8k17L61j28
$$ 158 8 -70 -102 -252 19 -202 92 88 27 -93 117 224 -154 131 139 -86 -88 51 -80 -2 -219 142 14
5797A4R7MJ8m6q9P0p2j80K19j20P3Q4j4j53R3j14K22l14K50P5j27J17MN6j65Q1
$$ 14 111 115 133 87 -2 68 -4 -184 35 -85 -12 72 58 -95 -2 -116 106 -208 42 117 -10 107 111 167 2 83
5823H3ln8k20K50K0j02M4J90j74L2k33L40k02m7J82q8J51j09m1j36k9K2J35j15
$$ 83 80 22 -198 52 72 -30 14 204 30 62 -171 169 -33 -80 102 14 165 56 15 -121 -150 -128 7 -108
5847a08j7K18J03p8m6m6j23P0r3J22J69k23N6J33l1j45J0O3rj76L4P8J44j72l7
$$ -108 -125 93 196 118 72 26 -97 -27 -120 2 171 -52 4 137 106 -39 -29 34 25 -151 -117 -39 105 -67 -104
5872a04M9rmJ02j68K54j31m1n2M7K51j17k1K9R6l04J68l05K87M8k9k74K39j58
$$ -104 -55 -64 -68 34 -134 120 -11 -52 -104 -57 194 77 56 85 181 -123 45 -260 27 75 46 -228 11 -147
5896a47J08J2j01m4K37Q1j11J84k88P7o5J31j82M1J48l85K82O2p3q1L66k30J0
$$ -147 -39 -27 -128 -172 65 146 35 219 -69 8 -57 74 -108 -67 81 -304 -22 40 -33 -114 252 22 32
5919C2n3n6j45K25p6N8J49j34o8n6J47qJ00p3Q2j30J02j26R5L8k8m4j46n7J63
$$ 32 -21 -77 -222 3 -73 -15 134 0 -68 -124 23 15 115 42 124 -6 96 -30 65 103 75 31 -115 -172 -9
5944ij19K06k60J42J37l8j49P5r8K27k59J34J39j30J28l05N5M0J39q0L6j30J88
$$ -9 -128 78 -182 -40 97 59 -90 -15 -113 114 -145 -11 128 -2 126 -179 -124 -84 55 -25 11 -119 69
$$ [...]
8191b3
##END NTUPLES=NMR FID
##END=
