##TITLE=1H_Pr Pu-dep
 200.13MHz,CDCl3.
 8 sc
 
 16.12.2025
##JCAMPDX= 6.0         $$ Bruker NMR JCAMP-DX V2.0
##DATA TYPE= NMR FID
##DATA CLASS= NTUPLES
##ORIGIN= UXNMR, Bruker Analytische Messtechnik GmbH
##OWNER= pz
$$ XWIN-NMR		Version 3.5
$$ Tue Dec 16 14:34:33 2025 Russian Standard Time (UT+4h)  she@DPX200
##.OBSERVE FREQUENCY= 200.1313
##.OBSERVE NUCLEUS= ^1H
##.DELAY= (6, 6)
##.ACQUISITION MODE= SIMULTANEOUS
##.ACQUISITION SCHEME= undefined
##.AVERAGES= 8
##.DIGITISER RES= 18
##SPECTROMETER/DATA SYSTEM= spect
##.PULSE SEQUENCE= zg30
##.SOLVENT NAME= CDCl3
##.SHIFT REFERENCE= (INTERNAL, CDCl3, 0, 14.3821)
##AUDIT TRAIL= $$ (NUMBER, WHEN, WHO, WHERE, WHAT)
$$ ##TITLE= Audit trail, XWIN-NMR		Version 3.5
$$ ##JCAMPDX= 5.01
$$ ##ORIGIN= Bruker BioSpin GmbH
$$ ##OWNER= she
$$ F:/spectra/data/she/nmr/H-C/1/audita.txt
$$ ##AUDIT TRAIL=  $$ (NUMBER, WHEN, WHO, WHERE, WHAT)
(   1,<2025-12-16 14:32:59.23 +0400>,<she>,<DPX200>,
      <created by zg, POWCHK disabled, PULCHK disabled
       configuration hash MD5:
       00 E9 B6 7A A2 85 ED C7 34 08 36 98 17 FE 4E 26
       data hash MD5: 16K
       5A D6 C8 92 30 BE BD 44 22 16 3C 88 24 90 7C A3>)
$$ ##END=
$$ 
$$ hash MD5
$$ A7 A0 3F 64 6B 5B 71 29 B5 17 D0 6C AF B3 F0 2F
##$RELAX= 
##$RELAX= 
##$RELAX= 
##$RELAX= 
##$RELAX= 
##$RELAX= 
$$ Bruker specific parameters
$$ --------------------------
##$DU= <F:/spectra>
##$EXPNO= 1
##$NAME= <H-C>
##$PROCNO= 1
##$TYPE= <nmr>
##$USER= <she>
##$AMP= (0..31)
100 100 100 100 100 100 100 100 100 100 100 100 100 100 100 100 100 100 
100 100 100 100 100 100 100 100 100 100 100 100 100 100 
##$AQSEQ= 0
##$AQ_mod= 1
##$AUNM= <au_zg>
##$AUTOPOS= <>
##$BF1= 200.13
##$BF2= 200.13
##$BF3= 200.13
##$BF4= 200.13
##$BF5= 200.13
##$BF6= 200.13
##$BF7= 200.13
##$BF8= 200.13
##$BYTORDA= 1
##$CFDGTYP= 0
##$CFRGTYP= 5
##$CHEMSTR= <none>
##$CNST= (0..31)
1 1 145 1 1 1 1 1 1 1 1 1 1 1 1 1 1 1 1 1 1 1 1 1 1 1 1 1 1 1 1 1 
##$CPDPRG= <>
##$CPDPRG1= <>
##$CPDPRG2= <>
##$CPDPRG3= <>
##$CPDPRG4= <mlev>
##$CPDPRG5= <mlev>
##$CPDPRG6= <mlev>
##$CPDPRG7= <mlev>
##$CPDPRG8= <mlev>
##$CPDPRGB= <>
##$CPDPRGT= <>
##$D= (0..31)
0 0.7 0 0 0 0 0 0 0 0 0 0.03 0 0 0 0 0 0 0 0 0 0 0 0 0 0 0 0 0 0 0 0 
##$DATE= 1765881178
##$DBL= (0..7)
120 120 120 120 120 120 120 120 
##$DBP= (0..7)
150 150 150 150 150 150 150 150 
##$DBP07= 0
##$DBPNAM0= <>
##$DBPNAM1= <>
##$DBPNAM2= <>
##$DBPNAM3= <>
##$DBPNAM4= <>
##$DBPNAM5= <>
##$DBPNAM6= <>
##$DBPNAM7= <>
##$DBPOAL= (0..7)
0.5 0.5 0.5 0.5 0.5 0.5 0.5 0.5 
##$DBPOFFS= (0..7)
0 0 0 0 0 0 0 0 
##$DE= 6
##$DECBNUC= <off>
##$DECIM= 32
##$DECNUC= <off>
##$DECSTAT= 4
##$DIGMOD= 1
##$DIGTYP= 9
##$DL= (0..7)
0 120 120 120 120 120 120 120 
##$DP= (0..7)
150 150 150 150 150 150 150 150 
##$DP07= 0
##$DPNAME0= <>
##$DPNAME1= <>
##$DPNAME2= <>
##$DPNAME3= <>
##$DPNAME4= <>
##$DPNAME5= <>
##$DPNAME6= <>
##$DPNAME7= <>
##$DPOAL= (0..7)
0.5 0.5 0.5 0.5 0.5 0.5 0.5 0.5 
##$DPOFFS= (0..7)
0 0 0 0 0 0 0 0 
##$DQDMODE= 0
##$DR= 18
##$DS= 0
##$DSLIST= <SSSSSSSSSSSSSSS>
$$ [...]
##$SUBNAM0= <"">
##$SUBNAM1= <"">
##$SUBNAM2= <"">
##$SUBNAM3= <"">
##$SUBNAM4= <"">
##$SUBNAM5= <"">
##$SUBNAM6= <"">
##$SUBNAM7= <"">
##$SUBNAM8= <"">
##$SUBNAM9= <"">
##$SW= 18.0517328524113
##$SWIBOX= (0..15)
0 0 2 0 0 0 0 0 0 0 0 0 0 0 0 0 
##$SW_h= 3612.71676300578
##$TD= 16384
##$TD0= 1
##$TE= 0
##$TE2= 300
##$TE3= 300
##$TEG= 300
##$TL= (0..7)
0 120 120 120 120 120 120 120 
##$TP= (0..7)
150 150 150 150 150 150 150 150 
##$TP07= 0
##$TPNAME0= <>
##$TPNAME1= <>
##$TPNAME2= <>
##$TPNAME3= <>
##$TPNAME4= <>
##$TPNAME5= <>
##$TPNAME6= <>
##$TPNAME7= <>
##$TPOAL= (0..7)
0.5 0.5 0.5 0.5 0.5 0.5 0.5 0.5 
##$TPOFFS= (0..7)
0 0 0 0 0 0 0 0 
##$TUNHIN= 0
##$TUNHOUT= 0
##$TUNXOUT= 0
##$USERA1= <user>
##$USERA2= <user>
##$USERA3= <user>
##$USERA4= <user>
##$USERA5= <user>
##$V9= 5
##$VALIST= <valist>
##$VCLIST= <CCCCCCCCCCCCCCC>
##$VD= 0
##$VDLIST= <DDDDDDDDDDDDDDD>
##$VPLIST= <PPPPPPPPPPPPPPP>
##$VTLIST= <TTTTTTTTTTTTTTT>
##$WBST= 1024
##$WBSW= 4
##$XGAIN= (0..3)
0 0 0 0 
##$XL= 0
##$YL= 0
##$YMAX_a= 208398
##$YMIN_a= -381014
##$ZGOPTNS= <>
##$ZL1= 120
##$ZL2= 120
##$ZL3= 120
##$ZL4= 120
##$ABSF1= 10
##$ABSF2= 0
##$ABSG= 5
##$ABSL= 3
##$ALPHA= 0
##$AQORDER= 0
##$ASSFAC= 0
##$ASSFACI= 0
##$ASSFACX= 0
##$ASSWID= 0
##$AUNMP= <proc_1d>
##$AZFE= 0.1
##$AZFW= 0.1
##$BCFW= 1
##$BC_mod= 2
##$BYTORDP= 1
##$COROFFS= 0
##$CY= -3
##$DATMOD= 1
##$DC= 2
##$DFILT= <>
##$DTYPP= 0
##$F1P= 0
##$F2P= 0
##$FCOR= 0.5
##$FTSIZE= 0
##$FT_mod= 4
##$GAMMA= 1
##$GB= 0.15
##$INTBC= 1
##$INTSCL= 1
##$ISEN= 128
##$LB= 0.25
##$LEV0= 0
##$LPBIN= 0
##$MAXI= 10000
##$MC2= 0
##$MEAN= 0
##$ME_mod= 0
##$MI= 1.114404
##$NCOEF= 0
##$NC_proc= 0
##$NLEV= 6
##$NOISF1= 3.799351
##$NOISF2= 2.8
##$NSP= 1
##$NTH_PI= 0
##$NZP= 0
##$OFFSET= 14.38212
##$PC= 1
##$PHC0= -3705.223
##$PHC1= 10.79234
##$PH_mod= 1
##$PKNL= yes
##$PPARMOD= 0
##$PSCAL= 0
##$PSIGN= 0
##$REVERSE= no
##$SF= 200.129724274929
##$SI= 16384
##$SIGF1= 3
##$SIGF2= 2
##$SINO= 400
##$SIOLD= 16384
##$SREGLST= <1H.CDCl3>
##$SSB= 0
##$STSI= 0
##$STSR= 0
##$SW_p= 3205.1282051282
##$SYMM= 0
##$S_DEV= 0
##$TDeff= 0
##$TDoff= 0
##$TI= <>
##$TILT= no
##$TM1= 0
##$TM2= 0
##$TOPLEV= 0
##$USERP1= <user>
##$USERP2= <user>
##$USERP3= <user>
##$USERP4= <user>
##$USERP5= <user>
##$WDW= 1
##$XDIM= 8192
##$YMAX_p= 0
##$YMIN_p= 0
$$ End of Bruker specific parameters
$$ ---------------------------------
##NTUPLES= NMR FID
##VAR_NAME=  TIME,          FID/REAL,        FID/IMAG
##SYMBOL=    X,             R,               I
##VAR_TYPE=  INDEPENDENT,   DEPENDENT,       DEPENDENT
##VAR_FORM=  AFFN,          ASDF,            ASDF
##VAR_DIM=   8192,          8192,            8192
##UNITS=     SECONDS,       ARBITRARY UNITS, ARBITRARY UNITS
##FACTOR=    0.0002768,     1,               1
##FIRST=     0,             0,               0
##LAST=      2.2672688,     0,               0
##MIN=       0,             -381014,         0
##MAX=       2.2672688,     208398,          0
$$ Real data points
##PAGE= N=1
##DATA TABLE= (X++(R..R)), XYDATA
0@%%%%%%%%%%%%%%%%%qJ3j3J6j6J6k0K5k9L2l6M3m9N4o2P0p9Q9r8J09j22J38j53
40h0J68j85K06k27K49k76L04l34L69m06M46m93N44o00O65p40Q26r28J049j191
60f34J371j602J903k318K917l849N468q778J7958q8102l05348K07948K84068L53
74A11355l7775K7252l9386q9422l5332J6939J03499J50431l0997j76994q1258
85h1688O9847J06910N313m6853J5237M592n0038m2579K0104N6954K4076l581o1500
98A6794p3001N4329O2744m9757k9724M0350r167n8149J2391K8469m3612K5965
110b2368N6114p2709m7924O0840K5468k9868L976J6647l5359O768N9184l9642
122a8873n3870O1051O2426m1382p8612L0670R4588j3796p1047K783O0976K0629
$$ y = [0, 0, 0, 0, 0, 0, 0, 0, 0, 0, 0, 0, 0, 0, 0, 0, 0, 0, -8, 5, -8, 8, -8, 8, -12, 13, -16, 16, -20, 23, -26, 28, -34, 36, -43, 46, -52, 57, -65, 73, -80, 88, -97, 109, -118, 131, -145, 159, -175, 194, -212, 234, -259, 285, -315, 350, -390, 436, -492, 557, -634, 737, -865, 1038, -1280, 1637, -2212, 3256, -5522, 12436, -75666, -381014, -173066, 111002, 111355, 73580, 100832, 61446, -27976, -63308, -46369, 57130, 207561, 176564, -430, -81688, -11841, 95069, 100382, 53529, 68766, 73358, 23320, -19259, 845, 57799, 81875, 78294, 16794, -56207, -1878, 60866, 11109, -18615, 21735, 12568, -45581, -33190, -4721, -48333, -22368, 33746, -38963, -86887, -26047, -579, -30447, -26471, -9824, -45183, -38415, 20769, -18873, -72743, -11692, 50734, 9352, -69260, -38590, 55998, 42202, -28845, -26062, 34914, 55543]
134E5543m1884j4303J5286K1197L4817l4070n7459M3729O1370k8895n7924J6766
146A4173M3170r445j1293j9311k0540M8518K2892o5761l1338N7938L3283n9282
158C004l1773M6742J0487k4856q303l82P480n21p96m808j4576J1081J1281j3482
172i422j2989M774J6484p585j5385J5431l692o279K1754m376k1531J0481L0317
185A7982r872l3795K1090K5561j9674p550O809L321L984j740k907n802P607R652
199A4666j1804n71N416l056O680q75o570j360L223R665q968j4452Q964J1393m931
214G420j8899J120K0533q886j4803N637L056J18k412l362j918J808Q544o502r860
229a8406J1215L426o433j222J482K369k520J619Q76p083M571N773n913k768J741
$$ y = [55543, 13659, -644, 14642, 35839, 70656, 36586, -20873, 22856, 84226, 55331, -2593, 14173, 57343, 47898, 36605, 17294, -3246, 45272, 68164, 2403, -28935, 29003, 62286, 3004, -28769, 17973, 28460, 3604, -4699, -5081, 2399, 1878, 1082, -3726, -18302, -7221, 4060, -9422, -22411, -17637, -1153, -8738, -24123, -8692, -12384, -18663, 3091, -1285, -22816, -12335, 17982, 8110, -25685, -4595, 20966, 1292, -6258, 551, 3872, 7856, 6116, 3209, -2593, 5014, 14666, 2862, 2291, 7707, 4651, 11331, 10456, 3886, 2526, 5749, 15414, 6446, -8006, 958, 12351, 7420, -11479, -10359, 10174, 1288, -13515, -7878, -4822, -4704, -7116, -10478, -12396, -10588, -2044, -8546, -18406, -7191, -3765, -10198, -11420, -9938, -7569, -10089, -8470, -7594, -14677, -10106, -4333, -10246, -13014, -11273]
244a1273O351o84o173M795L575r51J186p57J404M15J859Q73n561J821N081m429
260b468j585P70M81N42k243J507j021p97L664k062j747K541J181M1k876J098K483
277d91l356N31N51j381j04r83R84q77j415J579q1m94R77l74M62Q56N62P30o27
296b951J555R26q73O95R3PK78p20J74n83k14J265j004o82R12Q16O82n67k77J784
316A316M68Q7j62j83J446N77j068n69n44J366k61j619n67M34M34o13j222J034
334C54Q89N47l7r3N45K015n04q67L94J222J54j355l83Q31p2O5r94o35O44j55O75
355C240oj139K09J791n34M28r52K506M99k268K27M50R17l95k010m57O03J48j149
374B108k033J162K26j68K3p08Q58J018p66j2l81J178J229j534L42J70o93P78j525
$$ y = [-11273, -4922, -5606, -11779, -6984, -3409, -4360, -3174, -3931, -2527, -2112, -253, 620, -4941, -3120, 1961, -2468, -4053, -3283, -2802, -2260, -4503, -2996, -4017, -4814, -1150, -3212, -4959, -2418, -1237, -1196, -4072, -2974, -491, -3847, -3316, -2765, -4146, -4250, -5233, -4249, -5126, -6541, -4962, -5043, -5537, -4560, -4934, -4472, -3616, -3054, -2324, -2951, -1396, -470, -1343, -648, -555, -548, -270, -990, -816, -1399, -1613, -348, -1352, -2034, -1122, -306, 376, -191, -468, 1316, 1784, 1871, 1709, 1526, 2972, 3549, 2481, 1912, 1368, 2734, 2473, 854, 287, 721, 1155, 542, -680, 354, 1243, 1790, 1753, 1660, 2205, 4220, 3716, 2849, 3243, 4465, 4619, 3264, 2881, 3712, 3640, 3705, 2711, 2076, 2720, 2565, 3240, 3234, 2095, 2304, 4095, 3561, 3989, 3037, 5543, 6042, 3774, 4001, 4451, 5368, 4973, 2963, 2506, 3109, 3257, 2108, 75, 1237, 1463, 1295, 1318, 610, 1468, 2486, 1720, 1708, 1327, 2505, 3734, 2200, 2542, 2712, 2019, 2797, 1272]
393A272q3J292n62Jj086j16J041j057J080j093N15K745q38o50J137k14Q37k31
411C990j120l13Q28J280k589k154L378p78k160n12N83R71j549m6l7J93K503j791
429F77j236K992j561j76j41j435Q87p75k89j225p79K207l455K83K653k460o39
446d472J871j238O82J337K32j92j20K755k184p64J853j201Q86M62k347O08J133
463f99l06j675P46J948j713m22J811o41P73O66j345J849N80o34p77K16L42j646
481i27N72J211l110N68J47j310K51j94n38k52P15J032k157J639J058j235J47L32
499b051o77J624p83r34l63J839k23l291J169J089k01m71j522J420J830K7j360
516b878J101N65R03K86j94L96j44K127k684l57J814M7j002j443N56R22q96L00
$$ y = [1272, 1189, 2481, 1919, 1920, 834, 718, 1759, 702, 1782, 689, 1204, 3949, 3111, 2461, 3598, 3384, 4221, 3990, 2870, 2557, 3385, 4665, 2076, -78, 3300, 2522, 362, -150, 433, 1404, -145, -191, -228, -35, 2468, 677, -559, 2433, 872, 696, 555, -880, 7, -768, -1057, -2282, -3061, -854, -4309, -4026, -1373, -3833, -4472, -2601, -3839, -3157, -1820, -1588, -1780, -1900, 855, -1329, -2093, -240, -1441, -555, -93, -2440, -1832, -699, -1005, -2680, -1934, 14, -1699, -2121, -310, -951, -178, 488, -857, 992, 1572, 938, 161, 377, 719, -927, -355, 856, -2254, -1686, -1539, -2849, -2598, -2792, -3330, -3582, -2867, -1835, -3992, -2353, -1295, -2530, -2383, -2051, -2728, -1104, -1887, -2821, -3184, -1345, -1568, -4859, -3690, -2601, -2802, -3273, -4795, -3375, -1545, -1518, -2878, -1777, -1212, -309, -23, -217, 179, 35, 2162, -522, -879, 935, 982, -20, -1463, -907, 15, -881, -581]
534e81L06n13J085o76O67N63r30J249O03m78n59K21M23j180o07O17o43k0p23l75
554a551O63k70J3P44n26N3J105j05N90l94N23Q30j236N92K45j20r8k70q82M63
574C69k4m80p47J077j41o60J398o9m11J157N29q87J234L98j006l06J531q31j459
593F72J152p05k87M13r53j055J239R19j505P3J084k37O49O81j184K96K146q64
611B534j356J056J91j437N25k6j595O30O75j187l95R19l43n08J259n06p39K244
629A941j65j364J404N10j095L8Q78j361j94J042j085j479J282Qj238N45m5m57
647h35J160l3l06L30J285o73o33J466q3q01O30o87p80P97M5j643n55J586p95p49
667a274Q74j91j58J180q33l37J164N74m50jL65l64q54K179j768j247J726j168
$$ y = [-581, -275, -788, 297, -379, 288, 851, -79, 1170, 1773, 1295, 736, 957, 1380, 200, -407, 210, -433, -453, -1176, -1551, -888, -1158, -1145, -401, -927, -874, 231, 126, 716, 322, 845, 1675, 439, 1031, 1276, 1156, 1058, 788, -94, 369, 345, -135, -882, 195, 54, -606, 792, 723, 312, 1469, 1998, 1111, 2345, 2743, 1737, 1431, 2962, 2131, 672, 1824, 1119, 832, 1245, 292, -763, 476, 1395, -110, -37, 1047, 810, 1459, 2140, 956, 1252, 3398, 2534, 1178, 2234, 2425, 988, 1513, 1487, -108, 522, 1197, 10, -385, 534, 191, -317, 942, 436, -303, 1941, 1776, 412, 1816, 2326, 1231, 1269, 2147, 786, 592, 1634, 549, -930, 352, 360, -878, -333, -378, -835, 325, 292, -14, 316, 1601, 928, 295, 1761, 1678, 877, 1507, 820, 40, 837, 882, -761, -1316, 270, -525, -1274, -400, -591, -749, 431, -402, -739, 425, 999, 549, 548, 913, 549, -305, 1874, 106, -1141, 585, -583]
685e83r9q0k92k80M36N48j380N23J324j088N50P82k23l89O38j46q1o40J424j606
705f62m36J229j851N04K65j077O21L22n04J81M21R03p86k09J478j17l49O35j173
724f05O37Q24r94m54k30J43o17l72O63m49l37K88l11M91Q64j064J705l18P57J25
744G46k5M12j365q6O73n45L27q32K68R1j689J311k90k74O43m99J261k20o85J440
764F62k86O9L09l93K62l69k44L90r29J78j5j021N17l15j55L91m43J099n45K66
784e72R57o59N96J49p2O85q35K18K23p25K72m86m44N95j262R06J69r15J067n84
804g17P59O17m41R87o0m55Q13m32N75j99n03O63j117N04j75l68l33l29L81J17
824B87p63R76l78n3Q56m22K87K13p04J200q12j33M88q18j38O7l02J73r33L3K76
$$ y = [-583, -682, -762, -1054, -1334, -898, -350, -1730, -1207, 117, -971, -421, 361, 138, -251, 387, 241, 160, -480, 944, -662, -1098, 131, -1720, -1216, -951, -2028, -1407, -1085, -1589, -1408, -987, -84, -870, -1079, 399, 282, -67, 568, -605, 32, 856, -138, -592, -822, -679, -1296, -1668, -1005, -1454, -1791, -1503, -1814, -1323, -459, -1523, 182, -136, 621, 746, 721, 1133, -232, -318, 355, -190, 137, -695, -427, -336, -2025, -714, -1004, -1278, -635, -1134, 127, -93, -778, 662, 376, 445, 754, 361, 623, 254, 10, 400, -529, -351, -366, -1387, -870, -1185, -1340, -949, -1392, -293, -838, -572, 385, -274, 322, 471, 399, 1084, 249, 467, 690, -35, 237, -249, -693, -98, -1360, -454, -285, -1200, -133, -717, 42, 659, 218, 1205, 1145, 690, 1503, 1071, 1646, 1447, 944, 1607, 490, 994, 819, 451, 118, -211, 170, 287, -476, 500, 122, 69, 925, 503, 790, 1003, 299, 1499, 687, 554, 1042, 224, 86, 153, -149, 24, -909, -876, -600]
845f00p11O56k49J26Q73o40J257j71l5N54l66L83qo14O49n75n2J26q54M19k09
866d1j66M41n03M03K85k31R03k5N55k71Q5J70l97J2N92q85J8j81k81j01q95K2
888d91K40l95J70k22j51O18j50K32R7k56R42k30k34J91m45M42j74o13P8l85l5
909g71K10j086O34K89K95o88J33M75P00l14M73J03o9Q34j1o31l5M36m12o12p5
930a22J62n18P70r21m85O82L37k74l58O60L16J94K39m76l2Q94l87j019M94J93
950C49m68m84r2n59m7Q98j016l56J014l66j00P73j90J53P76M5o68M23P38k80p12
971a69O95n71j30M58p64o76P19K81n50j22P95p10Q53R16j356L8J754n06r30O23
991F48q2r2l05m03m77M74O03p29j387J556q63m03J102k64q74J937n1j009P02J366
$$ y = [-600, -1311, -655, -904, -778, 95, -545, 712, 541, 506, 1060, 694, 1077, 1069, 455, 1104, 529, 477, 603, -251, 168, -41, -207, 234, -269, 134, 419, 188, 1091, 1066, 1621, 1350, 1435, 1605, 1208, 1220, 1812, 927, 945, 764, 483, 382, -513, -491, -251, -646, -476, -698, -849, -231, -381, -149, -52, -308, 634, 404, 170, 361, -84, 358, 184, -429, -351, -736, -771, -561, -1647, -1013, -724, -429, -1117, -984, -509, 191, -123, 350, 453, 384, 1218, 1207, 576, 541, 977, 565, -47, -122, 40, -478, 292, -629, -1114, -432, -95, -369, -727, -67, 249, 443, 682, 206, 174, 1068, 681, -338, 156, 349, -119, -603, -695, -1254, -1301, -403, -1419, -1775, -761, -1127, -1227, -454, -644, -491, 285, 330, -338, 85, 823, 543, -169, 526, -45, -175, 283, -481, -1157, -438, -157, -707, -829, -34, -744, 109, 1025, -331, -293, 1461, 955, 25, 648, 566, 474, 169, -234, -711, -237, 366, -363, -1750, -194, -1057, -1460, -358, -622, -1496, 441, 390, -619, 83, 1449]
1011A449j186o35J101m59l86M59n43k24M55l57o53K40P90r64R1J751j259k7J564
1030A207q86j57J186J39j206L93R13r02p57J088q00n66N94m46k95L65mp97N64
1049c67M39l09PJ101j588P06J352q59MM59o61n93L58K81j441K71Q45j229K9J022
1069a73q79O26K40k28j44J241O38j197J62J445j3m10l05q98Q98K6k79n00m59Q27
1089F18p47l61N39k22Q99K10j249O26O39j10O4L4L36p54N6L05j243M08L59j586
1109a179Q65n38r0J30Qj85P7M02J0o23K54N47k22J132n11m43Q62m58Q03j218J8
1130c59M78l84No87l06J368l25j28P07r0M85n75O54J05k22P64k96o08N62l27K02
1151A023n94m73L39l77j54L15n84J52N8k48L83j88O44J80m67K40k68M5M59q44
$$ y = [1449, 263, -372, 729, 270, -116, 343, -200, -424, 31, -326, -979, -739, 51, -913, -822, 929, -330, -357, 1207, 321, 164, 1350, 1489, 283, 676, 1589, 687, -70, 1018, 218, -348, 246, -200, -495, -130, -134, -931, -367, 72, -237, -230, 871, -717, -11, 1341, 482, 486, 945, 284, -309, 49, 330, -1111, -840, 5, -1224, -1195, -173, -1052, -426, -186, -414, -558, 683, 1321, 124, 286, 1731, 1718, 1308, 1003, 105, 1003, 1029, 750, 250, -209, 618, -129, -490, 49, -173, 726, 936, -313, 313, 952, 842, 906, 940, 1276, 522, 578, 883, -360, 48, 407, -1179, -314, -852, -942, -812, -804, -989, -912, -510, -500, -1123, -869, -322, -544, 588, 77, -366, 496, 38, 841, -377, -359, 119, -265, -260, -947, -1253, 115, -210, -338, 369, 279, 764, 189, 843, 948, 726, 1490, 1194, 586, 1148, 821, 1023, 429, -44, 295, -82, -236, 79, -505, -353, -295, -543, -160, -348, 296, 476, 9, 249, -19, 26, 485, -359]
1171c59J48L6o45K98o16N6K88m51N39m85R8K81j53O20L19k68P32l10M3M74l64
1192B81K51m95K25J01m61J36L32q31l39KM07M63q9K78P2k45N54n28O56L20j14
1213I76m54J8n41M44m8j80n52P8J11n47K81l66j25M46j29j48M56pL66k70K12L37
1235C58l03R5J99o62J82k59J08k69l67L96j57Q1R7j91P30k56j01N91j25K39R1
1256D77K17J68l19K21J41n65M6k74j20J99n10L62l18M9O7l77M72K85l40L58p1
1277A68j11L49q9N6k1R8j33l33m29K57k5j79j79l21L04l7J08K18J5L63J1J12q9
1300A13K39K99%m36K34pk35k25J7j57j30O1Ok13J57L77j30M0L4L48J34j99J44
1323D71K58lJ6l18j23mk38J42n86l7J91m05K19k32K36L54l16K15J09J85J52J22
$$ y = [-359, -211, -175, -820, -522, -1138, -1082, -794, -1245, -706, -1191, -1093, -812, -965, -345, -26, -294, 438, 128, 171, 645, 281, 532, 37, 262, 363, -98, 38, 370, -461, -800, -798, -391, 72, -17, 261, 333, 88, 642, 114, 770, 1090, 976, 522, 540, -1, 443, 395, 215, -337, -259, -148, -695, -414, -780, -905, -459, -588, -736, -280, -287, 79, -191, 21, 358, 55, 150, 349, -313, -131, -390, -282, -551, -918, -522, -679, -598, -501, -692, 38, -218, -319, 272, 147, 386, 477, 694, 862, 543, 764, 905, 340, 386, 112, -8, 191, -319, 43, -275, -226, -159, -536, -64, 221, -119, 239, 168, 57, 406, 317, 373, 352, 450, 317, -16, -445, -188, -213, -392, -571, -892, -588, -625, -517, -299, -284, 79, 90, 202, 113, 352, 651, 651, 215, 449, 442, 207, -18, -1, -158, -288, -227, -221, -434, -277, 100, -30, 10, 44, 392, 526, 327, 471, 729, 726, 742, 424, 301, 297, 59, 201, -385, -422, -231, -636, -417, -649, -413, -59, -375, -160, -51, 134, 286, 408]
1345D08k46J87j96K75j67K6m54K6r0r5l01M82r4m44K99K47K0L44l52l6M62K63
1367E64M77l90K32m00QQ4m80Nk3l36p8r6K7k25M9L12j55K01N24m47K29J90J60
1390D32j10oj62J81o7Q2o96J75R0k47n6r1m10N39J71k99j27L53M33p93K84J138
1412H14j82n25N62k04p40O84n2q1o93K80l62J40L46l57j37J072m51n57L85J01
1432D3O9K4L90n21K15M24p21q6L21l64J4l32L90l69j91K70k97j12N75k10J29J43
1454a96M5N60k0o89O40J43N67j055J53J37m81N5pj24j11K04q5l57L30K25p8p7
1476b21LM25P67J43j067K10l14R69o04l55K92o38L47m8o90J90N11m03j57M52L7
1497a51o9kN04o18O17M15q06l5K10m8K57n39K07O7m03J35o11K45O86m7p30N24
$$ y = [408, 162, 349, 153, 428, 261, 287, -167, -141, -231, -326, -627, -145, -239, -683, -384, -137, -117, 227, -125, -161, 301, 564, 1041, 651, 883, 483, 491, 575, 95, 100, 77, -259, -337, -433, -406, -631, -582, -270, -425, -224, 300, -147, 82, 272, 432, 322, 316, 154, 335, 268, 350, -346, -171, -81, -328, -384, -475, -885, -346, -175, -474, -601, -248, 185, -608, -324, 814, 632, 107, 669, 465, -275, 409, 357, 276, -417, -137, -499, -359, -13, -370, -507, 565, 114, -443, -58, 43, 112, 136, 526, 5, 220, 644, -77, -163, 158, -206, -192, -524, -134, -503, -694, -424, -721, -833, -258, -468, -339, -196, -151, 409, 389, -300, 340, 483, 1050, -5, 148, 285, -196, -141, -148, -272, -383, -179, -264, -621, -291, -66, -144, -221, -218, 207, 974, 1117, 50, 260, -54, 915, 311, -44, 248, -390, -43, -91, -781, -591, -80, -483, -640, -188, -151, -220, -222, 282, -336, 281, 696, -110, -145, 65, 17, 274, -265, -58, 9, -394, -259, -870, -625, 61, 14, -716, -192]
1519a92K86K27P16r30j78L19P73n68k5K72m40j09p4n20J08K87j47m21J46M93o8
1540d5j39K10o70J017K48p62K78K58K69L70j082k14O91l30k56J30n16M16j62k28
1560e17k79L02N00L8L79o24L78N92n63k86O32o51O98J35n70l49M6K9j12r7L04
1581a5m61M01On48Q67P4J2j79k18N42J39j66k07k36J70M30q70J74L9k67L09p55
1603g59M33j50K43L6j83k1M74k6J55K73p11P02m39P7j92J87J6o59J09r2K56K20
1625e1o93Q79O35m85j60j77rJ81Q9O2J78m60O72m35q9m7J50l49J64k53L7l22L58
1648a25k97j41L04J17M4K23j01J03J9K18j62k26M57k09m22L73l19j98L24k86o8
1669c72j63k4M82k81K01L22p9J79J36l02N71l44N3j13Q5L8k58o3L73p89j09J10
$$ y = [-192, 94, 321, 1037, 107, -71, 248, 1021, 453, 428, 700, 260, 151, 77, -443, -335, -48, -195, -616, -470, 23, -45, -184, 26, -644, 373, 621, -141, 137, 395, 664, 1034, -48, -262, 429, 99, -157, -27, -543, -127, -289, -517, -796, -494, 6, 44, 423, -201, 177, 769, 206, -80, 552, -99, 599, 734, 164, -185, -139, -110, -222, -319, -15, -476, -75, -69, -617, 250, 324, 336, 157, -61, 481, 620, 454, 247, 11, 181, 611, -259, -85, -46, -313, -4, -759, -326, -476, -233, -197, -380, -401, 73, 47, 202, 475, -236, 466, 27, 104, -88, 99, 115, -544, -435, -527, -271, -51, -744, 135, 770, 285, 125, -52, -61, 120, 209, 271, 449, -11, 661, 226, 137, 90, 240, -109, 55, -198, -161, -483, -125, -422, -563, -259, -142, -98, 125, 24, 127, 146, 364, 202, -24, 433, 224, -198, 175, -144, -342, -18, -304, -372, -535, -559, -77, -358, -157, 165, 86, 265, 401, 99, 670, 326, 379, 266, 351, 389, 131, 68, 441, -348, -457, -347]
1691c47N9j97J81N8J9L00k88j11J34O03m71LL79J25j81J55m05Q2k76J92o34P76
1713A56k76n06M98l12J02K92k28K71j32O5L33j6L51k28n4M93m65k83K71n30K48
1734E0k6j61m2J03k1j13k25K60K73PL06R2n10J81L37m0p8M3rm23J66l08m19L83
1758a74k56L27q8j82L44L9Mj74k11L38J47J96M58k82m95J22l8J1k00m35O66j136
1780a019J495j060K37J066j388N82K11l75L25J90J75n9j51K0j37J69k29J21j38
1799C5l63n1J65n3N8P2q1J06j42N2M55j13O7l8J47j22O0j2j06QJ0l05l2J87k3
1824a9m10K58j84K14m6o9O6P3K51r2j14M69l26O03m47K34m73p3P42p36n38J129
1846E12q39o76J011M68p76N19p63M0K23O19k88J28N2L91M76r37N9o3L05l82K33
$$ y = [-347, -288, -485, -304, -246, -227, 73, -215, -326, -192, 411, -60, -57, 322, 447, 266, 421, 16, 98, -178, 14, -620, 156, -120, -626, -128, -440, -338, -46, -274, -3, -135, -70, 263, 247, 598, 370, 316, 809, 344, 61, 332, -198, 50, 24, -137, -179, -76, -97, -210, -435, -175, 98, 105, 411, 503, -7, 174, 511, 471, 393, 436, 427, 4, 170, -138, -557, -174, -430, -103, -191, -373, -29, 10, 14, -160, -371, -33, 114, 310, 768, 486, -9, 113, 75, 86, -114, -549, 117, -1019, 476, -584, -347, 719, -669, -87, 124, -251, 74, 264, 439, 380, 229, 249, 112, 281, 52, 173, 35, -328, -379, -214, -267, -209, -137, -218, -112, -254, -202, 253, 140, 207, 169, 316, 194, 254, 242, 136, 144, 154, -151, -183, 4, -19, -429, -171, -355, -141, -187, -256, -190, -117, 134, 42, -72, 397, 71, 674, 227, 461, -12, -85, 657, -79, -617, 512, -327, -1003, 8, 476, -300, 219, -544, -504, -281, 338, 50, 178, 230, 621, 1097, 160, 219, 156, 461, 79, 312]
1867C12o95L50l4k69J87K22n17K49K59J58mk56J04r3K75K48n41J62j8k0R3k77
1889a05l79m0J26Q0R2l30l4R38j10L72k44J2m65J33M92j18p7K74k95n97K39M01
1911C65n51M41k63j34J44P9M36p00J21K70N34o22k48K76j97L27k76K50J5l53J59
1932G3l76K02K36r63L48k38L87N97j018L46J92L14q44Q98Q6K16n49L94l30j3J020
1953I78o78q01P23p0l87K45nj70n38M97K82l71R44j27r21J42Q75J31n71k75j46
1974b43q21J599Lm78L34q63L81L17p40K31J77J14l99K77R4J78lL73m41n6L78j70
1996B42n8j80J86j82m5O3j57J06q2m3O8o58L69J067k89l97PL31J87J72m87N89
2018H09n76k99K15m34M17M84j231P22k72p2l63M49l26m83J102P6l15m22R20l44
$$ y = [312, -383, -33, -67, -336, -149, 73, -444, -195, 64, 222, 218, -38, 66, -27, 248, 496, -45, 117, 99, 79, 172, -105, -484, -524, -398, -318, -226, -556, -590, 348, 238, 610, 366, 378, -87, 46, 538, 420, 343, 617, 322, -275, -36, 365, -186, 255, -8, -142, 2, 81, 517, -183, -62, 208, 742, 120, -128, 148, -49, 278, 2, 252, 267, -86, 73, -303, -101, 135, -828, -480, -718, -331, 266, -752, -406, -214, 100, -744, 154, 240, 456, -93, 301, -29, -42, 978, 300, -501, 222, 152, -235, 10, 5, -165, -703, -206, 76, -295, 649, 522, -399, -257, 618, 749, 178, -97, -243, -1064, 535, 538, 60, 394, -469, -88, 229, -511, -280, -103, 11, -388, -111, -17, 161, 158, 531, 90, 34, 412, 242, 184, 4, 190, 8, -37, 26, -131, -25, -107, -150, -82, -740, -371, 696, 407, 10, 17, 348, 535, 707, 220, 809, 233, -66, 149, -285, 132, 616, -615, 107, -165, -237, -600, -151, -477, -960, 142, 218, -97, -519, 401, 57]
2038E7j73R5l62K16M83j36m77O07o1n26L98j5j53J70j24J8J23j23M12l61J01L14
2060D83k71J14p1j79K81l38j28o9J39L8l99J24J96j39J87K01m78L88kR6j37K62
2082B98j91N0Q9L6l67k0m7j81jJ67o0k41K60J90l73M82k06R9K04L8k7L9Mp4J93
2107C61j21p1m94N29l90l90L68M54j98M86p36q4K15J44mj35M27l50j05L62k01
2128F7N1J83k60M13k15j37Q8m73j75M66q7k27rJ69J44n4oL43k64P0L36n20J5J60
2152G8n6J7n9J64k22k33K42K57p5L2n6l99K41K57k93N4L82k6j74M7J43k83j11
2175g3K69j78J66l10J61m12L18p3k55J55K05J3j44L96l8p7q7K2N3J2O2j58J14
2198A41r2k83K09j54R6p2P2j62K32k15J06o6M26j94J36J80j53n3J50j91K00k13
$$ y = [57, -116, -21, -383, -167, 316, 180, -297, 310, 249, -277, 121, 106, -47, 123, -1, 17, 140, 17, 429, 68, 169, 483, 212, 326, 255, 76, 357, 19, -109, -178, -39, -1, -400, -276, -80, -219, -32, 169, -309, 79, 77, 173, 36, 298, 107, 157, 246, 282, -85, -105, -152, -333, -334, -167, -227, -468, -208, -18, -391, 91, -115, -16, 188, 226, 199, 238, 242, 168, 361, 240, 169, -325, 204, -186, -576, -208, 246, 48, 534, -202, -286, -71, 73, 69, -66, 361, 11, -94, 268, 67, 118, 301, 41, 454, 239, 102, 190, -283, -458, 8, -79, -306, -315, -146, -2, -56, -62, 281, 17, 87, 423, -97, -82, 78, 22, 39, -20, 144, -78, -311, -69, 188, 113, 145, 89, -310, -69, 188, -105, -51, 331, 305, 131, 178, 321, 38, -73, 196, 18, 184, -126, 35, -377, -59, -132, -387, -232, -27, -14, -158, 238, 200, 123, 36, 58, 111, 123, 185, 27, 141, 49, -234, -25, -179, -83, -155, -83, -245, -13, -228, -122, -188, 238, 44, 180, 360, 207, 154, 304, 113, 313, 100]
2220A00l3k05J32K0j8j36j91rL14l8j38O5J00J12L3L4jJ17R3l17K0j57R2L4j75
2245a52J13p3K93l49k3J08m7J72k57L08k50P94p47J58K14q3J5o4j15k62K24N4
2267C1j38qj72J8j30L36j30l1M58k43q8M21m02L83j19K3K6r3L26l94q1M2k92N3
2291b04J95o3m2n0p8M56l77K2j3L48k79N2j9M19l10J01l66L35J38j91j98K2R2
2314a0j73Nr8O6J24P4k2m4K80k92L32r5M2m9j24J82j21j36J46j17N4k03L2K80
2338A33k91j88L58K6N1j36m8J18P0J90l59K52J14m09J60J10j01n8J0j36O5L0r8
2361a37M7K6P7q9L26n8j9p0J73j64K30k40R0l39%M86n69pJ60k83K02m2q2L13r0
2386e9p4N8j77L78r5L8P28m24m0K14l45r9K29l38J33o2r8m16L33m1l9J54J81k74
$$ y = [100, 67, -138, -6, 14, -4, -140, -331, -340, -26, -64, -202, -137, -37, 75, 108, 142, 141, 258, 351, 34, 54, -103, -11, 23, -152, -39, -112, 181, -168, -191, -83, -130, 42, -215, 93, -157, 637, -110, 48, 262, 179, 194, 130, 15, -247, -23, 31, -107, -115, -287, -269, -399, -63, -193, -224, 234, -9, -97, 324, -78, 305, 186, 209, 235, 142, 468, 74, -7, 35, -257, -204, -9, -72, -114, -164, -242, 214, -163, -141, -154, 194, -85, -33, -52, 367, 57, 158, -208, 127, 265, 74, -124, -102, -10, -183, -178, -276, -210, -86, -12, -34, -78, 202, -90, 242, 147, 189, 140, 16, 198, 77, -59, 87, -30, 24, -179, -147, 133, -158, -346, 12, 38, 89, -47, -95, 23, 93, 283, -76, 176, 290, -119, 41, 151, 50, -8, 2, -134, -69, -39, -137, -90, -64, 13, -76, 250, 192, 173, 103, 276, 112, 342, 102, 192, -147, -147, 339, -230, -237, -77, -360, -158, -200, -282, 31, -59, -133, -75, -252, 126, 31, 69, 797, 373, 333, 547, 202, 103, 332, -6, 127, 65, -33, -449, -116, -157, -196, -42, 139, -135]
2410a35J38j26N6J94O8k1k20M6L12k09J6j80K03n7j56N5J70o68K45J08j55K62
2432e4J55l05r8N44M0k85K05P45j031K24p11O03J80n22l02p63J113L70o60O11
2452E9n74J83M63m62K72Q7j75K84L54l96k53K22J67l74L14R0k87j55J10J05j12
2473g8K94l48K98l23J66J05O1j97K15j82K95j25o8Qj10J40l36L0P1k13J53j29
2495b73Q8J41n1L37k11O4pJ56K7o6j34J25q3L00j63j29o7m6k52K45j67nrj6p6
2520b72J50j06K27j88JJ51L36n26J0M64m41J96J50q9j27l5O0l19M95k61J9r1k21
2543d17K42k36R26m96L87m96L82j61M26m03j39k13K10k27R1j3j66K04l35L42k14
2564c06m41O65J69j36k81M70k14K95Nk69K91k76l83J1L41j7l54O34l88K31J1o72
$$ y = [-135, 3, -123, -67, 127, 195, 174, -46, 0, 312, 103, 119, -61, 142, 85, -71, -16, 154, -514, -269, -161, -316, -54, 101, -204, -302, 242, 282, -3, 202, 947, -84, 140, -571, 32, 212, -310, -612, -1375, -262, 108, -552, 59, -515, -332, 131, -331, -59, 28, -147, 137, 491, 95, -158, 64, 231, -143, 171, 261, -26, -181, -71, 34, -78, 216, -132, 166, -157, 9, 114, 175, -22, 193, 11, 306, 181, 113, 121, 11, 151, -185, -155, -84, -297, -144, -273, -185, -44, -95, 242, 31, 95, 88, 244, 271, 205, 71, 196, 113, 413, 250, 121, 54, 8, -244, 1, -166, -171, -180, -196, -272, -122, -228, -1, -189, -188, -37, 299, -227, -217, 247, -194, 2, 152, 63, -64, -99, -39, -358, 137, -124, -105, -196, -417, -175, -411, 515, 19, 406, -90, 292, 131, 557, 154, 15, -198, 12, -215, -124, -137, -303, -99, -434, -92, -306, -747, -82, 87, -49, -330, 140, -74, 221, 226, -43, 248, -28, -411, -400, -59, -76, -430, 204, -184, 47, 58, -614]
2586f14M48N40m28l18O63K6K62l94P5l5N21n81j76Q8k2k56N53q1p26M62j76k31
2608d00L02K19J35l14j49J36o2M58j07j70L61l01j37N4J19j68o1j43K39m6O3l70
2630c42K61J45j87K16l1l0j9K07K1r2k65L87p2q9J9j54o4J10L5p6r2M0J03r3M6
2655a6j63M9kJ55J07J59k80j51J57j2L8r5l6j29k7L76j88p5lJ14k20J84j00K53
2679I5k08J81N1K41l64R7O9p2O2R5N7j152L85N07n06L16K5j19J41K42j42k60M76
2702B17j39q5o7K67j02k0j56J44j22j18L60l73L74q3j52J85j58n4K72k68J97L39
2724D58n58M38j41j40L2j82J95j94O9k0j03N3K8K12l58K32l33K89k38M29j20J52
2746B00k48N2J6o3J86J67k68J33n4n55R7J64l68L55n3K28j69k15N40m04L02j72
$$ y = [-614, -166, 374, -54, -372, 291, 317, 579, 185, 260, 225, 746, 165, -11, 77, 55, -201, 352, 271, -455, 7, -169, -400, -98, 121, 256, -58, -207, -71, -133, 325, 218, 48, 409, 108, -29, 25, 144, -24, -85, -228, 11, -35, 28, -342, -81, 64, -123, 93, 62, 32, 13, 220, 241, 149, -116, 271, 199, 110, 129, -25, -89, 21, 56, -20, -112, -72, 31, -62, -16, -179, -130, -132, 23, 130, 289, 9, -142, 15, 3, 41, -54, -90, -219, -246, 130, -58, -133, -136, -22, -242, -58, -158, 95, -113, 68, 119, 360, -4, 93, 162, 90, 152, 247, 304, -848, -463, 44, -462, -146, -121, -240, -99, 143, 1, -259, 217, 78, -7, -74, 193, 91, 71, -85, 59, -63, -181, 179, -194, 180, 97, -55, 130, -28, -82, 190, -78, 119, 458, -100, 338, 197, 57, 89, -93, 102, -92, -23, -43, -146, -93, -65, 147, -211, 21, -312, -23, -261, 168, 48, 200, -48, 4, 20, -43, 143, 310, 42, 175, 121, -434, -337, -173, -541, -186, -239, -11, -180, -395, 145, -259, 43, -129]
2768a29L26J16l51K63k41lOK17m8j42j60k75K45M7k04lL08k5m0j36K51j52R7k07
2792b40M05M4m2J01m12k38Q6O12j73M1j89m9J5L9o1j12J85o7J2J06m5J38j58K
2816@J7N37n45J21j14j30K01O8k33KKJ76j22o3k10K23J88j85J73n1j11L7L2J92
2840B05k51L14k92K39L1j53k16K37j2m41K13q0K40j33N7J48j69J2J13J34l4j83
2862b1MM2R8K8j57l54K80L3n8o0K38k56R6k6J02j73L77k63J43l3J11J24k63L9
2886E1K1J74j54O5k41J35n4J47j39k54r1J69P7P1j62R8J7R1PO%N3nl2O1k36K4
2913a01O4Kk30K70k71K70j49J94r0j12M9q2K15J79k25J02j23L34j42J27k92L14
2935C03o28R76Q6q38R8k10M71l08M5Jj41O6L3Q6j34K19rk37K40J58j97j96L0j27
$$ y = [-129, 197, 313, -38, 225, -16, -19, -13, 204, 156, 14, -146, -421, -176, -129, -333, -336, -28, -53, -93, -229, 22, -130, -33, -240, 165, 209, 167, 268, -144, -382, -296, 316, 143, 184, -5, -54, -39, 0, -61, -173, 12, -55, -43, 63, 18, 156, -2, 0, 17, 554, 9, 130, 16, -114, 87, 155, -78, -76, -74, 102, -20, -83, -293, -70, 118, -67, 106, 55, -56, -19, 13, 205, -46, 268, -24, 215, 246, 93, -123, 114, 102, -339, -126, -206, 34, -99, -42, 106, -63, -51, 62, 196, 162, -21, -17, 25, 123, 151, -6, -360, -80, -47, -105, -165, 73, -183, -87, -113, -11, -184, 193, -70, 73, 40, 151, 275, 12, 51, 72, 246, 92, 157, -84, 51, -3, 144, 5, -249, -340, -171, -94, -23, -185, -87, -70, 21, 28, 34, 34, 87, 82, 50, 111, -125, -101, -37, -35, -265, 5, -266, 4, -145, 49, -41, -153, -104, -186, 29, 208, -17, 85, -38, 296, 154, 281, -11, 303, -325, 651, 737, -101, -3, -213, 258, -50, -5, -4, -145, -79, -46, 40, -94, 125, 116, -121, 119, 277, 80, -116, -86, -213]
2959b13o7J20n0J01k11M4M16k92J16K57l56O70m9l63J90n42M36o45K85L95l07
2980f5J7Ok61k75M60nj91N6K66N8k7n77L01L42q3J14o30J45R97m72J55m03Q9l36
3004c19L05j47J71j75L24l84M43K72m03k03k13J04J105J0r64L45l6k77q0K79k71
3025a14L4K79l36k85N33j19j17p1K13j79K5JK68k0J56j4j19j59K78l35lL16j59
3048G3m17M46j55j54M8K57k87K53N9j90K50lk00K37j32l4R0r0R9Kl4k62J59J33
3072A48o0k58J59j45K56k70K38j11j04K76k08L09n9j28k42K81j13j62L37k02l0
3093h8qM2N56l12m58P34p21N23l37J47j6J47r3j02j6R3p4k4j9J03j88J61k65L49
3117A34j52q7K12j39O2k25o0L40k66K84l67M92r6O6N0k98L52k92K03k14j71J07
$$ y = [-213, -280, -160, -210, -109, -320, -276, 140, -152, -36, 221, -135, 535, 486, 123, 313, -229, 207, -438, -153, 242, -65, -48, -42, -303, -578, -118, -123, -314, -258, 8, 66, 39, -538, -237, 105, 22, 136, -494, -349, 648, 176, 331, -72, 17, -319, -14, -161, 10, -165, 159, -225, 218, 490, 87, -116, -329, -225, 880, 890, -74, 271, 235, -42, -122, 157, -114, -80, 199, -137, -422, 111, -8, -125, -196, 17, -162, -137, -136, 132, 112, 268, 254, 135, -24, 254, -81, -84, 232, 73, -344, 102, -53, -207, -159, 98, -189, 64, 123, -67, 183, 180, -20, 217, 85, 51, 141, 51, 150, 152, 118, -144, 15, 148, 88, -170, -11, -156, 100, -170, 68, -43, -147, 129, -79, 230, 171, 43, -199, 82, -31, -193, 144, -58, -88, -96, -54, 502, 190, -268, 466, -255, 268, -69, 78, 62, 209, 116, 14, -2, 91, 17, -7, -26, 77, -111, 50, -215, 134, -18, -105, 107, -32, 30, -195, -255, 85, -181, 103, -264, 228, 132, 198, 248, -50, 302, 10, 213, -1, -172, -65]
3139f5J43p4J31j58L9j87J84K2R9k09M23k33j70P7K42j39O6k2k55K8j19P0m5K17
3163F5r4j39J05l5J00o6m1jj5K15P6k93L23l28K18k64K38K15j242Q69p5M34j34
3186A31J71r1K24j90l92K3M37o16J10n8K3M12m04p8O5J38L16m00L38l34J97l59
3208c37k36j86J179o58p9j89N04o1j5K63j37J36j85l27K75m21O24M55o66J68k71
3229a64J68j88L00j60K3n4p3J40K35m2j51P9J14j84j26J00J04n9p1k0j13J8K31
3252A07j92j07O8K66k39K70j39q3R4n8P6j84K93k59L06j61p4R0j0l4K3r4j61J32
3276g0j4J59k60J88M28n31J40J07N0m11K63J42j91K61n09L96k80M9R9J73m97L56
3298D8m53o8J15l3K76M14m24L34l68L49k81L2N4J20k16M77n79j20K86L75n27J92
$$ y = [-65, 78, 4, 135, -23, 16, -171, 13, 35, 134, -75, 348, 115, -55, 22, 264, 125, 191, 169, -86, -58, -177, -107, -152, 65, -29, -168, -63, -98, 2, -64, -105, -106, -121, 94, 170, -123, 200, -128, 90, -174, 64, 279, -963, -94, -169, 265, 131, 302, 211, 435, 245, -147, -124, 313, -303, -193, -251, -228, 184, -220, -298, -233, -95, 221, -179, 159, -175, 22, -337, -573, -759, 420, -238, -317, -506, -2, -63, -78, 185, 48, 184, -1, -328, -53, -474, 150, 605, -61, 107, -164, 4, -184, 116, -44, -21, -75, -148, -8, 227, 185, 34, 113, 227, 43, -83, 17, 121, 62, -9, -29, -142, -124, 107, -85, -192, -124, 142, -97, 173, 34, -49, 45, -13, 63, -121, 172, -87, 219, 58, -16, 74, 64, 30, 53, -41, -202, -70, -84, 75, -185, 3, 431, -100, 40, 147, 197, -214, 49, 191, 0, 261, -248, 148, -132, -83, 16, 189, -308, 48, -405, -473, -358, -391, -115, 299, -125, 209, -159, 190, -91, -59, -5, 115, -101, 376, -203, -323, -37, 338, -189, 3]
3320Ck3q0J44r6j1J54o8j76K17K08m19K17j47j48K31j68J65Kjp7j31O5R5J2N7
3345B5k50Q1J9J68l0K12k06K15m55R0K77j04J10j60PJ35k72J52l45N21k39M1n68
3368e76M52l50K79K46k07J79k50L20J02j13P3n1n26P93p77Q59o74m12k19P11M77
3389C36j57o63k11J250l62L01L86n78k44M6M3j95N6Lk92K93p06N45m49M51l02
3410d49L10J18K04l68K75l59K83J09j6k8K9j0J03k75L3R3k29J17L9J37O9l05K5
3433i5L6M1j02J19j18L29k80J94l12K54M4nK6p5R0K5j46j17Q2J4n8N9j04P4J57
3458A32m37M49j05K61m97L38j28O9k41K24k0r8K32M6p18L81J92l49M9K02K11l38
3480a45J79k26K27J38k88J72K70j14o3j33K32j1k72J58k9m58L48J08J55m37L91
$$ y = [3, -20, -100, 44, -52, -63, 91, 23, -153, 64, 272, -147, 70, -77, -225, 6, -162, 3, 5, 4, -73, -204, -139, -44, -32, 25, -225, -144, -125, 43, 13, 225, 19, 234, -221, -131, 146, 42, 152, -8, -1, 134, -138, 14, -331, 190, -49, -8, -576, -124, -474, -195, 51, -156, 23, -227, 93, 195, 82, 155, 104, -422, 371, -406, 453, -221, -633, -852, -141, 336, 179, -484, -695, 555, 193, 494, 880, 302, 58, 104, 147, -48, 8, 11, -281, 12, -694, -149, -598, -147, -449, -139, -21, 183, -185, 90, -269, 14, 123, 107, 79, 108, 98, 201, -74, -41, 52, -177, -60, -21, 116, 185, -120, -95, -59, -18, -120, -1, -119, 210, -70, 124, -188, 66, 110, 105, 131, 56, 146, 171, 25, -92, -10, 4, -54, 5, -99, -25, 132, -305, 144, 39, 300, -197, 141, 13, 82, -159, 65, 45, -53, 179, 225, -493, -112, 80, -269, -220, -18, 193, -145, 34, -192, 35, 173, -115, 57, 327, 213, 150, 17, 249, 238, -34, 124, 95, -363, -15, 93, 248, -189, 202]
3501B02o5k59J84nj38l40L11K22K8j70J17J7j24J30j18N3K8k01M2j22K75m4j52
3524a29M2J89j0j95J99R6j95M5O0M0J8p14K74m16L95j97N65o9J05J29P3p61M53
3547cn37M04K44L64j28j45k28K85p41O83j58N09o51P8j75L27m1k13R4j31J45l17
3569c35M11J08K47n02K46k66J91k42J87k55K69o2k51J35O7j5J19J00m85N69k85
3590d9Q5q1P1K0jN1n3j42P9K12l42K65j28mJ44n5j09J25l01K42k85J96J66N6l49
3615a87K56p5K73r8j36K85l02J86j72l95J15K59K96j020R43M75o63L56n96n95
3635g95J202o56Q05n31l57L26J05O9j35n12J249r56p71K31R1J50R32o95J09K55
3655A16n48M30jl06J88qlJ57j57L26j78J64j39l5P4p2J10j62R9p3l6MR0o4R5j78
$$ y = [202, 137, -122, 62, 57, -81, -421, -110, 112, 140, -30, 87, 104, -20, 110, -8, 45, 73, -128, -86, -208, 67, 23, -129, -87, 102, 92, -103, 96, 192, -3, 42, 102, 142, 160, -554, -280, -696, -301, -498, 67, -2, 103, 232, 305, -456, -3, -540, -136, 108, 472, 344, 199, -29, 256, -485, 198, 40, 549, -102, -24, -199, 128, 87, -126, -32, -163, -18, -335, 76, 184, 431, -71, 175, -91, 100, -142, 45, -210, 59, -3, -254, -119, -52, -67, 52, 152, -333, 236, -49, 36, -45, 26, 46, 45, 96, 43, -99, -20, 192, -150, 115, -13, -17, 127, 72, -37, 88, -213, 29, -256, -60, 106, 162, -187, 69, -6, 267, 169, 33, 318, 16, 202, 30, -365, -250, 9, 305, -715, 228, 703, 40, 396, -200, -795, 407, -249, 556, 25, -332, -6, 99, 168, 33, -479, 770, -186, -957, -726, -635, -485, 447, -248, -139, 116, -432, -2, -3, -309, -121, -129, -132, 25, -132, 194, 16, 180, 41, 6, 80, 8, 118, -44, 55, -18, -54, -50, 40, -24, 71, -107]
3681a07OL24j58J27o6j37O6j71K39J15k99M3J40j70j73K56o0J8k20o4L31M4r7
3704a3K22o2n5j91L15k04M66k59L45j99k01j29j62K00k78O61q17N65o95J63M6
3725b82M73J31r17N65K25k97K03K20j65qp8j30j62J95K79k2q6j44O5rj82r0M65
3748B49j60k7L4M6l10L7J62Q7j17K8l7Q9J76m88L41R8j54l59l7l3K74p8%M9J34
3773Dp8J55r8Q9j40J03L9n0k1J53l1r8j99O2J79j00kj6J12K6j7K5n2j63R3Q1n2
3800DM10j59m56l2K18j58j00N16J48m40k73L86k92O59Q4j253P00j21J46l33L70
3821B4J10K7k25K36km18K06o0L13M7j51k88o1L25j99J32N49m98M27l41j2J25k98
3844c2q9J49q7oJ50j35J38j93J69k80L15j60qM0j32J68J07j28J32k0L9m4n3J1
$$ y = [-107, -101, 223, 65, 192, 126, -11, 55, -116, 123, 238, -61, -18, 122, -48, -221, 35, -25, -7, -227, -291, 40, 84, -13, 209, 147, 92, -99, 216, 12, 478, 219, 564, 365, 164, 35, -127, 73, -205, 456, -361, 204, -491, -328, -282, 191, 322, -595, -30, 195, -102, 101, 321, 156, 148, 70, -60, -222, -27, 252, 230, 144, 0, 65, 56, -126, -216, 249, 89, 62, 96, 142, -168, -131, 31, 118, 1, 29, -8, 81, 257, -231, 110, 208, 54, -305, -342, -375, -101, -179, -179, -130, 4, -74, 81, -17, 72, -68, 35, 74, 24, 3, 156, 125, 27, -172, -110, 69, -31, -33, -49, 63, 89, 72, 97, 45, -118, -25, 56, 4, 414, 255, -201, -233, -15, -173, -273, 243, 391, -49, -322, 64, -228, 431, 515, -738, -38, -159, -13, -346, 24, 134, 161, -64, 172, 170, -248, -42, -102, 211, 258, 107, -181, -242, 83, -116, 16, 565, 67, 494, 153, 141, 266, -32, -121, 28, -59, -65, 85, -50, 88, -105, 64, -216, 99, -61, -69, -29, -161, 7, 114, -14, 118, 98, 137, 93, 40, 51]
3868E1nq5J04r8rnj14J65P4l0j6J23l44K79j61P0P5j56J31K0j35q9M30k93K9J84
3894A95q2j53O1m10L96Q5n4L2l45K31K38l04R8K04l19P4J02j41k12J79R5N9q1
3917e2O1k33J83N7k02J99j55K2J05m5J86K04l64RQ3J21j93m7R3J11l82K67L7k58
3941a93j40L05j8j83m6P22r20N6N19m08M17J13k01R7k58L91l82l04L22k88Q2L11
3963fq2K83J28k20k9P6j91R9k28O20Pp85L43K84j05l88N5k96L11R3M41m53j44
3986a87j17L62l3j18K06K49m59J35q0k3J71j26j82L14j72J4j74L06p4j15J13N3
4008F3k3R8k20O7p1n1K5K40J88m65L30j92J5oLJK3p0J76k43n5L48j46l2M0K43
4034B86m76l9M60k00j87K43M4r55P93m10P76j00o06O13l76o3J83j62J34j11K11
$$ y = [51, 46, -39, 65, -33, -42, -47, -161, 4, 78, 48, 32, 155, -189, 90, -71, -1, 74, -82, 49, 69, -66, -155, 275, -18, 11, 195, 113, -40, 21, -389, 7, 92, 38, 70, -275, -44, 194, -110, -12, 192, -127, -53, 49, -92, -304, -125, -30, 29, -52, 9, -224, -41, 16, -186, 13, -142, -120, -15, -60, 126, 330, -34, -25, 58, 179, -14, -61, 32, 143, -239, 28, 65, -193, -333, -28, -46, -229, -275, 447, -473, -417, 102, -306, 111, 224, 23, 120, -138, 253, -129, -433, -111, -399, -317, -6, -88, 195, 323, 103, 74, 150, -41, 58, -170, 450, 457, -328, 15, 299, 194, -194, -139, -435, -124, -31, 410, -43, -187, -304, 58, 25, -93, 113, 362, -97, 38, -42, -65, 106, -20, -202, 112, -60, -46, -220, 86, 12, -103, 10, 63, 40, 138, -82, -15, -86, -137, -112, 128, 316, -149, 181, -11, 4, -2, 1, 2, 25, -45, 131, -112, -167, 181, 35, 3, 43, 286, -190, -229, 231, 31, -156, 87, 131, -824, -31, -441, 335, 235, -371, 242, -134, -197, -14, -176, -42, -153, 58]
4055E8j1j03K31j95J76P2k78j02J25P4k25K76j05J63k19J56p0j7L9j34J25K6k67
4078b05Q9J29j85K16l2R5k22L36l18J87Q4q0j83j33K95j55J28Q4l33J09J63j42
4100g3N4j03J41j89M02n64P43R4o96j8J44L39k76J3J02L3L56p96L53J31J12o66
4122c64K31R7J45k57k07k9N54m58J98K52r1J92k97J8J04j35p82Q02k72j69O19
4143A51k28J46j98K57j75r6k37N21J07j56Q2p2j13j05O1J39o9r2K09n5q8J55k06
4166f2N8J7J81k03j12J19K85l17j52J24J43j51l7J08k03J25l2P0J38q8j28J96
4188G9j41K2JN2K9j34J49K40m00P3j64L11k55K68J00p9j04j46L6N3j8J6J09o4
4212C3j10K00k01R3j52j16l91P28m0j57j36P30L65p19N0k3n01O3L63J28k32k39
$$ y = [58, 47, -56, 175, -20, 156, 228, -50, -152, -27, 47, -178, 98, -7, 156, -63, 93, 23, 6, 45, -89, 36, 62, -205, -116, 13, -172, 44, 12, 107, -115, 221, -97, 90, 174, 94, -89, -222, 73, -82, 46, 130, -203, -94, 69, -73, -19, -122, 19, -170, 232, -332, 411, 505, -191, -209, -65, 274, -2, 11, 113, 146, 502, -294, 59, 190, 302, -364, -133, -36, 109, -148, -355, -384, 170, -288, -90, 162, 71, 263, -34, -16, 88, -47, -829, -27, -299, -468, 151, -77, 69, -129, 128, -47, -143, -380, 141, 248, 92, 174, 102, -11, -116, -55, 84, 15, -77, 132, 77, -11, 144, -62, -4, 13, 194, -9, -121, -2, 283, -34, -186, -62, 81, -70, -107, 1, -202, -77, -109, -39, 99, 11, -117, 79, -62, -40, -39, 13, 42, -92, 57, 297, -103, -30, -194, 117, -138, 130, 230, 151, 47, -99, -63, -10, -28, -12, 97, 33, -77, 123, -78, 15, -137, -253, -644, 84, 44, -113, -249, 481, 846, 127, 177, 154, -347, -284, 79, 207, -25, -264]
4234b64L31l7j15O6l6J08q7N0N3j49o4M00k05o3R4j79MNl2K0l0J36Mp2K04k68
4260a26J85n4M6j19kJ07m4J23L4q8k9j58O3R1Mol6J27k58K54k85J63O8j36P1P5
4286G0J22j11q1j02L6J79n1P3j09p8J00L2n2j4N8j35Q4r1J69n38M12J16m81P89
4310C97k80j98K25l18l6K08K5q7M9J71j08n1Q1L9j83K63m18J89K07l29J43R7o9
4333A7N2j97p6J11M33j19J19k86l26K93m9n6M5l0k0j9j2K16l32K90j68K30k15
4356i9j6Q3O9n7j56K05O9k00K37k93J85j52J23N7P7m04O11m57K13L8oKq2j10p
4381g0RJ91k28J42N3k17L44n08K22O3J44JR8k89j09N9K0O2j28J0K19k9j68Q6m8
4406g1J74J19k63L4rJ07l35L48j39j22K30j28r8l2J56J87p3l0J45l06J02J8jM3
$$ y = [-264, 67, 30, -85, -19, -55, 53, -34, 16, 69, -80, -144, 256, 51, -12, 82, -97, -93, -88, -120, -100, -130, 6, 10, -62, 142, -126, 59, 5, 51, -68, -70, 37, -7, 116, 150, 62, 33, -125, -62, 29, 33, 27, -9, 118, -140, 114, -171, -8, 60, -76, -5, 70, 192, 81, 0, -102, -66, 113, 62, 135, 26, -52, 48, 80, 28, 14, 72, -63, 21, -70, 99, -439, -27, 89, -392, 397, 117, -81, 144, -174, -210, -2, 23, -64, -15, 156, 48, -3, 78, 117, -66, 197, -221, -32, 175, -154, -11, 86, 17, 69, -128, -204, -93, 340, 221, 340, 54, -272, 21, -28, -84, -39, -69, -89, -108, -120, 96, -236, 54, -114, 116, -99, -115, -32, 37, -20, -176, 29, 98, -102, 135, -158, 27, -125, -2, 55, 132, -272, 339, -118, 95, 133, 127, 129, 47, -63, -70, -61, 130, -98, 44, 97, -120, 224, -284, -62, 1, 145, 146, 244, -45, -154, -95, -75, -13, -141, -131, 88, 59, -109, -23, -71, 103, 222, -41, -7, -16, 91, -244, 104, -35, -157, 73, -55, -153, -185, -29, 158, 85, 55, 200, -106, -4, 14, 13, 56]
4430E6j3Pj28k0J37k2j39J04q1J1J06J39O0l72K89m7j04O6lj53J74k8J97k94K10
4455A52l40K24J30j21p0J6k1j15M36j17nj76P8j9l5L4q4K7olO5R3j04J82k57J29
4481I3P0p3r5n3J44N1o0n7J08j36R1j6R8k01p4J97M0l03N4K51r8n3L4M7M0j32
4507c3J14j05J22R4l12K88k71J85l3n2j47L4j8J17p0L7n0j38K81j24K44k43j3
4530i3J07J40j50k0L0J34q6j6K02l13O2R5N7l32L50q1j81N86o73K79r0k96P84
4553D95O17q19j70n28L80J33pk2k32R8j94K29l1n8K08m2l4j16J77qk71L57k4j52
4577a4J64n2l7l1j26O1J0j46L4L22k17M32j29N60j156N86l75J50j82N46L40o42
4599I8P80r01K6m14M40k13K04K91n16qj5P2k65Q1j13k79K31K21l2k36R07m63k6
$$ y = [56, 43, 50, -78, -98, 39, 17, -122, -18, -99, -88, 18, 157, 217, -155, 134, 87, -17, 49, 46, -107, 67, 39, 236, -58, 152, -188, 36, 166, 45, -25, -9, -30, -145, 291, 174, 169, -7, 71, 52, 17, 51, -33, -6, -12, -15, 50, 143, 39, 221, -36, 93, 163, 90, -5, -58, 86, 137, 77, 20, 128, -8, 83, 67, 165, -36, -110, 87, 127, -176, -122, 129, 31, -22, 12, 59, 99, -33, 81, -24, 98, 192, -120, 168, -103, 82, 49, -3, -150, -116, -134, -17, -87, -50, -100, -238, 43, -81, 163, -80, -93, 14, 154, 4, -16, 14, 148, 62, 46, 248, -65, -3, 92, 149, -183, 167, 86, -95, 491, -182, 97, 7, -289, 495, 1112, 293, 123, -405, -25, 108, 101, 79, -153, -55, -249, -20, -51, -109, 99, 57, 23, -93, 84, 76, -195, 162, 138, -14, 150, 98, 61, 30, -96, -35, -25, -171, -137, 185, -32, 400, 271, 831, -325, 261, -114, 36, -146, 400, 740, 98, 878, -23, 3, -411, 29, -184, 20, 311, -205, -213, -228, -156, -421, -340, -453, -732, -501, -280, -312, -548, 359, -104, -130]
4622a30N3K29n02k42N11j13Q11o14J05k77j70l73M13N21l24J47q2N46j46m23R6
4643C6P1j18P8m9j17p0O2J54J2j68K1j8J80N3j10n8R2N5p5k59K15j44J34N4l39
4668c08N74r8q03M74J81J36k92J5K93r3Q4J37k45K06n65QO26j110J021k17l01
4689b77L45Q32r36L52j147Q37j84J80K02l14J24J26k14J21LJ50j63n8R8j72j0
4710a05J03j23J27M18l86r1O6J07k68l7K05K87m83L58K01m03k72K45j22J59p8
4731i2L65J03l94k1k60k08P79l35J7J44K37m12L99n77O04p20K30K13K25o96Q1
4752c18N92k87M65o72k59L22QJ46K28r2p07J315k22n05K87k68k48O3M09k13o0
4773a6o6l7j59Q47o14K15n57Q09n87k47P51l04k70J62J78k48J97R8m1Mj32N3j04
$$ y = [-130, -77, 152, -350, -592, -81, -194, 617, 3, 108, -169, -339, -712, -299, 222, -102, 45, -37, 509, 363, -60, 36, 107, -11, 67, 18, -99, -169, -107, 47, 59, -109, -88, -106, 74, 127, 17, -41, 51, 106, 31, -228, -13, -157, -23, 31, -308, 266, 168, -635, -161, 20, 156, -136, -121, 172, 79, 163, 300, 55, 261, -304, -296, 330, -780, 241, 24, -277, 68, 900, -36, 316, -831, 6, -178, 2, 204, -110, 14, 140, -74, 47, 50, 200, 37, -21, 77, -95, -105, -2, -125, 2, 420, 34, -57, 9, 116, -152, -189, 16, 303, -180, 178, 379, -24, -296, -51, -173, -14, -92, 273, 376, -18, -39, -299, -507, 272, -63, -46, 98, 335, -77, 322, -255, 349, -371, -141, 72, 297, -399, -318, 274, -13, 452, -220, -479, -157, -149, -3, 225, 133, -574, 741, 519, 14, 301, 33, -215, -152, 257, 44, -16, -82, -119, -278, 569, -45, 170, -387, 422, -165, -412, 339, 35, -235, -73, 105, -143, 54, 152, 111, 115, -17, 36, -68]
4796f8n4j84j27O04k42J15P6j47P3L5j60M0k57M88j33l6m37N61j48k88J21K4N9
4819h5L49l50n4k41L55J55j15Q6l00j07M47kj58N82p40j54r1M70q3l06N73m24
4841a93r9N11m00O1J49n4Q1J24j39n8o1p8J62p0L3o6m2K6k4j98P9L79l00K73M36
4866E32j344L54M89J29n9j37P29o58o84J65Q70l11k32K54l52L89q0J77j83j65
4886a17J5J33jq7J88l2o9O4l29K69p9R4K0j0n9l0J91m45L05P8j68J16K42k63j38
4911a12n1K47o3K49m04m35O58K3J3j22K06l02k05N64K9q9j19j5k08O7J29Nl5k8
4935Bm7R1PLk6m1J52K2Q5L0n77l05Q62m14M62k01L48m84O00L34j811J232o06L32
4959E0l50M19j62o29J419l60n91j29L90pm15Q65k63m76J009r46L73j70l49L09
$$ y = [-68, -122, -306, -433, 171, -71, 44, 120, -27, 46, 81, -79, -39, -296, 192, 59, 23, -414, 147, -1, -289, -168, -144, -85, 264, -86, -140, -381, -26, 129, 14, 100, -200, -307, 140, 138, -20, 562, -178, -332, -423, 47, -36, -342, 231, -193, -292, 219, -181, -120, 29, -25, 56, 180, 41, -17, -78, -156, 6, -64, -31, -97, -139, -113, -137, -335, -256, 123, -177, 96, 532, -812, -458, 31, 160, 101, -36, 693, 35, -649, -484, 386, 75, -157, 97, -255, 134, 54, 231, 48, -117, -102, 31, 30, -57, 131, 99, 30, 94, -235, 34, -45, 49, 69, 59, 0, -30, 161, -284, 21, 99, -69, 47, 289, 26, -112, -163, 84, 21, 270, -134, -569, 89, 112, 125, 3, 209, -93, -298, 266, 295, 206, 87, 72, -136, -69, 60, 65, 30, 2, -45, 46, 53, 56, 30, -11, 141, 163, 248, 278, -299, -604, 258, -156, 306, 105, 453, -31, 569, 903, -908, 324, -282, 50, -300, 119, -43, -672, 747, 387, -204, -333, 57, 50, -365, 500, 237, -239, 770, -176, 197, 27, -322, -13]
4979a3j02K63k69M01m29K60j97K5qL15n58J29P13o62m17K92j28M74j03J2k80M62
5001A80j00l8P83j099N69k39O4k00J81J3j99j13K96j20j9O6P5J52j89j89j4J90
5023E0j68L39m52J12L20k33l4J08J52k32j36J92k71K43M7k9P7p5q5J22o02J49
5045d06P12L25j048o3n2L0Q8l5L23J82j88m6l91N70k00n90N51J21L77l17P0n49
5067e36N09j42l4J4J38K57p51L74K11J00K58k88j35j4j85o37P08K7J37K19j18
5088A12M5K5l34K99n32P59J45M06j099l57M91J52l63M11k20L0J56k21R3Q6m4K91
5110C31n58j44K4O08o30L2L47n64O20J13q05O42R7j25M38R4l96r8o2j0L4K0P1
5133G9o0n0Q5k9K2o9nO1p8Q2QJ05j52J48k60L63n43K79k23L4L20q5M70l13l17
$$ y = [-13, -115, 148, -121, 280, -149, 111, -86, -61, -69, 246, -312, -183, 530, -132, -549, -257, -385, 89, -14, -2, -282, 180, 80, 42, 825, -274, 295, 56, 120, -80, 101, 114, -85, -198, 98, -22, -41, 25, 100, 252, 63, -126, -140, 50, -118, 221, -231, -119, 201, -32, -66, 42, 194, -38, -174, 18, -253, -10, 37, 8, 85, 10, -75, 47, -555, -406, 306, 631, -417, -480, -532, -502, -414, -449, -126, 56, -132, -178, -569, 1, -199, -789, -238, -117, 260, -57, 13, -536, -27, -169, -203, -189, -51, 206, -545, -171, 40, 140, 398, 110, -25, -39, -224, -861, -153, -126, 11, 230, 112, 157, 182, -152, 147, -385, 374, 519, 925, -174, -531, -40, 112, -251, 160, -60, -30, 126, -95, -2, 84, 40, 331, -227, -371, -347, 261, -369, -337, 10, -554, 66, 179, -626, 16, 113, -12, 426, 520, 124, 26, -36, -46, -12, 8, 79, 19, -31, 54, 25, 47, -22, -27, 34, -44, 38, 46, 151, -1, 147, -113, 250, -293, -14, -237, -203, 117, 32, 502, 189, -128]
5158a28L49k73j05J29j4q3K87k22K80J5k57LNj52L01j20n84R58P7o21Q2k22k51
5181e46R69m38p8K99l19K34j83L9J77j24J1J6j94K99K5l72M57l79J13M5j68J01
5203a6L10j60M1l89L99j43p8Q1o8o1L09m65K18Q6l18K45J91R1m11j4KK00N3k19
5227a16L7%N6J21J10k74o1K82O7k06J02j75J10P0o7L2j3k12M2J54j96J98P9n4
5251H6j56Nj80K21J59J5k79Q0q2J24JJ36k28K20k81o5P2M6K88j66R4j71Opj52
5276b14K04p8O9lj73J09l0L6J19P1k79J77oP0r8o7R6P8k94Q9J90r0J5J08o5j59
5302a25J14M9M9k13R6%R1n9j74K80j09j2J76k84K3J37j44L27k99J92q2l3J70q0
5326I0m38L30jO2l6k7Qr5k9J30jj99J27J9K39q16L8K45K11M36L7o45M46j82K52
$$ y = [-128, 221, -52, -157, -28, -42, -125, 162, -60, 220, 235, -22, -19, -14, -166, 135, 15, -569, 389, 466, -155, -73, -295, -546, 423, -15, -93, 206, -113, 121, -62, -23, 154, 30, 41, 57, -137, 162, 187, -185, 272, -107, 6, 51, -117, -16, 294, 134, 175, -214, 185, 42, -36, 45, -23, -84, 225, -240, -22, 64, -254, -9, 182, 273, -138, -152, -150, 50, 103, -116, -79, -79, -23, 98, 208, -66, -127, 155, 222, 16, 118, -57, 53, 123, 56, 88, 75, -137, -95, 59, -137, 61, 140, 86, -70, -65, -245, -24, 135, 150, -129, -49, -131, -7, -6, 130, -98, 122, -159, -224, -152, -106, 182, 16, 110, -61, -55, -62, -214, -10, -88, -19, -22, -195, -86, -116, -80, 39, 110, -169, 8, 2, 72, -26, -93, 3, 81, -213, -124, 66, -24, -9, 99, 34, -125, -11, 38, 87, -126, -30, -30, 61, 2, -172, 108, -1, -13, 163, -121, -98, 39, -105, 222, -77, 115, 33, 0, 170, 90, -348, -18, -19, 43, 7, -20, -12, -107, -136, -6, -7, -206, -79, -60, 179, -637, -599, -354, -143, 293, 330, -315, 131, -51, 201]
5351B01n3l96NL26j10j32o1j74K41L3K43l9rk28J77k04J61n8J36j89K96j66m2
5374d2k82K49j29M1K27J91J3j09j24L1j28K17%m88K05P9nJ13M8j42k7O5j59R3
5398f3O2r9J84j05J73p2m18M68j96L1q0J00R6l3r7J7k4p5K91j69J27l5j09N9N
5423C8K6q4j37L12j56j0l32M63R3k23K58j57k11L0L64o3k64q8M12l10K4j04L36
5446B17k2l94MJ60k74O34l73l91R2K5K38k78N00l54K30p6n64N84L4r5M81n69M84
5469B93m39K94l64J72J2j17K41j09q0J21Q4O5q3j69J54j15k8K14l06J34J13o9
5491A8L4j02J06j17j2j5J6J28J75k47K64l14P8k4R8k34K02Mk15J65L65l64Ln5
5515d3J66r6MP8j38j95K74k92l63L86R0K72P4p13N73k06l86P83O2k58n96J60O2
$$ y = [201, 148, -248, -243, 83, -27, -159, -220, -394, -153, -120, 123, 84, 75, -153, 24, -180, -19, -77, 59, -130, 166, 0, -42, -324, -75, -204, -163, 64, 255, 268, 159, 35, 66, -62, 155, 155, -333, -128, -49, -54, 59, 107, -35, -62, 3, -156, -63, -1, -100, 84, -21, 152, 80, -338, 130, -66, -35, -115, -15, 81, 48, -49, -32, -56, -131, 160, -9, 118, 83, -26, 33, 38, 64, -20, -157, 155, -1, -11, -343, 120, 213, -10, 248, 91, -120, -90, 274, 211, -53, -141, 271, -39, -15, -119, 217, 195, -199, -195, -35, -309, 325, -48, -439, -347, -322, -84, -362, 138, -216, 14, -62, -626, -42, -8, -103, 378, -191, 293, -146, 148, -216, -44, -32, -149, 92, -17, -97, 24, 108, 173, 90, -79, 75, -40, -68, 146, -160, -26, 87, 18, 52, -50, 56, -61, -73, -88, -72, 56, 231, -16, 248, -66, 12, -12, 86, -148, 54, 58, -157, 8, 373, 9, 12, -43, 123, 27, 31, 109, -29, -224, 50, -242, -605, -219, -129, 143, 217, -496, 77, -129, -515, 268, 330, 72, -524, -364, -302]
5538c02L4J86J62J17j86K4P5j38j10JJ26k50J85J39o3m9J8Kj16K69l0n1L8p6Q1
5563H6j67J35j61J14l6P9k28K76j0O3j49J82l36L06j28k75K59K2J85j96O7k0K46
5586C14k27o6K03l27J60j23K69j82K4k54Q8K6m2K19j74J10l9R4j18o6K87k55Q7
5609Hj25K41m15L79j81J9J57k25J00l36N83k15O5M4o9J18j15j40k35K09L2j01
5631b02R1L02j57pK1K3J30l16R5K59j91r4j09J57N6q3L01P2p22J84K92j86L4p5
5655a25Q9j6Q5L5l8q3J81j26J26o8m1r3J40j08K42R0m65n1J83R9P6l01M7j77K45
5680e4K34j55j84K14j8j00J35j91J05k6L3p3j29J85M0J0J56j66L27k58J16m1m2
5703A18j20r8N1k08J81j38K89j39K79j17j47j91L91k3j86J65j7j87kP6L3j07N7
$$ y = [-302, -268, -82, 80, 197, 11, 35, 110, -28, -138, -137, -11, -261, -76, 63, 0, -49, -31, -29, -145, 124, 94, 43, 81, 5, 86, -81, 54, -107, 7, -29, 50, -178, 98, 88, 151, 2, 184, -152, 154, 26, -249, 10, 32, 217, 21, 88, 68, 314, 87, 21, 224, -103, 57, -66, 203, 21, 45, -209, -121, -95, -137, 82, -92, 18, -21, 73, -45, -111, 176, -79, 8, -117, 124, -291, 88, -93, -74, 83, -142, -42, -378, 205, -10, 55, 99, 30, 148, 33, -107, -342, -133, -101, -202, -111, 191, 34, 27, 48, 71, 201, -115, -20, 239, 48, -46, -155, 2, 58, -25, 276, 348, -374, -190, 102, -84, -50, -125, -36, -52, 33, 68, 30, -53, 128, 2, 128, 60, 19, -74, 66, -42, 200, 290, -175, -226, -43, 56, 132, -169, -122, -299, -54, 180, 25, -159, 55, 37, -63, 72, -119, -14, -40, -7, -80, -209, -24, 16, 26, 182, 16, 343, 85, 201, 160, 118, -2, -100, -49, -257, -76, -214, 75, -64, 215, 98, -49, -240, 151, 128, -58, 107, 90, -97, -99, -23, 10, -97, -40]
5726d0m01J39O06n09K1M8L14r3K72p76N82l15j72J13Q3j62j81N35L49L90q33o09
5748f39J072l62L08n96K3O4k31M33j70oQ6M7K5k6P3rj09N3o6o4J41J45k83J45
5772E4Qk50L24j07J00m6Nk8k25J59j18K09LQ5l08L04j61j96J39op8J45j36P1J38
5797H5j26J45k35J07Q1r3k86M29j03j89J76J18j25O3k5j58J54J83j60o5j53J62
5819a5j89L09q3o3R7J01j7p5J37l55J72j35j5R4n4Q3J38p8Lp2k0N5q9J91l24L01
5845I7j27J63k29K36m00L97n37j25J98K64J3k52J37M12M72j090N05k16l40Q90
5865D68O9q68M94j70p5R0j70N0J11k29J86n3M6j2J53j86J1o1K15p6J9R2rJ14k46
5890c7r5J98j05J95j76L6m7r6R2k12K33j56L04j22J96j93j43J67r3M6o7K9J45
$$ y = [-40, -441, -302, 304, -205, -184, -136, 178, 85, 357, -419, 163, -152, -324, -211, -128, -290, -471, 64, 413, 803, -30, -639, 433, 71, 379, -217, -194, -130, -361, 72, -98, -104, -18, 29, 54, 28, 101, 92, -17, 36, -30, -94, 47, 192, -91, 54, 62, -188, 136, 29, 129, 83, 88, 60, -165, -6, -124, 85, 88, 173, -135, 169, 8, -188, -49, -55, -133, 12, -124, -53, 85, -41, 104, -131, -24, 57, -36, -322, 107, 4, -185, -9, 109, -16, 47, 22, -136, 18, 201, 41, -24, -177, -15, -204, 105, 22, -41, 56, 157, 140, 65, 202, -153, 19, -116, -131, -37, -91, -8, 130, 52, 55, -17, -37, 18, -71, 120, -204, 97, -30, 133, -96, 140, -260, 137, -400, -525, -327, -63, -50, -302, -165, 247, 719, -371, 134, -82, -422, 468, 537, -331, 163, -7, -82, 8, -162, -112, -1, -230, -44, -97, -51, -63, 90, -96, -85, -146, 69, -7, 12, 104, 95, 209, -37, -132, 66, -39, 156, -20, 16, -31, -127, -35, -247, -14, -170, 134, 12, 208, 15, -128, 39, -54, -8, -75, -46, 99]
5913I9k62J85p8J2Jq8K29K6j58p2m6P3J02r6R2M1J17k19J7J70O5n5j4M8l06L61
5939B44L24n29j83P46j073N07k01Q7J80j0L22Kn39j08N00l71L60l3n92L18J6m14
5961d47O97k56n0L29k63j28L32j36k90pN69n67M80j71j57N0j27n38P17J34k62
5982i1m5O8N22k07J9q29O73k49Q19k53R3q43j16N40N5J8k49J35l15K07J50J2j18
6005dK0L2j36n3J61Pk38J56J83j37K09l37K8J84o4Q6J51l32k8Q1K30l27J40M9
6029F1j31O1O9o5j21L6Q4M16m06j47K0M44l14l1k3Q3K5k8r2M5j36L31j125L71
6053e73M70R8J12j22p1K9j67m00K10P32k41m24K49L2mJ28K04l06K51k81P0J3j6
6076gL1J31k41l7J51n6K7J38n4o5P9J34l09J71l2j37PRN7o5J46k33Q5p1k8K85
$$ y = [99, -163, 22, -56, -44, -43, -131, 98, 124, -34, -106, -152, -79, 23, -73, 19, 60, 177, -42, -25, 145, 210, 155, 141, 189, -117, 244, 568, 39, -144, 602, -471, 36, -165, -78, 102, 92, 414, 416, -123, -231, 269, -102, 258, 225, -367, -49, -33, -447, 250, -6, -56, 273, 10, -118, 214, 78, -212, -219, 350, -217, 263, 92, -65, -15, -142, -680, 37, 171, -91, -136, -68, 454, 247, 266, -563, 110, -139, 680, 427, 520, -323, -439, 101, 156, 174, -75, 60, -255, -48, 102, 114, -4, 16, 48, -88, -141, 20, 27, -211, -55, 128, -9, 200, -137, -109, 75, 11, 97, 248, -84, -112, -31, 199, -128, 12, 61, -70, -9, 60, -5, -126, -90, -6, 410, 4, -143, -123, 321, 7, -24, -47, 36, 61, 33, -59, -14, -150, 181, -944, -573, -103, -5, 107, -15, -86, -57, -224, -624, -414, 318, 77, -347, -98, -66, -70, 58, 262, -44, 207, -74, -4, 9, -7, 24, 155, -86, -123, 28, -28, -1, 137, 83, 18, 97, 231, -78, 93, 61, -76, -69, -60, -3, -68, 78, -155, -70, -141, -169, 116]
6102A16j32J36n0K38k35J31m45Q4%K13q6K06j93J97j79J09j03k6M1Nn6K30m14
6125b13L82j20N2Q4j13k5k26J64R0j57n4J24j08J03Q9j33Q1J62j15k64K46L0l5
6148D4j76K86j44Q4l43K09J73j25L20j92q6N9J2o80Q65m00p4qO35J97o83J6K6
6171A5l59K84P83m76J96j01pn89M25l00K11q1K43J01l2K00m72j87j6N22m61J97
6193I6n7QRo3J91k64m2K08j99J73k5j4j85L07j03lo2K17r3j93K00o8j02lj05K96
6219A24j17j50J08J1J37O8l87K40N3j6l09L75O7k28%O1j45P8p1q7K06n43K51P35
6243D61o08J10q1K79l03L16j7l11k45O7J27M8J82K06m8l46N04l81Q6L4k98N12
6265B94k24K70k37l27L6j1L48j35J46p37L16L86M19o56M7k43j23J076R9m91q3
$$ y = [116, -16, 120, 70, 308, 73, 204, -241, -157, -157, 56, -30, 176, -17, 180, 1, 110, 7, -19, 22, 27, -29, 201, -213, 169, 49, 101, 185, 72, 47, -179, -15, 75, -82, -136, -12, -120, -17, 72, -61, 20, 182, 67, -197, 49, 79, 44, -132, 154, 10, 94, -249, -40, 133, 8, 328, 136, 50, 109, 121, -559, 306, -94, -168, -176, 459, 656, -27, -11, 15, -344, -60, 723, 247, 443, 342, 335, -254, 171, -129, 82, 1, 244, 345, 313, 513, 41, -146, -162, 360, -101, 96, 39, 47, 56, -7, 184, -80, -122, 86, -113, 60, 35, 21, -164, 143, 40, 37, -25, 192, 99, -94, 106, 38, -64, -67, -172, 124, 7, -143, -35, -24, 113, 181, -206, 34, 87, 71, -238, 137, 204, -24, -24, 37, -108, -30, -101, -188, 18, -525, -274, 461, -147, -37, -118, 161, -142, 174, 157, -154, -399, -332, -205, -157, 25, 231, 183, -163, 341, -40, 46, 80, -218, 294, 70, 340, 103, -224, -188, -199, 149, 14, 160, -577, -261, 125, 544, -112, -65, -308, -431, 645, 744, 253, 170]
6286A70l17L22o41J202m74m96L79J45k05N7j23J3j57K15P8k9j55N4l20L95j17
6307dj86L5K18n3k26m5K55J19l5j82P9n0J71L41n62PJ86J83r92R43j98j1n9J03
6331C7L09l13m6J3j29J04j34j3R0N9j5J5k04K59j15j66K45R3Nm09M66j72J38O
6355A23L9j88L9J41j55N0j78J18L4M1n1j7Q3k7Q82j373N13M2n46L08N83j39p93
6378d71O23k13o8L83J40l07l6m8K43l39J42l31L27m40J22R34j049O16r4j97O1
6399bJ58j73M2J11j24j6K60k40J67j93J01k53L19j12O4O1j45jK44k00M3j81K06
6422A36n7j50K8j71L46j01j00n5K18j91J60j16KL1J68l04N9K8J46J70r5j14l6
6445BJ64j82L2M4j70rp8K13LRM2j93J60l23N00k43jl22M73k08j3k73J88J15o1
$$ y = [170, -147, 175, -466, 736, 262, -234, 145, 290, 85, 142, 19, 32, -125, 90, 168, 139, -16, 38, -282, 113, -4, -190, -155, 63, 10, -216, -261, -6, 113, 78, -104, -25, -75, 96, 437, -125, -118, 68, 251, -741, 202, 4, -7, -66, 37, 346, 33, -13, 0, -129, -25, -159, -172, -82, -23, -38, -23, -227, 32, -83, -249, -4, 89, 94, -315, 151, -21, 117, 123, 162, -26, 13, 154, -1, 49, -129, -11, 23, 64, 13, -4, 79, 52, 934, -439, 74, 116, -430, -122, 461, 322, -471, 152, -61, -129, 254, 394, 87, 51, 3, 246, -93, 49, -282, 45, -395, -273, 661, -388, 228, 134, -63, -2, 156, -17, 25, 136, 12, -4, 256, 16, 183, -10, 91, -162, 157, 45, 109, 170, 25, 24, 268, 68, 111, -70, 136, 79, -71, -43, -214, 132, 31, -69, -124, 94, -97, 63, -53, -51, -20, 148, -156, -97, -69, 77, 247, 152, 38, 2, 166, -16, 16, 60, -110, -119, -197, 16, 19, 28, 70, -123, 37, -286, 214, -29, -30, -352, 121, -87, -100, -373, -185, -70, -131]
6470a31L58J46j156M53L48J12j05k40J90k35J74l2J28R5j59J00kk7J26k86K47
6491A04j9k2J75q8j37J81k34r0J73P2m40L59l08j11k38L58P53j077J100l07l61
6512a57M8l44M34j2M64j80l1l67j74k40N93K07j35k73N9Q0j73L26j04J00j83J29
6534F7N4j70M6p7J28P9k23K19M0j69l2J41j71q6K71o6l7K05j27K9J8k32p2J74
6558Ij3M0j79R0q0l1J46KK1k09Q5l1N6J76J37j80J78m28K03q8m7K01l7r4l1k49
6584c53K52K95k84L0P8K00m24R7J36q7QJ36pK6k6m1j17J62j64o8J54Q9ok02J73
6609E7k16J00J20j70J7L0M24q40M93K07jm67M8K1M06n25N28M7p07M42O33j111
6631d64N09j87J26Q9j16J25k76m4P06m28j56J51K1k80k84M06k1N72o30K82Q21
$$ y = [-131, 227, 373, -783, -330, 18, 130, 25, -215, -25, -260, -86, -118, 10, 105, -54, 46, 44, 17, 143, -143, 104, 85, 63, 238, 150, 13, 194, -40, -130, 43, 115, -325, 34, -274, -385, -623, -265, 488, -589, 511, 204, -157, -109, -453, -19, -31, 433, 253, 222, -145, -319, -559, 34, 241, 106, -167, -108, -28, -201, 125, 21, 121, -62, 67, 121, -49, -3, -80, 48, 127, -96, 123, 163, -6, -38, 103, -68, -154, 117, 51, 14, 219, 92, 121, 139, -93, -165, 9, -4, 36, -143, -53, -133, -164, -18, -16, 5, -204, -119, -150, -94, 82, 219, 39, 217, -211, -8, -96, -143, 58, 21, -73, -104, -353, -101, 194, -90, -60, 18, 218, -206, -109, 27, -60, -52, 84, 77, 103, 77, 36, -81, 81, -83, -151, 3, 92, 86, -116, 57, -159, -59, 61, -109, -92, -62, 362, -478, 15, 222, 221, -246, -198, -177, 229, -296, 232, 279, -428, 14, 647, -464, 45, -142, -16, 73, -43, 82, -194, -238, 468, 40, -116, 35, 56, -224, -508, -102, -123, 449, -181, 101, 922]
6652I22l19o70o9k89M75m43J129o78K17m73M49k98k4K87j91l6K7j69k50K76L49
6673B22l62j64J95j94M53N3l78O1J93j82j6j5q4K79k23L22l28R1L0J23J25l6l32
6696a67J90nj64L53l55R7L40k15j8J89l26L5J54Lq0q1K48j35l67K85o5J36j13
6719f1J46j29K38m56L8L08L2k42L88l51n8J83r6K43j15J26l0j57J42j37K66k95
6741a7N2j68N7R8J08j22k8M4N5q1K0j1k34L92j16j37L00j78K6p2J7m9j45J00K1
6766f8R0j61J99k5j2kj05mJ16M8J15k94J49k7k46K38p6K42k03r8R6J72j67J85
6790A62j07k29L13K5r7o5Q2l13L34O0k44J20n4j64J90j66J07R5j63P1p5J40M6
6813F8j81n7K74n7M5m2j52q8L71mj01J65l49n1L05j9j93J32r4j64O2L2J74p7K8
$$ y = [922, 603, -67, -136, -425, 50, -393, 736, 58, 275, -198, 251, -47, -71, 216, 25, -11, 16, -153, -403, -127, 222, -140, -304, -109, -303, 150, 203, -175, -114, 79, -103, -119, -134, -218, 61, -162, 160, -168, -77, -47, 76, 201, 165, -167, 23, 18, -146, 207, -148, -51, 289, 74, 56, 245, -81, -46, 108, 111, 31, -50, 198, 63, -304, -19, -84, 52, -61, 85, -44, 194, -262, -224, 84, 116, -126, 262, -89, -147, 36, -60, 183, 68, 194, 164, 7, 149, 12, 278, -17, 35, -133, -76, 22, 130, 8, -20, 24, 79, -2, 18, 7, -227, 165, 49, -88, 212, 34, 60, -12, 5, -44, -189, -89, -68, 22, -139, 60, 35, 23, 21, -84, -88, 28, 76, 191, -103, 46, 19, -227, 11, -65, 177, -26, -124, -28, 144, -23, 162, 55, -174, 139, 164, 67, 2, 84, -229, 105, 165, -79, 41, -13, -177, 13, -153, -46, 49, -114, -43, -118, 22, 68, -113, -170, 104, 47, 92, 50, -102, -190, 181, 177, 76, 241, -108, -159, 146, 127, -66, 66, -28, -192, -130, -98, 76, -1, 27]
6838B7K07n02K92l5N7k6j15J6m6N4R4l3M2j58J08j64R2J58k09J86j75J96j79J67
6862E4k56j05J10mM2K22M9Pj38J25p9O8J01k08J05n7M2J88m39L71k54l3K06O1
6886A78Mj43J38k62J38m4J5q9k62K91r4K72k51J35j77K88N5j86m6R1j6J29k3j64
6910b3j87J18N8k9j15J00K94l31M7j56J06J20J96r6r0J37l32K18r9J26l5o2J89
6933A54m1%k01J46j8n6J22j40N6m1p7J99mp3K1k30K68Q8q6J47k62J60n2j09J90
6958A61k21J9N8n7J4M9M8o7m3o8O7L21j73m2n9j72K16r0J84j36k72N5K36J10k40
6983a02J37k2R5L99l93o8o8L37j16p6j41N33n14L50j77k57m8M75l46l66N89k63
7005d2m74M46L13o64N16q0l6J48l7M1q3j18J30o4j48J93j84L54J1l14J02m6p8
$$ y = [27, 234, -268, 24, -11, 46, 20, -95, -79, -125, -71, 23, -10, 32, -126, -18, -182, -90, 68, -141, 45, -130, 66, -113, 54, -202, -307, -197, -201, -159, 63, 112, 119, -19, 106, 27, 95, 196, -12, 93, 36, 78, 266, -173, 198, -56, -89, 117, 178, 182, 39, 177, -85, 53, 9, 24, -65, -327, -36, -130, 142, -109, 26, -151, 137, 192, 6, -40, 51, 35, 164, 141, -23, -210, -92, -34, -63, -178, -78, 216, -115, -68, -224, -118, 2, 198, 102, 12, 149, -183, 35, -64, 62, 27, -35, 154, 113, 113, -88, 58, 40, -16, 106, -34, 22, -19, -96, 103, 99, 26, 47, -183, 85, 173, 87, 234, -28, 132, 80, -29, 161, -60, -41, 17, -40, -26, 23, 71, 4, -39, -107, -40, 281, 108, 66, 7, -165, 51, -39, 145, 9, -263, -208, 28, 138, -102, 35, 13, 108, 507, 114, 46, -22, 315, 199, 123, -18, 515, 1, 351, 174, -83, -131, 344, -2, -368, 221, -42, -516, -70, 243, -421, 95, 15, -21, 127, 90, 131, 48, -70, 60, -4, -152, 41, -143, 211, 222, -92, 10, -36, -114]
7028a14M2o4J61l1J34q0j40J08o2j0O1J06k9J42k20O7jp2L7Q0j17J73j15k52J87
7053il1j57K68l6L0N2L1o6k44K55k44Q6l0J74p6l3pO6j33j25K50n1J07j72J52
7078E7r0J20j53P8k5K7O6l6M9J32l27p1K10k96K67q4m6J48m16L19j89Q9J22J9
7102c0j9K7O4Pq5m0p1K70m52K23Q6O5J4l9j43K63j66q5k1J54k4J28r6K5j99L10
7128A66k34J59J97j79r2k0J38j68m6J5J20m4L8k1j30J09k35K76j50r2K80p2j6
7151aJ89j05j91J86J63l25J20J73j82K16M1k59p4l8M8J11j46J44m8N1j74J59l4
7174B4Q3l13K02j97M3Q4l0j5K07k11J41p4K38j91nK3j30J08j3J98p8j84p7Q8M5
7199c4j2R1k4M8r2j15K70J36l50J5k81K36J55M87j79n25M20m28k01m33Q32M99
$$ y = [-114, -72, -136, 25, -6, 128, 48, -92, 16, -46, -56, 5, 111, 82, 224, 4, 71, 70, -2, 35, 115, -2, 171, 56, -196, -9, -40, -197, 71, 35, 65, 117, 148, 82, -162, 93, -151, -65, -95, 79, 3, -30, -37, 29, -104, -229, 21, -30, 77, -95, 57, -33, 87, -66, 12, -13, 14, 80, 44, 93, 225, -102, -173, 37, -259, 8, -76, -122, 26, -390, -71, -260, -171, -49, -30, -49, -22, 42, 49, -36, -76, -147, 123, -329, -106, -20, 45, 59, 20, -123, 140, -26, -111, -132, 22, -2, 126, 30, 55, -144, 166, -68, 91, 288, 109, 17, -3, 135, -33, -79, -64, 56, 12, 50, 29, -101, 8, -227, 49, -101, -193, 87, 15, -1, 188, 83, -108, 78, 241, -84, 36, 209, 27, 243, 284, 25, -49, -87, -39, 72, -74, 70, 22, 73, -101, 58, 24, 107, -206, -4, -201, -158, -74, -104, -119, 88, -123, 18, -56, 182, -9, -14, 9, -121, -13, -26, 172, 94, -90, -167, -79, -34, -46, 45, 21, 69, -23, -138, 132, 268, -82, -67, -348, -112, 43, 530, 351, -174, 246, -182, -383, -816, 16, 515]
7221E15k92k7k41J60P4j67k4r1o5J81j38P8l8K02O7j41J08k77K90k95R8j2n9M9
7245d5K16o2k32O1j3K33m65L05N28m71J0P3J21m12K54n7j34K12J79l58K37l11
7267a31J83k25K52k43K83q1o1j8N1n4n0J47j34Q9J5l5J67p7k82K96j09k1J2J2
7291a4M5O8j94o0K08m1j45L73r2j56J6j45K4J70l27K05PMQ6J38j84J6J3p4J96
7316A37m08K02J61J20l22N7J16j76Qj0J03j49J74J2k8L49l90J13j5o1N0j18j37
7339b12r7L01p6N2L8J1r8P3J43lJ6RJ3j80RMJ40j76pJ23L2r6n7j77O8J86O2k17
7367a16L0L18p5j73j45J46M5O7j53QL3P7J87j11k18J07p5N6l57L68lO1k46K82
7391A13p9j58J91k69L15m43L01Nop5J50j76J79j03l9J15o7o6J03R0j66O3N3k61
$$ y = [515, 223, 196, -45, 115, 189, 22, -2, -93, -158, 23, -115, -37, -75, 127, 194, 53, 161, -116, 174, -121, -23, -35, -94, -45, 171, 109, -123, -62, -75, 158, -307, -2, 526, 55, 65, 138, 259, -153, 101, 44, -90, 122, 301, -57, 180, -131, 52, -173, 79, -164, 119, 38, -23, -41, 10, -44, -94, 53, -81, 8, 23, -12, 155, 78, -204, 92, -17, -38, -26, -14, 31, 99, -95, -155, 53, 12, -133, 240, 148, -8, 8, -137, -113, 57, -270, -65, -58, -54, 32, 170, -14, 2, 15, -59, 137, -271, -69, 92, 212, -110, -53, 63, -113, -105, -115, -12, -161, 13, 25, -3, 346, -44, 69, 54, -7, 43, -75, -212, -309, -8, -84, -32, 6, 17, -81, -8, 135, 132, 148, 157, 170, -10, -1, 3, 143, -33, -40, 83, 115, 19, -38, -215, -147, 39, 101, -116, -86, 232, 157, -16, -161, -15, 30, 97, -56, -48, -15, 62, 249, 138, -80, 27, -48, 8, -349, 19, 16, 77, -169, 113, 34, -124, 67, -202, 113, -330, -29, -24, -30, -105, 45, -131, 48, -55, -94, 21, -46, -112, -9, 81, -85, -22, 31, -230]
7415b30K89r0L01j39q5j18J32j46N8J03q5J15lL3k96Q0j39J20L64q4k25L3K61
7438B49m75J84K0j54K09j20QN2l2L35l51LJ39p5mJ14nk1j96LR7J98M8k50J47J11
7464B34n05J58K05k1kj34J28j90K39k13K18r1L6o25J082p64R31m81l27M51o86
7485c57M08k37M50j81j7m6j36J15J88j12j55J96m62J74L41j42k8J05j41J4l7n2
7507a12K11k11m4J76J55j00o6qK68m06J1L50k26Ok9j16R4Q8K50k49j32P0j07N3
7531g4J56j52J3rN5O9o3j02J23L1m3M2n3n4KK70n6k01k7L2J13M3k42K41j86m6
7557a18J71j37J02N6k33K76m6j42m3k6J02J29j16O9l2O2p4l1j37J00O3o0N1O5
7581E1j29M9n4J49q0q7J13J95l33R3K52q6k4r1n7J04k32J73Jj9K42k24p5n5J76
$$ y = [-230, 59, -31, 270, 131, 46, -72, 60, -86, -28, 75, -10, 105, 102, 135, -161, -81, -220, -100, 264, 180, -45, -12, 249, -226, -42, -22, -176, 33, -87, -79, -27, -59, 276, -75, -72, 67, -8, -12, 102, 97, 76, -120, -117, -20, 178, 226, -24, 123, 234, -271, -113, 92, 71, 69, -65, 63, -127, 112, -101, 117, 26, 62, -563, 519, -245, 686, 205, -122, 329, -357, 51, -186, 264, 83, 66, 20, -116, -1, 187, 75, -80, 116, -346, -172, 169, 27, -1, 104, -37, -23, -60, -112, 99, -112, -156, 20, 175, 75, 9, 1, 269, -137, -126, 224, -2, 4, -25, -141, -47, 41, 291, 42, -90, -20, -127, -74, 82, -70, -57, -66, -11, 58, -5, -107, 16, 47, 4, 46, -7, -61, -59, 211, 155, -46, -73, -41, 72, 115, -127, 114, -72, -118, 53, -84, 18, 74, -159, 117, 71, -71, -114, -140, -38, 91, -25, 44, 12, 74, 0, -31, -168, -68, -5, -65, -14, 51, -78, -29, -83, 66, -14, -101, 12, 207, -126, -33, 219, 133, 109, 18, -39, 65, -167, 6, 7, -12, 230, 6, -69, -124, 52]
7606E2O2O5k20J45j53N3J38k91J31J90l52J44lM0J04r1R5J20k52l5K02%j93p1
7630a20L8K15j84J51M7k92K08j50kL19k36J16k80R6K22j88K46k43J30j34j54J45
7652e0J14J2j99L78q7k68J76k50K03O8j49Q0O4k97K29j06K3Q6J68l46K53p3K2
7675E1j98J99m0p5O0j3n3k6K4K6J29RQ3j1j53j66J95L3j12R9n4j32J57q2J36j83
7701i7Q3Jj5j0L7m1j64N7JK44N6j67J0J05n4Mj87K65j86M0J06j48Q2L4Jk08rK60
7729A00k20j24K52J74j44j94O0J29j53J5P0K0j66m5J72K32M8k06j89l9M16k68
7751f0L35k35j87L53k94k8J14Q3m6q5J69J0j41J09k01J24p6R2q9J46q1j54Q8K8
7775b6J73J44l40q8N8K17j68r8M4J40R2m4j78NJ21l0N9o1K16l21L01j62L7K8r3
$$ y = [52, 114, 179, -41, 104, -49, 4, 142, -149, -18, 172, -180, -36, -39, 1, 105, 14, 109, 229, -23, -58, 144, 144, -49, -120, -82, 133, -51, 100, 147, -145, 63, -87, -89, 230, -6, 110, -170, -74, 148, -40, 206, -37, 93, -41, -195, -50, 64, 76, -123, 255, 168, -100, 76, -174, 29, 97, -52, 28, 92, -205, 24, -82, -59, 27, 195, -151, 102, 29, 51, -147, 52, 12, -63, -3, -16, -69, -95, -71, -45, 84, 93, 176, 165, 12, -154, 41, 74, -38, 61, 7, -125, 32, -50, 86, -97, -14, -13, -28, -38, -1, -42, -206, -149, -148, 96, 152, -15, -5, 100, 46, 50, -137, 128, -58, -18, 88, -60, 22, 56, 57, -151, -160, 100, -120, -244, 8, 182, 38, -156, -96, 33, -120, -105, -35, -15, -181, -226, -54, 178, 226, 20, -169, -208, 208, -60, 275, 40, -147, 206, -88, -116, -2, 81, 35, -50, 119, 129, -12, 97, -104, 20, -56, 36, -53, 93, 12, -142, -54, -26, 147, 291, -49, -137, -79, 138, -30, -128, -84, 56, 148, 104, -74, -69, 52, 22, 81, 20, 236, -85, 216, 54, 91, 119, 26]
7800B6n5M1l76L15L39m70K86j25j5P5j10K6o2J82j60J51j52q3K36P2O0k55oL6
7824b4M1j37M9J39J7nrj29n7L64m14J15J47k21j77M33j68R5J29k94N1k2K13j48
7848a2N3j41K31j69o9oM9P7j96R0j06m8L62m02Q0K87q0L3J04p9p6j7J00k02J08
7873b9K7j6J19%Qr3oO7n4J38j91P5R4l28L9k2K24L6k60K91l94R5K34Oj35LK84
7900B12p6j52j74L04j76M0N3l2L9r9n7k16L03k28oJ40J16K0k2j00j11K21j47Q2
7924f6k6N6n6r2O5P1oJ52k10L01j97J4J31k19j6J12l9j05L3K50j35r6QN3j00N2
7950f5M1Jm0j38Q2m0n0K67K57m50K81m4j95Q7k9L0l2pr6N3J27j53M22k47j26J04
7976D0q9K4N5K45k88j16O9J1Q5J13r1K15j56k13O4L6M4j40J6J51J05r7k18K02
$$ y = [26, -29, 12, -364, -49, 290, -180, 106, -19, -34, 41, -69, -43, -105, 77, -83, 68, -84, -167, 69, 141, 201, -54, -60, -24, 17, -120, -71, 68, 85, 80, 71, -58, -115, 249, -165, -50, 97, -124, -301, 132, -36, 59, 188, -106, -55, -77, 136, -12, 41, -100, 131, -38, -107, -113, -64, 13, -183, -93, -199, -247, 115, -287, -207, 80, 0, 33, 137, 58, -18, -35, 65, -137, -29, -2, -18, 101, 101, 109, 16, 10, 77, 23, 161, -30, 45, 139, -189, -150, -172, 52, 88, -172, 119, -275, -180, 54, 60, -75, -72, 212, 136, -16, -190, 114, -62, -22, 31, -1, 38, -61, -118, -334, -31, -259, -265, -125, -9, 11, -11, -111, -222, -1, -148, -66, -92, -36, -92, -184, -119, -48, -54, 98, -112, 189, -8, 6, 137, -82, -98, 14, -25, -130, -97, 153, 18, -78, -70, -17, -117, -65, -24, -23, -63, -201, -119, -159, -209, 58, 315, -135, 146, 102, -93, -6, -35, -5, -37, -44, -140, -87, 40, -113, 309, 62, -64, 40, -49, -25, 30, 275, -13, -129, -60, -49, 36, 149, 58, 273, 117, -96, -32, 4, 48, -92, -76, 75, 180, 83, -135, 67]
8000F7l19J87J80km09L26Qj68K24J32O8l66o3L4K27j32l54M70k69P8J25j2j26
8023i4J08K27j54L0k50L9J11j55J56q0J21J26k83K12k65J42o9JP2M0J41k68K17
8046A25k95K9K33k73j38L68J61o4r7k48K51j33j44Q9l9L3K8K03nj48Q9J60k7m6
8070A12j44N3m0qJ3QK3j67J6J35k5M5q6k08L17j00R6j3R8k10r0J98J46M1q6K7
8096A51k33O4r5o6O5O0o4J63p7K9m4J10np6m5J34r0P5j72J84j17L7M4l2N5k52
8122a97K08K39k96MR2k41K85j22K8L02k07k67J70k8O8O8k61K14M9l38J19R5M1
8145B5k4J80J1k33O4o2J08l6n4J12k01L15n9L9j62p2J30o6n2p5J47J28j82J36
8169A17k10J50p3j1M9j1L0k4r0J19K5j30K54m8k61K23J1k86M7Q2J4K18
$$ y = [67, -252, -65, 115, 113, -296, 30, 38, -130, 94, 226, 294, -72, -135, -101, 126, -6, -360, 110, -159, -81, 44, 32, -94, 14, 241, 87, 117, -133, -94, 17, -138, 18, -62, 59, 185, -98, 114, -151, -9, -78, -77, -5, 35, 176, -92, 125, -170, -141, 92, -181, -319, 49, 210, 146, 49, -199, 52, -81, -225, -136, -175, -142, -114, 89, 84, -64, 25, 185, 158, 112, -32, 21, -19, -27, -14, -6, 17, -150, -134, 1, -24, 21, -65, -273, 44, -56, 40, 27, 125, -85, -175, 23, 169, 210, 124, 151, -82, -18, -113, -179, -114, -54, -118, 45, -32, -3, -47, 63, 58, -18, -63, 71, -19, 56, -116, 68, -49, -12, 32, 0, 55, -197, 11, 250, -46, -42, 50, -191, 94, -28, 0, 302, 95, -172, -2, -30, 38, 106, -155, 59, 108, -230, -111, -16, 25, 1, 181, 192, -41, 23, -39, 69, 33, -21, 91, -110, 205, 146, 185, 23, -49, 81, 15, -37, -112, 35, 163, -19, 117, -93, 57, -16, -27, 22, 11, 41, 17, -73, 46, 71, -59, 195, 147, -114, 109, 120, -166, -119, -37, -23, 195]
8191A95
$$ Imaginary data points
##PAGE= N=2
##DATA TABLE= (X++(I..I)), XYDATA
0@%%%%%%%%%%Qj6J6j6K4l2M0n5P0p9R5j18J34j58J89k20K58k98L43l98M56n19
32b76N90o69P56q54R61j078J204j344J500j667J849k049K266k504K765l052L365
49A763l706M084m499M957n468O040o682P408q238R198j0322J1663j3292J5320
63H226j7928K1424k6383L4020m7440P7873k75206l029M36841j28869j18896l4223
75g3590l122q4530L2512O6638J00930O7577o7883j91556j5483J29106J19608j9791
87F0416p1169k983K6389l6003r882M2619O5119L203l3892m5642l5568O0983Q0594
100A04184n3187m5487M0828N367n2779Q813M6530k9175o951M9384o1014n9772
112e3259O7380L2227m9285j5092J8206k2671j1185M6433k6239o1427N3247N3899
$$ y = [0, 0, 0, 0, 0, 0, 0, 0, 0, 0, 0, 8, -8, 8, -8, 16, -16, 24, -31, 39, -40, 55, -63, 71, -87, 102, -118, 140, -158, 185, -213, 243, -276, 314, -355, 401, -453, 508, -570, 634, -710, 790, -877, 972, -1077, 1189, -1315, 1450, -1602, 1763, -1943, 2141, -2358, 2599, -2869, 3171, -3511, 3897, -4341, 4857, -5465, 6198, -7094, 8226, -9702, 11722, -14661, 19359, -28081, 49792, -225414, -228443, 208398, 79529, -39367, -73590, -76712, -161242, -128730, -62092, 38838, 106415, 38532, -153024, -168507, -39401, 80207, 60416, -10753, -13736, 12653, -23350, -33232, 9387, 74506, 77709, 43817, -1825, -37393, 23590, 104184, 50997, 5510, 46338, 51705, -1074, 7739, 54269, 25094, 18143, 67527, 6513, -53259, 14121, 46348, -2937, -18029, 177, -22494, -33679, 12754, -13485, -74912, -21665, 32234]
124C2234n4796p0548L3926Q9830k3235q5960R303O4982J1515n1135j7510L4145
136b7249J7303J2501k4373m6464M6035O4955l3165n5256K5296N7139j0576k6162
148a6L51n159L7619K4994n8900k5650O3273L3085n7259l4676N4829K0919l6521
161A6889o477R828P495R11p149p75r065N585J4235j6704j3398O041J3447o526
175A4337k1231J1301M875j3442J2165j689k3946P875K4410r329l3259J5325L2134
188A9526k2111j5260J4271M760J084k303l115j245M991J0023j0452n429J0852
201E592k142J961K126o935K067N407O799m275j2079J1484J3794o376j3610J640
215E453K1139n226j9572Q271O968l676l085l815J52J156M602m483j1125R509O508
$$ y = [32234, -22562, -93110, -59184, 30646, 7411, -78549, -69246, -4264, 7251, -43884, -61394, -27249, -9946, 2555, -21818, -68282, -22247, 42708, 9543, -45713, -20417, 36722, 26146, -16, 335, -4824, 32795, 57789, -1111, -26761, 36512, 69597, 12338, -22338, 32491, 53410, 16889, 10412, 20240, 27735, 28646, 21497, 20722, 11657, 17242, 31477, 14773, 1375, 7416, 20863, 14337, -6894, 4407, 9282, -4160, 8005, 6316, -17630, -9755, 14655, 5326, -27933, -12608, 19526, -2585, -17845, -3574, 1186, 2270, -33, -3148, -4393, 598, 10621, 169, -5260, 5592, 3450, 5411, 7537, 602, 2669, 8076, 14875, 10600, -1479, 10005, 23799, 17423, 3813, 5453, 26592, 21366, 1794, 10065, 17033, 13357, 10272, 6457, 6609, 7765, 12367, 7884, -3241, 6268, 12776]
230A2776j0130j570K755J749k006j328J892n796J267O158o910m514K604L266p06
245d93q121K437N499l568o82o2N90J523p8J800l602N70P053l302k737L193L78
262C98K18j668K40M58k145K861j111l884L412J314j376j582Q94K832j930o63K633
279I01j162l67L07j77M49k498N81L83k476M21p26j028L55p10Op59O35J202j024
298e687K59P96P6R11j62l42M88n71P74o71j508N32O03m24r95n89J501K74p50%
318e485M6J461P56j64k81L24J426N45j659M8J171J93r79j658N94O73p60j214N31
337d432n4J023n50m19N07R85J228k72o31J390J158j093K91o03Q10n26J18j38j118
356b326M35R9n77L93o03J607J084k000P58J583J493k38j101J133J207l43Oj575
$$ y = [12776, 2646, 1076, 3831, 5580, 3574, 2246, 4138, -1658, -391, 5767, -1143, -5657, -3053, 213, -493, -8614, -6177, -678, -4246, -4928, -4990, -4400, -2877, -2955, -1155, -4757, -4187, 2866, -436, -3173, 20, 398, 616, -1052, -812, -354, -2499, 362, -749, -4633, -1221, 93, -1283, -2865, -1971, 861, -1069, -1732, 901, -261, -628, -321, -498, -49, -2547, -1966, -1583, -4059, -3638, -4364, -5392, -5037, -5747, -5741, -6500, -5865, -4663, -5687, -5428, -4632, -4556, -3645, -3807, -4149, -3661, -4232, -3458, -4129, -5637, -5105, -4502, -4926, -5921, -6510, -5009, -4735, -5485, -5485, -5439, -3978, -3222, -3386, -3667, -3343, -1917, -1372, -3031, -2983, -1812, -1619, -2598, -4256, -3662, -2989, -3749, -4963, -4432, -4486, -3463, -4013, -4432, -3925, -2940, -1712, -1984, -2615, -1225, -67, -1160, -869, -1472, -662, -1188, -1070, -1208, -2326, -1891, -1792, -2369, -1976, -2579, -972, 112, -1888, -1130, 453, 1946, 1708, 607, 1740, 2947, 2604, 2610, 1035]
374A035L66J492k026r61J28J62P76j071m12j60P69J411j680J63J444o59P95M64
392B036j022J549l22p04k48p55J078j549k39L50j252J752P09k806J028J342Q56
409A803r08k41J140J872Q84p17k470M219J28l225K75J452o8j500R8J50n72J486
427C806m0l478M227J44j982J249r12J806L76q33r90P69J174k362j991L275k022
444B216j773J356j096r9k23n14j65n24J765q32j505L081j246k04J760j992P39
461G44J260r42j441o02K688j810j793J696n17L83M14j239Q48J626l94k96P50R60
479B335o59M52K029k232J87J838j593L14n42n63k43n74N25j044p49J365j153k79
497e86J009r75J307L8j869R40J477J10k470J92K088j236k302M1p90J369q56j599
$$ y = [1035, 1401, 2893, 867, -94, 34, 196, 972, -99, -511, -671, 98, 1509, -171, -8, 1436, 777, 1572, 2036, 1014, 2563, 2241, 1537, 1289, 534, 1612, 63, -176, 174, -1078, 674, 1383, -1423, -395, 947, 1803, 895, 654, 1794, 3666, 4550, 3833, 1363, 5582, 5710, 2485, 2760, 4212, 4144, 2644, 2742, 2892, 2320, 3806, 3766, 288, 4515, 4659, 2677, 3926, 3014, 4820, 5196, 4363, 3373, 4142, 5316, 2954, 963, 4238, 2216, 443, 1799, 703, 604, 381, -133, -298, -822, 943, 111, -1394, 1687, 441, 237, 1997, 5, 744, 2004, 1062, -379, -981, 1707, -103, -1896, -200, -717, -334, 80, -1159, -311, 1315, 921, 625, 1375, 2335, 1676, 2128, 4157, 1925, 2112, 3950, 2357, 2671, 2129, 1566, 1323, 749, 1274, 230, -519, 846, -307, -586, 423, -552, 755, 793, -1076, -136, 1341, 1451, -1019, -827, 1261, 25, -2277, -2236, -3026, -1657, -2513, -4112]
515d112O56K99J127j100l15J000N53R06p19j000J777Q46p88q31Q38N72r16o21
533a828L7K7k29K86j139J159o44R40L96j93l81J013P01k46m70J272J04q86M74
552C93p77o1J41j202L08l36k00o51O38l80j11N23Q82r21L54P79j15L38j26q5k72
573h81Q33p92k55N10k82j047L97J47j471J416M06j175K34J043o63l18K377p22
591b43m3M78N94m70K96j43j417J834O1k036l37J128o16k11O33q08r9J797k12j294
611a108J248J402r93M42R24r40L36Q12j413m42Q97p62p82N94n23q66J259M39j684
630a160J075J172r42J6J326k10l60J140o5j508J225P56j903P9J55o94J84o9r07
649f90N5J029k15q24J248N08r45J010J09n93J384K1j003l05J151J98j983P48r2
$$ y = [-4112, -3456, -3157, -2030, -3130, -3445, -2445, -1892, -986, -1705, -2705, -928, -82, -870, -1701, -863, -291, -1207, -1828, -1791, -1764, -1993, -1707, -2846, -1687, -2331, -1391, -995, -1188, -1569, -556, 145, -101, -571, 701, 805, -81, 393, -384, -445, -304, -1506, -1198, -1534, -1734, -2385, -1747, -2127, -2238, -1715, -833, -1754, -1400, -621, -736, -398, -524, -609, -881, -48, -840, -1095, -585, -867, -1914, -1517, -1370, -2841, -1425, -1019, -2194, -1960, -917, -1580, -1898, 479, -243, -286, 192, 786, 316, 612, 469, -948, 886, 947, -1089, -1426, -298, -914, -1125, -492, -1300, -1399, 398, 186, -1108, 140, 1542, 549, 991, 1915, 975, 1311, 2123, 710, 268, 1165, 403, -379, 215, -308, -1174, 85, 524, -1160, -85, 1087, 145, 161, 1487, 1277, 917, 2057, 1992, 484, 1709, 2465, 562, 641, 796, 102, 286, 217, -690, -635, 394, 179, -645, 603, 1111, 166, 1176, 1285, 692, 2076, 2097, 1094, 789, 1940, 2138, 155, 903, 811]
668H11o36L52o30p88J319k78o48N07R23j52k09J493j7j535J963M1j071L90o68
687A167l36j67L64j358l01J393l80q28J001j009K02J006j17k46M61M50K50n62
705I90N37k63l60R60j254n73M18j050j32M0M00n21o58J288J59L8R74j270P33J183
725A639j212L77p3n23O25j167Q56m07p68M39j138J038L92j540N6O65k98L76r95
744a658K159j349l37J993p60k81N27ko0k70PM04j201P55j362N88r7r69J160m0
764g93k30P11o35R50L81n21Q99k23l78P81q48K45L7p76J92n31k91J23p08N15k76
785a376j15O66m76Q27j9n12J042k54lM61p44Q21m47q34Q09m38q45R1m18O57p84
806a891L26Q45q62Q64k85N10L81q5M00M13l37N72j89k92J34j09ro72L20l4q19
$$ y = [811, 175, 527, -103, -891, 428, 150, -498, 9, 932, 780, 571, 2064, 2047, 512, 2475, 2516, 1445, 1835, 1167, 831, 664, 1028, -330, -631, 762, 382, -446, 555, -454, -252, 754, 637, 391, 852, 1302, 1552, 990, 1527, 1264, 904, 1864, 610, 37, 455, -595, -727, -687, -287, -808, -1466, -178, -19, 19, 993, -277, 456, 1639, 427, 804, 731, 208, 833, -334, 522, 115, -653, -214, -1352, -314, 78, -1462, -1406, -741, -1039, -663, -1658, 501, -848, -1185, 808, 48, -233, 294, 292, 232, -38, -31, 373, -828, -73, -1435, -847, -944, -1913, -753, -793, -1023, -312, -947, 3, 384, -137, 762, 539, 161, 942, 94, 339, 376, -400, -208, -739, -1030, -907, -1615, -1100, -1376, -1491, -825, -1301, -474, -493, -1005, 37, -217, -220, 241, -503, 318, -129, -963, -154, -592, -1437, -1346, -1764, -1107, -1891, -1565, -720, -1582, -718, -1003, -493, -112, -197, 203, 616, 279, 851, 662, 370, 504, 395, 386, -286, 34, 0, -819]
827h19P47o09k47M88PP99O2k84J129p94K44N09l19M02o11l25L62j082J98R9o98
848g42P5o36K43L99q24P86L15m51Q57l26M84k3j19O38l21j96L42o18K30n86k5
869d98K39o04L62k60j28R28q09O56P76k37N32J52r6M30J94Q0n03j42L11o85J16
890H14q9m83L46l16l05k85K95L05k68qM81m3O27K84r18P04q1m05M25o19j63n39
912b41K54j036J73M44k10l92J22Q8k56J051l02j42M63O83K98p34K78N58n33L24
932H90m41n78N10Q7l63p23M61K14n73M16p1j95J264j11o65L95P26n8j30n2j24
953H79N4j44l54o97Q10k34j415O18p4l76L92K52m72k4J257k89n32N76L60l90N51
974G48k87o53L88K97r04q5M48q69K32N13q04l34J358J75j533J682J190j256K53
$$ y = [-819, -72, -681, -928, -440, -433, 366, 428, 144, 1273, 479, 723, 1232, 913, 1315, 704, 379, 741, -341, -143, -44, -742, -667, -1303, -1060, -661, -1485, -699, -384, -835, 22, -304, 180, 157, 38, 676, 355, 159, 501, -117, 113, -473, -498, -259, -863, -501, -761, -889, 39, -770, -114, 662, 425, 957, 1109, 1013, 1443, 1637, 1717, 1214, 1072, 1383, 698, 814, 725, 242, 588, 272, -33, -318, -23, 282, 14, 6, 487, 444, 1071, 1355, 437, 1141, 1060, 655, 1080, 461, 298, -241, 13, -1023, -850, -406, -616, -1008, -886, -798, -1054, -3, -305, -447, 16, 699, 997, 263, 541, 1099, 566, 890, 449, -129, 381, 468, 105, -618, -157, 57, -516, -100, -171, -366, 898, 787, 122, 517, 1243, 1185, 1055, 1003, 879, 933, 789, 435, -262, 548, 314, -1101, -483, -557, -933, -541, -289, -761, -785, 472, 183, -349, 227, 587, 197, 748, 461, -192, 196, 493, -411, -496, -48, -917, -685, -172, -976, -1310, 48, 223, -1310, 372, 1562, 306, 559]
993E59N03l63k05O46j168m17J540j230n59P56k60q86P03j78p83K38J120n90j052
1012a626J632L62r88O48L02m45N09j52o99K9O13o88n45Q83m69j114J454m33n56
1031a283R77J8o49L57J500n51o99J497l17o31P81l51l03J15m11j01j81J56m45
1050e21m5Q04j169k76P49k97L37Q57J98r52O61O69r70k02J294j077q76J248j124
1069f92l05N59o23n76Q76P9J28l94N43l23l70Q49m53P28J335j643k8Q93J40n26
1089A97o35P74q49P03K86j154o4J247l36m62M41M95p3q3O82m80L42Q71j003J91
1109A090J35o43K01K14n58m90ok14r76M48P45n25j84P68j349J772k45p63J15J69
1129b96R14J95j696R98j097J237l83j475O81P1K38l23l48P64R6K90M93o56P41
$$ y = [559, 1062, 699, 494, 1140, -28, -445, 1095, -135, -694, 62, -198, -1084, -381, -559, -1342, -1104, 16, -574, -1626, 6, 368, -620, 28, 330, -115, 394, 242, -457, -428, 185, -503, -1048, -165, -634, -1748, -294, -727, -1283, -306, -288, -937, -580, 920, 369, -330, 1167, 850, 219, 1000, 649, 346, 461, 50, -51, -232, -76, -521, -566, 238, -931, -1207, -458, -755, -418, 439, 637, -315, 346, 1015, 45, -157, 1137, 60, -816, 432, -692, -997, -438, -1061, -1637, -761, -682, -554, -948, -405, -728, -1098, -249, -702, 26, 1361, -282, -310, 583, 723, 197, -438, 336, -513, 190, 476, -678, -742, 505, 169, -293, 148, 643, 570, 487, 1169, 689, 1031, 1902, 899, 1090, 1225, 582, 783, 997, 439, -51, -57, -271, -1247, -799, -54, -579, -763, 5, -1344, 428, 183, -580, -465, -296, 618, 813, -883, 115, -982, 255, -128, -1603, -922, -851, -613, -936, -1284, -520, -424, -134, 359, -297, 444]
1148D44N18m32J65J0K50J70n43K88k46o9L2l14j42j00p9N68o98K09J83P7N29n79
1170B41L53P04n28n4m0j44P2n02L79n35n31L41m80k16J53m32O50j61q1pK34K55
1192c29p8L24K18J23q63Q87m41q6O65j038L85m04J27j33m23J72J61P41k22l27
1212e41J135n91l80J058k16Q66n09j24L83p37J46J48n30L09m62k55J83m77L00
1231b94J4l07L99OP6J86j98K53K99l44K49k96L24j09o55O6l65J68j86k74o4K91
1253g61j37K39k03L66K76Q9K99k46M20P0r0J32Nj87L50m57k39r7j73M26o48l6
1275f02N95m23M68J23k86L46K00j77L6J28J65o8j87j51J32k8l72k93J76m28N8
1296e88O5k00K53j12L82Kj98L20L19p0J37j91K81N7k37j84n3p9K19m57k45J37
$$ y = [444, 962, 530, 695, 705, 955, 1125, 582, 870, 624, 555, 587, 273, 131, 31, -48, 520, -178, 31, 214, 291, 820, 241, 594, 1298, 770, 716, 676, 532, 604, 102, 481, -54, -585, -244, -724, -940, -787, -1219, -569, -730, -811, -818, -584, -329, -407, -83, 135, 258, -605, 282, -159, -245, 420, -618, -233, -637, -510, -643, -1066, -894, -733, 8, -214, -541, 594, 3, -377, 681, 465, 1331, 822, 698, 1081, 344, 490, 638, 108, 417, -45, -300, -117, -594, -294, -280, -587, -188, -182, -106, 80, -118, 135, 434, 90, 339, 43, 367, 258, -397, -331, -696, -528, -714, -988, -1052, -761, -898, -659, -862, -496, -220, -131, 168, -78, 342, 412, 322, 454, 459, 272, 622, 165, -74, -171, -344, 82, -566, -602, -7, -430, 38, 161, -125, 221, 421, 244, 280, 408, 573, 505, 318, 167, 299, 271, -101, -394, -218, -646, -588, -523, -723, -470, -582, -200, -198, -396, -76, 243, 173, 310, 119, 400, 457, 220, 36, -17, -96, 123, -334, -579, -442]
1318d42k53N13k92J28J77J25K21L6K1K53J7J66R6l78J94p5j14m06k80L92m33j52
1340d86j43Q5L13j17j84L40L5O9L93j23M60r5j46j27j82j21J57k01K95o88O5o
1362d07m10N29j61N7j26K55M39L17m16L65J30pJ85k16J46m95J87N4m05Np8j79
1384b31N0j14n24O57N6j7o0K98K78k92M36J02m15K26L74r69N01n71J68K78n33
1405c02j78o05J22m5L83M61J11j12L63l94j16O64m3J32m39L47N52q38J85K1K38
1426E07l93j066N82k24n4Q93o22M7K01l7N64m38J94L97R2k77P8q2K9j24k79j51
1448a63l25N27m11l66N37l83k45Q80m20j7N69J26l66m14J160q14L78m8K83m92
1468dO83n49n79P7K45l7p23N82R1K74l81Q9K61O00m7rl35o8M60m10M88n38R4J77
$$ y = [-442, -695, -182, -474, -346, -169, -44, 177, 213, 234, 487, 504, 670, 766, 388, 582, 507, 393, -13, -293, 99, -334, -486, -629, -544, -231, -348, -532, -192, -157, -88, 305, 182, 642, 547, 401, 274, 92, -29, 128, -73, 222, -466, -401, -407, -817, -288, -449, -392, -518, -263, 176, 493, 77, 442, 572, 565, 750, 534, 680, 185, 372, 426, 21, 26, -52, -231, -181, -295, -819, -162, -106, -123, -183, 115, 393, 101, 537, 639, 224, 450, 824, -145, 356, -215, -47, 231, -302, -480, -1085, -963, -1008, -625, -164, -53, -165, 198, -196, -312, 352, 309, 441, 2, 349, 901, 63, 248, 269, 507, 114, -952, -370, -594, -648, 245, -377, -330, -129, -166, 398, -40, 154, 551, 643, 366, 444, 362, 391, 267, -12, -163, -488, 39, -372, -738, -201, -584, -829, 51, -369, -386, 183, 309, -57, -471, 689, -125, 253, 205, 488, -4, 679, 130, -449, -372, -127, -164, -887, -305, -214, 60, -321, -232, 29, 629, 582, 573, 238, 170, 630, 220, 708, 170, 264, 441]
1492D41n67n43M70j16J33j20j49p7K76O35n23m00R71k06k76L86l39m0P16m62l56
1513a46J29N3l25k92J87KJ23L51o96J49J61O12k09o47J009K8K7N6m41J12N98k32
1535F09o38R9K7j44n2r3j46J32O82q09m8O75L0j74j5k37J32J86P42r56j86N95
1557D11m65j33l24J40P1J52n56m0K19O13o37M53K00m26M60M11p12O62J62m04j09
1578A48L6K23j51k39J25n28J68M58q26K71n7J75K94j52L01j28K15L67m06l1N24
1599G87n00J36q3m36p7K16L6l05k46N35r34O93j8r34O93M86Q5n8n7J8O5m89J193
1622H06p93K10l25n2p9N43r79M85m55L02m66O29J9j75K05N26l29L44j09J03O0
1643D70k28L97n27J45J65p46K96M1l48M91m92NM49j08j91l2K67L54k91J6K71l90
$$ y = [441, -126, -669, -199, -315, -182, -302, -451, -528, -252, 383, -140, -540, 431, 225, -51, 335, -4, -44, 672, 210, -146, -17, 36, -289, -581, -394, -392, -269, 82, -614, -465, -304, 308, 99, -548, 461, 489, 516, 572, 131, 243, 841, 609, -29, 70, 97, -47, -99, -192, -338, -206, 476, -333, -381, 294, 324, 150, 135, -102, 30, 216, 958, 2, -184, 411, -54, -187, -511, -371, -300, -148, -704, -744, -525, 88, -549, -96, 104, -322, 138, 549, -163, 499, 661, 257, 148, 184, 407, 256, 17, 142, -386, -218, 240, -586, -315, -372, -197, 97, -55, 246, 118, 333, 700, 294, 263, 787, 287, 423, 340, -96, -173, 43, 79, -226, -472, 63, -871, -178, -196, -1130, -437, 49, 134, 76, 19, 37, 102, -387, 806, 13, 223, -102, -154, -233, 310, -669, -184, -639, -337, -803, -174, -155, -330, -125, 401, 72, 416, 307, 410, 470, 242, 639, 112, 257, 422, -324, -28, 13, -335, 156, -336, -331, 118, 10, -181, -213, 54, 408, 117, 133, 404, 14]
1665A4N13l89j86j2k81N34l86j69L91l89P5m4j64M40j41j63L47M2K39N6p0K60
1687E17m52K10K51o80L19k96K81j72J60m90O0L37j24J06M49n2p69O75M3j2L80
1708G41n59M80m85KK16j74j45K69k93j377J299o04J21K52K72j20k37K86K47j07
1728H4J54j97M68k15k93L16k86J06k18P8m9j07m3N9j83L0M75l13J72k67P79l74
1750A76l4l8L0J61J04j10J61j78k37J5n67M91k68j50L33l79L54R3L29r21P8R43
1772C86o45K92J77o3J0J94k61J55K2l17K10J23k73k07m18P24o59N19j81J49K40
1793A77j35k61O09k05o0K41l50K05k8k88J47k67Q7n1q9J27j45P1K24j22p8J99
1815HN5j4L36j67J57j79M9L6m3j39N8r4J1m3k62p4q9K8J34k07M41o4J90k34O37
$$ y = [14, 527, 138, -48, -60, -341, 193, -193, -362, 29, -360, -285, -329, -493, -53, -194, -357, -10, 32, 271, 327, 257, 517, 65, 275, 526, -154, 165, -131, 150, -22, 138, -352, -292, 45, -79, 27, 476, 424, -345, 330, 373, 361, 741, 182, 662, 177, 179, 395, 221, 76, 345, 52, -1325, -26, -630, -509, -257, 15, -105, -342, -56, 191, 84, 238, 41, 509, 294, 1, 317, 31, 137, -81, -3, -52, -159, -202, -143, -326, -296, 179, -134, 38, -229, 550, 176, 142, 104, 134, 295, 399, 289, 450, 272, 35, 50, -517, -26, -294, -444, -111, -490, -136, -43, 286, -635, -557, 386, -259, 33, 210, 147, 157, 351, 90, 245, 267, -50, 160, 283, 10, -197, -615, 109, -550, -31, -212, -63, 177, 42, -219, 390, 185, 125, 366, 16, 221, 193, -95, 52, -215, -128, -179, -268, -141, -286, -215, 9, -113, -191, 8, 63, 49, 385, 218, 375, 196, 245, 281, 238, 99, 157, 63, 74, 31, -231, -305, -394, -366, -232, -439, 2, -62, 128, -106, 531]
1840E31l79J63O9l91j7J002r85K5L52m91k3r4k75M06j50n94K47M20O05l80L69
1861D10j06o37Q49m74K35M84n44Nn8J70q45r9N83n21L37J16k98K30K20j57j53
1882b53L40l3J18r9L91m70J97P2n50Q81p51k58J25M52n99J66N65K59n24n51M85
1903c7J9O51p65K64k33Q59p24R82j191L78K95m83m52Q32n36L65l79j65l9L9L01
1924a9n8j17l9L28K5n1m37R73p47k96NP84k7J04p23K77k58N03j225P90N23n09
1946a94k93N26j36M12o5J51q60P98Q0m29M99l39l14L06j57J31j68p78M83O59q82
1967e70l5M65p87Q60k83M52n57j6O74p26M99KJ02j81l19N17n8j64j7l96J66J26
1989b46j17L61j83n6M26K8j33l5J55J97j02j66K2R2L73n87l06L46k66K91n15K6
$$ y = [531, 152, 315, 384, -7, -24, 978, -7, 18, 370, -121, -144, -238, -513, -107, -257, -851, -604, -184, 421, 41, 410, 304, -333, 516, 42, 277, 761, 217, 222, 164, 334, -511, -610, -27, -548, -211, -95, -393, -163, 57, -100, -253, 87, 54, 172, 73, 464, -6, 191, 263, -287, 594, -157, -415, -290, 162, -437, -271, 294, 553, 29, -522, -37, -18, 633, -132, 132, -101, 758, 34, 1016, -175, 203, 498, 15, -437, 395, -141, 224, -155, -320, -359, -320, -19, -77, -194, -233, 95, 120, 69, -368, 605, -142, -438, -433, 351, 324, 428, -295, -18, -276, 227, -998, -208, 315, -194, -487, 39, -97, 315, 250, 401, -459, 339, 419, -10, 489, 150, -164, 142, -15, 116, -52, -830, -347, 312, -570, -605, -140, -927, -67, -350, 102, -455, -471, 203, -523, -24, -22, 80, -101, -420, 97, 39, -125, -142, -538, -372, -246, -363, -2, -185, -241, 185, 213, 80, 45, 200, 397, 295, 129, 151, 243, 616, 29, -277, 69, -197, 94, -421, -395]
2011c95J20J1J001j79r58O85r7n51P32k27j81P80J67n47k99k36k81N8J91J74j68
2032b00m07L82o28R05L22j137N65J31K0j50N62k48r2K44j50J01J03l57O9j64O0
2053f9j04j27N44o20K08L49j12l40M38o0J74O2j8k37j20N4N0m0J49l89K11K33
2075B36n12K7Q3l2J36o4J96O4PJ41l82L73K83k95J37l19J98j46k4j49k49K20J01
2098C0n39J52J43j15J54J5J00J6J75Qp22J006K08j004J00R9j93J089n65r39N41
2119b41J37J30k13R4j58ln8K98q9P0L42j86K76j66L38j60k69J74m30o1k04J49
2141b30M07r1k81j0r5J72N9J55qp6p6j0L30j74j11P1j00K67j45J10k57j89O65
2164C83l71q4l57K70J2K5q7L67m85M24J35J0O6j2n84O77j30o08R3J41L87m4k32
$$ y = [-395, -275, -264, 737, 558, -400, 285, 188, -363, 369, 142, -39, 741, 908, 361, 62, -174, -455, -397, -206, -32, -200, -607, -225, -853, 52, 374, -763, -198, -67, -47, -197, 365, 117, 25, 269, 119, 220, 323, -34, 35, -129, -69, -173, -300, 244, -376, -168, 181, 69, -271, 167, 107, 281, 343, 325, 88, -32, 22, 72, 32, 181, -208, 3, 236, -276, -249, -166, -198, -62, -126, 70, 134, 141, 282, -100, 273, 556, 261, 398, 79, 277, 131, 107, -42, -291, -71, 30, -509, -357, -214, -329, -175, -160, -60, -44, 131, 139, -583, 423, 631, -373, -273, -174, -367, 722, 157, -782, -241, -104, 26, -187, -93, -251, -254, -312, -14, -103, -33, 309, 123, 399, 233, 571, 411, 142, 316, -114, -175, -379, -230, 177, 86, -195, -205, -300, -128, -69, 86, 78, 2, -74, -84, 246, 72, -39, 32, -68, 199, 54, 164, -93, -282, 383, 12, -72, -429, -159, -147, -122, -209, 158, -327, 97, 232, 242, 308, 296, -288, 389, 259, -349, -256, -115, 272, 228, -4]
2187dj99P0J0P0j95P2J29J64j94J41N0j55J87L9r4Q5j48J09m9k02L8r2P3R0q9
2212i4O4k7n8P9J12k0j06J4L86j53j16J40j94O0k30p2L23r1Q9m76K71j30M0N9
2236a30K9j59K80R1l5L5k2L1J57j47K06k60j63N5k35J25k25M62l98M64m12m09
2258f60P38K17m00M83l30r3L15j73L05j54m3m9o9k19o5Q6N1j65j25J71j82J28
2280b33J40k91L92o8j33J26J27R7q6J37r5Nj15r7o9K32l0k48J68n86K60M84q25
2303g08O53o42O60O4j15M51L9l82J18l09L84o9j59J92k78m4L6j38K27r8k9K7j21
2326b41J66L4J00K73n40L14j51J36L13k04k14J53p6j69K31r1k50k25M65r3r1j2
2348a72O7k4P3L6J6K38N7M5k15M3Q0k22K37k98j91K54m4j4J50k43J21k01J67n8
$$ y = [-4, -203, -133, -123, -53, -248, -176, -47, 117, -77, 64, 114, -41, 146, 185, 91, 176, 28, 137, 88, -114, -76, -168, -95, -5, -94, -30, -57, -115, -36, 76, 56, -50, -36, 350, 197, 81, 221, 27, 87, -143, -215, 108, 17, 106, -370, -99, -229, -189, -130, -101, -260, 20, 111, 76, 111, 89, 120, 277, 130, 336, 76, -87, -32, -267, -142, -367, 95, -303, 161, -251, -660, 78, 295, -105, 378, 48, -45, 270, 97, 402, 248, 205, 156, 87, -132, -197, -111, -60, -225, -350, -179, -361, -233, -93, -384, 8, -60, -193, -67, 60, 157, 71, 208, 113, 118, 3, -94, -163, 69, 39, -209, -41, -627, -367, 117, -708, -55, -697, -37, 27, -88, 363, 402, 20, 138, -171, 213, 144, -15, 177, -101, -145, -109, -247, -20, -118, -147, -120, -241, -75, -41, 59, 332, -208, 106, -45, 91, 404, 200, -14, 139, 63, -106, 125, 34, -216, -441, 24, -69, -160, -172, -105, -129, -56, -20, -4, 234, 291, 336, 121, 164, 244, 22, 259, -39, -230, 24, -20, -34, 116, -127, -6, -207, -40, -98]
2372i8M17j98n0J23l0j26o4L0l3K22j46p5k14J92Q2j13J67m39OK11j84J11J07
2395a02l50O18L6J92L88p71K84j33m70O88l54k69L85l22N6K6mk3Q3qj4K00Rk10
2419f5K27J2K8P8N2m30l3L05l27J29K81L44p90J0R6J70m92l92P80o47N58J72j22
2442e6m2N35j610P05N28K18p46N01l11k4J87K9J91l55ln24P44k25l85J285m97
2463A45k08L40n49M36j33J61k05K16P8k01m83O88l10k19k7J98O1m25J16Q0J31
2484a10M06l31K6M7K62l0j51j72K92l90J48K36l86J46m8j33J65Qj8K55m42L45
2506A25kk61J89n7J81N4j37K23k72m4O4j56K73o13L89K3j51j68O26j49o89L53
2528a99j2M98m81P84m23o16M52l44M67j96K53l61J98m24M51L84m92m17O14J95
$$ y = [-98, 319, 121, 71, 194, 164, 38, -26, 4, -29, 193, 47, -28, -242, -50, 32, -81, 86, -353, -347, -136, -320, -209, -102, -452, 166, 202, 394, 782, 11, 295, 162, -308, 380, 26, -243, 142, -180, -124, -98, -102, -125, -42, -50, -64, 136, 145, -65, 162, 174, 202, 280, 332, -98, -131, 174, -153, -24, 257, 601, -189, -179, -83, 87, -405, -797, -17, -664, -106, 66, -56, -98, 437, -1173, -468, 60, 278, -468, 33, -278, -302, -115, -86, 105, -250, -253, -777, -33, -258, -643, 642, 145, -63, 277, -272, 164, 31, 192, -13, 203, 281, 80, -403, 285, -25, -244, -271, -73, -12, -437, -321, -241, -110, 296, -35, -9, 38, 300, 270, 119, -53, 239, -151, -3, 233, -153, -7, -55, -188, -23, -15, -33, 222, -220, 125, 123, -138, 51, -6, 175, 229, 92, 315, 43, -1, 63, -93, 180, -433, -44, -21, -172, -340, 286, 137, -552, -199, -211, 287, -194, 590, 167, -449, 3, -341, 126, -70, 183, -178, 20, -404, 47, 431, -61, -478, 136, 331]
2548C31j38m68M18k70j3L91k76N0K34K5j57m47L15k21J80J02l51L61o45L98K8
2569a53ll0J71n41K15K84N2k87K42K25K44L6p66K47K58K0J29n10r5k66K64J98
2591f6o9j45K43l5J17J49m66J81O67o64J67n6kk65R10m78l54k2j67L06M90r0n47
2614a96l7N0J8P2J86J32j68Q6r7j51L42k45R8Or5l2j28l1n2P2R3j29nJ86j77n8
2640b60J54L64k71L4N5Q2q4N4n7q6k1l4j24O1p4k3L09j39k9n8L6l9K55J70k60
2665A5K9L52k18j93K01j15N6l08J63J22k11j15K2K29j49J21M2k95L42j07k1m3
2687h1j04L14O8k29M25o5k36j29K72m23L81r8j78j62L52k32L5J30J04q4q5K95
2709B70j53O7k26J83l5J0k99M41j49l20N40k8K04j119J60Q21n37M1K46N0k36O7
$$ y = [331, 193, -275, 143, -127, -140, 251, -25, 25, 259, 284, 127, -320, -5, -226, -46, 56, -295, 66, -579, -181, -153, -156, -186, -15, -556, -341, -57, -5, -292, -50, 175, 419, 455, -311, -64, 194, 214, 343, -167, -262, -528, -264, -66, -135, -280, -37, -72, 45, 194, -272, -91, 576, -88, 79, 23, 21, -244, 666, 188, -166, -188, -355, -49, 441, 351, -196, -233, -183, -165, -93, 93, 225, 57, 143, 46, -105, 237, -8, 90, 96, 1, -31, -159, -190, -242, -170, -77, -206, -211, -25, -202, -260, -106, 258, -13, 21, 76, 158, 74, 128, 71, -15, -36, -70, -194, -133, -207, -230, 79, -60, -89, -147, -111, -150, 105, 275, 15, 44, 396, 178, -15, 186, 71, 127, -181, -18, 104, -107, -222, -200, 29, -120, 1, 43, -252, 90, -17, -38, -81, -185, 129, 197, -32, 393, 328, 92, -37, 235, -188, 193, 95, -83, -245, 107, -125, -90, 40, 144, 60, -25, 270, 117, 184, -42, 141, 106, 116, -183, 258, 109, -211, 329, 301, 505, -614, -454, 367, -170, -129, 117, 167, -69, -2]
2731bp2J91j83Q0K57k53N1r5j12J48j11r4K36j42j33K6K88M8m26L59k56J94J8
2754A7N33n82j06L36n68K09L29l3j41P3j71j35R2L18q5j05r4J51N3j26P3j88N6
2777i4J25L73l3j02j41l36O2L7N7K19j85k29J30j08j7m10O43K26J98n15L3N73
2799E06l44PP4l07j1J73k41J59P9p9m5o0k40R9L74l61J38Q4Q9j91K46j27K06o1
2823A67j37j16K96o6nR1j32k00R0M0J53l77n1Q6J38R0K83l77m6L61m39N05m42
2846h8K73n51J99L08o6j68O8k73M90m37o9J57j42K46K19k16k52L25J33n5j66J84
2868A19n2Q7n0MLJ41k10k57K46K2k63J09P9J54k15J51j20J34O7l8K4M3k19J45
2892A04jQ3j30J7J7l31R3j8K12k92K21n7j45K63M8j26R7K0J72k66L50k92r5J08
$$ y = [-2, -74, 117, -66, 14, 271, 18, 69, -26, -138, 10, -101, -195, 41, -101, -234, -208, 80, 128, -298, 61, -195, -1, 17, 550, -32, -138, 198, -370, -161, 168, 135, -6, 67, -104, -239, -147, 171, 86, -19, -113, 38, 91, -35, 38, -150, -94, 31, 404, 371, 269, 128, -208, -146, -109, -52, 167, -18, -247, -117, -225, -242, -652, -9, 217, 415, -100, -67, 506, 162, 169, 243, -64, -75, 98, -143, 16, 95, 16, -29, -89, -329, -230, 144, -217, -79, 5, 94, -97, 149, 22, 228, 167, 30, -86, 210, 144, 139, 230, 98, -102, -12, 28, 181, -196, -247, -161, -23, 67, 350, -27, -73, 288, -151, 354, -88, 185, -366, -167, 141, 75, -93, -25, -298, 192, -245, -314, -157, -299, -53, 166, -50, -302, 23, 156, 101, -65, 119, 67, 154, 104, 108, 111, 252, 42, -215, 31, 53, -210, -101, -22, 132, -83, 68, -52, 82, 149, 111, 135, 178, -41, 104, 103, 186, 56, 73, 90, -241, -148, -166, 46, -246, -25, -82, -227, 36, 84, -42, 55, 75, 247, -19, 331, 39, -56, 52]
2916E2p9K4n9q0L6j57K10o2R0m0N9j81K12k05M21j13J19O2k51P6m81L15K04mk03
2941c5n2j07L78m92L35j84J72MK1j08n4J38k57M15k71J02k3L10l06j20K61k10
2963h3J71K7l42K40j48J07L4l38P49o55L35K34l01P5L46p1j12J3m65R69m38k02
2985A45o08K22l07L40l7Q28l80j19o5l75R28p12K93l51L80lk18K70n13J21K29
3006F8k5j79O0m2J78km62M51o64R8P10k8k42N73l20l2J70k53J96j57j45K55k59
3029e1p5r4J28N7k65K55j05l0J01R0o4q6K55k2K7O3n2k73R3j74j81L77J4k74K64
3054b2j04k04K93k44J3N4K26J2m1K23j48N52n61K15q5j64L20j28k44Q1j91J7j47
3077b77K3J22M5K95m77K19J36l0J47q2j42qO9P3j05K2J38k18n82N02O97o04q2
$$ y = [52, -27, -3, -62, -142, -106, -263, -53, -115, -25, -65, -6, -187, 25, -180, 241, 128, 247, 309, 58, 134, -347, -32, 172, 168, -35, -87, -194, 184, -308, 27, -157, 15, 19, 40, -68, -122, 16, -241, 174, -97, 5, -18, 292, -14, -134, 127, -83, 88, 115, -227, 13, -135, -28, 6, -332, 417, -238, 97, 331, 30, 105, 451, 380, 268, 281, -184, 785, 347, 145, -463, -241, -548, -208, -245, 583, 203, 84, 19, -356, 572, -140, 153, -198, 182, 179, -39, 231, -282, -161, 68, 43, -136, -76, -118, 60, 58, -404, 47, -617, -519, 191, 163, -79, 494, 174, 142, 312, 59, 255, 98, -47, 208, -51, -126, -220, -92, -35, -300, -45, -150, -180, -79, 11, -53, -139, 116, 94, 121, 184, 132, -141, -48, -222, -403, -26, -12, -286, -22, -126, -330, -37, -281, -268, -214, 12, 24, -17, 206, 58, 610, 49, 264, 179, 15, 335, 207, -37, 44, -147, -130, -277, -254, -132, -87, 208, -269, -50, 86, 56, 203, 121, -21, -29, 40, 113, 8, 30, 168, -50, -632, -130, 567, -37, -119]
3100a19J77Q9k58l6J1J59n9J42o0J14j02p9J14N8k4k4l50M66r5l68M75J71p8m55
3124a31L00k70m25M94J51k58K52R6k49J38J91k16l3O1k02J12L0R4q9j05J36k78
3146b01J74k78J22K53k6R6k04N1j87l33M69l0l9K01oJ46k10J9j64Q5J05r8J01
3169D6j74P0K6J17k31L6J19P8O8j99K11K74l59J10k07J51k71N4j74q4O42j56m50
3192c03O11l74K82n6q5m5K77P7k84j22K05l82j9K34P44j155L40m0L86l88l0M17
3214B90l85l1J2L40l72K91Jo3J84n75M5L71J03j37L1k31N8j3J59j45j6l7j02L22
3238A00r0m3jJ03J6o9j48L90l22J13J90p7k88J74J15j90j10J02j60m8J67n9N1
3261h4N0m1K5J3N6Q9j18K07k80K82j79r1k6K90k07j35K95l48R0L9p0J05r4J11
$$ y = [-119, 58, 147, -111, -147, -136, 23, -36, 106, 46, 160, 58, -21, 93, 151, 127, 103, -247, 219, 124, -244, 231, 402, 324, -131, 169, -101, -526, -32, 119, -139, 113, 209, -40, 98, 289, 73, 40, 101, -101, 11, 41, 135, 46, -59, 77, -201, -27, -305, -183, 70, 44, 140, -64, -13, -200, -533, -64, -94, -133, 68, 62, 208, -2, 17, -147, -62, 43, -55, 46, -128, -58, -32, 85, -146, -110, 9, 87, 155, -44, 167, 441, 82, 192, -15, 136, -135, -81, -255, -339, 303, 147, -303, 308, -66, 216, 160, 75, 30, 307, 384, 100, -22, 183, -199, -218, 16, 760, -395, -55, -95, 291, -97, -127, 290, -95, -126, -114, 226, -146, 145, 146, 83, 267, -308, -263, 108, 211, 74, 105, -126, -68, -81, 78, -67, -83, -120, -222, 100, 10, -33, -34, 69, 85, 16, -132, 258, -64, 49, 239, 162, -126, 48, 163, -27, -137, -35, -195, -243, -76, -135, -84, -34, -75, -50, -37, 19, 108, -10, 197, -83, 199, 20, -71, -97, 193, -14, -149, 146, -202, -112, -73, -143, -38, -132, -21]
3285b1r7N6J15j90J73j4L0P5j60p0J68p5k9R6o5p32N14L58o67J99r0J61M99m43
3309b09J71k0K66j63r4l09K28j00L62j19L6J39k65J57j88Q1rl7J27R7o9j32J8
3332c2o9K02k68J67P3k9j78L33j34J5j08L4om3K3p0N8K1k36L76j7p5j35R9K20
3357B21o6j60J70j63j33O15o22J79p9J12m3j71L43M9m8N3l20J88J1k97K28m54
3379c87M29m16j27P74L91m47J047j881P94j39j97K9J89P85j265J74N85k43p24
3398f29Q48m74Q03o94p7K95N11l45k35l9n0K62l24K29ol81L07k35L55j59q2K07
3420H7l5j15j74K48qJ1j8J58j65k55M28j40k1Nj57kJ08K7J0N2j99K29j74o9J24
3445d5P6m3L72k12j62Q5o8M4P5Ql8k02N1l5qK20j98l9J73j4j4N3o6J2Q8j74K73
$$ y = [-21, -118, -62, 53, -137, 36, 22, 52, 127, -33, -103, 65, -10, -39, 57, -8, -740, -226, 132, -535, -336, -426, -265, 234, -209, -38, -58, 208, 45, -49, -358, -130, -230, 132, 13, 49, 188, -77, 80, -108, -27, -36, -73, 54, 151, 82, -50, -32, -101, 101, -167, 0, 73, 44, -134, 199, 65, 80, -28, 6, 0, -43, -20, -90, -32, -11, -247, 129, 112, 37, -98, 1, 221, 155, -5, 165, 2, -131, 484, -138, 41, -38, 74, 31, -140, 203, 252, 204, 257, -63, 125, 136, -161, 67, -387, 42, -374, -501, 273, 664, 217, 1264, -617, 177, 38, -159, -130, 59, 844, -421, -247, 338, 95, -629, 219, -255, 548, -146, -223, 72, 583, 238, 3, -36, -86, 176, -148, 81, 75, -306, 1, -234, 121, -38, -120, 87, 52, -63, -237, 11, 3, 14, -4, 154, -11, -266, 162, 22, 1, 6, -151, -153, -45, -18, -8, 44, -155, 74, -100, -169, -45, 31, -12, 360, 148, -14, 71, 3, 47, 122, 130, 92, -110, -59, -94, -102, 118, -80, -119, 54, 40, 26, 79, 13, 25, 113, -61, 212]
3472B12M07p20n12Q90l99rN06l69K4Q8l34J19J4j4P6K80k31j15MJ38j67J60M45
3495D93m10j23p24L69K23Q2n6O4J86j57K29J85j152Q29L9j19M9J67k2j18K5j75
3517a16J99k05J66Ok0K5j82J24k64J72m3J6N8K09m8J98m49N2O31o50k6K41Q2n38
3541c62L97o6k39K9k46R14p74N1JR3m2L34L6m56R0L85j29J83J7n53J47J81n61
3564e70Q15L62m05j22K6oj56J21l78J98j36J09K34j32J18m5P3m3J25J46n59L08
3586H3m93N33J96m30M8k8J9n3J83L3M2p7j10J0K1L19l45M2O3O4m3k7m6k9j56P3
3612a08j2Q7r7M6J32M4m0k72j47J88J32L28L7n18Q4m25R47o71O96M42k89q93m5
3635c54k67Q14m46L4M53L35j021n13O39O82M84p31j95M62o51M36J51l5J69n74
$$ y = [212, 619, -101, -613, 277, -122, -131, 375, 6, 30, 118, -216, -97, -83, -97, -21, 259, 28, -87, -83, 55, -112, 48, 493, 83, -40, -764, -395, -172, -90, -146, -82, 104, -53, 176, 361, -791, 38, 77, -42, 7, 174, 152, 34, 59, -116, 83, -122, 44, 50, 30, 55, -127, -3, -267, -95, -138, -122, -64, 145, 97, 295, -154, -102, 529, -121, -147, 94, 176, -362, 35, -31, -270, -241, -487, 427, -347, -296, -295, -202, -244, 90, 126, -330, -240, 145, 16, 199, 216, -337, -190, -9, -570, 245, 607, 202, 80, 106, 100, -56, 65, -313, -115, -251, -142, 92, -40, 78, 33, 106, 63, 188, 334, -225, 83, -410, 123, 319, -111, -63, -91, -72, -125, 58, 91, 133, 56, -54, -44, -23, 296, -49, -7, 56, 120, 77, 50, 4, -25, -181, -108, -120, -33, -130, -84, 48, 92, 52, -220, -367, -179, -47, 281, 318, -200, -116, -541, 406, -265, 431, 873, 584, -309, -354, -621, 193, -253, -219, 234, 569, -452, -965, -326, 356, 840, 109, -86, 376, -275, 161, 312, 277, 446, -128]
3655a28jL62k30n9j42J49J54j36J55j25j71Q7J30m9Q9j9n0J10j1m1J35k94k8n4
3679a67J90o9j16J39j7P3o7M0p4QJ46j40j4N3M4P3k57L75n7o91O72l13J29K16
3703A76q8j60J41k3k57J17j3L29m40N38j43l56L13k25Q4K82k30K74p19m0N29m27
3725c38Q99j006Q98o22p5L37l62K31J97k48%K01k96K15J41J11j71q9K7M4l2j85
3747a23J6n4J15O6P7k55k36N49n9k38K05K3j2m69L8L54l08L16n03N46j80r5J73
3770e4j15K52k09N7q7L59j90M1J7j06j0r0K92l31K81q9n7K3N2p8L93m02N8r5M8
3795d0l9L1J28J21j37l4p0K35J6o9n1l37R5N4K65k5L6p87L92N78m90J86j18K4
3819c6K82L30p49j14K83M86k61l0k68p0l6N03n39Q88o02M49q71L79m49L07m00
$$ y = [-128, -129, 233, 3, -56, -198, -49, 105, -31, 124, -1, -172, -85, 45, -4, 85, 66, 16, 126, 115, 74, 209, -85, -113, -167, 23, -46, -162, -23, -40, 33, -34, 6, -68, -60, 86, -54, -68, -15, 29, 102, -155, 220, 163, -528, 144, -169, -40, 176, 88, -72, 69, 46, -211, -94, -107, 222, -218, 320, 177, -179, 134, -91, -7, 275, 45, 319, -400, -440, 89, -338, 561, -445, 453, -169, -244, 93, -269, -38, 159, -89, -89, 112, -184, 31, 172, 283, 112, 23, 50, 94, 62, -123, -107, -161, -46, 20, 97, -158, -394, 155, 96, -142, 63, 86, 74, -395, -357, -3, -311, 5, -498, 48, -132, -227, -54, -169, 83, -126, -69, -156, 203, 13, 54, 71, -35, -45, -135, 157, -174, 107, 18, -39, -16, 36, -42, 351, -51, 7, -88, -40, -79, -48, 80, 201, 64, 30, -40, 195, 211, 142, 91, -246, -151, -97, 168, 143, 179, -608, -216, 362, -128, 58, -60, -36, 246, 576, -173, -287, -4, 482, 221, 191, -77, -147, -183, 320, -219, 669, 67, 516, -355, 24, -425, -118, -518]
3840e18M4O87P5m06J57j10L9P5n5J30j61M0J85j29Q2j16m2L7o0j30Q9K03r0r1
3864f5K84k99R3lJ03j09L8k6j23p6J23L55m46O7J97j7j60j78L29j61O2po5L1N
3889d8k08M04j00l8J03j69L08r2k26J98o4n1J4k30J99j03N2r3m5K41J74k84O9
3912A1m6J26l3j5j5J22k42J24j03J20n3P9q2o3j06Q1J52m84O13j74Lj41O4n4K89
$$ y = [-518, -474, 213, 288, -118, 39, -71, -32, 43, -12, 118, -43, -3, 182, 53, 135, 19, -23, 14, -46, -176, -87, 116, 26, -65, 219, -80, 13, 10, 113, 4, 42, 16, -107, -183, -60, 295, -151, -84, 113, 96, -64, -242, 87, -74, -12, -19, -84, -53, -48, -256, 148, 48, 10, 113, -56, 252, 160, -66, 132, 68, 17, 31, -199, 0, -103, -51, -144, -189, 52, 226, -58, 11, -35, 91, 58, 43, 28, 150, -92, 32, -71, 49, -4, 75, -7, -70, -176, -95, 57, -427, 186, 12, 15, -126, -62, -116, 173]
$$ [...]
8191e7
##END NTUPLES=NMR FID
##END=
