##TITLE=1H_Pr Pu-NCO
 200.13MHz,CDCl3.
 8 sc
 
 10.12.2025
##JCAMPDX= 6.0         $$ Bruker NMR JCAMP-DX V2.0
##DATA TYPE= NMR FID
##DATA CLASS= NTUPLES
##ORIGIN= UXNMR, Bruker Analytische Messtechnik GmbH
##OWNER= pz
$$ XWIN-NMR		Version 3.5
$$ Wed Dec 10 15:52:50 2025 Russian Standard Time (UT+4h)  she@DPX200
##.OBSERVE FREQUENCY= 200.1313
##.OBSERVE NUCLEUS= ^1H
##.DELAY= (6, 6)
##.ACQUISITION MODE= SIMULTANEOUS
##.ACQUISITION SCHEME= undefined
##.AVERAGES= 8
##.DIGITISER RES= 18
##SPECTROMETER/DATA SYSTEM= spect
##.PULSE SEQUENCE= zg30
##.SOLVENT NAME= CDCl3
##.SHIFT REFERENCE= (INTERNAL, CDCl3, 0, 14.3821)
##AUDIT TRAIL= $$ (NUMBER, WHEN, WHO, WHERE, WHAT)
$$ ##TITLE= Audit trail, XWIN-NMR		Version 3.5
$$ ##JCAMPDX= 5.01
$$ ##ORIGIN= Bruker BioSpin GmbH
$$ ##OWNER= she
$$ F:/spectra/data/she/nmr/H-C/1/audita.txt
$$ ##AUDIT TRAIL=  $$ (NUMBER, WHEN, WHO, WHERE, WHAT)
(   1,<2025-12-10 15:51:13.01 +0400>,<she>,<DPX200>,
      <created by zg, POWCHK disabled, PULCHK disabled
       configuration hash MD5:
       00 E9 B6 7A A2 85 ED C7 34 08 36 98 17 FE 4E 26
       data hash MD5: 16K
       0E 43 63 8F E1 AF AF 0D 9A ED CA 09 7D A6 94 BA>)
$$ ##END=
$$ 
$$ hash MD5
$$ B4 12 71 3A 44 18 DA BB CA 68 84 A6 B0 3C D5 D7
##$RELAX= 
##$RELAX= 
##$RELAX= 
##$RELAX= 
##$RELAX= 
##$RELAX= 
$$ Bruker specific parameters
$$ --------------------------
##$DU= <F:/spectra>
##$EXPNO= 1
##$NAME= <H-C>
##$PROCNO= 1
##$TYPE= <nmr>
##$USER= <she>
##$AMP= (0..31)
100 100 100 100 100 100 100 100 100 100 100 100 100 100 100 100 100 100 
100 100 100 100 100 100 100 100 100 100 100 100 100 100 
##$AQSEQ= 0
##$AQ_mod= 1
##$AUNM= <au_zg>
##$AUTOPOS= <>
##$BF1= 200.13
##$BF2= 200.13
##$BF3= 200.13
##$BF4= 200.13
##$BF5= 200.13
##$BF6= 200.13
##$BF7= 200.13
##$BF8= 200.13
##$BYTORDA= 1
##$CFDGTYP= 0
##$CFRGTYP= 5
##$CHEMSTR= <none>
##$CNST= (0..31)
1 1 145 1 1 1 1 1 1 1 1 1 1 1 1 1 1 1 1 1 1 1 1 1 1 1 1 1 1 1 1 1 
##$CPDPRG= <>
##$CPDPRG1= <>
##$CPDPRG2= <>
##$CPDPRG3= <>
##$CPDPRG4= <mlev>
##$CPDPRG5= <mlev>
##$CPDPRG6= <mlev>
##$CPDPRG7= <mlev>
##$CPDPRG8= <mlev>
##$CPDPRGB= <>
##$CPDPRGT= <>
##$D= (0..31)
0 0.7 0 0 0 0 0 0 0 0 0 0.03 0 0 0 0 0 0 0 0 0 0 0 0 0 0 0 0 0 0 0 0 
##$DATE= 1765367472
##$DBL= (0..7)
120 120 120 120 120 120 120 120 
##$DBP= (0..7)
150 150 150 150 150 150 150 150 
##$DBP07= 0
##$DBPNAM0= <>
##$DBPNAM1= <>
##$DBPNAM2= <>
##$DBPNAM3= <>
##$DBPNAM4= <>
##$DBPNAM5= <>
##$DBPNAM6= <>
##$DBPNAM7= <>
##$DBPOAL= (0..7)
0.5 0.5 0.5 0.5 0.5 0.5 0.5 0.5 
##$DBPOFFS= (0..7)
0 0 0 0 0 0 0 0 
##$DE= 6
##$DECBNUC= <off>
##$DECIM= 32
##$DECNUC= <off>
##$DECSTAT= 4
##$DIGMOD= 1
##$DIGTYP= 9
##$DL= (0..7)
0 120 120 120 120 120 120 120 
##$DP= (0..7)
150 150 150 150 150 150 150 150 
##$DP07= 0
##$DPNAME0= <>
##$DPNAME1= <>
##$DPNAME2= <>
##$DPNAME3= <>
##$DPNAME4= <>
##$DPNAME5= <>
##$DPNAME6= <>
##$DPNAME7= <>
##$DPOAL= (0..7)
0.5 0.5 0.5 0.5 0.5 0.5 0.5 0.5 
##$DPOFFS= (0..7)
0 0 0 0 0 0 0 0 
##$DQDMODE= 0
##$DR= 18
##$DS= 0
##$DSLIST= <SSSSSSSSSSSSSSS>
$$ [...]
##$SUBNAM0= <"">
##$SUBNAM1= <"">
##$SUBNAM2= <"">
##$SUBNAM3= <"">
##$SUBNAM4= <"">
##$SUBNAM5= <"">
##$SUBNAM6= <"">
##$SUBNAM7= <"">
##$SUBNAM8= <"">
##$SUBNAM9= <"">
##$SW= 18.0517328524113
##$SWIBOX= (0..15)
0 0 2 0 0 0 0 0 0 0 0 0 0 0 0 0 
##$SW_h= 3612.71676300578
##$TD= 16384
##$TD0= 1
##$TE= 0
##$TE2= 300
##$TE3= 300
##$TEG= 300
##$TL= (0..7)
0 120 120 120 120 120 120 120 
##$TP= (0..7)
150 150 150 150 150 150 150 150 
##$TP07= 0
##$TPNAME0= <>
##$TPNAME1= <>
##$TPNAME2= <>
##$TPNAME3= <>
##$TPNAME4= <>
##$TPNAME5= <>
##$TPNAME6= <>
##$TPNAME7= <>
##$TPOAL= (0..7)
0.5 0.5 0.5 0.5 0.5 0.5 0.5 0.5 
##$TPOFFS= (0..7)
0 0 0 0 0 0 0 0 
##$TUNHIN= 0
##$TUNHOUT= 0
##$TUNXOUT= 0
##$USERA1= <user>
##$USERA2= <user>
##$USERA3= <user>
##$USERA4= <user>
##$USERA5= <user>
##$V9= 5
##$VALIST= <valist>
##$VCLIST= <CCCCCCCCCCCCCCC>
##$VD= 0
##$VDLIST= <DDDDDDDDDDDDDDD>
##$VPLIST= <PPPPPPPPPPPPPPP>
##$VTLIST= <TTTTTTTTTTTTTTT>
##$WBST= 1024
##$WBSW= 4
##$XGAIN= (0..3)
0 0 0 0 
##$XL= 0
##$YL= 0
##$YMAX_a= 84382
##$YMIN_a= -62649
##$ZGOPTNS= <>
##$ZL1= 120
##$ZL2= 120
##$ZL3= 120
##$ZL4= 120
##$ABSF1= 10
##$ABSF2= 0
##$ABSG= 5
##$ABSL= 3
##$ALPHA= 0
##$AQORDER= 0
##$ASSFAC= 0
##$ASSFACI= 0
##$ASSFACX= 0
##$ASSWID= 0
##$AUNMP= <proc_1d>
##$AZFE= 0.1
##$AZFW= 0.1
##$BCFW= 1
##$BC_mod= 2
##$BYTORDP= 1
##$COROFFS= 0
##$CY= -3
##$DATMOD= 1
##$DC= 2
##$DFILT= <>
##$DTYPP= 0
##$F1P= 0
##$F2P= 0
##$FCOR= 0.5
##$FTSIZE= 0
##$FT_mod= 4
##$GAMMA= 1
##$GB= 0.15
##$INTBC= 1
##$INTSCL= 1
##$ISEN= 128
##$LB= 0.25
##$LEV0= 0
##$LPBIN= 0
##$MAXI= 10000
##$MC2= 0
##$MEAN= 0
##$ME_mod= 0
##$MI= 1.114404
##$NCOEF= 0
##$NC_proc= 0
##$NLEV= 6
##$NOISF1= 3.799351
##$NOISF2= 2.8
##$NSP= 1
##$NTH_PI= 0
##$NZP= 0
##$OFFSET= 14.38212
##$PC= 1
##$PHC0= -3502.664
##$PHC1= 13.19234
##$PH_mod= 1
##$PKNL= yes
##$PPARMOD= 0
##$PSCAL= 0
##$PSIGN= 0
##$REVERSE= no
##$SF= 200.129724274929
##$SI= 16384
##$SIGF1= 3
##$SIGF2= 2
##$SINO= 400
##$SIOLD= 16384
##$SREGLST= <1H.CDCl3>
##$SSB= 0
##$STSI= 0
##$STSR= 0
##$SW_p= 3205.1282051282
##$SYMM= 0
##$S_DEV= 0
##$TDeff= 0
##$TDoff= 0
##$TI= <>
##$TILT= no
##$TM1= 0
##$TM2= 0
##$TOPLEV= 0
##$USERP1= <user>
##$USERP2= <user>
##$USERP3= <user>
##$USERP4= <user>
##$USERP5= <user>
##$WDW= 1
##$XDIM= 8192
##$YMAX_p= 0
##$YMIN_p= 0
$$ End of Bruker specific parameters
$$ ---------------------------------
##NTUPLES= NMR FID
##VAR_NAME=  TIME,          FID/REAL,        FID/IMAG
##SYMBOL=    X,             R,               I
##VAR_TYPE=  INDEPENDENT,   DEPENDENT,       DEPENDENT
##VAR_FORM=  AFFN,          ASDF,            ASDF
##VAR_DIM=   8192,          8192,            8192
##UNITS=     SECONDS,       ARBITRARY UNITS, ARBITRARY UNITS
##FACTOR=    0.0002768,     1,               1
##FIRST=     0,             0,               0
##LAST=      2.2672688,     0,               0
##MIN=       0,             -62649,          0
##MAX=       2.2672688,     84382,           0
$$ Real data points
##PAGE= N=1
##DATA TABLE= (X++(R..R)), XYDATA
$$ [...]
$$ plain form
1067 -741 1729 1782 -989 -1279 566 429 -202 636 -385 -2026 -994 1134 147 -1692 -439 985 5
1084 5 -85 1265 212 -1083 846 2284 702 -725 358 757 -613 -246 451 -899 -1346 341 583
1101 583 -1302 -1286 -104 -337 -693 575 1189 -420 -447 1409 1101 -248 220 882 102 182 1247 13
1119 13 -1863 -976 624 -218 -1473 -361 91 -774 -189 515 -669 -1042 823 1886 426 -216 914
1136 914 668 -207 687 750 -707 -502 853 346 -1121 -1191 -427 -925 -858 442 176 -978 -231 947 206
1155 206 -239 580 929 278 620 1242 376 -730 -13 455 -441 -597 -141 -478 -1094 -448 6 -702 -1097 143
1175 143 705 -31 219 479 3 170 807 600 10 225 947 199 -721 -455 -92 -627 -441 83 -446 -842
1195 -842 -368 106 -176 -304 163 370 220 684 891 242 -5 361 434 81 -51 178 -145 -441 -395 -353 -867
$$ packed form
1067g41K470N3k771k90J845j37o31Q38j021j641J032K128r87j839J253J424r80
1084Er0J350j053j295J929J438j582j427J083L99j370L67O97j350m47J687K42
1101E83j885J6J182k33l56J268O14j609k7J856l08j349M68O62p80Q0J065j234
1119A3j876Q87J600q42j255J112M52q65N85P04j184l73J865J063j460o42J130
1136I14k46q75Q94O3j457K05J355n07j467p0P64m98O7J300k66j154P47J178p41
1155B06m45Q19L49o51L42O22q66j106P17M68q96j56M56l37o16O46M54p08l95J240
1175A43N62p36K50K60m76J67O37k07n90K15P22p48r20K66L63n35J86N24n29l96
1195h42M74M74k82j28M67K07j50M64K07o49k47L66P3l53j32K29l23k96M6M2n14
$$ plain form
1216 -867 -562 71 -66 -224 -56 -43 -225 34 708 668 -20 282 663 410 60 132 -177 -208 -265 132 -78 -596
1238 -596 -424 -279 -411 -349 -26 62 240 248 36 42 106 440 493 293 342 238 -204 80 49 -104 -479 -302 -88
1261 -88 -146 -265 -69 -82 -285 -70 260 157 72 321 345 306 48 110 116 24 217 219 -82 -313 -245 -279 -107 -35 -91
1286 -91 -78 -44 54 -10 -40 45 206 -43 227 180 -9 19 -77 -18 -14 -122 -43 -74 -140 -93 -119 -53 23 10 97 159 39 12
1314 12 101 47 84 23 -100 -10 -37 28 -103 -108 -189 -125 -158 17 259 -63 166 205 73 184 300 178 52 59 18 48
1340 48 -220 -156 -189 -360 -302 -113 -271 -238 -131 -73 -38 -64 154 345 172 390 494 128 -47 335 227 42 -135
1363 -135 -149 -254 -318 -349 -75 -411 -341 -112 -231 -131 124 273 134 209 592 494 128 237 377 202 -139 42
1385 42 -158 -428 -251 -13 -353 -728 -463 -271 -377 -197 222 -196 -218 355 713 282 195 596 557 151 354
$$ packed form
1216h67L05O33j37j58J68J3j82K59O74m0o88L02L81k53l50P2l09l1n7L97k10n18
1238e96J72J45j32O2L23Q8J78Qk12OO4L34N3k00M9j04m42K84l1j53l75J77K14
1261h8n8j19J96j3k03K15L30j03q5K49K4l9k58O2Or2J93Kl01k31O8l4J72P2n6
1286i1J3L4R8o4l0Q5J61k49K70m7j89K8r6N9Mj08P9l1o6M7k6O6P6j3Q7O2j20k7
1314A2Q9n4L7o1j23R0k7O5j31nq1O4l3J75K42l22K29L9j32J11J16j22j26Pm1L0
1340D8k68O4l3j71N8J89j58L3J07N8L5k6K18J91j73K18J04l66j75L82j08j85j77
1363a35j4j05o4l1K74l36P0K29j19J00K55J49j39P5L83r8l66J09J40j75l41J81
1385D2k00k70J77K38l40l75K65J92j06J80M19m18k2N73L58m31q7M01l9m06K03
$$ plain form
1406 354 448 -287 -358 83 -84 -704 -711 -232 -399 -500 -39 -43 -553 -48 784 479 139 492 526 260 307 812 349
1429 349 -307 -70 237 -390 -716 -397 -492 -682 -456 -112 -647 -647 286 577 14 -18 729 534 328 979 888 -134
1451 -134 -128 616 269 -443 -442 -207 -807 -700 -19 -461 -1292 -491 470 28 -295 231 410 204 665 1109 249
1472 249 -324 707 909 3 -278 104 -356 -790 -186 -9 -1001 -1146 62 97 -656 -261 92 -175 130 1056
1492 1056 876 -262 229 1208 562 -155 266 195 -544 -160 490 -435 -1395 -573 -4 -534 -655 -6 -338 -685
1512 -685 559 1046 -159 -460 716 1098 285 302 587 -195 -269 681 349 -995 -811 244 -70 -752 -396
1531 -396 -283 -773 -213 797 80 -514 340 808 212 152 686 250 -275 379 995 -234 -1071 -148 294 -558
1551 -558 -384 138 -527 -676 401 322 -742 -515 603 474 -11 507 558 -507 -102 980 455 -519 -279
$$ packed form
1406C54R4p35p1M41j67o20pM79j67j01M61mn10N05Q32l05l40L53L4k66M7N05m63
1429C49o56K37L07o27l26L19r5j90K26L44n35%R33K91n63l2P47j95k06O51r1j022
1451a34OP44l47p12JK35o00J07O81m42q31Q01R61m42l23N26J79k06M61M44q60
1472B49n73J031K02r06k81L82m60m34O04J77r92j45J208L5p53L95L53k67L05R26
1492A056j80j138M91R79o46p17M21p1p39L84O50r25r60Q22N69n30j21O49l32l47
1512f85J244M87j205l01J176L82q13J7K85p82p4R50l32j344J84J055l14o82L56
1531c96J13m90N60J010p17n94Q54M68n96o0N34m36n25O54O16j229q37R23M42q52
1551e58J74N22o65j49J077p9j064K27J118j29m85N18N1j065M05J082n25r74K40
$$ plain form
1570 -279 287 -8 -403 6 -390 -1063 42 750 -209 -676 -52 361 -77 69 472 -164 -232 726 834 -461
1590 -461 -676 44 193 -232 115 170 -467 -523 506 189 -722 -234 421 66 -94 436 137 -582 -247 805
1610 805 191 -323 6 363 -161 44 195 -315 -587 241 598 -148 -323 144 -86 -263 204 412 -298 -247
1630 -247 479 495 -155 -333 -5 -117 -137 378 131 -571 -64 507 44 -432 8 407 92 29 385 -32 -424
1651 -424 -70 439 -22 -272 83 -86 -161 -172 40 -390 -546 207 385 -18 -20 218 24 -19 198 325 -41 3
1673 3 369 216 -262 13 83 -294 -245 71 -136 -489 -82 27 -36 -309 220 299 110 295 381 64 -120 155
1695 155 285 -66 -153 113 55 -299 -243 -111 -432 -239 6 -82 -311 -91 85 -41 22 380 178 167 221 405
1717 405 186 -135 52 -108 -140 -81 97 -124 -176 -289 -101 -337 -204 -31 -38 52 269 81 70 52 203 278 187
$$ packed form
1570b79N66k95l95M09l96o73J105P08r59m67O24M13m38J46M03o36o8R58J08j295
1590d61k15P20J49m25L47N5o37n6J029l17r11M88O55l55j60N30k99p19L35J052
1610H05o14n14L29L57n24K05J51n10k72Q28L57p46j75M67k30j77M67K08p10N1
1630b47P26J6o50j78L28j12k0N15k47p02N07N71m63m76M40L99l15o3L56m17l92
1651d24L54N09m61k50L55j69p5j1K12m30j56P53J78m03kK38j94m3K17J27l66M4
1673CL66j53m78K75P0l77M9L16k07l53M07J09o3k73N29P9j89J85Q6l17j84K75
1695A55J30l51q7K66n8l54N6J32l21J93K45q8k29K20J76j26O3L58k02j1N4J84
1717D05k19l21J87j60l2N9J78k21n2j13J88k36J33J73pR0K17j88j1j8J51P5r1
$$ plain form
1740 187 288 155 -85 -116 22 -129 -323 -263 -43 -128 -269 -208 -170 -163 -130 84 96 158 368 96 25 136 222 199
1764 199 102 -43 75 -91 -182 -255 -212 -286 -66 -230 -89 24 8 151 25 116 181 93 172 267 82 110 46 -1 -56
1789 -56 -190 -176 -157 -174 -264 -139 -221 -204 -202 -117 55 42 155 199 169 127 410 115 234 88 126 60 -134 -134 -268 -239
1815 -239 -279 -70 -259 -275 -9 -149 -135 157 121 106 200 263 255 114 59 217 115 -62 5 32 -91 -246 -150 -260
1839 -260 -153 -282 -139 -99 -66 82 46 93 103 271 176 298 180 104 -30 111 111 -35 -247 -93 -116 -357 -190
1862 -190 -155 -209 -185 -190 19 49 79 135 104 32 247 214 150 130 112 39 -164 -140 -15 -123 -331 -55 -221 -374 -35
1887 -35 70 -213 -212 103 59 112 162 297 -25 -60 285 184 -97 8 132 18 -245 -67 -52 -381 -207 88 -40
1910 -40 -200 -87 154 17 91 335 203 -119 88 430 114 -69 20 102 -128 -156 147 -335 -350 -79 91 -268
$$ packed form
1740A87J01j33k40l1J38j51j94O0K20q5j41O1L8PL3K14J2O2K10k72p1J11Q6k3
1764A99r7j45J18j66r1p3M3p4K20j64J41J13j6J43j26R1O5q8P9R5j85K8o4m7n5
1789e6j34J4J9j7r0J25q2J7KQ5J72j3J13M4l0m2K83k95J19j46L8o6j94%j34K9
1815b39m0K09j89j6K66j40J4K92l6j5R4O3qj41n5J58j02j77O7K7j23j55R6j10
1839b60J07j29J43M0L3J48l6M7J0J68r5J22j18p6j34J41%j46k12J54k3k41J67
1862a90L5n4K4nK09L0L0N6l1p2K15l3o4k0j8p3k03K4J25j08k08K76j66j53L39
1887c5J05k83JL15m4N3N0J35l22l5L45j01k81J05J24j14k63J78J5l29J74K95j28
1910d0j60J13K41j37P4K44j32l22K07L42l16j83Q9Q2k30k8L03m82j5K71J70l59
$$ plain form
1932 -268 -216 42 28 -55 135 287 -137 -27 376 405 -62 -120 85 -83 -137 222 -13 -562 -107 268 -74 -318
1954 -318 163 102 -24 -24 243 152 -279 191 502 0 -190 167 -126 -180 146 43 -377 -354 170 249 -407 -147
1976 -147 -21 -121 49 346 256 -310 -3 521 242 -175 47 148 -151 -53 291 -194 -370 -195 211 -134 -273
1997 -273 60 -121 -212 122 431 -69 -242 279 520 97 -56 161 -74 -202 204 89 -437 -195 194 59
2017 59 -315 -174 -35 -229 -108 487 47 -405 74 537 91 -88 288 64 -170 229 389 -255 -602 29
2037 29 305 -223 -143 -94 -219 -213 167 231 -308 -261 359 375 -48 90 254 -275 15 430 195 -373 -89 176 -37
2060 -37 -380 -37 -53 -515 -28 370 -46 -260 108 263 -9 58 195 89 -95 299 429 -243 -439 22 58
2081 58 -244 -130 -2 -235 -283 102 85 -274 -180 290 174 43 334 161 -114 43 426 220 -363 -46 179
$$ packed form
1932b68N2K58j4q3J90J52m24J10M03K9m67n8K05j68n4L59k35n49M55L75l42k44
1954c18M81o1j26%K67r1m31M70L11n02j90L57k93n4L26j03m20K3N24P9o56K60
1976a47J26j00J70K97r0n66L07N24k79m17K22J01k99R8L44m85j76J75M06l45j39
1997b73L33j81r1L34L09n00j73N21K41m23j53K17k35j28M06j15n26K42L89j35
2017E9l74J41J39j94J21N95m40m52M79M63m46j79L76k24k34L99J60o44l47O31
2037B9K76n28Q0M9j25OL80O4n39M7O20J6m23J38J64n29K90M15k35n68K84K65k13
2060c7l43L43j6m62M87L98m16k14L68J55k72O7J37j06j84L94J30o72j96M61L6
2081E8l02J14J28k33m8L85j7l59R4M70j16j31K91j73k75J57L83k06n83L17K25
$$ plain form
2102 179 -159 -159 -39 -245 -371 57 271 -82 -286 -14 248 -21 186 334 46 0 324 349 -122 -61 22 -3
2124 -3 -166 -26 -38 -357 -248 70 -138 -378 -141 129 -35 136 247 7 -90 127 361 65 -127 101 87 -22
2146 -22 -38 4 -218 -223 -31 94 -314 -187 -77 -130 -53 198 181 76 151 414 352 -70 33 216 38 94 61 -69
2170 -69 -316 -148 -60 -167 -252 -171 -40 -69 -86 146 -76 -89 116 296 161 155 297 220 125 -20 63 -119 -297 120
2194 120 -41 -138 -285 -225 -254 -240 -109 76 -45 37 228 126 97 169 122 45 143 164 89 -14 -97 -52 -213 -345 -44
2219 -44 -165 -169 -136 -87 -60 -122 48 57 103 71 238 209 100 145 189 -27 54 154 0 -74 -187 -149 -218 -229 -82 -133 -50
2246 -50 -10 34 21 109 51 72 61 98 200 118 50 80 14 -19 -44 -83 18 -52 -103 -235 -118 -81 -88 -29 -13 93 33 97
2274 97 87 72 181 91 92 195 -61 -66 29 -123 -98 -205 -145 -218 76 -38 -10 -28 16 117 107 63 47 209 193 119 -18
$$ packed form
2102A79l38%J20k06j26M28K14l53k04K72K62k69K07J48k88m6L24K5m71O1Q3k5
2124cj63J40j2l19J09L18k08k40K37K70j64J71J11k40r7K17K34k96j92K28j4j09
2146b2j6M2k22nJ92J25m08J27J10n3P7K51j7j05P5K63o2m22J03J83j78N6l3j30
2170f9k47J68Q8j07q5Q1J31k9j7K32k22j3K05J80j35oJ42p7r5j45Q3j82j78M17
2194A20j61r7j47O0k9J4J31J85j21Q2J91j02k9P2m7p7R8K1p5j03q3M5j61j32L01
2219d4j21mL3M9K7o2J70RM6l2J67k9j09M5M4k16Q1J00j54p4j13L8o9j1J47n1Q3
2246e0M0M4j3Q8n8K1j1L7J02q2o8L0o6l3k5l9J01p0n1j32J17L7pN9J6J06o0O4
2274I7j0j5J09r0JJ03k56nR5j52K5j07O0p3K94j14K8j8M4J01j0m4j6J62j6p4j37
$$ plain form
2301 -18 63 -133 33 -32 -71 -147 -69 -110 -113 -109 -65 -29 -27 13 89 68 100 153 193 35 65 201 60 -17 -49 59 -171 -109
2329 -109 -121 -130 -133 -3 -55 -76 -35 -42 86 45 60 47 113 123 59 129 9 44 153 53 -122 -10 -107 -90 10 -102 -23
2356 -23 -12 58 -1 -57 -25 100 55 61 172 95 -83 49 54 -85 -150 20 87 -120 -50 -86 -140 -86 -62 153 3 115
2382 115 104 101 34 129 274 67 0 174 39 -96 -104 -77 -231 -282 45 -32 -105 -132 -2 -3 47 141 157 -35 -2 74 205
2409 205 -63 69 163 16 32 129 -125 -141 66 -37 -62 -239 -21 21 -70 -88 46 -58 57 253 162 69 21 130
2433 130 60 44 117 99 -275 -77 -1 -61 -308 -97 48 -110 -48 39 -118 -172 183 343 -38 29 56 139 27 108
2457 108 205 -104 -182 -107 98 -246 -211 -13 -232 -114 34 131 -123 -69 196 158 -56 134 301 -33 37 238 -66
2480 -66 -175 74 210 -97 -119 -156 -65 -156 -36 126 -84 -222 95 224 48 -25 24 66 69 223 201 -132 -159 262
$$ packed form
2301a8Q1j96J66o5l9p6P8m1lMM4L6KM0P6k1L2N3M0j58L0J36j41p7l2J08k30O2
2329a09j2rlJ30n2k1M1pJ28m1J5j3O6J0o4P0j20L5J09j00j75J12r7J7J00j12P9
2356b3J1P0n9n6L2J25m5OJ11p7j78J32Nj39o5J70O7k07P0l6n4N4K4K15j50J12
2382A15j1lo7R5J45k07o7J74j35j35qK7j54n1L27p7p3k7J30jN0R4J6j92L3P6J31
2409B05k68J32R4j47J6R7k54j6K07j03k5j77K18M2r1j8J34j04J15J96r1r3m8J09
2433A30p0j6P3j8l74J98P6o0k47K11J45j58O2Q7j57n4L55J60l81O7K7Q3j12Q1
2457A08R7l09p8P5K05l44L5J98k19J18J48R7k54N4K65l8k14J90J67l34P0K01l04
2480f6j09K49J36l07k2l7R1r1J20J62k10j38L17J29j76p3M9M2LJ54k2l33k7M21
$$ plain form
2504 262 109 -241 -165 -128 -274 -46 71 -45 -281 -105 40 76 5 81 89 124 252 203 11 -171 19 112 -39
2527 -39 -138 -15 -170 -188 12 -33 -178 -187 64 106 -20 47 125 22 47 202 145 -151 120 239 -49 -51 -77 -78 -388
2552 -388 -104 25 -123 -349 -138 116 2 -7 86 62 13 228 265 -87 -134 80 186 -56 -5 46 -103 -226 10
2575 10 68 -319 -240 29 -10 -27 179 5 -71 42 191 -6 -44 38 278 85 6 -62 -54 -175 10 31 -31 -212 -12
2600 -12 -9 -119 -73 -30 79 -12 164 37 156 -63 189 -3 27 124 146 -157 -10 -85 -35 -158 -158 132 -23 -64 -47
2625 -47 -37 -113 10 157 -72 -50 284 166 70 67 80 8 -129 -20 63 65 -190 -19 -26 -84 -61 -102 -6 84 82 147 -62
2652 -62 -18 116 -11 93 60 161 -36 -3 32 -44 -198 29 -1 -64 -61 -33 -58 -57 26 -5 72 108 -3 121 -8 -14 49
2679 49 -63 5 266 -19 -59 -1 -141 -120 -49 -93 -84 35 -54 11 -4 -26 -70 74 39 107 136 72 38 55 52 -22 -22 -119 -92
$$ packed form
2504B62j53l50P6L7j46K28J17j16k36J76J45L6p1P6QL5J28m9j92j82J90R3j51
2527c9r9J23j55j8K00m5j45rK51M2j26O7P8j03K5J55n7k96K71J19k88kk6jl10
2552c88K84J29j48k26K11K54j14rR3k4m9K15L7l52m7K14J06k42N1N1j49j23K36
2575A0N8l87P9K69l9j7K06j74p6J13J49j97l8Q2K40j93p9o8Qj21J85K1o2j81K00
2600a2Lj10M6M3J09r1J76j27J19k19K52j92L0R7K2l03J47p5N0j23%K90j55m1J7
2625d7J0p6J23J47k29K2L34j18r6lJ3p2j37J09Q3Kk55J71pn8K3m1R6R0kO5k09
2652f2M4J34j27J04l3J01j97L3L5p6j54K27l0o3LK8k5JQ3l1P7L6j11J24j29oO3
2679D9j12O8K61k85m0N8j40K1P1m4RJ19q9O5j5k2m4J44l5O8K9o4l4J7lp4%r7K7
$$ plain form
2708 -92 -50 -63 -65 36 -224 -81 72 0 63 44 115 71 97 88 48 104 31 180 -77 -60 -20 -74 -48 -16 -100 -90 -11 -79
2736 -79 -55 -62 -69 21 18 74 84 65 -23 146 30 -52 -48 49 -11 -74 -84 -98 -39 -5 -123 117 112 -34 13 34 36 -43 61 41
2766 41 62 7 145 1 -33 -153 -40 -118 -111 7 -120 -2 -56 -112 -16 75 -80 82 67 66 113 52 67 136 -22 1
2792 1 39 8 -40 -163 -113 -207 -93 -132 -41 24 72 -39 -28 -17 95 81 34 40 -76 -39 99 13 27 -90 -22 25 48 21
2820 21 -9 -59 -73 -211 41 -84 -45 34 -62 135 13 38 -47 12 5 157 35 112 -70 37 -28 -67 -119 26 -123
2845 -123 20 -75 -68 -48 87 32 -44 164 4 48 59 144 21 -44 -53 24 -101 135 20 -3 -133 -105 -4 -94 0 -73
2871 -73 -24 109 35 58 104 21 85 53 -89 53 -73 19 159 -46 7 -45 -48 -60 -146 -86 -58 65 -62 -30 63 71 40
2898 40 -57 168 31 44 50 -4 -8 26 54 -54 -121 -34 106 -86 -119 77 -73 -79 -15 78 -42 -49 25 108 25 68 113 24
$$ packed form
2708i2M2j3kJ01k60J43J53p2O3j9P1m4K6rm0N6p3J49k57J7M0n4K6L2q4J0P9o8
2736g9K4ppR0lN6J0j9q8J69j16q2MR7o0o3j0j4N9L4j18K40nj46M7K1Kp9J04k0
2766D1K1n5J38j44l4j20J13p8PJ18j27J18n4n6R6R1j55J62j5jM7o1J5O9j58K3
2792AL8l1m8j23N0r4J14l9R1O5M8j11J1J1J12j4m7Oj16L7J38q6J4j17O8M7K3k7
2820B1l0n0j4j38K52j25L9P9r6J97j22K5q5N9pJ52j22P7j82J07o5l9n2J45j49
2845a23J43r5PK0J35n5p6K08j60M4J1Q5j23o5rP7j25K36j15k3j30K8J01r0R4p3
2871g3M9J33p4K3M6q3O4l2j42J42j26R2J40k05N3n2lj2q6O0K8J23j27L2R3Ql1
2898D0r7K25j37J3On4mL4K8j08o7Q7J40j92l3J96j50oO4R3j20pP4Q3q3M3M5q9
$$ plain form
2926 24 37 47 34 -246 -32 9 -14 -186 -95 -85 -145 6 -29 -141 -66 -46 117 -62 -13 -18 26 -105 96 102 31 -138
2952 -138 126 7 -131 -49 -74 -52 -109 11 -22 3 42 11 41 -4 34 134 13 35 78 -35 -107 65 -32 -55 -141 62
2978 62 -59 -132 -81 31 -9 -84 30 19 83 143 62 77 -112 285 33 77 -63 111 -31 -90 -19 9 -66 -149 129
3003 129 -15 -121 -25 26 -45 122 78 8 22 65 10 80 -30 2 -107 -99 -19 79 -69 -113 20 58 -54 19 8 52
3029 52 118 124 68 9 -24 159 109 33 72 18 -2 -36 30 -66 -79 21 58 -71 11 -96 -42 -187 52 49 9 -24 130 61
3057 61 74 105 90 84 6 39 -60 -116 -209 28 43 -12 -6 5 10 -59 -12 116 -120 -142 125 -19 4 10 35 70 88 3 44 89
3087 89 -18 5 -41 -21 22 -43 36 51 112 53 44 117 178 -1 40 47 -53 -43 64 4 -13 -61 117 41 -20 96 -16 -44
3115 -44 5 45 -107 2 142 6 -19 32 -15 -31 -63 3 44 104 -100 32 -31 -112 -75 -66 -10 -51 -41 55 28 -56 98
$$ packed form
2926B4J3J0j3k80K14M1k3j72R1J0o0J51l5j12P5K0J63j79M9nM4j31K01Op1j69
2952a38K64j19j38Q2k5K2n7J20l3K5L9l1L0m5L8J00j21K2M3j13p2J72r7k3q6K03
2978F2j21p3N1J12m0p5J14j1O4O0q1J5j89L97k52M4j40J74j42n9P1K8p5q3K78
3003A29j44j06R6N1p1J67m4p0J4M3n5P0j10L2j09QQ0R8j48m4J33L8j12P3j1M4
3029E2O6On6n9l3J83n0p6L9n4k0l4O6r6j3J00L7j29Q2j07N4j45K39lm0l3J54o9
3057F1J3L1j5op8L3r9n6r3K37J5n5OJ1No9M7J28k36k2K67j44K3OK5L5J8q5M1M5
3087H9j07K3m6K0M3o5P9J5O1n9rP3O1j79M1Pj00J0J07o0j7m8J78p6o1J16j12k8
3115d4M9M0j52J09J40j36k5N1m7j6l2O6M1O0k04J32o3q1L7RN6m1J0R6k7q4J54
$$ plain form
3142 98 45 1 62 27 5 164 128 -19 -173 -26 68 8 -84 16 19 -85 -1 94 -16 63 -34 -81 12 56 -113 24
3168 24 36 132 63 -75 79 2 -130 -52 -44 -51 -25 4 -32 80 -53 5 -36 72 17 56 44 -12 27 62 -53 -111 -99 -56
3196 -56 66 -47 -37 -72 -55 -49 -45 8 -13 -35 31 105 83 63 3 116 150 154 -53 82 -2 22 -99 -1 33 -74 99 -32
3224 -32 -65 57 54 -50 45 -33 128 -86 75 98 105 -44 -51 -45 -36 47 -101 29 -104 -35 -44 -35 4 -11 84 25 -67 87 -57
3253 -57 14 127 -22 -28 -86 47 -44 97 62 2 -23 13 -37 -56 -96 -62 -83 12 -4 16 18 -14 -10 81 36 95 90 99 56 63 88
3284 88 118 30 -52 4 -72 -70 -58 -66 33 6 4 131 13 4 -4 3 83 55 19 58 -77 -25 18 33 -14 -27 -51 -18 30 -33 25 73
3316 73 -20 46 -81 -9 71 -14 4 -35 37 127 80 -2 -27 48 -58 -39 21 -87 -11 -93 -51 -79 59 18 91 44 121 18
3344 18 84 3 74 151 53 57 8 -62 -30 -36 -71 -18 19 -96 17 -59 -45 56 2 -85 -48 89 37 -3 88 48 -55 -14 73
$$ packed form
3142I8n3m4O1l5k2J59l6j47j54J47R4o0r2J00Lj04Q4R5j10P9r7m7R3M4j69J37
3168B4J2R6o9j38J54p7j32P8QpK6K9l6J12j33N8m1J08n5L9j2n6L9L5j15n8J2M3
3196e6J22j13J0l5J7OMN3k1k2O6P4k2k0o0J13L4Mk07J35q4K4j21R8L4j07J73j31
3224c2l3J22lj04R5p8J61k14J61K3Pj49pORQ3j48J30j33O9rRL9j5R5n9r2J54j44
3253e7P1J13j49on8J33r1J41l5o0k5L6n0j9m0L4k1R5j6K0Kl2MR1m5N9nRm3PK5
3284H8L0q8q2N6p6KJ2qR9k7kJ27j18rqPQ0k8l6L9j35N2M3J5m7j3k4L3M8o3N8M8
3316G3r3O6j27P2Q0q5J8l9P2R0m7q2k5P5j06J9O0j08P6q2M2k8J38m1P3m7P7j03
3344A8O6q1P1P7r8Mm9p0L2ol5N3L7j15J13p6J4J01n4q7L7J37n2m0R1m0j03M1Q7
$$ plain form
3373 73 58 15 -16 144 -67 -19 40 -66 -3 -36 70 38 76 -77 43 175 -3 59 31 -61 102 -45 17 -15 85
3398 85 -23 23 9 -24 -32 -80 -4 57 -119 65 -20 6 87 -13 29 85 29 4 -44 31 88 -61 -29 1 -10 52 5 35
3426 35 -22 -45 -18 -53 5 -97 34 -74 84 -56 -32 32 27 -38 94 -98 -47 -53 -66 4 -9 -33 98 6 -89 11 -76
3453 -76 11 -47 125 -33 9 70 87 -141 -12 -124 67 0 141 -29 -113 -21 17 -29 -86 40 46 -6 3 22 15 -44 68
3480 68 31 4 95 51 51 -38 -57 54 -44 62 83 37 -53 -32 16 2 22 49 167 42 86 93 31 -19 -3 -2 -194 79 2
3509 2 -12 17 40 -74 1 38 1 34 43 -2 128 8 12 -42 15 29 158 40 -32 11 -15 -90 -72 80 16 7 -165 -13
3537 -13 -56 -39 91 3 84 -80 52 -76 -54 -19 137 175 29 17 60 59 -18 73 -25 -92 73 -14 -15 -170 -28 -11 56
3564 56 37 -28 -63 -73 62 -85 37 51 115 -34 -89 -65 127 56 -93 -38 33 21 89 -136 -168 -53 32 -29 18 -24
$$ packed form
3373G3j5m3l1J60k11M8N9j06O3l3J06l2L8j53J20J32j78O2k8r2J63j47O2l2J00
3398H5j08M6j4l3qm8P6O1j76J84q5K6Q1j00M2N6n6k5m8P5N7j49L2L0j1O2m7L0
3426C5n7k3K7l5N8j02J31j08J58j40K4O4no5J32j92N1oj3P0j3k4J31r2r5J00q7
3453g6Q7n8J72j58M2O1J7k28J29j12J91o7J41j70q4R2L8m6n7J26On2RJ9pn9J12
3480F8l7k7R1m4%q9j9J11r8J06K1m6r0K1M8j4K0K7J18j25M4Po2n0J6Jj92K73p7
3509Bj4K9K3j14P5L7l7L3Rm5J30j20Mn4N7J4J29j18p2M3k6p5J8J52o4rj72J52
3537a3m3J7J30q8Q1j64J32j28K2L5J56L8j46j2M3jp7R1r8o7J65q7jj55J42J7O7
3564E6j9o5l5j0J35j47J22J4O4j49n5K4J92p1j49N5P1j2O8k25l2J15Q5o1M7m2
$$ plain form
3590 -24 -82 29 -15 64 11 21 5 97 -81 -64 -36 -37 -33 -68 -30 -19 -8 69 28 69 15 8 52 -90 139 18 43 -8 35
3619 35 -29 -74 52 -50 72 -87 -89 38 -80 77 32 17 -52 51 85 38 -60 -2 83 -27 -60 31 22 -19 -48 -14 16
3646 16 -33 60 -50 -41 3 49 49 19 -36 -9 13 -1 -7 18 42 3 -33 -49 -51 -37 -74 -132 -14 -85 -16 -30 -8 -107 98 43 83
3677 83 -64 32 41 -6 -58 -24 9 -63 -16 -66 11 2 2 -44 19 26 -41 43 -154 -25 -92 72 -13 2 43 125 -62 -1 53 -86
3707 -86 -72 6 118 -133 -90 -33 9 -74 7 40 29 -71 -51 1 9 34 29 -39 152 45 43 -19 -143 -101 -89 35 -135 -94
3735 -94 -45 -32 34 -10 19 -46 23 7 -36 -37 97 -6 13 -38 -45 -94 101 92 52 40 16 -61 71 26 18 -7 -76 48 -37 42
3765 42 62 18 -45 79 47 -56 18 -27 -44 -185 -25 67 16 32 -57 7 48 41 -70 7 -12 10 21 57 -132 -17 0
3792 0 42 -49 14 26 26 -144 -7 133 57 -69 112 6 -130 50 -30 63 -20 -45 62 131 72 -39 -30 100 10 92
$$ packed form
3590b4n8J11m4P9n3J0j6R2j78J7K8jMl5L8J1J1P7m1M1n4pM4j42K29j21K5n1M3
3619C5o4m5J26j02J22j59kJ27j18J57m5j5o9J03L4m7r8N8Q5j10l3R1rm1k9L4L0
3646A6m9R3j10RM4M6%l0n5K7K2j4oK5K4l9l6j6kJ4l7n8J18p1O9j4K2r9K05n5M0
3677H3j47R6Rm7n2L4L3p2M7n0P7r%m6O3Po7Q4j97J29o7J64q5J5M1Q2j87O1N4j39
3707h6J4P8J12k51M3N7M2q3Q1L3j1j00K0N2QK5no8J91j07ko2j24M2J2J24j70M1
3735i4M9J3O6m4K9o5O9j6m3jJ34j03J9n1pm9J95rm0j2k4p7J32m5qk5o9J24q5P9
3765D2K0m4o3J24l2j03P4m5j7j41J60R2n1J6q9O4M1pj11P7j9K2J1L6j89J15J7
3792@M2r1O3J2%j70J37J40p6j26J81j06j36J80q0R3q3k5J07O9n9j11RJ30r0Q2
$$ plain form
3818 92 -26 -44 -1 38 82 -5 38 -6 9 -125 55 55 -139 13 19 -23 22 42 67 61 -45 56 12 117 35 67 -76
3845 -76 -23 52 16 -54 8 -18 -10 117 -2 -86 -23 67 3 30 -53 20 -14 -82 66 78 33 -2 -63 79 50 48 -106 -26 -91
3874 -91 -64 -35 -72 50 -16 -72 136 -87 58 -134 73 70 -31 37 37 -26 132 -57 -14 12 4 43 -158 -9 -120 62
3900 62 -23 -38 47 29 16 -13 -101 -100 -87 2 16 -15 68 -36 -14 22 -55 -17 48 -39 -41 -20 31 -102 62 -48 97 40 26
3929 26 74 -108 -98 -38 -54 68 89 -28 44 31 31 46 20 80 14 113 26 -7 -42 -7 -63 -82 58 25 -63 154 -9 92
3957 92 -56 72 -90 83 -51 -45 88 -101 86 -53 110 -22 3 -146 -100 21 77 -85 -78 -34 -104 51 -103
3980 -103 32 46 -28 49 32 84 56 -105 -34 -17 -49 -50 95 26 -68 -24 48 -30 -102 -88 -64 35 -16 58 38 -84 -94 65
4008 65 -33 4 -74 -97 36 21 -72 -26 -117 -6 -13 96 -19 105 -41 -42 -39 -13 60 10 -40 -34 -6 -81 57 -77 -94 -75
$$ packed form
3818I2j18j8M3L9M4q7M3m4J5j34J80%j94J52Om2M5K0K5oj06J01m4J05q2L2j43
3845g6N3P5l6p0O2k6QJ27j19q4O3R0o4K7q3P3l4o8J48J2m5l5o1J42k9kj54Q0o5
3874i1K7K9l7J22o6n6K08k23J45j92K07lj01O8%o3J58j89M3K6qL9k01J49j11J82
3900F2q5j5Q5j8j3k9q8JJ3Q9J4l1Q3j04K2L6p7L8O5q7kK1N1j33J64j10J45n7j4
3929B6M8j82J0O0j6J22K1j17P2j3%J5k6O0o6R9q7l3l5L5n6j9J40l3q8K17j63J01
3957I2j48J28j62J73j34OJ33j89J87j39J63j32K5j49M6J21N6j62PM4p0J55j54
3980a03J35J4p4P7j7N2k8j61P1J7l2jJ45o9r4M4P2p8p2J4K4R9n1P4k0j22j0J59
4008F5r8L7p8k3J33j5r3M6r1J11pJ09j15J24j46jLK6P3n0n0OK8p5J38j34j7J9
$$ plain form
4036 -75 -79 3 -57 29 -54 -12 -87 37 10 -61 -54 -56 34 -21 10 -67 -79 38 -91 23 -128 -74 107 84 30 14 100 -18
4064 -18 -42 56 38 -14 -118 90 -82 41 -110 3 -21 -11 36 -34 -8 -68 103 -111 87 31 111 134 106 26 -54 -114
4090 -114 -41 69 -8 -60 8 10 114 -6 14 -56 -64 22 87 -123 -90 -27 -80 -11 -87 -4 10 -69 11 53 -18 54 -13 -59 -31
4119 -31 26 -55 31 45 30 -5 69 16 97 59 -100 -32 -89 -7 38 0 -49 44 -53 -37 53 -72 -46 -18 -13 -6 -60 42 24 -19
4149 -19 -40 10 9 -38 16 28 -27 35 23 23 61 -20 14 22 -183 44 125 82 -31 -36 41 -94 58 -36 11 -28 45 27 -38 45
4179 45 -83 -8 6 68 4 -25 -47 -57 -42 26 21 121 132 201 12 30 55 46 -32 18 34 -14 79 -157 -10 -14 -8 -42 36 18
4209 18 -48 81 122 -69 -25 89 -27 -97 -33 -22 -93 17 122 47 -66 21 73 -129 30 -80 12 -11 -76 -32 -61
4234 -61 9 57 -15 26 -30 -13 91 2 0 -105 -16 52 50 -59 6 61 -92 -26 -21 172 -6 4 -11 -8 3 66 -104 132
$$ packed form
4036g5mQ2o0Q6q3M2p5J24k7p1PkR0n5L1p7j2J17j29J14j51N4J81k3n4j6Q6j18
4064a8k4R8j8n2j04K08j72J23j51J13k4J0M7p0K6o0J71k14J98n6Q0K3k8q0q0o0
4090a14P3J10p7n2O8KJ04j20K0p0qQ6O5k10L3O3n3O9p6Q3J4p9Q0M2p1P2o7m6K8
4119c1N7q1Q6J4j5l5P4n3Q1l8j59O8n7Q2M5l8m9R3r7J6R0j25K6K8NPn4J02j8m3
4149a9k1N0jm7N4J2n5O2j2%L8q1L4Qk05K27Q1m3j13nP7j35J52r4M7l9P3j8o5Q3
4179D5j28P5J4O2o4k9k2j0J5O8nJ00J1O9j89J8K5rp8N0J6m8R3k36J47mOl4P8j8
4209A8o6J29M1j91M4J14j16p0O4J1p1J10J05p5j13Q7N2k02J59j10R2k3o5M4k9
4234f1P0M8p2M1n6J7J04q9kj05Q9O8kj09O5N5j53O6NJ93j78J0j5LJ1O3j70K36
$$ plain form
4262 132 44 -38 66 -7 40 -24 -3 -20 41 50 -8 -99 22 94 24 102 70 80 70 -181 41 7 105 -69 -62 -93 -40 35
4290 35 -19 -19 -17 40 -102 25 24 -169 46 94 22 -83 -89 3 95 100 48 35 13 -22 -91 -39 31 -37 -101 -20 -117 32 23 2
4320 2 -21 -71 -65 -143 37 -41 -89 58 -103 106 -23 -74 -12 38 57 -85 17 -82 -11 -14 18 -32 25 19 62 -23 69 -3 45
4349 45 -21 72 -23 -53 -118 6 57 -22 46 10 4 7 -53 -38 49 -10 23 -226 40 15 -79 42 64 -105 -28 -20 -76 61 -35
4378 -35 68 17 -82 17 -79 6 -5 -36 -93 84 -120 -45 -72 -91 56 10 35 72 -18 57 2 -94 46 56 -144 -113 -21
4405 -21 -43 75 36 -73 -68 6 37 -21 43 -37 -28 -25 41 107 142 92 -21 -33 -82 -36 73 -6 -44 -79 27 113 83 13 68
4434 68 -22 46 13 -64 -92 -22 105 22 11 -26 -59 -20 6 0 -26 -28 90 -9 75 104 15 8 -40 -4 19 19 -9 56 -2 -64 43
4465 43 -62 4 -57 123 -92 -102 28 -76 -107 78 -152 1 -2 9 -9 -51 -34 17 1 80 -4 -27 48 -119 68 126
$$ packed form
4262A32q8q2J04p3M7o4K1j7O1Rn8r1J21P2p0P8l2J0j0k51K22l4R8j74Pl1N3P5
4290C5n4%KN7j42J27jj93K15M8p2j05oR2R2Nn2j3k2l5o9N2P0o8o4Q1r7J49rk1
4320Bk3n0Op8J80p8m8J47j61K09j29n1O2N0J9j42J02r9P1lL2n0N7oM3q5R2p2M8
4349D5o6R3r5l0o5J24N1p9O8l6oLo0J5Q7n9L3k49K66k5r4J21K2j69P7Qn6J37r6
4378c5J03n1r9R9r6Q5j1l1n7J77k04P5k7j9J47m6K5L7r0P5n5r6J40J0k00L1R2
4405b1k2J18l9j09NP4L1n8O4q0RLO6O6L5n0j13j2m9M6J09p9l8l5J06Q6l0p0N5
4434F8r0O8l3p7k8P0J27q3j1l7l3L9K6ok6kJ18r9Q4K9q9pm8L6K3%k8O5n8o2J07
4465D3j05O6o1J80k15j0J30j04l1J85k30J53lJ1j8m2J7N1j6P9q4k3P5j67J87N8
$$ plain form
4491 126 33 40 47 16 91 -17 35 -41 68 43 -83 -71 6 17 27 10 -66 33 56 -20 27 -22 168 -10 -40 -62 -12 3
4519 3 2 39 64 -23 34 -24 14 121 68 27 -12 -89 -11 -64 20 -2 -37 21 -55 -11 13 4 -18 54 42 -3 2 73 36 -20 103
4550 103 110 71 -17 56 19 -44 -10 20 16 -130 -70 35 18 6 -65 25 -124 43 15 25 16 -152 -120 -22 -34 -119 -89 43
4578 43 1 -33 -28 -83 3 -27 -48 112 28 25 55 121 -51 -40 -85 -82 55 -35 11 -34 33 -15 34 26 62 -11 -9 28 58 -14 36
4609 36 92 17 -146 29 -28 -15 -110 16 -41 98 29 21 -114 21 79 -50 58 -7 6 34 84 87 -9 60 20 46 22
4636 22 58 -11 -16 57 18 -57 56 -81 91 -2 -71 -71 3 34 76 133 11 -44 69 69 10 110 8 80 10 33 -32 -10
4664 -10 -14 -40 -31 5 57 95 -20 30 -112 -31 -11 -107 9 73 -28 -99 24 84 64 60 -25 51 13 60 45 -49 37 14 13 44
4694 44 20 6 -19 27 158 -35 10 -45 -2 -45 -47 61 -53 -33 -24 48 -7 47 16 20 65 6 -51 -6 109 -69 42 35 -37
$$ packed form
4491A26r3PPl1P5j08N2p6J09k5j26J2P7J1J0j7p6R9K3p6M7m9J90j78l0k2N0J5
4519CjL7K5q7N7n8L8J07n3m1l9p7P8n3Q4k2l5N8p6M4K4rk2P2j2m5NP1l7n6J23
4550A03Pl9q8P3l7o3L4L0mj46O0J05j7j2p1R0j49J67k8J0rj68L2R8j2q5L0J32
4578D3m2l4Nn5Q6l0k1J60q4lL0O6j72J1m5LJ37r0M6m5O7m8M9qL6p3KL7L0p2N0
4609C6N6p5j63J75n7J3r5J26n7J39o9qj35J35N8j29J08o5J3K8N0Lr6O9m0K6k4
4636B2L6o9nP3l9p5J13j37J72r3o9%P4L1M2N7j22n5J13%n9J00j02P2p0K3o5K2
4664a0mk6RL6N2L8j15N0j42Q1K0r6J16O4j01p1J23O0k0mq5P6l8M7j5r4Q6k3jL1
4694D4k4j4k5M6J31j93M5n5M3m3kJ08j14K0RP2n5N4l1MM5n9n7M5J15j78J11pp2
$$ plain form
4723 -37 -9 41 35 -26 109 65 -9 -3 26 62 -118 -3 -29 -78 40 -45 108 -61 37 74 -59 30 75 14 -56 31 96 -148
4751 -148 -39 90 72 -16 15 61 0 -55 -60 -13 -19 17 -22 46 0 40 -9 -34 -22 -15 5 84 18 23 -91 32 16 42 8 59
4781 59 -49 -32 64 -76 -59 128 90 -12 138 -111 143 93 -69 -21 20 -80 79 -154 -65 30 -34 122 -44 24
4805 24 -117 -64 -36 -49 -59 -17 -97 -75 19 -19 -38 8 -108 -91 34 81 -37 -9 -12 25 20 6 26 -29 52 -42 65 -45
4833 -45 -37 -70 18 -9 -31 7 -39 -39 -1 -40 23 -4 64 -96 -33 -25 66 54 65 -11 122 -50 -13 1 -82 -68 -62 -11 -70 14 -45
4864 -45 -9 -1 -6 4 123 48 -1 -33 44 45 48 24 -23 -62 82 -15 75 -55 -67 9 -55 11 -37 -71 71 -64 -28 50 82 -56
4894 -56 47 61 93 -23 -6 -18 32 -41 71 -40 -177 60 30 163 0 -10 48 18 89 -10 2 28 -66 29 -5 -21
4920 -21 77 -10 42 -11 19 22 47 71 -28 76 -20 77 12 3 14 -67 3 -26 51 6 -58 -19 65 -122 -72 -4 -17 111 -45
$$ packed form
4723c7K8N0oo1J35m4p4OK9L6j80J15k6m9J18q5J53j69R8L7j33Q9M5o1p0Q7O5k44
4751a48J09J29j8q8L1M6o1n5nM7oL6l9O8m6M0m9k5J2PK0P9o6Nj14J23j6K6l4N1
4781E9j08J7R6j40J7J87l8j02J50k49K54n0j62M8M1j00J59k33Q9R5o4J56j66O8
4805B4j41N3K8j3j0M2q0K2R4l8j9M6j16J7J25M7j18K8lL7nj4K0n5Q1r4J07j10
4833d5Ql3Q8k7k2L8m6%L8l9O3k7O8j60O3QR1j2J1p6J33j72L7J4q3J4ON1n9Q4n9
4864d5L6QnJ0J19p5m9l2P7JLk4m7l9J44r7R0j30j2P6o4O6m8l4J42j35L6P8L2j38
4894e6J03J4L2j16J7j2N0p3J12j11j37K37l0J33j63j0N8l0P1r9J2K6r4R5l4j6
4920b1R8q7N2n3L0LK5K4r9J04r6R7o5rJ1q1P0k9P7m5o4L9Q4j87N0O8j3J28j56
$$ plain form
4949 -45 -95 -14 -22 60 109 -25 -21 88 10 84 66 79 16 6 11 -73 -76 63 -60 104 69 -21 -41 -63 99 -126 -1 44
4977 44 14 28 -8 -20 19 -14 -44 -63 124 22 -86 -83 149 30 -8 -69 60 26 96 -3 -30 31 -11 90 -104 -28 -30
5004 -30 53 32 14 52 13 -53 -7 54 33 -11 -150 -128 -93 22 -14 -61 70 85 -1 -62 -56 191 72 -3 19 101 40 28
5032 28 88 7 13 167 -104 -2 -24 -32 -30 39 161 -55 2 -95 158 -85 -43 87 31 -23 54 -32 -2 139 -67 -24 42
5059 42 20 -33 -1 -47 -34 16 92 -24 -25 -81 -59 18 -64 54 -35 18 -66 -78 50 -88 11 3 51 -14 41 -88 5 -64 32
5088 32 -61 -21 -72 -9 75 -125 -57 94 0 -55 68 33 -46 -31 59 -24 88 -72 -29 71 -16 23 94 -24 -106 66
5114 66 32 28 127 51 -43 10 30 -83 -12 64 40 15 0 10 -5 47 127 -33 151 -23 15 35 -38 8 28 120 62 -5 -27
5143 -27 42 -77 57 -92 -23 99 21 14 -57 -14 -162 54 0 4 -85 10 72 -58 17 -26 -26 13 17 -32 -4 45 47 -36 -14
$$ packed form
4949d5n0Q1qQ2M9j34MJ09p8P4j8J3o3j0Nq4lJ39j23J64l5r0k0k2J62k25J25M5
4977D4l0J4l6j2L9l3l0j9J87j02j08LK32j19l8o1J29l4P0r9k7O1m2J01j94P6k
5004c0Q3k1j8L8l9o6M6O1k1m4j39K2L5J15l6m7J31J5q6o1OK47j19p5K2Q2o1j2
5032B8O0q1OJ54k71J02k2qKO9J22k16N7r7K53k43M2J30n6n4P7q6L0J41k06M3O6
5059D2k2n3L2m6J3N0P6j16jn6K2P7q2J18q9N3q4j2J28j38R9qM8o5N5j29R3o9R6
5088C2r3M0n1O3Q4k00O8J51r4n5J23l5p9J5R0q3J12j60M3J00q7L9P1j18q2J72
5114F6l4mR9p6r4N3K0j13P1P6k4k5j5J0j5N2Q0j60J84j74L8K0p3M6K0R2n8o7k2
5143b7O9j19J34j49O9J22p8pp1M3j48K16n4Mq9R5O2j30P5m3%L9Mm9K8M9Kq3K2
$$ plain form
5172 -14 -94 -21 -73 9 -48 48 76 36 -16 32 107 58 26 61 70 -59 -53 98 -3 78 -37 -12 29 18 -25 -118 -41 -25 23
5201 23 -8 -42 50 35 7 62 -75 20 -134 6 -54 59 -49 -50 -38 -20 37 -62 -23 3 27 -102 70 13 115 78 69
5228 69 7 -28 -9 85 64 71 58 -6 -10 49 -64 -27 -42 11 -43 -20 -62 -33 52 -36 15 8 12 11 18 22 35 -37 36 -18 9 -38 135
5261 135 -44 97 14 -92 -22 -194 30 61 184 -21 -48 -39 90 -95 -33 -49 -23 60 -20 41 -41 -16 29 13 82 57
5287 57 -29 12 57 67 12 45 63 49 65 39 -28 55 16 71 -63 -35 69 -19 107 85 18 4 -55 -34 -49 10 -61 -49 80
5316 80 -42 -57 -77 -93 43 50 -64 30 65 -2 81 72 18 37 27 -72 10 42 27 -12 32 18 71 94 31 15 54 19 -53 -11
5346 -11 -3 120 -30 5 -3 110 -49 62 65 -70 106 -132 -44 -80 -59 -3 63 -52 -69 -74 62 -15 -54 0 7 3 -15 -28
5374 -28 -63 22 -33 -31 102 32 -167 80 84 -27 -91 0 15 -25 124 13 28 -38 -8 48 132 85 -90 -31 25 -80 29
$$ packed form
5172a4q0P3n2Q2n7R6K8m0n2M8P5m9l2L5Rj29OJ51j01Q1j15K5M1j1m3r3P7J6M8
5201B3l1l4R2j5k8N5j37R5j54J40o0J13j08jJ2J8N7r9L9K6K4j29J72n7J02l7r
5228F9o2l5J9R4k1Pj3o4mN9j13L7j5N3n4K3m2K9Q5q8N1pMjPMJ3p2P3n4K7m7J73
5261A35j79J41q3j06P0j72K24L1J23k05k7RJ29j85O2j6K6Q3q0O1q2K5M5j6O9k5
5287E7q6M1M5J0n5L3J8j4J6k6o7Q3l9N5j34K8J04q8J26k2o7j4n9K1j5N9p1J2J29
5316H0j22j5k0j6J36Pj14R4L5o7Q3rn4J9j0r9Q2L2j5l9M4j4N3K3o3j6L9l5p2M2
5346a1QJ23j50L5qJ13j59J11Lj35J76k38Q8l6K1N6O6j15j7nJ36p7l9N4Pmj8j3
5374b8l5Q5n5KJ33p0j99K47Mj11o4R1J5m0J49j11J5o6L0N6Q4m7j75N9N6j05J09
$$ plain form
5401 29 -55 -108 1 11 96 -36 132 -34 46 -4 100 46 -6 22 -15 -84 -104 -32 -51 -44 21 -58 -19 -33 3 0 31 -52 64
5430 64 -4 70 -62 -81 126 4 27 89 15 -34 62 -8 46 2 -11 104 -16 -75 -59 93 -91 7 -66 23 20 -32 32
5457 32 -59 -71 -42 36 -5 -99 30 4 -66 20 101 -128 -129 51 -84 -52 59 -106 24 -59 -75 -55 -6 53 5 1 -31 -43
5485 -43 -49 54 -22 -39 -17 6 -57 59 -42 -66 93 93 -66 -13 78 33 -25 -18 74 93 24 -60 -7 -24 43 -107 -10 -23 -54
5514 -54 40 60 33 -85 -16 -95 64 -3 -72 33 51 -47 -31 -33 -15 102 -102 69 19 2 -32 15 -88 27 55 -68
5540 -68 75 9 -13 -97 -8 55 4 135 -70 9 -24 -14 66 71 -27 -27 -40 -6 -75 37 17 -81 68 -52 39 54 -78 109
5568 109 -53 68 -42 40 -79 -85 64 -56 96 -5 72 -7 119 -5 35 85 103 62 68 -11 -74 -48 28 16 -69 25
5594 25 -38 -58 6 -22 -78 -17 156 68 85 89 -37 -5 -14 -16 -121 -21 -31 -19 -13 -17 14 -88 -56 -112 39 68 27 146 -3
$$ packed form
5401B9q4n3J09J0Q5j32J68j66Q0n0J04n4n2K8l7o9k0P2j9PO5p9L9j4L6lL1q3J16
5430F4o8P4j32j9K07j22K3O2p4m9R6p0N4m4j3J15j20n9J6J52j84R8p3Q9ln2O4
5457C2r1j2K9P8m1r4J29k6p0Q6Q1k29jJ80j35L2J11j65J30q3j6K0M9N9m8ml2j2
5485d3oJ03p6j7K2K3o3J16j01k4J59%j59N3R1m5n8PR2J9o9q4N3j7O7j50R7j3l1
5514e4R4K0k7j18O9p9J59o7o9J05J8r8J6kJ8J17k04J71n0j7l4M7j03J15K8j23
5540f8J43o6k2q4Q9O3n1J31k05P9l3J0Q0Nr8%j3L4o9J12k0r8J49j20R1J5j32J87
5568A09j62J21j10Q2j19oJ49j20J52j01P7p9J26j24M0N0J8m1Op9o3K6P6j2q5R4
5594B5o3k0O4k8n6O1J73q8J7Mj26L2rkj05J00j0J2OmL1j02L2n6J51K9m1J19j49
$$ plain form
5623 -3 8 46 67 -15 17 58 -56 56 -89 -60 -10 30 -62 -7 39 -4 20 66 126 4 28 -62 -26 -39 -36 -90 -66 -16 12
5652 12 -23 -17 58 41 -48 -55 36 51 92 5 -17 60 -71 150 -93 -72 -64 -72 28 -6 -48 14 35 73 -13 -72 -15 9 -27 50
5682 50 -96 60 5 -24 48 95 -48 84 72 50 15 -26 14 29 -56 -148 124 1 -41 -45 14 82 -12 69 6 57 -30 28
5710 28 -17 -42 92 -88 -26 -34 -123 -36 -3 148 3 6 78 49 -73 -9 -74 -29 102 -53 -25 -44 52 62 61 -62 28 55
5738 55 -98 35 -61 -17 -16 -68 -32 -53 7 -5 95 133 57 101 -3 30 -51 43 -36 73 -14 126 -4 -94 67 -135
5764 -135 92 89 3 40 -53 44 43 -47 6 0 70 7 -54 -72 12 2 22 72 39 -18 -27 -11 -62 -1 -42 -19 82 38 64 -22 -6
5795 -6 245 -110 22 -74 1 28 62 -62 -45 8 42 113 -38 16 66 34 51 126 49 -57 41 22 -7 -22 -12 -36 -73 31
5823 31 43 -56 -26 -19 68 -114 49 -5 41 -54 -37 16 -23 15 92 -83 -36 -94 14 -15 -90 -36 18 13 11 -40 -52 68 -17
$$ packed form
5623cJ1L8K1q2L2M1j14J12j45K9N0M0r2N5M6m3K4M6O0j22K4r0L6j3Ln4K4N0K8
5652A2l5OP5j7q9pR1J5M1q7k2P7j31K21k43K1QqJ00l4m2O2K1L8q6n9N7K4l6P7
5682E0j46J56n5k9P2M7j43J32j2k2l5m1M0J5q5r2K72j23m2mN9O8r4Q1o3N1q7N8
5710B8m5k5J34j80O2qq9Q7L3J51j45LP2k9j22O4o5M5J31j55K8j9R6J0jj23R0K7
5738E5j53J33r6M4Jn2L6k1O0j2J00L8p6M4j04L3q1R4p9J09q7J40j30r0J61k02
5764a35K27lq6L7r3R7jr0N3oP0o3o1j8Q4j0K0N0l3n7rJ6n1O1m1K3J01m4K6q6J6
5795fK51l55J32r6P5K7L4j24J7N3L4P1j51N4N0l2J7P5p7j06R8j9k9j5J0k4l7J04
5823C1J2r9L0PQ7j82J63n4M6r5J7N3l9L8P7j75M7n8J08k9p5N4N4nkn1j2J20q5
$$ plain form
5852 -17 34 9 53 16 27 133 33 1 8 -10 -69 80 -13 37 25 -55 -20 63 -30 -89 15 24 31 -63 41 -56 44 63 41
5881 41 19 -5 43 -43 46 26 -57 34 -92 9 8 52 -49 -40 -112 17 59 81 -73 18 -3 26 -11 130 5 86 48 3
5909 3 70 54 -9 95 25 76 1 52 -83 -129 59 -111 -26 -36 44 26 81 71 0 -67 123 -135 32 64 41 -33 -10
5936 -10 -47 -24 -52 -70 85 -14 -5 14 56 -119 -27 -48 52 -2 -12 79 -63 14 48 -8 -105 37 83 -54 -17 20 -163
5963 -163 5 3 -10 -46 4 32 41 71 31 46 -49 -22 9 -80 55 49 -34 -16 -26 -126 41 -41 -16 115 -109 33 73 70
5991 70 -68 -22 3 19 -56 -60 21 104 -48 -84 83 -93 -36 -52 -42 -2 1 66 15 59 4 47 21 -97 7 -45 118 -49
6019 -49 -19 -28 56 -79 -41 -112 96 -58 36 -7 -65 10 -2 5 54 -51 47 79 6 87 23 -20 6 -82 -113 -69 -101 -85 26
6048 26 10 -18 -89 -38 -40 -83 33 30 85 9 -71 100 124 108 -59 -30 74 68 -64 -35 14 -39 24 54 -2 108 45 16 17
$$ packed form
5852a7N1k5M4l7J1J06j00l2Pj8n9J49r3N0j2q0L5Q3r3n9J04RPr4J04r7J00J9k2
5881D1k2k4M8q6Q9k0q3R1j26J01jM4j01Rp2J29M2K2j54R1k1K9l7J41j25Q1l8m5
5909CO7j6o3J04p0N1p5N1j35m6J88j70Q5j0Q0j8N5j0p1o7J90k58J67L2k3p4K3
5936a0l7K3k8j8J55r9RJ9M2j75R2k1J00n4j0R1j42P7L4n6r7J42M6j37L7L7j83
5963a63J68kj3l6N0K8RL0m0J5r5K7L1q9J35oq3J8j0j00J67q2K5J31k24J42M0l
5991G0j38M6K5J6p5mQ1Q3j52l6J67j76N7j6J0M0LO5n1M4n5M3k6j18J04n2J63j67
6019d9L0rQ4j35L8p1K08j54R4m3n8P5j2PM9j05R8L2p3Q1o4m3K6q8l1M4l2J6J11
6048B6j6k8p1N1km3J16lN5p6q0J71K4j6j67K9J04oj32K9M9n3O3L0n6J10o3k9J
$$ plain form
6077 17 -6 11 -5 9 -53 -49 -4 43 -17 35 -15 -53 -76 -54 -135 -6 -52 19 8 -42 -102 49 35 92 -25 -112 75 -35
6105 -35 -28 36 -18 -99 -57 -35 -11 41 97 -18 -19 -22 4 -55 -78 -84 21 70 -5 -163 -28 16 -42 103 -65 -2 -13 51 87
6134 87 -19 55 -61 -41 53 -65 28 -39 -29 -45 44 -43 -96 -18 50 44 99 -13 -33 63 33 91 51 30 89 20 -31 -42 -60
6163 -60 27 24 22 29 -34 42 -67 86 -52 -10 0 76 59 -195 -66 -126 -13 -78 25 -29 -55 -20 -36 -36 -37 -28 -36 -13 66 147
6193 147 -119 19 84 17 3 10 193 -20 -96 -20 -6 2 45 -90 -15 4 -74 32 33 -34 -124 -43 -17 -89 94 18 -46 18
6221 18 61 35 29 -69 89 -68 13 32 -145 97 -26 -51 40 41 11 47 -40 101 -56 63 7 -18 -1 3 121 81 5
6248 5 -106 19 -77 88 34 -21 -75 -42 -22 60 -97 -50 48 -6 4 -33 -81 -84 6 91 -46 8 45 63 -18 -67 -4 10 -10
6277 -10 -43 -15 20 60 -30 -45 -18 38 -42 35 1 37 37 -53 119 17 29 -19 21 139 -82 28 -76 40 7 35 -20
$$ packed form
6077A7k3J7j6J4o2MM5M7o0N2n0l8k3K2q1J29m6P1j1n0o0J51j4N7j17q7J87j10
6105c5PO4n4q1M2K2K4N2N6j15jlK6n9k3oJ05M9p5j58J35M4n8J45j68O3j1O4L6
6134H7j06P4j16K0R4j18R3o7J0j6Q9q7n3P8O8oN5j12k0R6l0N8m0k1N9o9n1j1j8
6163f0Q7lkPo3P6j09J53j38M2J0P6j7k54J29o0J13o5J03n4k6L5j6%jRqK3P9Q1
6193A47k66J38O5o7j4PJ83k13p6P6J4QM3j35P5J9p8J06Jo7r0Q1K6p2J83p6o4O4
6221A8M3k6or8J58j57Q1J9j77K42j23k5R1Jl0L6q7J41j57J19n6k5J7MJ18m0p6
6248Ej11J25r6J65n4n5n4L3K0Q2j57M7R8n4J0l7m8lR0Q5j37N4L7J8q1m9O3J4k0
6277a0l3K8L5M0r0j5K7N6q0P7l4L6%r0J72j02J2m8M0J18k21J10j04J16l3K8n5
$$ plain form
6304 -20 85 37 -21 65 65 76 -42 -11 -53 -59 -50 55 -106 157 -17 -89 150 46 -38 -66 -35 -31 -26 156 30 9 -37 -11
6332 -11 -21 34 -60 -15 5 49 149 68 -9 79 -25 -8 20 -79 12 124 -42 -45 62 5 -76 -33 -58 29 -20 51 32 40 -19
6361 -19 -82 31 -57 -99 61 38 -11 -18 -66 64 -145 -1 156 32 -60 9 -35 -124 -29 -53 3 44 43 -20 -5 75 -23 88
6389 88 -11 -117 -53 92 90 -30 -49 -109 -85 -52 -68 42 97 2 20 -12 13 128 33 -84 -61 -3 -36 -100 28 -51 66
6416 66 27 -38 74 67 -49 27 -18 -74 40 -105 -96 -100 -152 -48 37 -22 -79 60 0 -41 -38 66 32 5 -72 172 24 -31
6444 -31 15 -14 -11 -15 -13 42 120 -25 -106 -34 -26 8 168 89 -1 -19 -17 42 -56 67 -60 -43 16 58 -78 8 46 -119 32
6473 32 -56 -34 -23 49 -38 -5 -42 -51 -9 16 24 24 -95 -15 3 129 -21 -24 -56 -128 0 -20 13 -56 -54 34 41 -13 35 64 14
6504 14 51 -11 -93 -48 -32 41 88 8 -41 -99 28 77 -52 -8 21 3 22 18 0 20 -6 -4 -48 -80 -21 -39 64 -64 52
$$ packed form
6304b0J05m8n8Q6%J1j18L1m2oRJ05j61K63j74p2K39j04q4k8L1MNJ82j26k1m6K6
6332a1j0N5r4M5K0M4J00q1p7Q8j04J7K8r9R1J12j66lJ07n7q1M3k5Q7m9P1j9Qn9
6361a9o3J13q8m2J60k3m9pm8J30k09J44J57j24r2O9m4q9R5k4N6M1jo3J5Q0r8J11
6389H8r9j06O4J45kj20j9o0K4L3j6J10N5r5J8l2K5J15r5j17K3N8l3o4J28p9J17
6416F6l9o5J12pj16P6m5n6J14j45Rmn2J04Q5n9n7J39o0m1LJ04l4k7p7K44j48n5
6444c1M6k9LmKN5P8j45q1P2QL4J60p9r0j8KN9r8J23j27J7N9M2j36Q6L8j65J51
6473C2q8K2J1P2q7L3l7rM2K5Q%j19Q0J8J26j50ll2p2J28k0L3o9KQ8Pn4M8K9n0
6504A4L7o2q2M5J6P3M7q0m9n8J27M9j29M4K9j8J9mj8K0k6Km4l2N9j8J03j28J16
$$ plain form
6533 52 -5 49 81 -21 35 4 -39 28 -110 11 -4 -72 -49 115 48 126 98 -23 7 15 109 58 -2 -7 -75 -15 42 82 30
6562 30 14 -10 -70 60 -98 21 -28 43 -7 32 14 15 8 50 -26 78 -109 -54 -8 55 -68 -41 106 -25 -46 -83 50
6589 50 12 80 47 42 14 17 35 -11 -10 -21 -27 -61 3 -25 -18 -39 132 6 64 40 2 86 34 -48 13 29 5 144 -47 -84 -81
6620 -81 112 -14 11 11 -72 -123 -35 9 -30 -47 -8 115 -90 14 61 47 -82 78 86 -52 11 36 -19 -44 -5 51 -58
6647 -58 -3 32 -70 -49 -42 39 -53 2 -82 3 74 -34 6 -38 13 92 -8 128 -48 13 -45 -46 -20 -89 -11 -3 5 -55 5 -53
6677 -53 -63 -59 138 -15 29 85 29 22 -70 25 -2 7 -18 -10 -96 17 3 96 -44 -20 -10 -81 99 87 -66 88 -155 21
6705 21 3 -95 17 -6 -77 3 66 52 -99 84 -70 -10 -51 35 16 -131 21 -60 86 -38 -64 34 84 50 54 -16 -6
6732 -6 -58 31 66 -87 89 -12 -13 4 -47 20 -23 29 0 64 80 -75 -140 -69 64 -3 19 51 -79 -6 77 -17 -69 25
$$ packed form
6533E2n7N4L2j02N6l1m3O7j38J21j5o8K3J64o7P8k8j21L0QR4n1o0no8O0N7M0n2
6562C0j6k4o0J30j58J19m9P1n0L9j8JpM2p6J04j87N5M6O3j23K7J47j31k1l7J33
6589E0l8O8l3nk8LJ8m6Jj1ol4O4k8Pk1J71j26N8k4l8Q4n2q2O1J6k4J39j91l7L
6620h1J93j26K5%q3n1Q8M4l9j7L9J23k05J04M7j4j29J60Qj38O3K5n5k5L9N6j09
6647e8N5L5j02K1PQ1r2N5q4Q5P1j08M0m4N1P9j00J36j76O1n8jK6o9P8QQo0O0n8
6677e3j0MJ97j53M4N6n6pr2R5k7Rk5Qq6J13j4R3j40K4J0p1J80j2j53J54k43J76
6705B1j8r8J12k3p1Q0O3j4j51J83j54O0m1Q6j9j47J52q1J46j24k6R8N0l4Mp0J0
6732fn2Q9L5j53J76j01jJ7n1O7m3N2k9O4J6j55o5P1J33o7K2L2j30P3Q3r4n2R4
$$ plain form
6760 25 0 51 58 74 -20 16 -19 -60 -51 -87 -49 -92 -126 -10 68 25 -12 28 -48 151 -12 134 -89 -26 -85 189 -66 109
6788 109 -67 -126 15 29 15 18 24 81 -38 -85 36 48 11 74 28 -32 71 184 6 -26 7 -64 77 -21 -55 -31 -94
6815 -94 -105 -113 45 119 56 -4 42 -68 -75 -56 -55 6 -45 118 10 -29 -53 -37 18 10 14 60 -55 -53 26 80 -15 -94 -32 -83 -84
6846 -84 75 -13 -42 -65 73 85 -17 -28 -28 -42 -81 17 -45 99 -26 -71 -23 -47 -11 -85 109 -43 10 41 44 -57 1
6873 1 -83 106 -44 -7 44 -76 -21 13 104 -5 32 -70 -3 4 -119 -40 15 -64 28 -78 16 162 -23 130 -48 -9
6899 -9 16 68 -39 -100 -76 78 -20 -21 -59 -66 36 -63 14 -17 47 27 24 -65 30 44 -91 148 12 129 42 -85 10 -80
6927 -80 -20 -33 -1 10 17 -31 -107 98 -10 -35 20 -44 38 101 -134 -38 -3 -31 -34 -65 -67 -63 58 82 -18 14 -9 -32 81
6956 81 67 -28 44 -49 -2 110 -51 -35 148 26 47 -12 59 16 113 -114 -74 -35 15 94 47 26 14 112 7 95 -10
$$ packed form
6760B5k5N1PJ6r4L6l5m1Rl6L8m3l4J16P8m3l7M0p6J99j63J46k23O3n9K74k55J75
6788A09j76n9J41J4j4LON7j19m7J21J2l7O3m6o0J03J13j78l2L3p1J41r8l4K4o3
6815i4j1qJ58P4o3o0M6j10pJ9JO1n1J63j08l9k4J6N5qMM6j15KP9N4r5p9O2n1j
6846h4J59q8k9k3J38J2j02j1%j4l9R8o2J44j25m5M8k4L6p4J94j52N3L1Lj01N8
6873Aq4J89j50L7N1j20N5L4R1j09L7j02O7Pj23P9N5p9R2j06R4J46j85J53j78L9
6899iK5N2j07o1K4J54r8jl8pJ02r9P7l1O4k0lq9R5J4j35K39j36J17q7j27R5r0
6927h0O0j3L2J1Pm8p6K05j08k5N5o4Q2O3k35R6L5k8ll1kMJ21K4j00L2k3k3J13
6956H1j4r5P2r3M7J12j61J6J83j22K1n9P1m3R7k27M0L9N0P9m7k1j2R8j05Q8j05
$$ plain form
6983 -10 29 42 -1 55 70 22 31 -7 43 19 69 65 21 -80 -26 34 56 -36 -15 -3 52 -21 -46 -20 13 -49 149 53 22 16 28
7014 28 57 -60 -35 88 9 -21 88 1 -18 -48 43 -50 -100 74 76 67 76 -10 -65 -99 -125 4 -11 -59 72 120 9 -11
7042 -11 -18 -7 -17 -148 -68 -16 -25 89 23 -75 -43 23 -37 17 52 74 -9 -18 107 73 7 -109 24 -17 -41 27 42 -22 -15 39
7072 39 59 10 -85 -3 12 77 7 41 20 24 -13 12 -66 -50 30 -26 79 -24 -74 -4 -83 29 6 -53 -2 25 38 -77 59
7101 59 -16 189 71 128 -55 93 -62 -47 14 -73 35 -85 -11 -5 53 13 53 -53 46 23 -83 1 -80 17 17 -93
7127 -93 -17 -108 41 -71 11 139 46 8 34 -81 -142 -120 11 -70 27 -53 51 39 21 25 35 22 1 89 -25 -2 -96
7154 -96 15 56 4 -95 -40 -7 -81 52 -106 18 -70 -51 -10 -80 5 -82 5 70 -86 16 30 4 -32 106 -36 0
7180 0 53 -2 6 -3 73 35 -11 57 -72 -129 27 -39 -18 11 -39 -105 -68 80 8 -97 -12 33 53 -19 -14 -10 -53 -6 19 41 -4
$$ packed form
6983a0L9J3m3N6J5m8Rl8N0k4N0mm4j01N4O0K2r2K1J2N5p3k5K6L3o2J98r6l1oJ2
7014B8K9j17K5J23p9l0J09q7j9l0R1r3n0J74KrRq6n5l4k6J29j5m8J31M8j11k0
7042a1pJ1j0j31Q0N2rJ14o6r8L2O6o0N4L5K2q3rJ25l4o6j16J33m1k4O8J5o4PN4
7072C9K0m9r5Q2J5O5p0L4k1Ml7K5p8J6Q0n6J05j03n0P0p9J12k3n9N1K7J3j15J36
7101E9p5K05j18N7j83J48j55J5O1q7J08j20P4ON8m0M0j06R9k3j06Q4q1R7%j10
7127i3P6r1J49j12Q2J28r3l8K6j15o1K2J31q1R7q0J04j2j8MJ0j3k1Q8j14K3r4
7154i6J11M1n2r9N5L3p4J33j58J24q8J9M1p0Q5q7Q7O5j56J02J4k6l6J38j42L6
7180@N3n5QrP6l8m6O8j29n7J56o6K1K9n0o6L7J48p2j05Q5M5K0p2NMm3M7K5K2m5
$$ plain form
7211 -4 88 18 0 0 67 5 13 21 70 33 58 31 -11 39 71 36 31 -38 -55 65 115 -21 3 -53 -1 -38 79 13 44 103 -86
7242 -86 110 -35 -70 47 -25 -46 -49 7 -16 -37 5 83 -9 75 108 90 13 65 25 -65 -85 69 3 56 75 115 36 -39 87
7271 87 -177 46 44 43 -40 -80 13 -24 -57 4 29 -139 -9 12 4 -5 70 1 -75 35 -1 -76 8 122 38 84 44 54 108
7300 108 -27 -26 75 112 33 25 43 -14 10 18 127 32 32 88 45 -1 3 -120 -7 35 18 31 35 -33 -13 -22 26 -1 52 -12 -11
7331 -11 65 2 -60 80 5 35 -34 -56 -48 2 70 19 -36 45 -112 -48 19 -30 -21 -4 90 -8 -35 -29 54 10 -95 -49 137 16
7361 16 101 48 -64 -10 -39 65 107 -5 -147 76 -85 -31 -38 -69 40 -22 -10 5 -70 -4 43 50 -40 29 54 -75 75
7388 75 -51 -23 -163 -12 -35 -77 -45 -20 15 -49 -87 -119 -7 164 34 33 -66 -108 -2 -153 -133 -139 32 38 -81 86
7414 86 109 88 -13 59 76 -4 34 70 31 83 29 -101 51 53 -6 74 36 8 26 -8 -12 -39 60 70 -91 51 113 -43
$$ packed form
7211dR2p0j8%O7o2QQM9l7K5k7m2N0L2l5no9j7J20N0j36K4n6N2l7J17o6L1N9j89
7242h6J96j45l5J17p2k1lN6k3k1M2P8r2Q4L3j8p7N2m0r0k0J54o6N3J9M0p9p5J26
7271H7k64K23kjq3m0R3l7l3O1K5j68J30K1qrP5o9p6J10l6p5Q4J14q4M6m0J0N4
7300A08j35JJ01L7p9qJ8n7K4QJ09r5%N6m3m6Mj23J13M2j7J3Mo8K0rM8k7N3o4J
7331a1P6o3o2J40p5L0o9k2QN0O8n1n5Q1j57O4O7m9RJ7R4r8k7OQ3m4j05M6J86j21
7361A6Q5n3j12N4k9J04M2j12j42K23j61N4pl1J09o2J2J5p5O6M7Pr0O9K5j29J50
7388G5j26K8j40J51k3m2L2K5L5o4l8l2J12J71j30jr9m2J06j51K0oJ71Oj19J67
7414H6K3k1j01P2J7q0L8L6l9N2n4j30J52Kn9Q0l8k8J8l4mk7R9J0j61J42O2j56
$$ plain form
7442 -43 27 -86 0 -35 4 -11 -60 48 -20 90 -24 12 18 66 35 38 -101 -14 22 45 -4 58 37 -65 -72 44 -36 -33 62
7471 62 33 66 17 168 19 34 -61 -117 0 -10 -6 51 -8 3 -15 9 7 -159 29 -105 -40 82 30 29 29 -29 104 29
7499 29 22 -26 31 30 -44 -21 97 -61 -25 -15 37 -91 -58 -16 -48 26 46 129 -104 -41 -24 122 -68 -145 -7 41 12 11
7527 11 30 68 -21 16 48 -140 45 -54 87 -138 -9 -48 -83 8 -30 -53 -54 23 -18 27 -45 11 -25 51 -62 -61 -21 24
7555 24 19 62 -76 -128 3 -56 -47 31 25 -124 -147 -71 -34 1 -91 -24 -22 -59 40 34 28 11 -62 -146 -9 5 7 -51 -20 17 -44 64
7587 64 -33 24 61 -6 -43 -21 26 73 -42 40 28 -7 -79 105 80 47 -55 15 51 47 -13 46 -89 12 17 16 24 -84 -67
7616 -67 22 -37 -15 69 40 72 -87 -22 -59 151 -18 23 64 -1 -77 -91 77 -23 144 -95 5 31 29 -94 -64 10
7642 10 -24 -4 -29 34 -50 78 99 55 -56 81 -17 3 73 -22 -1 -95 -19 22 100 13 -3 -43 -3 -4 -11 37 -57 50 20
$$ packed form
7442d3P0j13Q6l5L9j5m9J08o8J10j14L6OM8l1Lj39Q7L6K3m9O2k1j02pJ16q0LR5
7471F2k9L3m9J51j49J5r5n6J17j0MN7n9J1j8K4kj66J88j34O5J22n2j%n8J33p5
7499B9pm8N7jp4K3J18j58L6J0N2j28L3M2l2P4K0Q3k33O3J7J46j90p7J38M8k9j
7527A1J9L8q9L7L2j88J85r9J41k25J29l9l5R1l8k3jP7m1M5p2N6l6P6j13JM0M5
7555B4nM3j38n2J31n9RP8oj49k3P6L7L5r2O7Kl7R9ooj7p3q4J37J4Kn8L1L7o1J08
7587F4r7N7L7o7l7K2M7M7j15Q2j2l5p2J84k5l3j02P0L6mo0N9j35J01NjQj08J7
7616f7Q9n9K2Q4k9L2j59O5l7K10j69M1M1o5p6j4J68j00J67k39J00K6kj23L0P4
7642A0l4K0k5O3q4J28K1m4j11J37r8K0P0r5K1r4P6M1P8q7j6m0M0jpM8r4J07l0
$$ plain form
7671 20 45 76 15 -10 52 36 -11 127 -71 -44 -72 56 29 28 7 -18 21 52 21 -24 126 -117 -23 3 146 -26 101
7698 101 13 -79 -54 136 -81 -28 -98 -29 14 -40 -33 48 -54 -31 10 5 -21 67 71 41 35 -59 -6 -37 19 -114 71 24 0
7727 0 123 9 -41 -4 41 5 -37 -20 60 -75 87 26 -30 66 -12 82 -82 19 62 54 43 53 9 -48 61 50 -7 -139
7755 -139 10 -6 -5 43 42 69 -23 -109 -122 6 -11 52 10 -13 68 -84 -131 -75 -34 -1 66 100 -25 3 -16 -70 19 -4 -82
7784 -82 22 12 19 -41 45 -45 -27 15 44 44 98 -33 -52 9 -140 9 -22 -13 -47 -36 31 28 100 14 112 19 63 -14 33 -70
7814 -70 -5 4 -85 124 -15 -31 -26 -75 129 8 3 56 -16 38 64 -39 -10 65 -4 -50 86 -22 -17 -69 -42 9 -166 60
7842 60 5 -73 97 18 -69 -148 -16 -47 -41 -27 -83 40 -69 118 43 -2 29 82 -2 30 -19 117 27 -83 -19 27 -17
7869 -17 -13 45 -30 1 -65 73 -87 46 -48 24 -90 6 33 35 -24 -56 -108 -21 75 17 -60 -65 -37 -51 -86 -5 2 -109 -11 19
$$ packed form
7671B0K5L1o1k5O2j6m7J38j98K7k8J28k7jk1k5L9L1l1m5J50k43R4K6J43j72J27
7698A01q8r2K5J90k17N3p0O9M3n4PQ1j02K3M1nk6Q8Ml0or4N3l1N6j33J85m7k4
7727@J23j14n0L7M5l6m2J7Q0j35J62o1n6R6p8R4j64J01M3qj1J0m4n7J09j1n7j32
7755a39J49j6JM8jK7r2q6j3J28j7O3m2k3Q1j52m7N6M1L3O7L4j25K8j9n4Q9k3p8
7784h2J04j0Po0Q6r0J8M2K9%N4j31j9O1j49J49l1Rl4J1O7lP2q6R8r3M4p7M7j03
7814g0O5Rq9K09j39j6Nm9K04j21nN3p2N4K6j03K9P5o9m6J36j08Nn2K7N1j75K26
7842F0n5p8J70p9q7p9J32l1OJ4n6J23j09J87p5m5L1N3q4L2m9J36r0j10O4M6m4
7869a7MN8p5L1o6J38j60J33r4P2j14R6K7Kn9l2n2Q7R6n8p7nK8j4l5Q1Pj11R8L0
$$ plain form
7899 19 9 30 -32 48 42 16 -2 64 19 -93 4 -3 -37 -52 5 5 -25 -112 24 -19 -15 -14 -42 -33 9 45 85 21 6 -174 -72
7930 -72 9 7 84 42 17 8 97 -110 104 13 -84 13 34 28 -20 -13 -50 2 -6 15 14 -64 -20 22 69 76 61 127 -30 18 112 55
7962 55 75 -28 -6 -8 62 4 -148 -47 24 -86 57 102 56 173 -95 -139 -19 68 21 25 2 51 34 -47 -72 5 -22
7989 -22 14 112 99 15 -11 -78 2 -66 -56 6 56 70 152 -67 -89 79 40 -46 30 22 24 55 -20 53 14 -106 16 31 4
8018 4 -12 -109 128 19 0 -21 -70 -45 -10 -23 70 -96 -29 -32 -93 113 11 -34 -61 -15 -80 90 -101 -112 -84 11 25 52
8046 52 6 40 -2 28 7 -14 13 10 -5 -7 -13 80 -42 -32 -6 -143 -4 -57 26 -5 -56 31 -24 20 -79 107 -55 76 -54
8075 -54 -8 18 137 -86 88 76 -62 -33 118 109 -9 -73 22 -107 46 50 -14 -54 -53 -86 1 40 -90 21 2 76 38
8102 38 33 -67 -117 61 -35 -1 3 -31 71 115 -93 33 34 138 -11 -47 -132 18 -65 -22 86 -149 -62 10 -22 -1 18
$$ packed form
7899A9j0K1o2Q0ok6j8O6m5j12R7pl4j5N7%l0q7J36m3MJk8RM2L6M0o4j5j80J02
7930g2Q1kP7m2k5rQ9k07K14r1r7R7K1om8Pl7N2qK1jp8M4M2M7Pj5O6j57M8R4n7
7962E5K0j03K2kP0n8j52J01P1j10J43M5m6J17k68m4J20Q7m7Mk3M9j7q1k5P7k7
7989b2L6R8j3q4k6o7Q0o8J0O2N0J4Q2k19k2J68l9q6P6qKL1p5P3l9j20J22J5k7
8018Dj6r7K37j09j9k1m9K5L5j3R3j66O7lo1K06j02m5k7M6o5J70j91j1K8R5J4K7
8046E2m6L4m2L0k1k1K7lj5koR3j22J0K6j37J39n3Q3l1n1Q7n5M4r9J86j62J31j30
8075e4M6K6J19k23J74j2j38K9J51rj18o4R5j29J53Mo4m0Jl3Q7L9j30J11j9P4l8
8102C8nj00n0J78r6L4Ml4J02M4k08J26JJ04j49l6q5J50q3M3J08k35Q7P2l2K1J9
$$ plain form
8129 18 28 -105 -128 -18 21 -35 -59 -4 23 -58 30 15 46 0 -84 134 -90 6 4 -5 36 -102 -19 -36 -6 -142 -30 -21
8157 -21 -105 -18 -61 80 41 -31 -39 -15 82 -20 -23 -112 -60 -6 89 22 -54 -78 40 83 -17 -6 49 -13 74 -107 98 -48
8185 -48 -7 46 -63 -16 -30 -42
$$ packed form
8129A8J0j33k3J10L9n6k4N5K7q1Q8j5L1m6q4K18k24R6krM1j38Q3j7L0j36J12R
8157b1q4Q7m3J41l9p2qK4R7j02lq9N2N4R5o7p6k4J18M3j00J1N5o2Q7j81K05j46
8185d8M1N3j09M7j4j2
8191d2
$$ Imaginary data points
##PAGE= N=2
##DATA TABLE= (X++(I..I)), XYDATA
$$ plain form
0 0 0 0 0 0 0 0 0 0 0 0 0 0 0 0 0 8 -8 8 -8 8 -15 16 -16 23 -24 25 -32 40 -40 48 -56 64 -72 80 -95 104 -119
37 -119 131 -147 164 -184 203 -225 250 -276 305 -336 371 -409 450 -495 546 -602 664 -734 814
56 814 -903 1007 -1125 1268 -1438 1649 -1914 2263 -2742 3443 -4575 6709 -12153 58552 84382
71 84382 -32947 -28514 20992 36910 387 -10544 -20298 -26337 -14592 10910 -5231 -33831 -28403
84 -28403 6066 15773 3489 -6552 2379 15758 26965 26254 17182 8697 12154 20780 24574 11263
98 11263 -8986 -13428 -748 344 -12737 -15607 -7600 -12187 -19372 -7527 4829 -5894 -11487 6708
112 6708 16959 6668 8124 20550 12305 -1674 14351 31712 8207 -19705 -4511 18687 4450
125 4450 -21592 -21359 -7527 -4235 -6212 -7216 -12263 -13428 -3040 5799 3482 -1259 -163 5113 11023
$$ packed form
0@%%%%%%%%%%%%%%%Qj6J6j6J6k3L1l2L9m7M9n7P2q0Q8j04J20j36J52j75J99k23
37a19K50k78L11l48L87m28M75n26N81o41P07p80Q59r45J041j148J266j398J548
56H14j717J910k132K393k706L087l563M177n005O185q018J1284j8862P0705K5830
71H4382j17329M433M9506J5918l6523j0931r754o039J1745K5502j6141k8600N428
84b8403L4469R707j2284j0041Q931J3379J1207p11r072q485L457Q626L794j3311
98A1263k0249m442J2680J092j3081k870Q007m587p185J1845J2356j0723n593J8195
112F708J0251j0291J456J2426q245j3979J6025J7361k3505k7912J5194K3198j4237
125D450k6042K33J3832L292j977j004n047j165J0388Q839k317m741J096N276N910
$$ plain form
140 11023 12232 7212 778 -100 3002 4919 4649 -1833 -13397 -14161 -2216 186 -11895 -16327 -6561
155 -6561 -1641 -5502 -3100 1238 -4935 -7604 5056 11589 1200 -3932 4051 6152 118 1201 3523
170 3523 -5895 -11159 470 6226 -7581 -17666 -8747 2156 -13 -7408 -8836 -3778 2380 3467
184 3467 -2261 -5700 -494 4789 4160 1511 -720 -1711 597 3493 870 -5224 -5209 -1027 -1778 -3621
200 -3621 -1640 -2702 -7016 -3575 3465 1365 -5629 -2986 4563 2922 -2785 -448 3447 1993 810
215 810 2718 1999 -737 103 1911 -688 -3263 -426 1447 -1761 -3854 -1339 1620 1190 -1518 -2093
231 -2093 523 2554 2013 661 1273 2639 2148 1646 3668 3728 1083 421 2125 2049 175 -284 380 -454
249 -454 -614 1147 358 -2236 -1089 2659 2511 -948 -726 3051 4029 1794 1833 3632 3248 2330 2599 2883
$$ packed form
140A1023J209n020o434q78L102J917k70o482j1564p64J1945K402j2081m432R766
155f561M920l861K402M338o173k669J2660O533j0389n132P983K101o034J083K322
170C523r418n264J1629N756j3807j0085Q919J0903k169p395j428N058O158J087
184C467n728l439N206N283o29k649k231r91K308K896k623o094J5M182p51j843
200c621J981j062m314L441P040k100o994K643P549j641n707K337L895j454j183
215H10J908p19k736Q40J808k599k575K837J873l208k093K515K959m30k708n75
231b093K616K031n41j352O12J366m91n02K022O0k645o62J704p6j874m59O64q34
249d54j60J761p89k594J147L748j48l459K22L777R78k235L9J799l84r18K69K84
$$ plain form
267 2883 1888 843 1201 1359 -96 -862 -218 -415 -1021 -975 -399 -91 -401 307 2069 2031 881 1615 3363
286 3363 3734 2170 1539 3257 3378 1262 41 857 835 -339 -1485 -1525 -1893 -2016 -1130 -1016 -2293 -1641
304 -1641 833 1539 535 279 1866 2850 1989 1669 2502 2089 1154 1022 1062 139 -1609 -2347 -1629 -2043 -3008
323 -3008 -3135 -2566 -1917 -1817 -1502 -766 -357 -130 1291 1663 951 1038 2019 2193 940 76 629 377 -1362
342 -1362 -2205 -1914 -2548 -3119 -3039 -2654 -2619 -2663 -1812 -861 -1172 -878 152 480 969 1360 1527 1329 860 756 902
363 902 -320 -1452 -1754 -1805 -1732 -2292 -3275 -3013 -2128 -1711 -1907 -1910 -1065 -102 85 985 1307 573 928 2302 1929
384 1929 606 169 529 -201 -1340 -1081 -1124 -2573 -2450 -1040 -1536 -2484 -1417 -283 -714 -845 823 1848
402 1848 894 1294 2225 1803 1324 1839 912 -688 -337 1187 -94 -2339 -2046 -694 -1011 -1305 -970 -1693
$$ packed form
267B883r95j045L58J58j455p66O44j97o06M6N76L08l10P08J762l8j150P34J748
286C363L71j564o31J718J21k116j221Q16k2j174j146m0l68j23Q86J14j277O52
304a641K474P06j004k56J587R84q61l20Q33m13r35j32M0r23j748p38P18m14r65
323c008j27N69O49J00L15P36M09K27J421L72p12Q7R81J74j253q64N53k52j739
342a362q43K91o34n71Q0L85L5m4Q51R51l11K94J030L28M89L91J67j98m69j04J46
363I02j222j132l02n1P3n60r83K62Q85M17j96lQ45R63J87R00L22p34L55J374l73
384A929j323m37L60p30j139K59m3j449J23J410m96r48J067J134m31j31J668J025
402A848r54M00R31m22m79N15r27j600L51J524j281k245K93J352l17k94L35p23
$$ plain form
420 -1693 -1244 1370 1917 -402 -469 2478 3223 1343 1953 2604 742 513 2250 1117 -1864 -1124 1025
437 1025 -238 -1907 -702 -396 -2299 -1271 1401 246 -1074 1440 2851 1149 1069 3088 2075 150
453 150 1757 3448 833 -394 1050 -148 -2033 49 1383 -2106 -3601 198 2467 -582 -2080
468 -2080 -613 95 1602 3912 1911 -1822 286 4887 3092 -1495 -638 2171 550 89 1449 -943
484 -943 -3649 -710 1919 -957 -3304 -382 1268 -985 -302 1342 -870 -1468 2556 3110 -349 21
500 21 2315 515 -1722 1046 2207 -1590 -1870 2020 858 -2785 -1422 685 -1679 -2462 1128 1252
516 1252 -2340 -1884 1025 46 -607 1196 -451 -2660 1539 5107 -296 -5413 -572 4185 1001 -2073
532 -2073 -65 -119 -1444 945 1114 -3218 -3801 559 1276 -1361 -834 -55 -3240 -2588 2822 1963 -3289
$$ packed form
420a693M49K614N47k319o7K947P45j880O10O51j862k29J737j133k981P40K149
437A025j263j669J205L06j903J028K672j155j320K514J411j702q0K019j013j925
453A50J607J691k615j227J444j198j885K082J334l489j495L799K269l049j498
468b080J467P08J507K310k001l733K108M601j795m587Q57K809j621m61J360k392
484i43k706K939K629k876k347K922J650k253O83J644k212n98M024N54l459L70
500B1K294j800k237K768J161l797k80L890j162l643J363K107k364p83L590J24
516A252l592M56K909r79o53J803j647k209M199L568n403n117M841M757l184l074
532b073K008n4j325K389J69m332n83M360P17k637N27P79l185O52N410q59n252
$$ plain form
549 -3289 -1726 2993 1565 -1173 999 1288 -2105 -632 4011 1567 -3128 -1245 803 -1451 -1779 344
565 344 -1425 -3573 -235 2077 -1908 -3559 321 1128 -734 1308 2891 -309 -1231 2813 3349 -1495
581 -1495 -1810 2270 2447 4 -188 -1610 -3996 -1043 2334 -1191 -4938 -1653 2047 -335 -1588 1124
597 1124 228 -1924 1547 4897 1646 -1160 1288 2457 283 502 2192 -390 -2279 762 1528 -2843
613 -2843 -4009 -1172 -374 -1011 335 483 -1867 -965 2628 1865 -679 1427 3144 1055 910 3216 2255
630 2255 -1362 -901 1781 293 -1867 -393 -167 -2504 -1854 -94 -1364 -1881 1122 2232 -691 -743 2248
647 2248 1707 -408 1631 3421 966 -64 1881 1503 -1101 -1054 144 -1047 -1667 169 -345 -2798 -1535
664 -1535 870 100 -1465 -217 1243 1149 1490 2112 241 -991 1445 2799 1040 -59 333 -450 -1315
$$ packed form
549c289J563M719j428k738K172K89l393J473M643k444m695J883K048k254l28K123
565C44j769k148L338K312l985j651L880Q07j862K042J583l200r22M044N36m844
581a495l15M080J77k443j92j422k386K953L377l525l747L285L700k382j253K712
597A124q96k152L471L350l251k806K448J169k174K19J690k582j889L041P66m371
613b843j166K837P98o37J346J48k350R02L593p63k544K106J717k089j45K306r61
630B255l617M61K682j488k160J474K26k337O50J760j270n17L003J110k923n2K991
647B248n41k115K039J790k455j030J945l78k604M7J198j191o20J836n14k453J263
664a535K405p70j565J248J460r4L41O22j871j232K436J354j759j099L92p83q65
$$ plain form
681 -1315 -398 88 -1717 -1828 105 -62 -1671 -660 587 -416 -562 1224 1403 -49 713 2284 838
698 838 -1208 33 1357 54 -720 -18 -162 -1123 -1027 -604 -1007 -1154 -25 312 -469 -525 279 77 213
717 213 830 789 468 312 338 -62 -240 266 -460 -1341 -380 725 -395 -1205 -534 -175 -406 -550 345 290 -299
738 -299 267 965 92 -358 205 435 45 -165 210 -233 -1103 -742 1 -235 -480 -157 143 -97 -270 -258 125
759 125 279 340 181 111 371 389 -190 -114 11 -330 -364 -351 -225 -171 -257 -271 -215 -328 331 711 211 55 401 522
783 522 177 -57 299 407 54 -91 -46 -646 -738 -330 -206 -251 -451 -406 12 84 379 552 213 222 665 872 813
806 813 423 98 392 250 -140 -363 -471 -402 -269 -558 -700 -611 -621 -2 475 435 0 165 631 839 936 890
828 890 635 335 437 603 212 -303 -465 -468 -420 -743 -911 -592 -456 -327 -198 -74 -10 351 625 952 918 883
$$ packed form
681a315R17M86j805j11J933j67j609J011J247j003j46J786J79j452P62J571j446
698H38k046J241J324j303p74P02j44r61R6M23m03j47J129L37p81n6Q04k02J36
717B13O17m1l21j56K6m00j78N06p26q81R61J105j120q10O71L59k31j44Q95n5n89
738b99N66O98q73m50N63K30l90k10L75m43q70L61P43k36k45L23L00k40j73J2L83
759A25J54O1j59p0K60J8n79P6J25l41l4J3J26N4q6j4N6j13O59L80n00j56L46J21
783E22l45k34L56J08l53j45M5o00r2M08J24m5k00M5M18P2K95J73l39RM43K07n9
806H13l90l25K94j42l90k23j08O9J33k89j42Q9j0O19M77m0m35J65M66K08R7m6
828H90k55l00J02J66l91n15j62lM8l23j68L19J36J29J29J24O4L61K74L27l4l5
$$ plain form
850 883 679 529 703 1019 493 -211 -377 -518 -479 -531 -919 -1016 -967 -535 -207 -559 -146 353 237 331 891 979
872 979 537 633 1032 907 260 46 85 -584 -416 -192 -870 -1500 -998 -199 -600 -868 -423 52 -246 133 801
893 801 585 437 1101 963 262 573 927 260 -465 -87 4 -1002 -1111 -394 -661 -1165 -515 -159 -607 -499
913 -499 234 173 -193 674 1347 390 -232 1107 1155 -3 -72 341 -99 -529 -152 -154 -1400 -1148 210 -331 -1252
934 -1252 -122 259 -420 -212 749 549 -387 523 1605 581 -134 728 370 -556 199 613 -785 -1290 -19
953 -19 497 -986 -1185 -19 -315 -535 598 676 -847 -353 1301 1093 -549 93 1106 64 -67 1048
971 1048 314 -1508 -520 936 -110 -822 -41 -6 -1018 67 1204 -541 -1588 754 1727 -189 -445
988 -445 787 200 -638 580 1093 -638 -981 598 586 -755 -211 361 -891 -561 1414 873 -1601 -937
$$ packed form
850H83k04j50J74L16n26p04j66j41L9n2l88r7M9M32L28l52M13M99j16R4N60Q8
872I79m42R6L99j25o47k14L9o69J68K24o78o30N02P99m01k68M45M75k98L79O68
893H01k16j48O64j38p01L11L54o67p25L78R1j006j09P17k67n04O50L56m48J08
913d99P33o1l66Q67O73r57o22J339M8j158o9M13m40m30L77kj246K52J358n41r21
934a252J130L81o79K08R61k00r36R10J082j024p15Q62l58r26P55M14j398n05J271
953a9N16j483j99J166k96k20J133P8j523M94J654k08j642O42J013j042j31J115
971A048p34j822R88J456j046p12P81L5j012J085J137j745j047K342R73j916k56
988d45J232n87q38J218N13j731l43J579j2j341N44N72j252L30J975n41k474O64
$$ plain form
1006 -937 1228 674 -875 212 428 -789 213 1512 -266 -1816 -171 1520 -130 -516 451 -77
1022 -77 -972 724 1411 -883 -1318 1182 1368 -448 -323 559 -792 -1037 1219 832 -1535 -947 934 230
1040 230 -915 41 429 -830 -159 1901 845 -1189 181 1230 5 -252 968 116 -1113 145
1056 145 1562 -719 -2110 -381 347 -491 -35 469 -1031 -1094 1150 1472 -974 -1110 1344 1480 278
1073 278 477 380 -1234 -194 1749 378 -1690 -800 788 -474 -1265 -119 -407 -1498 65 1669 268
1090 268 -1156 439 1146 169 121 1150 367 -329 1119 1121 -912 -1091 262 -83 -958 -163 236 -1347 -1461
1109 -1461 459 624 -993 -375 838 373 428 1116 584 -913 76 1902 794 -937 -47 646 -669
1126 -669 -651 -138 -1097 -1534 152 879 -737 -1533 -147 472 -146 518 1075 -13 130 1539 1059 -389
$$ packed form
1006i37K165n54j549J087K16j217J002J299j778j550J645J691j650l86R67n28
1022g7q95J696O87k294m35K500J86j816J25Q82j351k45K256l87k367N88J881p04
1040B30j145R56L88j259O71K060j056k034J370J049j225k57J220q52j229J258
1056A45J417k281j391J729P28q38M56N04j500o3K244L22k446j36K454J36j202
1073B78J99r7j614J040J943j371k068Q90J588j262p91J146k88j091J563J604j401
1090B68j424J595P07r77m8J029p83o96J448Kk033j79J353l45q75P95L99j583j14
1109a461J920J65j617O18J213m65N5O88n32j497R89J826j108j731Q90O93j315
1126f69J8N13r59m37J686P27j616p96J386O19o18O64N57j088J43J409m80j448
$$ plain form
1144 -389 -386 625 272 -298 334 -130 -1351 -1024 237 -569 -1168 -331 391 -83 -7 679 260 -539 480 1364
1164 1364 529 299 846 561 -338 -105 365 -431 -1004 -66 335 -744 -922 -384 -678 -571 377 349 -208 184
1184 184 1011 464 -381 226 999 524 303 510 127 -673 -299 -73 -502 -810 -317 -139 -490 -79 114 -437
1204 -437 -441 375 601 406 461 676 520 185 266 235 -139 -12 342 -113 -643 -579 -560 -610 -524 50 9 -517 -222
1227 -222 419 201 95 233 459 294 506 661 421 2 -121 59 -332 -461 -54 -130 -218 -239 -511 -410 -137
1248 -137 -11 130 161 121 220 87 224 383 414 137 207 216 157 -67 -171 12 -384 -353 -123 -30 -201 -195 -89 -90 -262
1273 -262 -5 118 181 391 290 126 30 94 123 178 139 24 -250 -113 -41 -105 -132 -165 77 -70 91 192 21
1296 21 51 139 -41 259 -2 11 207 -15 -110 -68 -159 -198 61 44 -11 -215 -130 40 155 85 134 122 90 110 170 -81
$$ packed form
1144c89LJ011l53n70O32m64j221L27J261q06n99Q37P22m74P6O86m19p99J019Q84
1164A364q35k30N47k85q99K33M70p96n73R38M01j079j78N38k94J07R48k8n57L92
1184A84Q27n47q45O07P73m75k21K07l83q00L74K26m29l08M93J78l51M11J93n51
1204d37mQ16K26j95N5K15j56l35Q1l1l74J27L54m55n30O4J9n0Q6N74m1n26K95
1227b22O41k18j06J38K26j65K12J55k40m19j23J80l91j29M07p6q8k1k72J01K73
1248a37J26J41L1m0R9j33J37J59L1k77P0Rn9k24j04J83l96L1K30R3j71OJ06jj72
1273b62K57J23O3K10j01j64r6O4K9N5l9j15k74J37P2o4k7l3K42j47J61J01j71
1296B1L0Q8j80L00k61J3J96k22r5M2r1l9K59j7n5k04Q5J70J15p0M9j2l2K0O0k51
$$ plain form
1322 -81 -51 -79 -69 -73 -141 -68 -270 -307 -182 -92 -31 73 43 3 89 150 229 248 149 162 172 42 95 88 -56 -144 -193 -240 -375
1351 -375 -86 -140 -177 -191 0 -57 -113 273 422 394 213 398 264 93 210 200 -49 -474 -144 -155 -348 -269 -187
1374 -187 -355 -422 -50 120 -23 -62 401 296 59 403 493 261 482 424 201 -427 -50 92 -215 -410 -233
1395 -233 -447 -845 -296 11 -316 -498 137 364 95 387 613 218 143 808 681 -54 22 432 81 -273 -186
1416 -186 -268 -828 -690 -51 -150 -972 -464 62 -247 149 532 492 69 573 1121 464 -52 471 515 -125 6
1437 6 -23 -622 -912 -248 -53 -797 -1022 -289 -186 -357 227 473 -334 81 926 976 302 410 803 321 132
1458 132 585 1 -888 -491 268 -453 -990 -772 -311 -537 -367 229 -299 -490 546 1211 302 126 858 697
1478 697 109 585 833 -239 -644 393 254 -923 -898 -355 -600 -652 151 -99 -1038 -518 889 540 -276
$$ packed form
1322h1L0k8J0mo8P3k02l7J25R0O1J04l0m0Q6O1P9J9r9J3J0j30N3pj44q8m9m7j35
1351c75K89n4l7j4J91n7n6L86J49k8j81J85j34j71J17j0k49m25L30j1j93P9Q2
1374a87j68o7L72J70j43l9M63j05k37L44R0k32K21n8k23o28L77J42l07j95J77
1395b33k14l98N49L07l27j82O35K27k69K92K26l95p5O65j27p35P6M10l51l54Q7
1416a86q2n60J38O39r9q22N08N26l09L96L83m0m23N04N48o57n16N23M4o40J31
1437Fk9n99k90O64J95p44k25P33J03j71N84K46q07M15Q45N0o74J08L93m82j89
1458A32M53n84q89L97P59p21n37K18M61k26J70N96n28j91J036O65r09j76P32j61
1478F97n88M76K48j072m05J037j39j177K5N43k45n2Q03k50r39N20J407l49q16
$$ plain form
1497 -276 511 821 236 526 1101 257 -498 90 863 -6 -691 -162 -393 -957 -165 28 -934 -1111 193 703
1517 703 -175 -187 298 75 39 1088 883 -457 -147 1120 473 -415 -218 -137 -480 -373 346 -352 -1290 -364
1537 -364 312 -304 -564 283 297 -211 342 1172 204 -635 414 995 174 83 331 -144 -476 251 154 -928
1557 -928 -790 410 296 -545 -85 74 -688 -260 790 577 -472 -63 769 469 -142 259 12 -425 210
1576 210 780 -151 -1024 -169 249 -234 -383 -37 -181 -395 340 680 -491 -509 442 429 11 277 214 -364 -234
1597 -234 428 395 -595 -262 488 136 -365 94 -119 -660 -130 672 237 -557 55 489 44 -111 244 -230
1617 -230 -493 280 673 -102 -682 -36 205 -292 40 283 -262 -216 429 325 -406 -366 189 302 23 295 137
1638 137 -550 -339 315 81 -520 -47 238 92 -187 221 -144 -504 52 601 197 -231 286 268 -122 -10
$$ packed form
1497b76P87L10n85K90N75q44p55N88P73q69o85N29k31n64P92J93r62j77J304N10
1517G03q78j2M85k23l6J049k05j340L10J267o47q88J97Q1l43J07P19o98r38R26
1537c64O76o16k60Q47J4n08N53Q30r68q39J049N81q21r1K48m75l32P27r7j082
1557i28J38J200j14q41M60J59p62M28J050k13j049M09Q32l00o11M01k47m37O35
1576B10N70r31q73Q55M18m83j49L46j44k14P35L40j171j8R51j3m18K66o3n78J30
1597b34O62l3r90L33P50l52n01M59k13n41N30Q02m35p94O12M34m45j55L55m74
1617b30k63P73L93p75n80O46K41m97L32K43n45M6O45j04p31M0N55J13k79K72j58
1638A37o87K11O54k34o01M73K85j46k79M08l65l60N56N49m04m28N17j8l90J12
$$ plain form
1658 -10 -7 -77 -389 170 370 -318 -363 68 -194 -284 226 198 -84 -37 451 122 -113 -36 439 214 181 296 -21
1681 -21 -375 -144 43 -322 -375 -185 148 -174 -46 -54 -268 -172 113 400 112 151 344 241 -33 58 212 -31
1703 -31 -18 167 -8 -224 -312 -235 -217 -237 -69 110 -166 -120 238 126 -71 30 207 317 236 300 284 80 43 100
1727 100 -91 -242 -64 -177 -197 -190 -249 -227 -221 -91 94 16 108 170 203 91 270 244 -11 248 231 186 14 -110 -180
1752 -180 -163 -170 -94 -148 -184 42 -53 -114 -103 233 254 132 139 252 99 33 152 91 17 69 26 -94 -110 -179 -149 -383 -306
1779 -306 -33 -94 -28 176 95 36 115 135 238 210 241 340 107 8 101 148 -102 -33 -194 -155 -216 -179 -253 -92 -14 -65
1805 -65 119 118 268 265 119 176 212 194 -40 128 194 -23 -250 -132 -182 -349 -127 -144 -67 -110 -13 0 7 -12 236 283
1831 283 72 171 224 224 45 189 96 6 -116 -84 -93 -131 -80 -181 -297 -125 -180 -62 -16 -13 58 146 192 336 247 102
$$ packed form
1658a0Lp0l12N59K00o88m5M31k62r0N10k8k82M7M88l29k35P7M75k25l3J15l17
1681b1l54K31J87l65n3J90L33l22J28qk14R6K85K87k88L9J93j03k74R1J54k43
1703c1J3J85j75k16q8P7J8k0J68J79k76M6L58j12j97J01J77J10q1O4j6k04l7N7
1727A00j91j51J78j13k0Pn9K2OJ30J85p8R2O2L3j12J79k6k55K59j7m5j72j24p0
1752a80J7pP6n4l6K26r5o1J1L36K1j22PJ13j53o6J19o1p4N2m3j20j6o9L0k34P7
1779c06K73o1O6K04q1n9P9K0J03k8L1R9k33r9R3M7k50O9j61L9o1L7p4J61P8n1
1805f5J84jJ50lj46N7L6j8k34J68O6k17k27J18n0j67K22j7P7m3R7J3Pj9K48M7
1831B83k11R9N3%j79J44r3r0j22L2rl8N1j01j16J72n5J18M6LP1Q8M6J44q9j45
$$ plain form
1857 102 238 248 -5 -7 133 -27 -197 -220 -89 -312 -301 -61 -139 -319 -45 45 -5 97 239 184 92 212 330
1880 330 136 165 130 4 -175 -90 69 -254 -289 -74 -51 -123 -107 -23 -169 -106 211 274 19 -35 244 208 43 71
1904 71 90 -81 -40 216 -3 -327 -158 37 -92 -137 79 -20 -238 37 324 117 -192 86 433 67 177 180
1926 180 63 -101 81 261 -182 -426 40 72 -209 -76 43 -210 -56 228 184 -175 -134 279 211 63 210
1947 210 74 -349 -81 353 88 -301 -129 115 -176 -210 200 -101 -341 148 295 -128 -194 307 303 -51 351
1968 351 325 -193 -233 216 348 -195 -239 56 -110 -227 156 9 -457 -277 337 194 -353 71 332 82 94
1989 94 406 -24 -293 68 453 -22 -297 -141 0 -373 -36 144 -366 -356 187 329 38 -203 186 107 -54
2010 -54 469 219 -250 -157 541 155 -305 -100 52 -238 -237 165 -183 -572 -233 298 -42 -255 48 87 -42 267
$$ packed form
1857A02J36J0k53kJ40j60j70k3J31k23J1K40p8j80K74R0n0J02J42n5r2J20J18
1880C30j94K9l5j26j79Q5J59l23l5K15K3p2J6Q4j46O3L17O3k55n4K79l6j65K8
1904G1J9j71M1K56k19l24J69J95j29m5K16r9k18K75K87k07l09K78L47l66J10L
1926A80j17j64J82J80m43k44M66L2k81J33J19k53J54K84m4l59M1M13o8j48J47
1947B10j36m23K68M34k65l89J72K44k91l4M10l01k40M89J47m23o6N01ml54M02
1968C51k6n18m0M49J32n43m4K95j66j17L83j47m66J80O14j43n47M24K61k50J2
1989I4L12m30k69L61L85m75k75J56J41l73L37J80n10J0N43J42k91k41L89p9j61
2010e4N23k50m69R3O98l86m60K05J52k90JM02l48l89L39N31l40k13L03L9j29L09
$$ plain form
2032 267 409 39 -231 232 446 27 -199 58 -29 -292 60 80 -486 -525 401 205 -309 -101 180 -148 134
2053 134 425 161 -305 19 408 -51 -152 35 105 -132 -53 199 -161 -575 -148 39 -215 -232 31 16 25 263
2075 263 502 -123 -159 404 367 17 91 115 -155 -251 134 17 -416 -223 233 53 -287 11 -63 -305 -58 435
2097 435 259 -83 149 340 182 73 159 23 -101 224 300 -272 -494 -116 -2 -274 -210 18 -151 -105 264
2118 264 316 -158 -119 338 250 118 104 238 -134 -153 258 46 -435 -216 -5 -59 -277 -137 -149 -308 19 193
2140 193 76 -2 213 399 183 194 278 78 4 274 302 -25 -326 -30 -255 -339 -104 -62 -157 -322 138 60 -133
2163 -133 -115 281 281 137 244 219 -107 126 328 68 -228 46 -23 -79 -193 -212 -288 -384 -153 -3 -160 -19 80
2186 80 150 157 16 264 79 79 237 141 60 -10 10 -55 -99 -82 -112 -203 -242 -35 -215 -208 -63 29 -18 131 115 78 153 215
$$ packed form
2032B67J42l70k70M63K14m19k26K57q7k63L52K0n66l9R26j96n14K08K81l28K82
2053A34K91k64m66L24L89m59j01J87P0k37P9K52l60m14M27J87k54j7K63j5RK38
2075B63K39o25l6N63l7l50P4K4k70r6L85j17m33J93M56j80l40K98p4k42K47M93
2097D35j76l42K32J91j58j09Q6j36j24L25P6n72k22L78J14k72O4K28j69M6L69
2118B64N2m74L9M57q8j32j4J34l72j9M11k12m81K19K11n4k18J40j2j59L27J74
2140A93j17p8K15J86k16J1Q4k00p4K70K8l27l01K96k25q4K35M2r5j65M60p8j93
2163a33J8L96%j44J07k5l26K33K02k60k96K74o9n6j14j9p6r6K31J50j57J41R9
2186H0P0Pj41K48j85%J58r6q1p0K0o5m4J7l0r1l9K07j80PJ45R2m7J49j6l7P5O2
$$ plain form
2214 215 213 126 154 175 168 -34 -107 -156 -181 -237 -146 -191 -179 -46 14 -86 -67 36 106 79 167 285 74 66 29 121 33 -22
2242 -22 71 -32 -145 -122 -161 -141 -191 -139 -73 -65 92 97 88 84 67 171 70 168 151 214 181 -145 -80 -134 -195 -29 -41 -69 -109
2271 -109 -121 -124 -216 -74 21 33 97 110 191 76 110 178 20 129 67 82 11 -78 -136 -213 -103 -38 -88 -86 -77 23 -50 -53 108
2300 108 99 159 158 145 169 98 -6 -22 -43 21 -25 -65 -14 -74 -55 -158 -156 -81 -6 -85 -69 152 29 111 7 211 102 16
2328 16 186 94 141 84 -89 -81 -95 -34 -23 -33 -23 -20 -34 -10 9 54 -45 210 177 61 134 111 96 -14 95 -112 -1
2355 -1 -151 -54 57 -118 -88 -16 -135 -31 -17 -75 -51 17 111 25 -55 113 115 12 -88 -7 -131 -141 -47 89 -176 -216
2381 -216 -79 -84 -134 -48 140 -30 -100 148 189 -87 75 119 72 8 -1 24 -198 39 18 -103 -121 -69 -63 -221 -69 94
2407 94 55 19 63 148 101 112 111 29 -6 53 151 -78 -100 -34 -62 -141 -159 -76 -147 -166 116 20 -190 -188 178 138 120 187 321
$$ packed form
2214B15kq7K8K1pk02p3m9k5n6R1m5J2J33O0j00J9J03P0k7Q8J18k11ql7R2q8n5
2242b2R3j03j13K3l9K0n0N2O6QJ57Nrmj7J04j01R8j7O3l3l26O5n4o1J66j2k8m0
2271a09j2lr2J42R5J2O4J3Q1j15L4O8j58J09o2J5p1q9n8p7J10O5n0KRJ00p3lJ61
2300A08rO0jj3K4p1j04j6k1O4m6m0N1o0J9j03KP5P5p9J6K21j23Q2j04K04j09q6
2328A6J70r2M7n7j73Qj4O1J1j0J0Lj4K4J9M5r9K55l3j16P3k3j5j10J09k07J11
2355aj50R7J11j75L0P2j19J04J4n8K4O8R4q6q0J68Kj03j00Q1j24j0R4J36k65m0
2381b16J37nn0Q6J88j70p0K48M1k76J62M4m7o4rK5k22K37k1j21j8N2Oj58J52J63
2407I4l9l6M4Q5m7J1jq2l5N9R8k29k2O6k8p9j8Q3p1j9K82r6k10KL66m0j8O7J34
$$ plain form
2436 321 -70 132 153 21 -114 -97 35 -41 -177 -137 -7 -205 -75 190 -230 -203 11 171 56 82 229 25
2458 25 -122 230 234 15 -91 43 -145 -97 -35 -27 -187 -219 127 76 -214 -54 154 21 -74 125 177 -46 187 380
2482 380 15 -119 125 110 -78 -15 71 -236 -344 -139 78 -167 -172 -139 -128 -59 168 211 -49 69 253 187 42
2505 42 17 67 -8 -52 10 -71 -232 -215 123 -55 -254 -140 72 -48 -53 157 -91 -156 198 255 162 -74 137 1
2529 1 -86 90 66 -214 -176 101 93 -147 -161 -57 -133 -10 -27 146 -24 31 319 123 1 47 51 -96 128 288 -25
2554 -25 -251 -95 101 -4 -229 -77 -45 -18 87 45 -155 -149 113 138 -9 51 112 41 25 247 85 -101 -163 21
2578 21 75 -126 -113 -143 -131 -4 -10 -73 -236 9 106 54 8 57 120 54 106 61 -92 -39 16 144 -16 -168 -68 -71 -153
2605 -153 36 -77 -184 -117 -20 115 -29 45 48 15 67 90 76 -89 -31 61 107 -75 -47 -69 -100 -33 11 -52 -228 -43
$$ packed form
2436C21l91K02K1j32j35J7J32p6j36M0J30j98J30K65m20K7K14J60j15K6J47k04
2458B5j47L52Mk19j06J34j88M8O2Qj60l2L46n1k90J60K08j33r5J99N2k23K33J93
2482C80l65j34K44j5j88O3Q6l07j08K05K17k45nL3J1O9K27M3k60J18J84o6j45
2505D2k5N0p5m4O2q1j61J7L38j78j99J14K12j20nK10k48o5L54N7r3k36K11j36
2529Aq7J76k4k80L8K77qk40j4J04p6J23j7J73j70N5K88j96j22M6Mj47K24J60l13
2554b5k26J56J96j05k25J52L2K7J05m2k00OK62K5j47O0O1p1j6K22j62j86o2J84
2578B1N4k01J3l0J2J27oo3j63K45R7n2m6M9O3o6N2m5j53N3N5J28j60j52J00lq2
2605a53J89j13j07O7R7J35j44P4Ll3N2K3j4j65N8R2M6j82K8k2l1O7M4o3j76J85
$$ plain form
2631 -43 116 -184 45 8 181 -50 169 197 35 -54 -9 22 -88 -11 -59 -126 -10 18 -168 -163 -123 16 53 70 69 30
2657 30 -47 -33 65 78 -58 -26 66 45 -12 -20 -246 -144 -27 79 -102 -115 41 28 -22 -96 166 94 91 136 72 115 -22
2684 -22 79 33 -27 -5 60 -49 -46 -71 -61 -134 39 40 -129 -7 4 33 24 -57 17 98 80 119 238 74 -7 38 -114 -146
2712 -146 -127 -17 -41 -61 -73 -106 -83 79 29 -39 27 77 30 18 -5 22 -2 85 31 80 10 -55 52 -133 -59 -234 -72
2739 -72 -31 -6 99 26 -5 -15 56 84 116 155 40 -88 43 -46 43 88 -6 -58 -130 -183 -110 -120 -19 -93 56 -10 -58
2766 -58 126 -23 93 21 105 14 -10 228 67 19 -3 -181 -23 -61 -68 -38 -41 -118 -14 -53 -29 -20 -140 -85 93 214
2792 214 106 103 20 66 9 132 21 41 -76 -80 -78 -77 -13 -33 34 -190 24 -7 -50 9 105 142 -84 92 146 40 139
2819 139 104 -33 -105 -60 -40 -31 32 -30 -11 -100 -111 16 -79 -5 -46 -20 -40 18 -12 31 -81 86 67 6 -5 -28 -33 -50 -24
$$ packed form
2631d3J59l00K29l7J73k31K19K8j62q9M5L1j10P7m8o7J16K8j86NM0J39L7J7jl9
2657C0p7J4R8J3j36L2R2k1n7qk26J02J17J06j81j3J56j3n0p4K62p2lM5o4M3j37
2684b2J01m6o0K2O5j09Lk5J0p3J73Jj69J22J1K9rq1P4Q1j8L9J19j64q1M5j52l2
2712a46J9J10k4k0j2l3K3J62n0o8O6N0m7j2k3K7k4Q7n4M9p0o5J07j85P4j75J62
2739g2M1K5J05p3l1j0P1K8L2L9j15j28J31q9Q9M5r4n2p2n3P3j0J01p4J49o6m8
2766e8J84j49J16p2Q4r1k4K38j61m8k2j78J58l8pL0lp7J04l9K4Rj20N5J78J21
2792B14j08lq3M6n7J23j11K0j17mKJO4k0O7k24K14l1m3N9R6L7k26J76N4j06R9
2819A39l5j37p2M5K0RO3o2J9q9j1J27r5P4m1K6k0N8l0M3j12J67j9o1j1k3nj7K6
$$ plain form
2848 -24 -5 -97 -106 -8 -37 33 -140 -2 29 108 54 233 116 56 80 54 -33 44 79 -17 -207 -79 -185 -46 1 -5 -114
2875 -114 41 53 -11 -74 -121 -32 79 -18 87 48 142 -9 119 -51 3 -151 -37 -15 -62 -70 14 -131 -38 3 -89 26
2901 26 -16 51 -32 97 31 140 -22 -1 51 -13 6 80 35 13 14 -31 -27 -47 28 21 -91 4 101 96 -74 136 -75 35
2929 35 19 6 69 20 69 52 -147 -82 -51 -89 -72 93 49 -52 -54 51 -65 -13 87 189 -13 -71 39 -41 43 -1
2955 -1 36 -99 -90 146 -101 -126 -51 7 26 -79 -42 -3 2 54 75 7 -41 -10 71 156 -108 -17 -25 -66 -134 33 37 -64 -69 -27
2985 -27 94 115 -2 -95 -25 192 59 28 -54 62 96 -9 -33 -57 -50 -43 86 131 -66 109 9 30 -46 -26 -25 -33 166
3012 166 216 55 55 56 99 -5 72 118 -7 10 1 18 -90 -157 51 29 -93 -13 10 -77 35 127 91 48 108 68 87 -17
3040 -17 23 58 -75 -11 222 -117 -136 37 -66 24 28 -54 -151 -16 80 26 -70 60 151 -62 -76 154 91 5 -32 147
$$ packed form
2848b4J9r2rR8k9P0j73J38L1P9n4J79j17o0K4k6q7P7L5r6j90J28j06J39M7oj09
2875a14J55J2o4o3m7Q9J11r7J05l9R4j51J28j70N4j54J14K2m7qQ4j45R3M1r2J15
2901B6m2O7q3J29o6J09j62K1N2o4J9P4m5k2Jm5Mk0P5pj12R5R7nj70K10k11J10
2929C5j6j3O3m9M9j7j99O5L1l8J7J65m4j01kJ05j16N2J00J02k02n8J10q0Q4m4
2955aL7j35RK36k47k5P5N8J9j05L7L9NN2K1o8m8L1Q1Q5k64R1qm1o8J67Mj01nM2
2985b7J21K1j17r3P0K17j33l1q2J16L4j05k4k4PPJ29M5j97J75j00K1p6K0JqJ99
3012A66N0j61%JM3j04P7M6j25J7rJ7j08o7K08k2j22Q0K3q7J12R2l6m3O0m0J9j04
3040a7M0L5j33O4K33l39j9J73j03R0Mq2r7J35R6n4r6J30R1k13j4K30o3q6l7J79
$$ plain form
3066 147 131 -7 -94 -71 -81 -44 -61 -20 -156 -117 65 5 -63 -29 76 -47 76 62 54 11 -81 -2 -79 -93 2 0 -35 -11
3094 -11 -8 -63 -160 -9 94 24 -3 30 87 115 80 -56 -45 -16 -16 -4 8 -26 31 -107 -68 20 -138 -92 -61 138 -46 -87
3122 -87 -79 27 56 45 23 64 -20 -3 90 -13 109 -1 -46 -95 -105 1 16 -107 1 -10 35 -65 31 72 75 -121 -15
3149 -15 -108 116 -30 55 -16 4 29 11 53 65 -82 74 79 4 -49 33 -15 -77 -16 58 51 13 93 -28 92 -116 105
3176 105 33 -40 -67 23 27 -44 -10 65 -18 -51 -89 7 8 -30 -40 -24 -28 108 135 44 19 28 68 -119 55 -1 -39 -15 -106 26
3206 26 13 -8 -33 -14 148 -27 117 89 118 45 107 93 19 111 -26 -10 25 38 -51 -23 -59 -65 -11 98 -42 -58 -68 -84
3234 -84 56 -104 85 30 71 51 34 62 59 -32 129 -85 -176 -62 -86 -80 -7 -119 74 15 -18 -2 60 1 6 -34 20 -7
3262 -7 129 167 36 35 6 26 21 26 -32 4 -45 -44 -34 35 -49 58 74 121 -136 -8 9 162 9 -7 50 86 -82 34
$$ packed form
3066A47j6j38q7K3j0L7j7M1j36L9J82o0o8L4J05j23J23j4qm3r2P9p7j4R5kl5K4
3094a1Ln5r7J51J03p0k7L3N7K8l5j36J1K9%J2J2l4N7j38L9Q8j58M6L1J99j84m1
3122h7QJ06K9j1k2M1q4J7R3j03J22j10m5m9j0J06J5j23J08j1M5j00R6M1Lj96J06
3149a5r3K24j46Q5p1K0K5j8M2J2j47J56Np5n3Q2m8o2O1P4pl8Q0j21J20k08K21
3176A05p2p3k7R0Mp1L4P5q3l3l8R6Jl8j0J6mJ36K7r1k5RM0j87J74n6l8K4r1J32
3206B6j3k1k5J9J62j75J44k8K9p3O2j4p4R2j37J6L5J3q9K8l6oN4J09j40j6j0j6
3234h4J40j60J89n5M1k0j7K8lr1J61k14r1J14k4OP3j12J93n9l3J6O2n9Nm0N4k7
3262gJ36L8j31jk9K0nNn8L6m9JJ0O9q4J07J6M7k57J28J7J53j53j6N7L6j68J16
$$ plain form
3290 34 52 -34 -50 -63 -41 -110 93 7 -31 -80 -28 -23 -70 53 88 69 73 35 68 138 -45 53 -104 -25 158 -2 14 -85
3318 -85 -96 -79 41 -159 -40 -110 -27 96 48 -104 98 25 -11 -10 -77 45 -98 -59 -95 -2 69 -26 -6 34 68 -81
3344 -81 101 120 -21 43 40 87 18 37 38 12 -14 29 -31 -20 62 -15 -11 19 -38 -39 61 -34 -96 71 51 12 41 20 -20 57
3374 57 38 139 46 -8 -8 -15 29 77 26 62 -17 -167 44 -55 -40 -10 22 13 -31 -17 76 146 125 105 26 45 105 -43 -59 9
3404 9 -91 119 -96 -93 -42 -33 -87 126 -9 -119 144 -76 22 11 112 -2 26 154 45 15 21 47 46 -81 -9 55
3430 55 -78 5 50 -4 2 -61 44 -44 53 92 -26 -89 -33 -9 -69 42 51 -55 -76 -26 90 85 -10 123 23 -164 -83
3457 -83 -57 41 -11 31 83 -14 -15 72 31 16 121 49 129 5 50 73 58 -47 132 -67 -32 42 10 -22 -26 61 86 -40
3485 -40 20 44 43 28 44 -27 47 -24 7 -31 -15 0 -84 -102 -116 106 18 -71 -21 1 7 40 -1 -53 17 148 -36 59 -89
$$ packed form
3290C4J8q6j6j3K2o9K03q6l8m9N2Nm7J23L5j9Ml8L3P0j83R8j57P9J83j60J6r9
3318h5j1J7J20k00J19p0Q3J23m8j52K02p3l6Jo7J22j43L9l6R3P1r5K0M0L4j49
3344h1J82J9j41O4lM7o9J9Jk6k6M3o0J1Q2p7ML0n7jJ00r5o2J67k0l9K9k1m0P7
3374E7j9J01r3n4%pM4M8n1L6p9j50K11r9J5L0L2rm4J4R3P0k1k0p9J9O0j48j6O8
3404Ij00K10k15LN1Rn4K13j35j10K63k20R8j1J01j14K8J28j09l0OK6jj27P2O4
3430E5j33Q3M5n4Oo3J05q8R7L9j18o3N6K4o0J11Rj06k1N0J16nr5J33j00j87Q1
3457h3K6R8n2M2N2r7jQ7m1j5J05p2Q0j24M5K3j5j05J79j99L5P4l2l2mQ7K5j26
3485d0O0K4jj5J6p1P4p1L1l8J6J5q4j8j4K22q8q9N0K2OL3m1n2P0J31j84R5j48
$$ plain form
3514 -89 70 60 -105 -85 58 -46 -76 64 16 -180 6 -17 0 15 -30 -19 -26 -74 4 40 14 2 49 73 0 39 -8
3541 -8 -66 50 -86 -18 -86 51 8 24 52 73 -54 91 87 -20 42 57 36 56 77 50 21 -8 -19 41 47 -107 32 -11
3569 -11 -30 -47 -26 48 -11 53 46 81 -57 36 -11 70 147 134 54 -88 4 12 -108 -120 56 -82 -16 105 -57 -64 -98 68
3597 68 65 30 35 -46 10 21 -70 34 -153 53 33 42 -115 -129 30 30 36 11 26 -58 38 53 72 -5 111 -97 43 87 -14
3626 -14 -44 -45 -42 -26 88 -71 4 -93 13 47 113 -7 -13 96 55 -73 -7 27 60 7 20 96 -9 26 -30 -77 -11 114
3654 114 -52 37 61 53 -82 40 19 10 40 24 52 7 44 -28 -6 -2 -66 -59 -20 -90 102 29 -98 -25 -33 107 -4 4 4 -39
3684 -39 89 -15 15 -42 -55 58 -95 -3 -17 70 -11 -90 -24 30 -9 -50 7 -47 -34 116 -43 -67 45 -13 148 -41
3710 -41 -63 19 -72 -41 -14 -54 100 -14 -25 88 38 36 -26 -32 -72 29 55 4 20 29 103 -5 145 46 -61 45 -57
$$ packed form
3514h9J59j0j65K0J43j04l0J40m8j96J86k3J7J5m5J1pm8P8L6k6j2M7K4p3L9m7
3541hn8J16j36O8o8J37m3J6K8K1j27J45mj07O2J5k1K0K1k7k9k9j1O0Oj54J39m3
3569a1j9j7K1P4n9O4pL5j38R3m7Q1P7j3q0j42R2Qj20j2J76j38O6J21j62pl4J66
3597F8ll5Nq1N6J1r1J04j87K06k0Rj57j4J59%Ok5J5q4R6J5J9p7J16k08J40M4j01
3626a4l0jLJ6J14j59P5r7J06L4O6j20oJ09m1j28O6L4L3n3J3P6j05L5n6m7O6J25
3654A14j66Q9K4qj35J22k1rL0j6K8m5L7p2K2Mo4PL9p0J92p3j27P3qJ40j11Q%m3
3684c9J28j04L0n7j3J13j53R2j4Q7q1p9O6N4l9m1N7n4J3J50j59k4J12n8J61j89
3710d1k2Q2r1L1K7m0J54j14j1J13n0ko2om0J01K6n1J6RP4j08J50r9j07J06j02
$$ plain form
3737 -57 -95 -21 -65 84 48 -87 75 -116 -34 16 56 -25 -9 13 -20 -66 -35 -66 31 -100 39 91 25 82 38 60 -71
3764 -71 66 31 14 41 55 -62 25 49 -15 -26 -51 -47 -27 83 -30 49 36 19 -34 -33 -59 -121 73 45 92 -11 -51 50
3792 50 32 -4 -17 86 -5 172 24 -41 -31 -97 -1 51 -47 52 -48 38 -27 7 -10 1 2 -9 -76 -57 13 32 -21 -27 -2
3821 -2 -26 -28 0 28 -7 -36 -34 52 -112 -89 20 -45 -19 44 23 -16 -106 -102 -16 28 -20 45 -3 44 37 -22 -37 21 -1 -51 -97 -102
3853 -102 -147 40 22 -18 -104 90 63 21 -4 -15 -26 95 92 4 75 37 30 95 -9 76 26 16 64 28 71 -35 -13 80
3881 80 72 -70 17 91 39 28 64 54 -50 58 -22 52 52 84 7 6 -105 93 -56 31 105 131 -89 -90 -24 -53 15 -57 12
3910 12 2 70 101 39 51 30 2 100 102 -78 -26 25 59 -64 -31 34 -108 -47 75 -6 49 134 41 16 -16 -37 -39 -27 134
3939 134 30 17 -113 -16 -33 17 97 66 -26 -60 118 -57 103 -30 -50 -91 1 58 38 -68 -83 59 -67 -62 -33 93
$$ packed form
3737e7l8P4m4J49l6j35J62j91Q2N0M0q1J6K2l3m6L1l1R7j31J39N2o6N7m4K2j31
3764g1J37l5j7K7J4j17Q7K4o4j1k5MK0J10j13P9j3j7n3Jk6o2J94k8M7j03m0J01
3792E0j8l6j3J03r1J77j48o5J0o6R6N2r8R9j00Q6o5L4j7J1Jj1o7J9P0J9n3oK5
3821bk4kK8K8l5k9KQ6j64K3J09o5K6O3k1l9r0MQ6M4m8O5m8M7pn9j5N8k2n0m6n
3853a02m5J87j8m0q6J94k7m2k5j1j1J21lq8P1l8pO5j04Q5n0j0M8l6M3j06K2R3
3881H0qj42Q7P4n2j1L6j0j04J08q0P4%L2p7jj11J98j49Q7P4K6k20jO6k9O8p2O9
3910A2j0O8L1o2J2k1k8R8Kj80N2N1L4j23L3O5j42O1J22q1N5Q5r3k5l2k1kJ2J61
3939A34j04j3j30R7j7N0Q0l1r2l4J78j75J60j33k0m1R2N7k0j06j5J42j26NK9J26
$$ plain form
3965 93 -136 -33 -6 52 -69 31 16 -73 58 -15 -32 -1 0 77 98 3 -126 71 71 -59 -34 -15 9 39 -72 -17 21
3992 21 -68 -12 26 76 -57 4 22 96 64 11 47 6 49 7 -19 63 -31 -79 -128 -1 31 -96 -19 60 94 -8 16 -61
4020 -61 -9 13 10 2 35 37 116 -9 96 -7 27 -46 -61 -27 -84 97 -88 -58 9 -41 80 -6 -55 50 -155 -134 0
4047 0 55 -42 -14 -29 -18 -30 -144 -60 14 29 10 37 50 -18 2 24 -66 52 -59 16 8 -29 90 -15 27 -112 61 -18
4075 -18 2 17 -95 -6 -56 -20 1 -49 -113 -102 69 -11 54 178 -47 -40 -116 21 7 36 -62 20 18 77 46 34 19 -14 103
4104 103 -113 53 -58 39 -70 -1 41 4 32 -138 -35 22 66 10 -11 -43 46 -71 -96 45 -18 12 -87 10 0 13
4130 13 82 -6 68 17 12 8 21 170 -66 2 -112 22 14 63 22 -39 51 -75 -72 16 102 139 -101 -31 36 -60 8 -43 86
4159 86 16 -15 19 42 -35 -39 -49 -42 -13 -69 -10 -111 -40 -194 113 86 -4 33 14 102 -35 13 96 -19 -31 68 66 -31 -4
$$ packed form
3965I3k29J03K7N8j21J00j5q9J31p3j7L1JP7K1r5j29J97%j30K5J9K4L0j11N5L8
3992B1q9N6L8N0j33O1J8P4l2n3L6m1M3m2k6Q2r4m8m9J27L2j27P7P9L4j02K4p7
4020f1N2K2lqL3KP9j25J05j03L4p3j5L4n7J81j85L0O7n0J21q6m9J05k05K1J34
4047@N5r7K8j5J1j2j14Q4P4J5j9K7J3o8K0K2r0J18j11P5ql7J19j05M2j39J73p9
4075a8K0J5j12Q9n0L6K1n0o4J1J71q0O5J24k25Pp6J37j4K9r8Q2kN9l1j2j5l3J17
4104A03k16J66j11R7j09O9M2l7K8j70J03N7M4n6k1l2Q9j17k5J41o3L0r9R7j0J3
4130A3O9q8P4n1nmJ3J49k36O8j14J34qM9m1o1R0j26LQ8Q6L7k40P0O7r6O8n1J29
4159H6p0l1L4K3p7mj0PK9n6N9j01P1j54L07k7r0L7j9Q8j37M8Q3j15j2R9kr7K7
$$ plain form
4188 -4 -2 37 44 15 15 24 41 -56 -32 -69 -46 -100 53 -35 61 56 45 128 83 64 0 -56 -19 -75 -84 -25 92 41 9 -78 -11 52 72
4221 72 74 -76 7 -31 9 47 45 31 52 -2 -65 -34 -30 -1 -111 -49 -102 24 94 -39 27 -48 0 -8 -46 16 65 47 -60 -41
4251 -41 -102 -21 -26 -26 -30 112 -45 -36 12 4 -5 51 -25 29 67 12 36 69 -21 82 -41 -125 26 -36 -104 20 70 -133 11
4280 11 -141 29 77 27 52 127 -43 3 -44 -12 -57 -17 1 -60 -78 -87 -45 24 72 23 66 88 -30 12 34 0 79 -6 -19
4309 -19 64 -14 -25 18 -53 -47 -81 20 5 -10 35 10 21 -71 15 -19 44 99 9 -53 40 100 6 128 4 25 -14 81 42
4338 42 -59 26 67 -8 9 1 -49 -67 15 27 -64 37 32 -87 -62 -49 -4 0 0 1 -43 -3 23 -76 -71 -18 59 -51 -100 28 -44
4369 -44 -37 24 -52 79 16 55 17 -66 -124 48 -21 56 37 59 41 -25 67 83 -73 34 90 -21 -26 26 67 -1 14 -82 -139
4398 -139 102 -5 -18 79 -27 2 47 8 4 92 76 -25 -111 -93 68 -78 -8 10 39 -51 30 -7 -77 31 -110 52
$$ packed form
4188dKL9Pk9%RJ7r7K4l7K3n4J53q8R6nj1Q3m5j9o4n6L7n6rN9J17n1l2q7O7O3K0
4221G2Kj50Q3l8M0L8kj4K1n4o3L1MK9j10O2n3J26P0j33O6p5M8ql8O2M9j8j07J9
4251d1o1Q1n%mJ42j57RM8qrN6p6N4L8n5K4L3r0J03j23q4J51o2o8J24N0k03J44
4280A1j52J70M8n0K5P5j70M6m7L2m5M0J8o1j8rM2O9M8m9M3K2j18M2K2l4P9q5j3
4309a9Q3p8j1M3p1Ol4J01j5j5M5k5J1r2Q6l4O3N5r0o2R3O0r4J22j24K1l9R5l9
4338D2j01Q5M1p5J7qn0j8Q2J2r1J01nj19K5J3M5M%Jm4M0K6r9NN3P7j10m9J28p2
4369d4PO1p6J31o3L9l8q3n8J72o9P7j9K2j8o6R2J6j56J07N6j11nN2M1o8J5r6n7
4398a39K41j07j3R7j06K9M5l9mQ8j6j01q6J8J61j46P0J8K9r0Q1l7p0J08j41J62
$$ plain form
4424 52 -85 -73 114 62 -31 -40 77 5 -53 102 -99 -8 -132 66 -127 10 10 -110 -100 -7 -12 115 47 -29 48 -12
4450 -12 116 27 -18 -9 1 8 22 119 10 27 -1 24 0 26 38 -27 51 -22 4 26 -57 -25 62 -23 45 51 60 22 -1 -28 69
4481 69 -89 51 -51 96 -52 -26 -83 97 30 6 -7 65 -11 102 3 39 -85 25 151 6 11 -31 35 -44 -48 26
4507 26 37 89 -13 24 31 3 -36 -58 -59 -118 18 -71 11 -73 63 -56 -8 -15 -50 104 -132 28 5 38 69 115 24 52
4535 52 -28 -26 -65 122 -78 -117 -16 -35 -16 -98 -31 -43 44 4 96 25 -80 -142 42 -13 18 -162 -25 30 15 62 37
4562 37 -37 81 -75 70 63 55 -92 -31 47 44 -1 16 -57 57 153 23 117 30 -44 -74 -16 34 12 20 121 60 48 -4 -86
4591 -86 37 -62 -159 -4 -27 19 25 35 26 45 40 123 -57 -23 -46 -105 -63 48 -36 -11 -7 6 19 12 -12 -42 30 59 126 -64
4621 -64 -72 25 -131 14 27 -118 -54 -21 -21 -53 22 -21 10 29 120 42 -107 -78 -25 -31 -3 9 -41 0 -72 17 17 -52 35 -7
$$ packed form
4424E2j37J2J87n2r3rJ17p2n8J55k01R1j24J98j93J37%j20J0R3nJ27o8p6P7o0
4450a2J28q9m5RJ0PJ4R7j09J7k8K5k4K6J2o5P8p3K6K2q3L2Q7q5O8ORl8k3k7R7
4481F9j58J40j02J47j48K6n7J80o7k4j3P2p6J13r9L6j24J10J26j45Nm2O6p9mP4
4507B6J1N2j02L7Pk8l9k2jn9J36q9Q2q4J36j19M8pl5J54k36J60k3L3L1M6r1K8
4535E2q0Kl9J87k00l9J01j9J9q2O7j2Q7m0R2p1j05o2J84n5L1j80J37N5j5M7k5
4562C7p4J18j56J45pqj47O1P8lm5J7p3J14R6j30R4q7p4l0N8N0k2QJ01o1j2n2q2
4591h6J23r9r7J55k3M6OJ0rJ9nQ3j80L4k3n9M2J11q4K5MJ3J3pk4l0P2K9O7j90
4621f4qR7j56J45J3j45O4L3%l2P5m3L1J9R1p8j49K9N3oK8J2n0M1p2Q9%o9Q7m2
$$ plain form
4651 -7 31 10 -27 106 -50 -30 -27 46 102 80 -1 -8 -13 51 -8 40 40 27 -13 -21 -88 -21 -63 -86 -51 -38 -38 27 42 24 17 15 7 -15
4685 -15 61 33 -32 12 -8 0 -74 17 46 81 0 -97 -32 101 70 -14 21 10 -22 23 61 -77 65 28 17 67 53 -39 49
4714 49 145 68 -6 -4 -7 -27 -28 -46 58 -8 -106 2 -21 145 36 100 30 -5 83 -139 -40 30 70 -9 -8 -53 -142 -52 67
4743 67 -78 21 -22 -28 19 22 -65 -43 61 -81 -9 -56 27 7 -49 16 77 -111 50 51 45 -148 1 14 45 -32 -31 -95 44
4772 44 28 129 28 87 42 -60 -131 56 105 -74 -20 -15 -25 26 -53 -35 19 -49 47 -35 -15 50 37 -62 -113 6 13 -107
4800 -107 112 -42 51 -20 -10 -10 100 5 34 -46 -60 57 -11 -33 61 -153 24 -39 108 -107 11 -77 -16 47 75 -5
4826 -5 3 49 -34 10 -30 86 26 23 57 -27 49 33 116 -33 -73 28 -54 -106 -53 0 -40 -20 -119 -116 -28 86 -51 -51 -158 -46
4856 -46 19 95 52 -74 7 132 -13 -14 74 24 30 36 -19 -49 83 -25 -3 -42 -68 -13 -104 -3 12 -130 76 6 14 -17
$$ packed form
4651gL8k1l7J33j56K0LP3N6k2q1pnO4n9M8%j3m0qo7O7m2k3L5J3%O5J5j8pkqk2
4685a5P6k8o5M4k0Qp4R1K9L5q1r7O5J33l1q4L5j1l2M5L8j38J42l7j1N0j4r2Q8
4714D9R6p7p4Klk0jj8J04o6r8J08k3J66j09O4p0l5Q8k22R9P0M0p9Jm5q9R0J19
4743F7j45R9m3oM7Lq7K2J04j42P2m7Q3k0n6O5O1j88J61Joj93J49J3L1p7Jo4J39
4772D4j6J01j01N9m5j02p1J87M9j79N4Nj0N1p9J8N4o8R6q2K0O5j3r9n1J19Pj20
4800a07K19j54R3p1J0%J10r5K9q0j4J17o8k2R4k14J77o3J47k15J18q8O1O3K8q0
4826eQM6q3M4m0J16o0lL4q4P6j6Q3j49m0J01q2n2N3N3m0K0r9LQ8J14j37%j07J12
4856d6O5P6m3j26Q1J25j45jQ8n0OOn5l0J32j08K2l9k6N5r1J01J5j42K06p0Ql1
$$ plain form
4884 -17 -136 -23 47 17 55 98 10 -14 -38 43 -69 -12 -139 -21 93 132 -38 -62 94 20 -9 1 76 -73 -61 67
4910 67 85 -132 87 -78 95 75 56 12 21 105 17 -36 -69 -3 6 -44 62 101 -24 80 -62 -56 111 150 -97 -4 2
4937 2 -83 -27 -158 -68 12 -10 -31 18 -84 47 22 21 102 -114 45 15 0 12 27 -83 18 -45 -26 -4 -30 105 71
4964 71 -78 -96 14 1 112 82 -16 -32 87 9 -59 -120 16 22 142 15 -15 64 6 -155 -92 54 -65 50 13
4989 13 -84 29 -104 0 -34 -66 -45 -84 3 37 -17 -91 -101 44 67 -59 -3 25 61 19 49 35 52 8 8 -57 -11 6
5017 6 -68 121 56 56 42 34 26 -6 44 -90 -72 -6 2 -22 -40 53 56 -90 -32 40 -61 -85 13 -114 37 -30 -3 -16 -38 25
5047 25 -85 79 119 -79 -72 -9 21 -68 113 3 -30 62 -7 -71 -57 111 -30 2 -71 46 17 136 46 -15 -22 -41 20
5074 20 81 10 -86 2 -66 98 66 -39 6 57 -46 59 -26 -75 107 106 -6 -1 -46 -64 79 -141 -31 -6 -40 -4 27
$$ packed form
4884a7j19J13P0l0L8M3q8k4k4Q1j12N7j27J18J14L9j70k4J56p4k9J0P5j49J2J28
4910F7J8k17K19j65J73k0j9m4RQ4q8n3l3O6Rn0J06L9j25J04j42OJ67L9k47R3O
4937Bq5N6j31R0Q0k2k1M9j02J31k5jQ1k16J59l0j5J2J5j10J01o3J9K2k6J35l4
4964G1j49j8J10j3J11l0r8j6J19p8o8o1J36OJ20j27l0P9n8j61O3J46j19J15l7
4989A3r7J13j33J04l4l2K1l9Q7L4n4p4j0J45K3j26N6K8L6m2L0j4J7m4%o5M6J7
5017Fp4J89o5%j4qql2N0j34J8O6Qk4j8R3Lj46N8P2j01k4R8j27J51o7K7j3k2O3
5047B5j10J64M0j98PO3L0q9J81j10l3R2o9o4J4J68j41L2p3J17k9J19r0o1pj9O1
5074B0O1p1r6Q8o8J64l2j05M5N1j03J05q5m9J82jj12Nm5j8J43k20J10K5l4L6L1
$$ plain form
5101 27 2 -31 -21 -5 31 -26 55 -71 -10 31 55 117 -40 -66 52 54 69 4 59 -69 41 78 -79 61 73 12 9 6
5129 6 36 139 -15 -29 -139 -9 -11 92 42 -22 -2 -13 62 -65 -50 21 57 -5 -37 13 23 -16 48 -33 35 97 -78 62
5157 62 8 84 21 16 -44 58 -42 -122 -40 -130 -91 157 -26 -99 40 -46 77 26 125 24 -59 -55 -5 -37 6 -12 -80 30
5185 30 -12 47 -31 79 122 12 -6 40 -21 35 -4 64 -17 -21 6 -50 -1 43 -13 22 -59 104 -138 56 -25 -64 -123 60
5213 60 65 72 33 -46 39 85 -45 66 34 138 12 45 -2 -110 144 25 59 -13 -62 -26 24 46 -32 59 -109 48 51
5240 51 -43 102 -29 -44 -144 -47 -59 -28 -35 -1 66 -3 5 -99 69 -3 -55 49 -14 59 99 22 134 -6 86 36 11
5267 11 44 -73 -32 -119 -28 -8 -13 -127 -118 -7 -128 48 118 57 3 55 44 14 41 104 -3 -8 -38 30 25 -60 -23 -14 -53 27
5297 27 30 -115 -84 106 -32 96 29 -19 51 -24 79 -17 74 70 -67 10 -18 -90 -128 -1 43 33 -39 -99 -60 -11 -86 -79
$$ packed form
5101B7k5l3J0J6L6n7Q1j26O1M1K4O2j57k6J18KJ5o5N5j28J10L7j57J40J2o1ll
5129FL0J03j54j4j10J30kJ03n0o4K0j1P5j27J5P1L6o2l2N0J0l9O4q1O8O2j75J40
5157F2n4P6o3no0J02j00q0Q2r0L9K48j83p3J39q6J23n1R9j01q3MN0l2M3j8o8J10
5185C0m2N9p8J10M3j10j8M6o1N6l9O8q1mK7n6M9M4n6L5q1J63k42J94q1l9n9J83
5213F0NPl9p9Q5M6j30J11l2J04j26L3m7j08K54j19L4p2m9L6N0K2p8R1j68J57L
5240E1r4J45j31j5j00R7j2L1pL4O7o9Qj04J68p2n2J04o3P3M0p7J12j40R2n0k5
5267A1L3j17M1q7R1K0nj14RJ11j21J76P0o1n4N2j1l0K7O3j07nl0O8nq5L7Rl9Q0
5297B7Lj45L1J90j38J28o7m8P0p5J03r6R1mj37P7k8p2l8J27M4j0p2o0L9M9p5P
$$ plain form
5325 -79 -37 40 50 -136 22 6 27 55 -5 -6 22 83 45 14 -4 25 -21 -26 -44 20 96 38 15 14 38 -25 25 12 126 -51
5355 -51 1 14 -12 -83 -82 7 -73 79 59 -136 -56 50 -182 65 -62 -67 -19 -105 -23 65 -62 -43 -88 52 123 -62 7
5382 7 -51 -18 -119 18 66 -126 -22 17 3 116 24 -9 -44 -35 37 -112 42 -107 42 41 4 -23 32 -52 105 35 -116
5409 -116 52 39 38 6 -4 132 -102 55 86 33 -104 41 -53 97 29 -144 44 -21 -50 94 52 -29 0 4 22 -22
5435 -22 -29 46 56 -105 25 -15 -58 58 44 14 56 -19 2 41 -131 -101 58 -3 -27 36 -36 -70 -8 -33 23 -18 -3 12
5463 12 -18 43 113 -25 -83 116 37 -41 103 84 67 -5 10 27 28 33 72 -52 -40 62 70 26 86 -62 37 152 -59 -79
5491 -79 -55 54 12 -4 -47 85 -33 83 -20 8 8 40 65 -39 -130 99 30 -73 -62 -119 15 -92 27 25 -5 -90
5517 -90 -33 77 42 -25 -67 -32 -43 -9 33 -66 -10 -89 73 -11 125 65 -24 63 72 -108 31 -56 -109 58 -122 -28 52
$$ packed form
5325g9M2P7J0j86J58j6K1K8o0jK8O1l8l1j8K9m6nj8O4P6n8k3jK4o3N0j3J14j77
5355e1N2J3k6p1JQ9q0J52k0j95Q0J06k32K47j27nM8q6Q2Q8j27J9m5J40P1j85O9
5382Gn8L3j01J37M8j92J04L9j4J13r2l3l5RP2j49J54j49J49jl7k7N5q4J57p0j51
5409a16J68j3jl2j0J36k34J57L1n3j37J45r4J50o8j73J88o5k9J44m2q1K9MJ8m4
5435b2pP5J0j61J30m0m3J16j4l0M2p5K1L9j72L0J59o1k4O3p2l4O2k5N6m1J5J5
5463A2l0O1P0j38n8J99p9p8J44j9j7p2J5J7JNL9j24J2J02Qm4O0j48R9J15k11k0
5491g9K4J09m2j6m3J32j18J16j03K8%L2K5j04r1K29o9j03J1n7J34j07J19kl0q5
5517i0N7J10l5o7m2L5j1L4M2r9N6p9J62q4J36o0q9Q7Rj80J39q7n3J67j80R4Q0
$$ plain form
5544 52 69 52 14 -4 3 49 151 -4 2 -31 -32 -20 -6 54 49 -18 -9 -93 -65 42 -72 -78 -52 -69 -25 110 54 32 11 8 42
5575 42 -26 2 36 -34 -126 20 52 34 -20 5 -21 -51 -85 76 2 36 -31 23 -119 108 -91 43 14 -67 69 32 25
5602 25 2 118 38 -17 -73 -58 -49 47 34 -22 -103 29 36 -2 -18 -37 -26 59 21 108 -45 65 27 -101 56 35 -110 44
5630 44 15 42 -51 -82 18 -78 -68 -2 -2 93 11 16 12 57 -41 62 -56 -4 -77 -68 29 -34 41 69 -82 41 19 7 -61 28
5660 28 31 171 68 -77 -76 -29 -82 43 51 9 -10 -29 47 -10 -115 41 73 25 193 15 78 81 66 40 -51 -66 -137 -15
5688 -15 2 19 -19 9 44 25 0 -35 -107 58 -18 29 27 2 8 94 75 34 4 -12 -12 134 -37 -31 -148 -19 38 -63 76
5717 76 -18 -57 -13 -14 -60 82 46 -45 96 -103 -30 53 17 73 66 -81 -13 -8 -36 60 -124 -8 21 -44 -7 -100 61 -54
5745 -54 -189 -45 23 -161 17 -7 6 -49 -46 -28 -25 100 -85 -4 -84 31 -35 77 -14 -2 17 111 54 -34 55 64 122 -63
$$ packed form
5544E2J7j7l8j8PM6J02j55Ol3jJ2J4O0no7Rq4K8J07j14oK6j7M4J35n6k2k1lL4
5575D2o8K8L4p0r2J46L2j8n4K5k6l0l4J61p4L4o7N4j42K27j99J34k9q1J36l7p
5602B5k3J16q0n5n6J5RR6j3n6q1J32Pl8j6j9J1Q5l8Q7j53J10l8j28J57k1j45J54
5630D4k9K7r3l1J00r6J0O6%R5q2NmM5r8J03j18N2p3RR7o3P5K8j51J23k2j2o8Q9
5660B8LJ40j03j45JM7n3J25Qm2j9j9P6n7j05J56L2m8J68j78O3Lj5k6r1j5p1J22
5688a5J7J7l8K8L5j9k5l5p2J65p6M7kk5OQ6j9m1l0j6%J46j71Oj17J29N7j01J39
5717G6r4l9M4jm6J42l6r1J41j99P3Q3l6N6pj47O8Nk8R6j84J16K9o5L7r3J61j15
5745e4j35J44O8j84J78k4J3n5LJ8LJ25j85Q1q0J15o6J12r1J2J9R4n7q8Q9RN8j85
$$ plain form
5773 -63 143 7 10 -15 -22 -22 -27 -17 61 -90 -85 -28 -122 20 -8 -21 -21 -26 -15 -29 -20 -117 -54 32 -16 23 20 26 -20 -13 -4 45 57 25
5807 25 107 -63 61 21 -61 -19 63 -130 -94 24 62 -27 -41 -50 30 13 19 -44 43 40 37 -80 -99 7 103 -1 -55 -34 138
5836 138 81 20 -19 -52 91 69 29 -13 -65 -143 -64 -9 50 -76 -36 45 86 32 87 -141 89 6 -61 7 -20 19 -47 12
5864 12 82 -90 64 36 -16 -2 23 6 -22 -26 4 -66 -14 3 -29 -74 26 -31 44 -2 -10 122 24 -31 -29 0 -29 38 -47 -137
5894 -137 -76 -15 17 39 43 90 -21 103 22 67 -70 8 -29 66 26 -120 51 48 37 -36 6 69 -36 24 -152 -5 57
5921 57 -116 -53 11 14 102 22 -72 63 45 70 49 -3 -79 -24 -9 66 -24 50 6 30 -37 -69 -60 20 -41 -22 -20 -54 22 19 55
5952 55 35 -4 -25 18 16 -65 -49 -14 58 -48 24 29 -51 -33 28 5 -31 68 10 114 -13 69 -38 54 102 -61 19 -32 -10
5981 -10 -51 -20 9 -17 3 8 -4 16 65 -53 -39 2 -84 -42 98 -47 10 -66 7 115 -101 -64 -6 -25 -12 -79 1 -18
$$ packed form
5773f3K06j36Lk5p%nJ0P8j51NN7r4J42k8j3%nJ1j4Rr7O3Q6m8L9lOm6PRM9J2l2
5807B5Q2j70J24m0q2M2Q2j93L6J18L8q9j4rQ0j7Oo3Q7llj17j9J06R6j04n4K1J72
5836A38n7o1l9l3J43k2m0m2n2p8P9N5N9j26M0Q1M1n4N5k28K30q3o7O8k7L9o6N9
5864A2P0j72J54k8n2J4K5j7k8mL0p0N2J7l2m5J00n7P5m6qJ32r8n5KK9k9O7q5r0
5894a37O1O1L2K2MM7j11J24q1M5j37P8l7R5m0j46J71lj1p3M2O3j05O0j76J47O2
5921E7j73O3O4LQ8q0r4J35j8K5k1n2p6N5J5P5r0P4m4K4o7l2RQ0o1J9Kl4P6lL6
5952E5k0l9k1M3kq1J6L5P2j06P2Nq0J8O1k3l6R9n8J04j27Q2j07R2M8j63Q0n1K2
5981a0m1L1K9k6K0Nj2K0M9j18J4M1q6M2J40j45N7p6P3J08k16L7N8j9J3o7Q0j9
$$ plain form
6009 -18 -73 53 64 21 -13 -29 -48 -12 -43 100 72 19 58 -38 -64 89 -42 66 -6 7 16 136 10 0 -73 110 -39
6036 -39 5 -111 -46 -55 19 132 29 2 13 71 43 -51 -85 -48 -25 -3 -30 -24 -21 122 -123 -67 46 -59 -18 -32 -40 51 -62
6065 -62 -22 -64 55 -23 81 5 1 35 -44 37 21 13 -16 -42 85 -89 98 52 -61 29 -6 -23 -7 22 -13 -134 -18
6092 -18 73 79 8 3 6 -21 -45 54 102 48 -42 -48 -59 93 -30 -88 47 -95 92 78 -3 35 -35 -33 63 58 14 -20 -57 -26 57
6123 57 -53 17 16 -85 -20 93 -3 -72 -126 -93 24 26 -5 116 4 -31 -144 -14 25 2 37 -16 -6 -37 -5 -4 0 0 25
6152 25 0 -43 159 -24 41 34 -8 -59 23 49 -26 -25 50 153 -22 -61 -37 33 35 -83 -22 -36 87 -7 84 83 109 -72 -72
6181 -72 107 116 -34 50 132 -39 -3 60 -59 -1 43 -91 -65 46 12 -48 6 59 23 45 -55 -25 -37 9 118 -55
6207 -55 -108 86 29 -67 105 52 42 -111 -127 -58 -12 2 77 -12 3 -2 -72 36 -15 -91 17 20 -69 16 34 62 25 117 -21
$$ packed form
6009a8n5J26J1m3l4j6j9L6l1J43k8n3L9r6k6J53j31J08p2J3RJ20j26j0p3J83j49
6036c9M4j16O5rP4J13j03k7J1N8k8r4l4L7K3K2k7OLJ43k45N6J13j05M1j4qR1j13
6065f2M0m2J19p8J04p6mL4p9Q1j6qk9k6J27j74J87m6j13R0l5j7J6K9l5j21J16
6092a8R1Op1nLk7k4R9M8n4r0oj1J52j23n8J35j42J87j4q1L8p0KR6nm4l4l7L1Q3
6123E7j10P0jj01O5J13r6o9n4L3J17Kl1J21j12l5j13J30L9k3L5n3J0l1L2JM%K5
6152B5k5m3K02j83O5pm2n1Q2K6p5JP5J03j75l9K4P0Kj18O1j4J23r4R1jK6j81%
6181g2J79Rj50Q4Q2j71L6O3j19N8M4j34K6J11l4o0N4N3l6K2j00L0j2M6J09j73
6207e5n3J94n7r6J72n3j0j53j6O9M6J4P5q9J5np0J08n1p6J08Lq9Q5J8K8l7R2j38
$$ plain form
6236 -21 61 37 82 18 53 -8 -2 -95 -80 -74 52 -47 -96 36 47 4 -78 -66 3 18 -31 21 60 138 -103 -87 -44 91 66
6265 66 3 19 -104 -9 58 86 -113 30 -111 28 77 21 87 23 -51 -39 -90 5 71 74 86 21 -15 -63 24 58 26 24 -6
6294 -6 -48 46 107 24 -1 58 74 -88 -29 26 -11 -6 -5 5 34 146 34 32 47 -29 78 -29 -9 -77 -89 51 -43 -3 -39
6323 -39 -71 30 -29 -128 -13 24 -36 -49 -106 -37 -109 -68 107 7 -118 -29 116 56 -44 -31 -65 36 -107 63 -59
6348 -59 -40 -15 95 96 5 -94 14 -10 84 93 -27 77 -1 109 53 -8 58 -7 -30 34 61 -67 -93 11 -64 -90 16
6375 16 5 -98 -26 14 50 -40 -13 -92 67 37 -147 -51 20 41 -133 13 -22 35 -17 -122 69 -103 -109 14 -20 96
6401 96 -77 83 80 -105 -11 2 29 15 -13 -134 -75 -8 -53 -57 58 -39 14 -57 -112 53 2 0 89 -68 118 32 -5 -14
6429 -14 -43 -9 11 26 46 -11 -27 -26 79 72 -44 -9 54 -7 68 41 31 -82 -38 -13 -29 -70 -89 -22 -141 -94 52 5 62
$$ packed form
6236b1Q2k4M5o4L5o1Or3J5OJ26r9m9J32J1m3q2J2O9J5m9N2L9P8k41J6M3J35k5
6265F6o3J6j23R5O7K8j99J43j41J39M9n6O6o4p4J2n1R5O6LJ2o5l6m8Q7L4l2kl0
6294fm2R4O1q3k5N9J6j62N9N5l7NJJ0K9J12j12kJ5p6J07j07K0o8j2J40r4M0l6
6323c9l2J01n9r9J15L7o0j3n7O9p2M1J75j00j25Q9J45o0j00J3l4J01j43J70j22
6348e9J9K5J10Jr1r9J08k4R4Rj20J04p8J10n6o1O6o5k3O4K7j28k6J04p5k6J06
6375A6j1j03P2M0L6r0K7p9J59l0j84R6P1K1j74J46l5N7n2j05J91j72oJ23l4J16
6401I6j73J60lj85R4J3K7j4k8j21N9O7m5mJ15r7N3p1n5J65n1kQ9j57J86q6l7r
6429a4k9L4K0J5K0n7j6JJ05pj16L5O3o1P5k7j0j13M4K5j6m1j9O7j19M7J46m7N7
$$ plain form
6458 62 117 8 22 67 -12 -82 109 -31 24 -22 122 -81 -58 17 33 -41 11 -81 34 -81 -47 -50 -23 -40 -56 -54 54
6485 54 -95 -46 9 -27 -36 -57 -108 -20 35 -1 -37 30 33 47 -88 -83 70 -35 108 11 72 -13 -46 -116 99 53 19 -50 -117
6514 -117 -32 -3 -103 59 -8 -201 135 -52 -9 -26 -5 -135 -4 -38 48 -40 -15 -17 5 103 10 70 52 41 -41 81
6540 81 132 80 -69 -76 51 10 -39 -63 -52 -19 -4 -55 -16 30 -60 -190 30 -29 50 22 23 -4 -17 7 -6 -9 -54 4 -18 -80
6570 -80 -7 -15 21 36 48 54 -32 -14 59 -46 86 -91 -114 111 47 139 -82 -15 84 -8 10 49 -65 24 -64 85 -127
6597 -127 0 131 -11 49 37 -58 -27 86 -62 -133 62 101 -129 7 37 64 -13 -83 -20 -4 12 -75 -8 63 52 -27
6623 -27 -65 62 1 121 -8 -61 3 38 35 53 88 -57 -6 -42 -27 -34 -20 -48 -55 57 -101 87 60 -100 102 -97 -30
6650 -30 -58 -5 110 29 51 -52 158 -5 107 121 -32 -10 -47 -60 86 116 30 16 -3 12 0 -74 29 5 16 -156
$$ packed form
6458F2N5j09J4M5p9p0J91j40N5m6J44k03K3P5J6p4N2r2J15j15L4lK7j7j6KJ08
6485E4j49M9N5l6rk1n1Q8N5l6l6O7LJ4j35NJ53j05J43r7O1q5l3p0K15m6l4o9o7
6514a17Q5K9j00J62o7j93L36j87M3j7K1j30J31l4Q6q8K5kK2R8r3O0j8j1q2J22
6540H1N1n2j49pJ27m1m9k4J1L3J5n1L9M6r0j30K20n9P9k8Jk7j3K4j3lm5N8k2o2
6570h0P3qL6J5J2Oq6J8P3j05J32j77k3K25o4R2k21O7R9r2J8L9j14Q9q8J49k12
6597a27J27J31j42O0j2r5L1J13j48p1J95L9k30J36L0K7p7p0O3J6J6q7O7P1j1p9
6623b7l8J27o1J20j29n3O4L5lJ8L5j45N1l6J5pJ4k8pJ12j58J88k7j60K02j99O7
6650c0k8N3J15q1K2j03K10j63J12J4j53K2l7j3J46L0q6j4j9J5j2p4J03k4J1j72
$$ plain form
6676 -156 -10 72 31 14 -18 -92 -16 23 -18 -18 -17 -47 -40 20 9 57 -54 -131 46 -69 -38 -40 115 -19 20 5 -66 -23 -11
6705 -11 -125 -7 -44 34 -2 -81 29 105 -55 13 3 -50 95 -12 36 -43 -17 -65 -71 -12 21 -36 -50 -47 -15 4 -60 -29
6733 -29 61 49 21 56 -52 59 -42 -19 9 -8 -60 -63 -14 -17 -110 -47 -62 2 76 26 41 36 47 18 93 28 -27 -28 14 -34 40
6764 40 -37 70 -67 -65 82 28 -59 -49 -35 -39 14 64 -144 97 -2 -5 -32 -58 100 -47 104 -43 48 71 -46 43 -13
6791 -13 -9 6 10 -34 -23 -60 18 92 81 -39 65 -121 46 -75 -1 -25 -51 -59 -6 15 9 -40 -117 28 2 -47 -57 -9 -71
6820 -71 120 -18 -41 -83 -21 -10 45 -33 86 19 95 -19 12 44 -56 -69 -53 -50 -42 -21 47 70 -42 -41 -15 38 -15 -30 -2
$$ packed form
6676a56J46Q2m1j7l2p4P6L9m1%Jl0PO0j1M8j11p7J77j15L1kJ55j34L9j5p1M3J2
6705a1j14J18l7P8l6p9J10P6j60O8j0n3J45j07M8p9K6m8oN9L3n7j4LL2J9o4L1
6733b9R0j2k8L5j08J11j01K3K8j7n2lM9lr3O3j5O4P4n0J5nJ1k9P5o5n5jM2m8P4
6764D0p7J07j37KJ47n4q7J0J4mN3N0k08K41r9lk7k6J58j47J51j47R1K3j17Q9n6
6791a3MJ5Mm4J1l7P8P4j1j20J04j86J67j21P4k4k6qN3K1om9p7J45k6m9j0M8o2
6820g1J91j38k3m2O2J1N5p8J19o7P6j14L1L2j00j3J6LQK1O8K3j12JK6N3n3j5K8
$$ [...]
8191A0
##END NTUPLES=NMR FID
##END=
