##TITLE=1H_Pr Pr-D
 200.13MHz,DMSO.
 8 sc
 
 16.12.2025
##JCAMPDX= 6.0         $$ Bruker NMR JCAMP-DX V2.0
##DATA TYPE= NMR FID
##DATA CLASS= NTUPLES
##ORIGIN= UXNMR, Bruker Analytische Messtechnik GmbH
##OWNER= pz
$$ XWIN-NMR		Version 3.5
$$ Tue Dec 16 14:43:09 2025 Russian Standard Time (UT+4h)  she@DPX200
##.OBSERVE FREQUENCY= 200.1313
##.OBSERVE NUCLEUS= ^1H
##.DELAY= (6, 6)
##.ACQUISITION MODE= SIMULTANEOUS
##.ACQUISITION SCHEME= undefined
##.AVERAGES= 8
##.DIGITISER RES= 18
##SPECTROMETER/DATA SYSTEM= spect
##.PULSE SEQUENCE= zg30
##.SOLVENT NAME= DMSO
##.SHIFT REFERENCE= (INTERNAL, DMSO, 0, 14.3821)
##AUDIT TRAIL= $$ (NUMBER, WHEN, WHO, WHERE, WHAT)
$$ ##TITLE= Audit trail, XWIN-NMR		Version 3.5
$$ ##JCAMPDX= 5.01
$$ ##ORIGIN= Bruker BioSpin GmbH
$$ ##OWNER= she
$$ F:/spectra/data/she/nmr/H-C/1/audita.txt
$$ ##AUDIT TRAIL=  $$ (NUMBER, WHEN, WHO, WHERE, WHAT)
(   1,<2025-12-16 14:41:54.14 +0400>,<she>,<DPX200>,
      <created by zg, POWCHK disabled, PULCHK disabled
       configuration hash MD5:
       00 E9 B6 7A A2 85 ED C7 34 08 36 98 17 FE 4E 26
       data hash MD5: 16K
       8B 08 BD 38 3B 66 FC BE 8D 19 18 E2 4F BD 08 FF>)
$$ ##END=
$$ 
$$ hash MD5
$$ 4A FC F7 76 F1 45 77 CA EC 93 96 64 6F BD 25 D7
##$RELAX= 
##$RELAX= 
##$RELAX= 
##$RELAX= 
##$RELAX= 
##$RELAX= 
$$ Bruker specific parameters
$$ --------------------------
##$DU= <F:/spectra>
##$EXPNO= 1
##$NAME= <H-C>
##$PROCNO= 1
##$TYPE= <nmr>
##$USER= <she>
##$AMP= (0..31)
100 100 100 100 100 100 100 100 100 100 100 100 100 100 100 100 100 100 
100 100 100 100 100 100 100 100 100 100 100 100 100 100 
##$AQSEQ= 0
##$AQ_mod= 1
##$AUNM= <au_zg>
##$AUTOPOS= <>
##$BF1= 200.13
##$BF2= 200.13
##$BF3= 200.13
##$BF4= 200.13
##$BF5= 200.13
##$BF6= 200.13
##$BF7= 200.13
##$BF8= 200.13
##$BYTORDA= 1
##$CFDGTYP= 0
##$CFRGTYP= 5
##$CHEMSTR= <none>
##$CNST= (0..31)
1 1 145 1 1 1 1 1 1 1 1 1 1 1 1 1 1 1 1 1 1 1 1 1 1 1 1 1 1 1 1 1 
##$CPDPRG= <>
##$CPDPRG1= <>
##$CPDPRG2= <>
##$CPDPRG3= <>
##$CPDPRG4= <mlev>
##$CPDPRG5= <mlev>
##$CPDPRG6= <mlev>
##$CPDPRG7= <mlev>
##$CPDPRG8= <mlev>
##$CPDPRGB= <>
##$CPDPRGT= <>
##$D= (0..31)
0 0.7 0 0 0 0 0 0 0 0 0 0.03 0 0 0 0 0 0 0 0 0 0 0 0 0 0 0 0 0 0 0 0 
##$DATE= 1765881713
##$DBL= (0..7)
120 120 120 120 120 120 120 120 
##$DBP= (0..7)
150 150 150 150 150 150 150 150 
##$DBP07= 0
##$DBPNAM0= <>
##$DBPNAM1= <>
##$DBPNAM2= <>
##$DBPNAM3= <>
##$DBPNAM4= <>
##$DBPNAM5= <>
##$DBPNAM6= <>
##$DBPNAM7= <>
##$DBPOAL= (0..7)
0.5 0.5 0.5 0.5 0.5 0.5 0.5 0.5 
##$DBPOFFS= (0..7)
0 0 0 0 0 0 0 0 
##$DE= 6
##$DECBNUC= <off>
##$DECIM= 32
##$DECNUC= <off>
##$DECSTAT= 4
##$DIGMOD= 1
##$DIGTYP= 9
##$DL= (0..7)
0 120 120 120 120 120 120 120 
##$DP= (0..7)
150 150 150 150 150 150 150 150 
##$DP07= 0
##$DPNAME0= <>
##$DPNAME1= <>
##$DPNAME2= <>
##$DPNAME3= <>
##$DPNAME4= <>
##$DPNAME5= <>
##$DPNAME6= <>
##$DPNAME7= <>
##$DPOAL= (0..7)
0.5 0.5 0.5 0.5 0.5 0.5 0.5 0.5 
##$DPOFFS= (0..7)
0 0 0 0 0 0 0 0 
##$DQDMODE= 0
##$DR= 18
##$DS= 0
##$DSLIST= <SSSSSSSSSSSSSSS>
$$ [...]
##$SUBNAM0= <"">
##$SUBNAM1= <"">
##$SUBNAM2= <"">
##$SUBNAM3= <"">
##$SUBNAM4= <"">
##$SUBNAM5= <"">
##$SUBNAM6= <"">
##$SUBNAM7= <"">
##$SUBNAM8= <"">
##$SUBNAM9= <"">
##$SW= 18.0517328524113
##$SWIBOX= (0..15)
0 0 2 0 0 0 0 0 0 0 0 0 0 0 0 0 
##$SW_h= 3612.71676300578
##$TD= 16384
##$TD0= 1
##$TE= 0
##$TE2= 300
##$TE3= 300
##$TEG= 300
##$TL= (0..7)
0 120 120 120 120 120 120 120 
##$TP= (0..7)
150 150 150 150 150 150 150 150 
##$TP07= 0
##$TPNAME0= <>
##$TPNAME1= <>
##$TPNAME2= <>
##$TPNAME3= <>
##$TPNAME4= <>
##$TPNAME5= <>
##$TPNAME6= <>
##$TPNAME7= <>
##$TPOAL= (0..7)
0.5 0.5 0.5 0.5 0.5 0.5 0.5 0.5 
##$TPOFFS= (0..7)
0 0 0 0 0 0 0 0 
##$TUNHIN= 0
##$TUNHOUT= 0
##$TUNXOUT= 0
##$USERA1= <user>
##$USERA2= <user>
##$USERA3= <user>
##$USERA4= <user>
##$USERA5= <user>
##$V9= 5
##$VALIST= <valist>
##$VCLIST= <CCCCCCCCCCCCCCC>
##$VD= 0
##$VDLIST= <DDDDDDDDDDDDDDD>
##$VPLIST= <PPPPPPPPPPPPPPP>
##$VTLIST= <TTTTTTTTTTTTTTT>
##$WBST= 1024
##$WBSW= 4
##$XGAIN= (0..3)
0 0 0 0 
##$XL= 0
##$YL= 0
##$YMAX_a= 680317
##$YMIN_a= -805679
##$ZGOPTNS= <>
##$ZL1= 120
##$ZL2= 120
##$ZL3= 120
##$ZL4= 120
##$ABSF1= 10
##$ABSF2= 0
##$ABSG= 5
##$ABSL= 3
##$ALPHA= 0
##$AQORDER= 0
##$ASSFAC= 0
##$ASSFACI= 0
##$ASSFACX= 0
##$ASSWID= 0
##$AUNMP= <proc_1d>
##$AZFE= 0.1
##$AZFW= 0.1
##$BCFW= 1
##$BC_mod= 2
##$BYTORDP= 1
##$COROFFS= 0
##$CY= -3
##$DATMOD= 1
##$DC= 2
##$DFILT= <>
##$DTYPP= 0
##$F1P= 0
##$F2P= 0
##$FCOR= 0.5
##$FTSIZE= 0
##$FT_mod= 4
##$GAMMA= 1
##$GB= 0.15
##$INTBC= 1
##$INTSCL= 1
##$ISEN= 128
##$LB= 0.25
##$LEV0= 0
##$LPBIN= 0
##$MAXI= 10000
##$MC2= 0
##$MEAN= 0
##$ME_mod= 0
##$MI= 1.114404
##$NCOEF= 0
##$NC_proc= 0
##$NLEV= 6
##$NOISF1= 3.799351
##$NOISF2= 2.8
##$NSP= 1
##$NTH_PI= 0
##$NZP= 0
##$OFFSET= 14.38212
##$PC= 1
##$PHC0= -3703.982
##$PHC1= 8.59234
##$PH_mod= 1
##$PKNL= yes
##$PPARMOD= 0
##$PSCAL= 0
##$PSIGN= 0
##$REVERSE= no
##$SF= 200.129724274929
##$SI= 16384
##$SIGF1= 3
##$SIGF2= 2
##$SINO= 400
##$SIOLD= 16384
##$SREGLST= <1H.CDCl3>
##$SSB= 0
##$STSI= 0
##$STSR= 0
##$SW_p= 3205.1282051282
##$SYMM= 0
##$S_DEV= 0
##$TDeff= 0
##$TDoff= 0
##$TI= <>
##$TILT= no
##$TM1= 0
##$TM2= 0
##$TOPLEV= 0
##$USERP1= <user>
##$USERP2= <user>
##$USERP3= <user>
##$USERP4= <user>
##$USERP5= <user>
##$WDW= 1
##$XDIM= 8192
##$YMAX_p= 0
##$YMIN_p= 0
$$ End of Bruker specific parameters
$$ ---------------------------------
##NTUPLES= NMR FID
##VAR_NAME=  TIME,          FID/REAL,        FID/IMAG
##SYMBOL=    X,             R,               I
##VAR_TYPE=  INDEPENDENT,   DEPENDENT,       DEPENDENT
##VAR_FORM=  AFFN,          ASDF,            ASDF
##VAR_DIM=   8192,          8192,            8192
##UNITS=     SECONDS,       ARBITRARY UNITS, ARBITRARY UNITS
##FACTOR=    0.0002768,     1,               1
##FIRST=     0,             0,               0
##LAST=      2.2672688,     0,               0
##MIN=       0,             -805679,         0
##MAX=       2.2672688,     680317,          0
$$ Real data points
##PAGE= N=1
##DATA TABLE= (X++(R..R)), XYDATA
$$ [...]
$$ plain form
1639 204 -53 55 461 155 67 109 18 -135 -67 -109 -377 -29 -128 -74 -160 73 144 -397 25 102 -67 67 -39
1662 -39 -184 112 102 144 -342 -30 554 -181 -331 -140 -134 285 15 66 -396 -296 -83 -538 -515 -205 88 -288
1684 -288 699 -75 88 430 315 -143 11 94 -109 -165 -323 195 13 -23 -87 119 157 36 -55 -103 201 182 96
1707 96 -136 110 147 236 85 88 86 51 -152 102 -389 165 42 -48 -211 -59 19 -107 -54 -74 79 -127 -112 224
1731 224 -117 325 112 -887 166 -285 185 -157 -18 220 -65 331 -232 42 -73 262 239 -74 53 170
1751 170 -26 21 -64 84 170 53 -152 -198 124 -241 -266 -220 202 -40 -259 -394 89 -90 264 -50 -443 325
1773 325 331 -288 -56 -360 281 -102 -223 -197 -120 209 -50 -194 -16 278 169 32 -136 67 138 56 -43 155
1795 155 53 222 101 -182 48 130 -25 -162 -302 -69 200 -51 -129 62 -43 -7 -157 -57 38 76 54 447
$$ packed form
1639B04k57J08M06l06q8M2r1j53O8m2k68L48r9N4q6K33P1n41M22P7j69J34j06
1662c9j45K96j0M2m86L12N84p35j50J91OM19k70N1m62J00K13m55K3L10K93l76
1684b88R87p74J63L42j15m58J54Q3k03n6j58N18j82l6o4K06L8j21r1m8L04j9q6
1707I6k32K46L7Q9j51Lkl5k03K54m91N54j23r0j63J52P8j26N3k0J53k06J5L36
1731B24l41M42k13r99J053m51M70l42J39K38k85L96n63K74j15L35k3l13J27J17
1751A70j96M7q5J48Q6j17k05m6L22l65k5M6M22k42k19j35M83j79L54l14l93P68
1773C25Oo19K32l04O41l83j21K6P7L29k59j44J78K94j09j37j68K03P1q2r9J98
1795A55j02J69j21k83K30Q2j55j37j40K33K69k51p8J91j05L6j50J00R5L8k2L93
$$ plain form
1817 447 395 89 -136 -398 -204 -10 -362 23 -430 -237 -121 13 -321 -3 -21 248 188 86 204 203 63 127
1839 127 -194 -302 411 -492 -193 -33 -238 116 -327 -307 -151 -11 31 -20 -130 -91 472 85 -118 436 727
1860 727 173 -192 227 345 -32 -166 -46 -439 -395 -23 -264 -210 -37 103 -227 -91 -359 216 145 55 -33 -121
1882 -121 354 -100 247 208 -8 -73 -254 148 2 -79 -146 -312 -315 -42 498 -169 -255 34 226 -401 1 -526
1904 -526 463 3 174 -336 385 -205 -18 -369 -418 -568 110 410 -343 -153 119 42 -736 318 113 553
1924 553 22 119 137 195 76 213 249 19 -357 248 -326 -524 75 74 -219 -100 -41 44 149 -63 -22 119 48
1947 48 275 -443 -87 -159 88 100 -327 85 55 -39 -654 -45 -5 19 200 -237 120 231 108 -207 -101 91
1969 91 -90 -53 76 121 -26 7 -158 -200 81 126 -67 -86 172 -95 48 140 -144 176 340 -270 -440 174 277
$$ packed form
1817D47n2l06k25k62J94J94l52L85m53J93J16J34l34L18j8K69o0j02J18jj40O4
1839A27l21j08P13r03K99J60k05L54m43K0J56J40M2n1j10L9N63l87k03N54K91
1860G27n54l65M19J18l77j34J20l93M4L72k41N4J73J40l30J36k68N75p1r0q8q8
1882a21M75m54L47l9k16o5j81M02j46q1o7j66lK73N40o67q6K89J92o27M02n27
1904e26R89m60J71n10P21n90J87l51m9j50O78L00p53J90K72p7p78J054k05M40
1924E53n31R7J8N8j19J37L6k30l76O05n74j98N99jk93J19N9Q5J05k12M1J41p1
1947D8K27p18L56p2K47J2m27M12l0r4o15O09M0K4J81m37L57J11j23l15J06J92
1969I1j81L7J29M5j47L3j65m2K81M5j93j9K58k67J43R2k84L20J64o10j70O14J03
$$ plain form
1992 277 372 245 115 -97 113 -407 313 -130 455 226 254 -134 87 455 614 -213 206 503 -104 -143 -300
2013 -300 223 207 87 -339 -270 -94 46 -350 -266 100 -16 -52 -58 211 49 356 76 -90 7 281 -19 -199
2035 -199 -275 181 -167 -170 25 -195 214 -165 44 -406 -81 91 25 -51 124 377 -195 21 -93 197 15 219
2057 219 -409 -126 157 87 -336 -258 160 -146 57 11 -126 -18 170 194 45 -106 183 63 84 -113 137 77
2079 77 -87 25 55 -56 229 -240 -221 257 60 -96 -193 -70 151 -96 35 355 -100 365 225 -218 3
2100 3 80 14 -110 -75 -64 211 -83 -36 -153 -118 245 114 -238 -59 258 58 -18 93 146 187 115 239 146 -24
2124 -24 -5 -65 -136 148 139 -138 -226 79 92 -46 -48 -9 -53 59 38 139 -14 231 20 -400 106 178 -143 -158 -62
2149 -62 -33 -30 39 -169 -36 -16 -71 92 -308 18 -79 124 87 -77 177 162 -2 -64 -302 55 -40 -95 -304 140
$$ packed form
1992B77R5j27j30k12K10n20P20m43N85k29K8l88K21L68J59q27M19K97o07l9j57
2013c00N23j6j20m26O9J76J40l96Q4L66j16l6oK69j62L07k80j66R7K74l00j80
2035a99p6M56l48lJ95k20M09l79K09m50L25J72o6p6J75K53n72K16j14K90j82K04
2057B19o28K83K83p0m23P8M18l06K03m6j37J08J88K4j49j51K89j20K1j97K50o0
2079G7j64J12L0j11K85m69J9M78j97j56r7J23K21k47J31L20m55M65j40m43K21
2100CP7o6j24L5J1K75k94M7j17L5L63j31l52J79L17k00p6J11N3M1p2J24r3j70
2124b4J9o0p1K84rk77q8L05J3j38kL9m4J12k1J01j53K45k11m20N06P2l21j5R6
2149f2K9LO9k08J33K0n5J63m00L26r7K03l7j64K54j5j64o2k38L57r5n5k09M44
$$ plain form
2173 140 69 91 167 -74 141 209 -166 -45 108 105 102 -128 -148 101 171 -15 -123 -71 117 256 -145 -104 -96 130 36
2198 36 -114 -34 37 -4 -12 45 -55 69 199 78 41 4 -66 -28 -169 37 -50 16 84 -40 -226 20 -111 76 15
2223 15 64 -5 -52 56 226 259 208 10 -5 31 65 -142 -59 -197 225 14 -103 28 181 -86 -195 -107 33 117
2247 117 4 -95 -106 246 165 -92 87 -69 315 92 -186 171 -7 -20 -71 57 31 95 29 154 -35 155 86
2270 86 -33 -77 -82 86 114 131 -111 48 78 -34 -104 -208 140 -39 23 86 23 69 -45 105 9 109 48 -2 -43
2295 -43 -28 -163 -133 -80 154 57 21 7 -117 -105 132 87 115 134 51 -324 -39 -115 -162 -53 -34 -89 -90 46 18 -203
2321 -203 -158 201 -38 -29 72 -123 -103 163 179 -61 91 45 152 -237 2 78 -148 72 139 -112 -26 93 -33
2344 -33 -49 -188 8 99 187 31 -24 -127 -96 -48 7 -135 -18 -103 176 141 -82 -180 -9 33 106 -63 133 12
$$ packed form
2173A40p1K2P6k41K15O8l75J21J53llk30k0K49P0j86j08N2J88J39m01M1QK26r4
2198C6j50Q0P1m1qN7j00J24J30j21l7l7p0L8j41K06q7O6O8j24j86K46j31J87o1
2223A5M9o9m7J08J70L3n1j98j5L6L4k07Q3j38M22k11j17J31J53k67j09Q8J40Q4
2247A17j13r9j1L52q1k57J79j56L84k23k78L57j78j3n1J28k6O4o6J25j89J90o9
2270H6j19m4nJ68K8J7k42J59L0j12p0j04L48j79O2O3o3M6j14J50r6J00o1n0m1
2295d3J5j35L0N3K34r7l6j4j24J2K37m5K8J9q3l75K85p6m7J09J9n5jJ36k8k21
2321b03M5L59k39RJ01j95K0K66J6k40J52m6J07l89K39P6k26K20O7k51Q6J19j26
2344c3j6j39J96R1Q8j56n5j03L1M8N5j42J17q5K79l5k23r8J71M2P3j69J96j21
$$ plain form
2368 12 22 151 27 81 -220 169 54 105 -54 -150 15 147 -4 -186 -266 -54 134 -109 116 -62 50 10
2390 10 1 -150 -10 0 8 -146 72 -45 -67 49 -100 -114 -20 57 -49 129 40 64 -67 1 -246 49 90 129 112
2415 112 -67 74 -1 -123 27 -46 -80 -39 131 106 -42 147 186 -24 -66 165 121 -48 122 34 -222 20 -77
2438 -77 -174 95 30 9 -113 -44 27 -25 -96 -299 -92 -45 -108 -3 -180 -157 86 203 17 9 97 -10 -9 77 -30 -58
2464 -58 -211 36 -111 -4 -171 -7 105 -12 133 -69 -163 117 88 225 -23 -29 -48 11 42 -183 -93 -119 -46 109
2488 109 -51 -102 -218 133 24 77 150 -125 21 46 -71 153 -7 -23 238 145 163 -117 155 -52 118 -184
2510 -184 68 65 272 -191 22 -73 3 -174 63 151 -40 -73 188 -101 -93 52 -47 9 68 -18 -181 -61 -69 30 34 -172
2536 -172 62 -151 175 227 8 136 111 -47 -6 -6 -49 132 -105 281 157 -120 -172 189 -100 -27 73 -25 36
$$ packed form
2368A2J0J29j24N4l01L89j15N1j59r6J65J32j51j82q0K12J88k43K25j78J12m0
2390A0rj51J40J0Qj54K18j17k2J16j49j4R4P7j06J78q9K4j31O8k47K95M1L9j7
2415A12j79J41p5j22J50p3l4M1J70k5j48J89L9k10m2K31m4j69J70q8k56K42r7
2438g7r7K69o5k1j22O9P1n2p1k03K07M7o3J05j77K3K43J17j86qQ8j07JQ6j07k8
2464e8j53K47j47J07j67J64J12j17J45k02r4K80k9J37k48oj9N9L1k25R0k6P3J55
2488A09j60n1j16L51j09N3P3k75J46K5j17K24j60j6K61r3J8k80K72k07J70l02
2510a84K52lK07m63K13r5P6j77K37Q8j91l3K61k89QJ45r9N6N9q6j63J20qR9Mk06
2536a72K34k13L26N2k19J28k5j58M1%m3J81k37L86j24k77n2L61k89P3J00r8O1
$$ plain form
2559 36 -130 92 -36 -206 -140 -131 -91 97 119 -129 -28 19 -82 -43 -142 84 75 -12 45 -134 -148 50 -47 9 50 -154
2585 -154 -86 -48 85 -83 53 50 130 -273 -6 50 -34 96 94 65 -71 -20 -20 -4 -104 91 -30 97 77 -88 -44
2610 -44 -42 182 -134 -59 122 227 -100 -3 -49 -8 59 -18 -59 66 112 85 76 142 193 88 189 -24 -153 158 26
2635 26 -39 -7 -17 -14 -89 12 -58 -71 -130 -16 20 115 102 -51 84 -33 -67 -69 65 -7 -71 14 0 144 33 -93 -124
2662 -124 103 -145 248 200 -176 10 2 -53 44 -118 -36 42 -96 35 14 135 145 -43 33 -240 -43 -138 146 -134
2686 -134 145 172 45 148 47 -131 -261 -74 -154 98 85 -105 -21 194 62 -8 0 159 -97 83 50 209 -108
2709 -108 76 19 92 72 -247 -163 -65 -97 -78 -64 1 39 140 66 -40 -82 -204 175 -10 128 -62 109 10 96 149
2734 149 11 -18 -89 117 -100 -162 -60 -87 -95 15 -29 147 36 64 201 -145 -123 -179 60 -66 13 -240 205 -8
$$ packed form
2559C6j66K22j28j70O6RM0J88K2k48J01M7j01L9r9K26rq7N7j79j4J98r7N6M1k04
2585a54O8L8J33j68J36lQ0m03K67N6q4J30kk9j36N1%J6j00J95j21J27k0j65M4
2610d4KK24l16P5J81J05l27R7m6M1O7p7m1J25M6k7rO6N1j05J01k13j29L11j32
2635B6o5L2j0Lp5J01p0j3n9J14L6R5j3j53J35j17l4kJ34p2o4Q5j4J44j11j26l1
2662a24K27k48L93m8l76J86qn5R7j62Q2P8j38J31k1J21J0j88P6k73J97r5K84k80
2686a34K79K7j27J03j01j78j30J87q0K52j3j90Q4K15j32p0QJ59k56J80l3J59l17
2709a08J84n7P3k0l19Q4R8l2J9J4O5L8J01p4j06m2j22L79j85J38j90J71r9Q6N3
2734A49j38k9p1K06k17o2J02k7qJ10m4J76j11K8J37l46K2n6K39j26P9k53M45k13
$$ plain form
2758 -8 82 31 -165 99 -185 -107 -65 13 -99 36 176 -111 -131 157 142 25 -92 78 -109 -30 46 -81 75 175
2782 175 93 -83 2 -88 12 -312 -127 94 -24 14 -13 -287 -125 -142 -14 -27 -38 23 40 195 -129 34 -107
2805 -107 118 140 -70 -130 132 -59 -56 -38 36 23 -114 -143 -22 27 68 130 -135 -77 162 31 65 133 28 24 129
2830 129 74 128 44 -72 29 -6 -215 167 -75 -142 -143 -2 -224 -30 111 -75 -18 191 24 -57 86 41 -29 13
2854 13 269 -139 -76 -117 40 42 -68 234 -47 -148 50 -94 173 -22 -116 54 -191 119 97 -43 -1 16 70
2877 70 -64 -95 -79 47 -216 2 40 -91 -127 -182 154 -189 30 -103 0 59 -22 -41 -211 100 165 5 -39 -49
2901 -49 34 75 -118 -62 -105 203 89 -72 81 -133 -125 -96 127 -98 -123 99 -74 57 26 -82 44 37 5 187
2925 187 298 7 163 -36 86 0 139 56 28 -115 113 -58 -107 205 34 115 -54 53 -178 -69 28 25 43
$$ packed form
2758hR0n1j96K64k84P8M2P8j12J35J40k87k0K88j5j17j17J70j87P9P6j27J56J00
2782A75q2j76Q5r0J00l24J85K21j18L8k7k74J62j7J28j3j1O1J7J55l24J63j41
2805a07K25K2k10o0K62j91LJ8P4j3j37k9J21M9M1O2k65N8K39j31L4O8j05mJ05
2830A29n5N4q4j16J01l5k09L82k42o7jJ41k22J94J41j86N7K09j67q1J43m5p0M2
2854A3K56m08O3m1J57Kj10L02k81j01J98j44K67j95r4J70k45L10k2j40M2J7N4
2877G0j34l1J6J26k63K18L8j31l6n5L36l43K19j33J03N9q1j9j70L11O5j60m4j0
2901d9Q3M1j93N6m3L08j14j61J53k14QK9K23k25k5K22j73J31l1j08J26pl2J82
2925A87J11k91J56j99J22q6J39q3k8j43K28j71m9L12j71Q1j69J07k31J09R7lJ8
$$ plain form
2948 43 -168 -223 -73 -5 -121 -126 42 -49 -48 -103 96 -102 134 51 121 -6 29 17 -74 -53 77 18 26 57 -104 -125 -141
2975 -141 97 16 12 23 147 -226 117 25 193 -89 -75 173 -55 -43 258 -19 -108 -100 -44 -26 141 -27 208 35
2999 35 139 -13 180 42 166 -53 -121 75 -44 -114 -159 38 -52 -14 222 -181 -241 26 127 -95 -40 -245 101
3022 101 7 151 164 -80 92 -44 188 -98 14 -76 98 -3 -39 129 -34 77 -83 -61 -163 -209 210 32
3044 32 -42 -136 102 11 26 74 -57 -14 24 28 2 -155 58 -62 -16 -65 -109 -35 -31 -29 -87 113 155 59 51 113 -14 -181
3072 -181 11 -30 139 19 -67 -104 120 -2 247 93 -194 88 15 -177 -24 98 61 -5 135 137 2 -32 -1
3095 -1 180 248 67 -44 -31 -39 -72 145 107 111 0 365 -112 -53 -157 -70 -48 104 117 127 56 -120 110 -7 -61 -56
3121 -56 -112 37 -23 -70 -42 -97 -8 152 -219 -44 7 -79 114 27 -148 -253 -23 -29 63 -172 -31 -16 -63 16 -64 105
$$ packed form
2948D3k11n5J50O8j16nJ68r1Jn5J99j98K36q3P0j27L5j2r1K1J30n9QL1j61k1j6
2975a41K38q1mJ1J24l73L43r2J68k82J4K48k28J2L01k77q9QN6J8J67j68K35j73
2999C5J04j52J93j38J24k19o8J96j19p0m5J97r0L8K36m03o0K67J01k22N5k05L46
3022A01r4J44J3k44J72j36K32k86J12r0J74j01l6J68j63J11j60K2j02m6M19j78
3044C2p4r4K38r1J5M8j31M3L8Mk6j57K13j20M6m9m4P4MKn8K00M2r6qO2j27j67
3072a81J92m1J69j20q6l7K24j22K49j54k87K82p3j92J53J22l7o6J40Kj35l4L1
3095aJ81O8j81j11J3ql3K17l8Mj11L65m77N9j04Q7K2J52J3J0p1j76K30j17n4N
3121e6n6J49o0m7K8n5Q9J60l71J75N1q6J93q7j75j05K30oR2k35J41J5m7P9q0J69
$$ plain form
3147 105 -84 66 18 -12 -55 -74 11 -27 107 -135 -83 147 -86 -82 38 -106 72 101 65 -6 82 -20 -118 16 -36
3172 -36 168 46 -10 -40 -162 -117 -69 -123 -160 18 211 -7 -189 78 -3 48 136 59 155 70 -150 -110 -54 -53 0 158
3198 158 -100 30 228 -26 106 220 24 -58 48 -89 -59 145 19 76 -2 -75 -38 -166 -144 66 139 -101 15
3221 15 113 -1 189 -43 -83 2 10 65 133 33 16 -87 119 -124 -135 123 17 -29 59 83 -112 -12 -20 28 -111
3246 -111 73 -96 -86 -124 -130 -58 57 62 40 -64 -57 221 135 68 187 116 3 229 27 44 1 158 92 -118 -42 -37
3272 -37 64 -24 -1 67 60 -78 -22 52 154 -54 114 258 -30 34 -92 82 -31 -48 -57 -87 -103 71 -101 118 21
3297 21 -152 195 -92 -209 121 -67 82 -232 103 94 13 -46 -83 -65 -60 -161 -75 42 -94 -86 93 -84 -1 -98 92
3322 92 -9 28 15 -82 -175 -129 66 -114 27 43 -69 36 -56 -114 -162 -20 148 -110 -106 37 21 -133 -18 -12 61
$$ packed form
3147A05j89J50m8l0m3j9Q5l8J34k42N2K30k33MJ20j44J78K9l6p1Q8j02r8J34n2
3172c6K04j22n6l0j22M5M8n4l7J78J93k18j82K67q1N1Q8p7R6q5k20M0N6JN3J58
3198A58k58J30J98k54J32J14j96q2J06j37L0K04j26N7p8p3L7j28K2K10P3k40J16
3221A5R8j14J90k32m0Q5QN5O8j00j7j03K06k43j1K58j06m6Q8K4j95J00qM8j39
3246a11J84j69J0l8oP2J15Nk2j04PK78q6o7J19p1j13K26k02J7m3J57o6k10P6N
3272c7J01q8K3O8pj38N6P4J02k08J68J44k88O4j26J74j13j7rl0j6J74j72K19r7
3297B1j73L47k87j17L30j88J49l14L35rq1n9l7J8Nj01Q6J17j36QJ79j77Q3r7J90
3322I2j01L7j3r7r3M6J95j80J41J6j12J05r2n8m8J42J68k58MJ43j6j54J15OP3
$$ plain form
3347 61 37 66 66 89 218 -106 180 -84 86 -80 -93 55 73 62 -17 202 -156 42 -44 -48 -142 -98 35 103 -70
3372 -70 -39 121 84 13 -18 12 21 114 55 -131 122 123 -32 -128 25 -140 183 107 -125 26 31 65 -108 98 173 73
3398 73 -50 -168 -101 -129 44 302 80 -112 30 61 -2 11 -84 -138 -7 27 -102 -112 10 44 -79 -4 -11 -116 -212
3423 -212 -22 -103 8 2 121 80 -126 18 -120 -198 -56 168 3 128 182 -25 -41 -12 -29 -158 140 101 16 0
3447 0 -47 -289 -90 134 -38 -75 -58 -63 -58 120 89 -186 105 42 52 -34 -28 -53 -42 -36 -25 81 -41 216 -107 5 -56
3474 -56 -25 112 -215 -238 27 276 6 -132 -33 114 -57 -111 8 -101 -164 -6 -3 63 33 40 -67 -50 270 121
3498 121 -28 -220 -48 184 -60 54 19 73 -69 126 80 -99 -39 125 -14 26 203 -68 -130 20 27 -24 -213
3521 -213 102 -25 -116 -75 -35 42 -144 19 -101 66 -57 99 36 -33 148 -30 197 -54 239 -132 43 -91
$$ packed form
3347F1k4K9%K3J29l24K86k64J70j66j3J48J8j1p9K19l58J98q6mr4M4J33O8j73
3372g0L1J60l7p1l1L0RR3n9j86K53Jj55r6J53j65L23p6k32J51NL4j73K06P5j00
3398G3j23j18O7k8J73K58k22j92J42L1o3J3r5n4J31L4j29j0J22L4j23P5pj05r6
3423b12J90q1J11oJ19m1k06J44j38p8J42K24j65J25N4k07j6K9j7j29K98l9q5j6
3447@m7k42J99K24j72l7J7nNJ78l1k75K91o3J0q6Ok5J1OJ1J06j22K57l23J12o1
3474e6L1J37l27k3K65K49k70j38R9J47j71n4J19j09o3J58LO6l0Pj07J7L20j49
3498A21j49j92J72K32k44J14l5N4j42J95m6j79O0J64j39M0J77k71o2J50Pn1j89
3521b13L15j27r1M1M0P7j86J63j20J67j23J56o3o9J81j78K27k51K93l71J75j34
$$ plain form
3543 -91 -165 -256 -124 -86 -35 33 14 -2 -46 9 -102 -66 -32 166 35 62 79 151 15 -140 -142 56 28 149 14 109
3569 109 -188 83 5 -150 -143 -54 17 64 130 92 -50 25 -24 118 0 -9 -66 -206 13 -14 -171 -100 -77 84 -84
3594 -84 190 61 -108 231 -101 -50 41 -42 -85 6 168 78 -177 102 -46 220 252 -195 -151 -47 -23 -52 -107 -46
3618 -46 116 -57 58 -67 -64 -129 166 -2 -15 -114 -40 1 200 42 -257 -187 -51 48 129 -29 -93 231 13 -2
3642 -2 -155 -16 -46 60 -132 67 -39 25 52 -135 76 -35 -146 -183 51 -37 -103 143 -82 195 -140 7 101
3665 101 -188 -178 -85 87 56 -149 -34 205 -64 -10 -46 -70 107 53 350 183 176 100 31 73 -114 -66 -51 -104 140
3690 140 33 87 13 -29 32 -128 136 21 15 -19 19 -8 -34 -157 -105 -21 84 90 -99 -10 -29 -104 -74 -58 -50 -149 -112 -19
3718 -19 23 -57 -74 -110 -3 212 80 -52 -10 122 55 -23 -122 3 -57 5 34 95 189 81 -162 -51 146 12 -60
$$ packed form
3543i1p4r1J32L8N1O8j9j6m4N5j11L6L4J98j31K7J7P2j36j55kJ98k8J21j35R5
3569A09k97K71p8j55PQ9P1M7O6l8j42P5m9J42j18rn7j40K19k7j57P1K3J61j68
3594h4K74j29j69L39l32N1R1q3m3R1J62r0k55K79j48K66L2m47M4J04K4k9n5O1
3618d6J62j73J15j25Lo5K95j68j3r9P4M1J99j58k99P0J36R9Q1j58o4L24k18j5
3642bj53J39l0J06j92J99j06O4K7j87K11j11j11l7K34q8o6K46k25K77l35J47R4
3665A01k89J0R3J72l1k05J15K39k69N4l6k4J77n4K97j67pp6o9M2j87M8J5n3K44
3690A40j07N4p4m2O1j60K64j15ol4L8k7k6j23N2Q4J05Oj89Q9j9p5L0J6Qr9L7R3
3718a9M2q0j7l6J07K15j32j32M2J32o7p8r9J25o0O2K9O1R4j08k43J11J97j34p2
$$ plain form
3743 -60 -33 -200 118 -38 187 40 -64 -178 -2 90 48 -66 -131 -242 5 4 79 55 -18 -101 127 148 -206 -66
3767 -66 -274 -86 -3 68 80 37 -38 31 50 -18 -210 -41 59 -168 118 -195 -11 17 339 198 -27 26 -32 108
3791 108 69 68 -81 -140 -47 72 123 156 167 -18 -46 104 11 23 0 57 178 -178 5 119 406 -6 -151 159
3815 159 0 101 45 -51 -51 -13 61 -119 142 -172 -188 -37 -141 -156 76 125 -94 -25 143 -6 -70 67 -1 -134
3839 -134 78 -48 -237 -12 22 41 149 209 -22 -102 176 80 71 -28 20 217 -88 -120 95 58 93 -155 53 4
3863 4 -35 159 101 -24 123 -120 -63 268 19 -105 227 122 -258 114 -164 -33 -15 -31 15 72 37 -173 -33
3886 -33 -52 227 54 -88 81 12 53 -72 99 61 -5 -206 101 146 7 -141 -106 74 378 127 273 -7 97
3909 97 -335 10 -26 -61 -79 -1 64 -84 7 181 -8 -63 -18 29 -162 24 -99 -177 -152 -95 -8 22 11 38 -77 -91
$$ packed form
3743f0K7j67L18j56K25j47j04j14J76R2m2j14o5j11K47jP5k4p3q3K28K1l54J40
3767f6k08J88Q3P1J2m3p5O9J9o8j92J69J00k27K86l13J84K8L22j41k25N3n8J40
3791A08l9jj49n9R3J19N1L3J1j85k8J50r3J2k3N7J21l56J83J14K87m12j45L10
3815A59j59J01n6r6%L8P4j80K61l14j6J51j04j5K32M9k19O9J68j49o4J37o8j33
3839a34K12j26j89K25L4J9J08O0k31q0K78r6rr9M8J97l05l2K15l7L5k48K08m9
3863Dl9J94n8j25J47k43N7L31k49j24L32j05l80L72k78J31J8j6M6N7l5k10J40
3886c3j9K79j73j42J69o9M1j25J71l8o6k01L07M5j39j48L5J80L04k51J46k80J04
3909I7m32L45l6l5j8P8O5j48R1J74j89n5M5M7j91J86j23p8K5N7Q7L0j1K7j15j4
$$ plain form
3935 -91 7 101 -259 -15 126 197 -99 -78 -67 -83 -32 -127 87 37 115 146 31 196 -135 -27 20 -41 -149 103 97
3960 97 -65 70 142 40 59 -43 -165 -87 -136 -77 50 -55 96 53 171 3 -53 116 -71 63 -48 18 -48
3983 -48 162 -260 -279 54 145 145 -251 -108 -166 -81 -219 45 -16 118 -60 34 -15 -205 122 12 -142 236 135
4006 135 -17 9 -92 -102 -99 35 -73 172 -127 164 57 136 14 55 63 140 115 139 -36 7 -153 -105 53 -22 103
4031 103 -56 -52 -187 -8 -25 34 168 108 -58 -74 -43 -48 8 -140 12 -151 128 0 -45 59 114 -108 316 -16
4055 -16 -158 163 56 -47 -98 132 77 105 -136 139 -100 -106 28 215 210 -74 -177 -27 178 92 -13 -125 9
4078 9 17 -49 -51 30 153 -163 44 112 -44 25 -2 33 -104 -60 183 -119 -80 13 -23 188 5 86 -22 -211 -154 27
4104 27 179 -116 4 -274 -151 128 -1 51 122 -146 -51 48 -145 9 60 -123 41 -204 42 -178 17 -38
$$ packed form
3935i1R8R4l60K44J41P1k96K1J1j6N1r5K14n0P8L1j15J65l31J08M7o1j08K52o
3960I7j62J35P2j02J9j02j22P8m9N9J27j05J51m3J18j68n6J69j87J34j11O6o6
3983d8K10m22j9L33R1%l96J43n8Q5j38K64o1J34j78R4m9j90L27j10j54L78j01
4006A35j52K6j01j0LJ34j08K45k99K91j07P9j22M1QP7k5K4j75M3j60M8J58p5J25
4031A03j59Mj35J79j7N9J34o0j66j6L1nN6j48J52j63K79j28m5J04N5k22M24l32
4055a6j42L21j07j03n1K30n5K8k41K75k39oJ34J87nk84j03J50K05q6j05j12J34
4078IQo6kQ1J23l16K07O8j56O9k7L5j37M4K43l02L9R3l6K11j83Q1j08j89N7J81
4104B7J52k95J20k78J23K79j29N2P1k68R5R9j93J54N1j83J64k45K46k20J95n5
$$ plain form
4126 -38 -130 -74 137 87 -70 34 -83 -148 -24 -148 159 79 78 122 -79 -24 101 -63 -19 64 -132 -112 41 -12 181
4151 181 -4 -25 61 -28 61 -57 127 -1 -107 156 -92 7 140 12 -140 28 41 -167 29 -240 -125 192
4173 192 -18 165 162 47 -67 70 -139 -26 -67 51 -84 112 178 104 87 16 -240 80 125 -169 102 -199 114
4196 114 48 -2 76 5 -21 62 -62 292 38 -237 76 136 96 255 -63 -50 9 56 -126 -37 -69 -61 48 -46 80
4221 80 -174 -44 233 175 51 52 30 238 -5 -161 -74 -9 18 117 99 107 131 125 31 -56 -18 62 283 46 97 -46 -61
4248 -61 -149 76 -155 -95 157 -31 -35 25 106 -137 23 -45 35 135 47 67 -125 -20 -138 27 26 85 135 100 11 -13
4274 -13 145 -88 -59 129 -96 -63 36 -196 85 -45 132 28 -74 -211 -69 -52 -100 -32 -56 -119 21 -225 -139
4297 -139 87 -67 169 -26 -35 -159 -89 -37 -16 -67 -23 -136 -65 -32 -89 -5 -133 -43 24 -88 -78 57 -40 149 57
$$ packed form
4126c8r2N6K11n0j57J04j17o5J24j24L07q0jM4k01N5J25j64M4Q3j96K0J53n3J93
4151A81j85k1Q6q9Q9j18J84j28j06K63k48R9J33j28j52J68J3k08J96k69J15L17
4173A92k10J83lj15j14J37k09J13m1J18j35J96O6p4j7p1k56L20M5k94K71l01L13
4196A14o6n0P8p1k6Q3j24L54k54k75L13O0m0J59l18J3N9M7j82Q9l2QJ09r4J26
4221H0k54J30K77n8j24Jk2K08k43j56Q7O5K7R9j8QK4or4q7L8Q0K21k37N1j43j5
4248f1q8K25k31O0K52j88mO0Q1k43J60o8Q0J00q8K0j92J05j18J65jN9N0l5q9k4
4274a3J58k33K9J88k25L3R9k32K81j30J77j04j02j37J42J7m8O8k4o3J40k46Q6
4297a39K26j54K36j95rj24P0N2K1n1M4j13P1L3n7Q4j28R0O7j12J0J35r7J89r2
$$ plain form
4322 57 -99 100 60 142 129 123 -62 -141 -15 72 118 121 4 38 23 -85 -129 77 160 -140 39 -9 -35 -60 31 -231
4348 -231 -1 19 118 56 9 150 62 -19 -95 -151 225 -37 21 -7 -37 -190 -28 237 20 220 177 -137 -78 104
4372 104 121 -182 -104 44 117 -93 -84 71 63 142 -44 -147 -111 24 39 -183 -122 -158 -99 129 103 288 4 186 -148
4397 -148 -161 -45 -22 16 -7 24 106 -86 8 175 -50 83 -12 205 38 180 -270 8 -44 102 -54 32 25 -83
4421 -83 40 -146 150 143 -97 -154 -166 -62 128 -61 -54 -43 124 -5 -83 -83 -256 -94 130 -125 60 0 -58 269
4445 269 140 190 63 -73 92 -117 -96 38 -36 -35 38 -101 -34 10 74 157 -11 -180 10 -28 -119 -4 -198 166
4469 166 -164 63 -194 53 -17 -107 -122 131 40 -36 -3 9 88 3 177 -196 -116 -9 -59 -52 92 -107 -81 -146 51
4494 51 -130 131 138 -140 45 129 132 134 9 -157 179 0 -98 -239 -41 -10 -94 -68 -156 -54 -7 108 221 -52 -88
$$ packed form
4322E7j56J99m0Q2j3oj85p9J26Q7M6Lj17L4j5j08m4K06Q3l00J79m8k6k5R1k62
4348b31K30K0R9o2m7J41q8q1p6n6L76k62N8k8l0j53J62K65k17K00m3l14N9J82
4372A04J7l03P8J48P3k10RJ55qP9j86j03L6J35J5k22O1l6N9K28k6J85k84J82l34
4397a48j3J16K3L8k3L1Q2j92R4J67k25J33r5K17j67J42m50K78n2J46j56Q6pj08
4421h3J23j86K96pk40n7j2J04J90j89PJ1J67j29p8%j73J62K24k55J85o0n8L27
4445B69j29N0j27j36J65k09K1J34p4JP3j39O7M4O4Q3j68j69J90l8r1J15j94L64
4469A66l30K27k57K47p0r0j5K53r1p6L3J2P9q5J74l73Q0J07n0PJ44j99K6o5J97
4494E1j81K61Pk78J85Q4LKj25j66L36j79r8j41J98L1q4K6q8J02M7J15J13k73l6
$$ plain form
4519 -88 -99 -34 -81 4 -120 -183 -167 16 -283 66 -189 165 -34 -34 120 -183 -172 42 10 67 -181 24 42 -34 -81
4544 -81 57 127 -108 -101 -128 -159 1 16 -36 -183 -39 8 44 -75 -82 -104 -267 24 121 68 44 64 -159 -10 193 -31
4570 -31 -239 73 61 -6 39 29 102 200 48 -31 -150 -99 0 50 -17 -83 57 -62 -78 -43 -63 -89 -20 -131 -210 115
4596 115 -28 210 -163 -167 -52 -92 -95 58 -253 -239 -134 117 -199 -61 -97 187 190 86 122 129 -65 -131 -102 364 298
4621 298 160 903 360 266 192 131 -7 -315 -373 170 70 19 -197 -117 15 108 -85 36 -89 132 72 36 -60
4644 -60 90 28 -116 68 -73 -100 -141 -14 -102 -24 100 165 -64 503 279 -56 162 394 189 -243 -67 1 -128
4667 -128 623 107 -87 262 -117 212 -11 91 498 -295 -191 905 54 317 58 103 334 494 372 -141
4687 -141 155 337 -424 176 622 -11 -218 -474 56 580 164 -35 251 -207 -267 -345 265 -184 181 198 -83
$$ packed form
4519h8j1O5m7Q5j24o3J6J83k99L49k55L54j99%J54l03J1K14l2N7k48K05J8p6m7
4544h1J38P0k35Pk7l1J60J5n2j47J44M7L6j19pk2j63K91R7n3k4K0k23J49K03k24
4570c1k08L12j2o7M5j0P3R8j52p9j19N1R9N0o7o6J40j19j6L5k0k6O9j11p9L25
4596A15j43K38l73mJ15m0lJ53l11J4J05K51l16J38l6K84Lj04L6Pj94o6K9M66o6
4621B98j38P43n43r4p4o1j38l08n8N43j00n1k16Q0J32R3j93J21j25K21o0l6r6
4644f0J50o2j44J84j41k7m1J27q8P8J24O5k29N67k24l35K18K32k05m32J76O8j29
4667a28P51n16j94L49l79L29k23J02M07p93J04J096q51K63k59M5K31J60j22n13
4687a41K96J82p61O00M46o33k07k56N30N24m16j99K86m58o0p8O10m49L65J7k81
$$ plain form
4708 -83 -602 317 62 112 49 -31 -208 184 258 -39 74 -88 41 -214 280 -171 -127 418 -257 180 215 569
4730 569 449 144 -63 70 -46 -339 370 226 -282 78 -485 -447 358 -153 -140 48 -33 -155 -90 -380 276
4751 276 -373 330 -338 -275 427 -315 -7 -152 85 -317 64 -337 -378 -184 271 70 60 257 96 460 486
4772 486 478 -4 -96 7 -118 -293 -287 77 166 -18 -358 -177 -119 273 -165 174 26 240 -9 -41 155 126 35
4795 35 115 388 468 -314 -297 -113 306 -117 -455 44 46 467 272 -675 173 79 169 202 85 -80 -194 168 570
4818 570 -116 372 -420 -309 20 -265 460 -330 -153 -24 550 37 -95 248 456 -114 103 412 -60 431
4838 431 17 -86 118 588 212 -679 -599 -724 -305 -248 -194 -53 -361 -340 140 598 -217 174 68 575 503 350
4860 350 527 -268 -62 -361 231 -81 -86 92 372 100 382 196 -211 -36 358 -473 -47 488 -46 217 252
$$ packed form
4708h3n19R19k55N0o3q0j77L92P4k97J13j62J29k55M94m51M4N45o75M37L5L54
4730E69j20l05k07J33j16k93P09j44n08L60n63L8Q05n11J3J88q1j22O5k90O56
4751B76o49P03o68O3P02p42L08j45K37m02L81m01m1J94M55k01j0J97j61L64K6
4772D86qm82r2J03j25j75OL64Q9j84l40J81N8L92m38L39j48K14k49l2J96k9r1
4795C5Q0K73Q0p82J7J84M19m23l38M99KM21j95r47Q48r4R0L3j17j65j14L62M02
4818E70o86M88p92J11L29k85P25p90J77J29N74n13j32L43K08n70K17L09m72M91
4838D31m14j03K04M70l76q91Q0j25M19N7N4J41l08K1M80M58q15L91j06N07p2j53
4860C50J77p95K06k99N92l12nJ78K80k72K82j86m07J75L94q31M26N35n34K63L5
$$ plain form
4881 252 204 151 -150 169 12 54 -91 307 73 -254 -738 942 510 -719 -134 212 -236 287 73 18 -72
4902 -72 -52 -191 167 191 89 -42 205 102 -105 176 -53 -57 15 91 208 51 193 5 10 -196 -65 49 17
4925 17 1 94 -96 83 61 139 -60 198 -154 69 -83 -185 181 -144 -133 99 -46 50 8 -14 104 -73 -7
4948 -7 87 24 -77 -43 -190 66 -132 -63 -47 173 -152 -15 83 -112 -57 118 35 82 -64 28 22 -114 -57 127 -53
4973 -53 -53 28 62 -26 145 -83 47 -38 84 121 -5 -129 164 102 58 89 -72 56 -112 -20 -163 -20 82 -3
4997 -3 -44 52 132 68 -77 45 -65 150 10 82 81 40 109 251 -4 172 67 -37 -44 88 -65 -13 255 64 -66
5022 -66 -2 -64 -26 51 75 -144 -121 -130 162 74 31 -13 13 96 18 -8 -138 -51 37 220 -36 -110 103 137 -163 -10 -11
5049 -11 112 -172 37 199 -205 -15 -268 -15 47 -40 -80 9 1 -65 184 -61 -94 -112 1 87 -147 118 240 -103
$$ packed form
4881B52m8n3l01L19j57M2j45L98k34l27m84J680m32j229N85L46m48N23k14n5r0
4902g2K0j39L58K4j02j31K47j03k07K81k29mP2P6J17j57J42j88Nk06J31J14l2
4925A7j6R3j90J79k2P8j99K58l52K23j52j02L66l25J1K32j45R6m2k2J18j77O6
4948gR4o3j01L4j47K56j98O9J6K20l25J37R8j95N5J75q3M7j46R2oj36N7J84j80
4973e3%Q1L4q8J71k28J30q5J22L7j26j24K93o2m4L1j61J28j68R2j43J43J02q5
4997cm1R6Q0o4j45J22j10K15j40P2jm1O9J42k55J76j05j04pJ32j53N2K68j91j30
5022f6O4o2L8P7K4k19K3rK92q8m3m4K6Q3p8k6j30Q7Q8J83k56p4K13L4l00J53j
5049a1J23k84K09J62m04J90k53K53O2q7m0Q9qo6K49k45l3j8J13Q6k34K65J22l43
$$ plain form
5073 -103 -113 -8 200 -27 49 18 42 -92 192 -116 -18 -50 18 156 -252 -178 99 -43 -115 198 -148 24 -11
5096 -11 -26 170 -34 -18 -127 -33 86 19 -150 -18 -128 -68 -35 58 49 11 105 -15 -56 278 -15 117 -59 -45 -39
5121 -39 15 -92 102 193 -31 136 270 -171 196 -8 39 397 67 -177 138 183 121 57 -241 85 50 47 63 97
5145 97 -55 62 -43 -113 -227 86 -130 18 83 27 13 38 112 197 -52 53 -21 -236 19 -25 -37 125 10 144
5169 144 0 -129 60 -109 409 -22 37 -88 0 -3 -47 -194 -256 -205 -74 27 -41 77 79 -23 16 -60 -239 97
5193 97 -171 -35 179 -34 102 -135 -54 -18 113 63 -158 -130 171 -37 54 89 -41 -72 -68 -57 156 22 28 25 -27
5218 -27 -33 -142 83 -101 -39 -138 -91 -126 242 16 57 64 -3 -16 -8 -163 -114 22 -141 -112 -131 -185 24 99 -70 129
5244 129 -28 86 -44 -76 119 -61 -110 -2 -93 13 44 -60 -137 -81 -61 -175 -93 -2 -166 -15 -205 -181 -60
$$ packed form
5073a03j0J05K08k27P6l1K4j34K84l08R8l2O8J38m08P4K77j42p2L13l46J72l5
5096a1j5J96k04J6j09R4J19o7j69J32j10O0L3R3rl8R4j20m1L34k93J32j76J4O
5121c9N4j07J94R1k24J67J34m41L67k04M7L58l30k44L15M5o2o4k98L26l5lJ6L4
5145I7j52J17j05p0j14L13k16J48O5n6j4K5P4Q5k49J05p4k15K55m4j2J62j15J34
5169A44j44j29J89j69N18m31N9j25Q8lm4j47o2N1J31J01o8J18Kj02L9p6j79L36
5193I7k68J36K14k13J36k37Q1L6J31n0k21K8L01k08R1L5j30l1MJ1K13j34Oln2
5218b7oj09K25j84O2r9M7l5L68k26M1Po7j3Qj55M9J36j63K9j9n4K09P5j69J99
5244A29j57J14j30l2J95j80m9J08r1J06L1j04p7N6K0j14Q2R1j64J51j90K4J21
$$ plain form
5267 -60 -123 -138 -56 187 59 34 189 -116 -113 -86 -171 216 -159 39 -31 -75 -36 36 -145 24 -143 27 -132 -59 29
5292 29 -43 156 -68 393 -122 27 -24 -53 -171 131 -168 70 -213 -70 152 -76 21 -12 26 -108 -47 -215 -67
5315 -67 -34 -67 -166 -61 -112 -68 -136 -106 83 -73 -85 -233 34 54 133 -367 68 -29 -280 19 16 47 -20 -29 -87 -167 107
5342 107 51 27 11 -57 -36 38 -102 0 118 -66 -26 106 -58 -27 146 138 -6 107 3 -119 115 -253 73
5365 73 -152 -87 61 -113 67 -199 -102 -100 164 183 -164 -10 -65 -206 -51 -4 53 45 7 84 0 75 97 136 -82 102
5391 102 -179 -76 135 142 15 52 70 -31 -25 -79 38 109 52 17 -242 70 -49 121 34 -96 60 -3 -39 -41 10
5416 10 111 -64 -186 -21 -18 -267 -149 -45 118 -211 527 181 -84 -107 59 -82 444 332 257 305 358 -96
5438 -96 110 14 -349 95 -246 0 -68 -159 -156 109 -75 -48 -83 -135 290 -102 27 -240 -11 -277 -333 -234 -220 201
$$ packed form
5267f0o3j5Q2K43j28k5J55l05LK7q5L87l75J98p0m4L9P2j81J69j67J70j59P3Q8
5292B9p2J99k24M61n15J49n1k9j18L02k99K38k83J43K22k28R7l3L8j34O1j68J48
5315f7L3l3r9J05n1M4o8L0J89j56j2j48K67K0P9n00M35r7k51K99lL1o7rn8q0K74
5342A07n6k4j6o8K1P4j40J02J18j84M0J32j64L1J73qj44J13j04j22K34l68L26
5365G3k25O5J48j74J80k66R7KK64J9l47J54n5j41J55M7N7ql8P7q4P5K2L9k18J84
5391A02k81J03K11Pj27L7J8j01On4J17P1n7l5k59L12j19J70q7j30J56o3l6kN1
5416A0J01j75j22J65Lk49J18J04J63l29P38l46k65k3J66j41N26j12p5M8N3m54
5438i6K06r6l63M44l41K46o8r1LK65j84K7l5n2M25l92J29k67K29k66n6R9J4M21
$$ plain form
5462 201 -90 -10 255 -53 29 -45 -58 -149 3 -108 69 -63 -14 -196 51 53 64 -185 -29 236 52 -104 17
5485 17 -146 96 -126 307 167 -37 -7 16 57 -207 30 68 -81 -30 -31 -39 136 -59 -91 40 -88 12 47 58
5509 58 50 77 -64 -9 52 28 161 -122 -52 5 -4 -76 -54 -17 71 233 -58 27 110 -113 179 -66 -100 -221 -31 -176
5535 -176 -98 -121 -278 -58 94 -175 265 -61 -81 256 -231 -290 129 -10 -102 -3 16 122 -1 -113 80 70 -12
5558 -12 -9 31 -24 -96 -5 166 110 -7 -131 -374 77 -129 30 116 -49 -96 67 -200 -230 42 -21 145 -36 156
5582 156 142 -112 3 83 -23 32 -67 29 -151 119 37 -85 -96 75 -50 9 91 -58 -113 103 -65 -79 100 134
5606 134 -37 39 -60 -50 73 -21 167 -104 11 42 -158 7 37 -22 -137 -106 -180 17 96 -22 -43 -130 18 40
5630 40 -185 112 -96 -29 -58 -31 -68 176 197 65 104 81 16 34 -65 -121 -156 304 80 -141 71 102 -41 -254 -39
$$ packed form
5462B01k91Q0K65l08Q2p4j3r1J52j11J77j32M9j82K47KJ1k49J56K65j84j56J21
5485A7j63K42k22M33j40k04L0K3M1k64K37L8j49N1jqJ75j95l2J31j28J00L5J1
5509E8qK7j41N5O1k4J33k83P0N7rp2K2L7Q8J62k91Q5Q3k23K92k45l4j21J90j45
5535a76P8k3j57K20J52k69M40l26k0L37m87n9M19j39r2R9J9J06j23j12J93j0q2
5558a2LM0n5p2R1J71n6j17j24k43M51k06J59Q6j65m7J63k67l0K72o3J66j81J92
5582A56j4k54J15Q0j06N5r9R6j80K70q2j22j1J71j25N9Q2j49n5K16j68j4J79L4
5606A34j71P6r9J0J23r4J88k71J15L1k00J65L0n9j15L1p4J97P9j18k1q7J48K2
5630D0k25K97k08O7k9K7l7K44K1j32L9k3o5J8r9n6l5M60k24k21K12L1j43k13K15
$$ plain form
5655 -39 -217 -186 98 6 -13 -131 98 124 46 71 82 24 97 20 -204 -146 -87 -25 -71 -72 90 41 37 85 -48 33 -27 138
5683 138 4 38 -77 -111 -3 -52 -104 -106 -40 -130 -149 -121 105 -5 -157 63 13 -47 115 -11 -59 74 231 -136
5707 -136 -43 -141 -219 1 79 -175 -125 -87 75 53 -20 89 -132 -203 -123 26 -57 47 134 31 -284 -127 -8 35
5731 35 -83 78 -29 19 -41 -182 -14 -2 -61 -96 -102 -92 95 4 -106 146 -210 11 62 145 -100 -158 173 -68
5755 -68 -91 -121 -175 -121 -21 13 -1 -31 -144 -134 -78 -111 -7 -81 111 -89 36 -4 152 -41 -11 162 -34 87 4
5780 4 21 100 -10 48 53 -37 59 10 -156 83 1 39 -205 -3 -50 89 -128 -123 179 139 50 7 90 100 -148 70 108
5807 108 -149 -167 -226 72 -62 60 -93 -136 -103 116 -203 112 59 184 208 -15 -69 -97 189 -25 -195 -77 25
5830 25 -150 -23 -293 49 -20 5 14 -265 47 -167 123 89 80 379 -166 100 -29 -149 -153 -95 -93 -170 122 92 -42
$$ packed form
5655c9j78L1K84r2j9j18K29K6p8K5J1n8P3p7k24N8N9O2m6jJ62m9mM8j33Q1o0J65
5683A38j34L4j15l4J08m9n2kO6r0j9K8K26j10j52K20n0o0J62j26m8J33J57l67
5707a36R3r8p8K20P8k54N0L8J62k2p3J09k21p1Q0J49q3J04Q7j03l15J57J19M3
5731C5j18J61j07M8o0j41J68J2n9l5oJ0J87r1j10K52l56K21N1Q3k45n8L31k41
5755f8k3l0n4N4J00L4j4l0j13J0N6l3J04p4J92k00J25m0J56j93L0J73j96J21q3
5780DJ7P9j10N8Nr0R6m9j66K39q2L8k44K02m7J39k17NL02m0q9m3Q3J0k48K18L8
5807A08k57j8n9K98j34J22j53m3L3K19l19L15n3J25K4k23n4k8K86k14j70J18J02
5830B5j75J27k70L42o9K5Rk79L12k14K90l4rK99n45K66j29j20mN8Kp7K92l0j34
$$ plain form
5855 -42 73 162 128 19 -171 -7 -5 -5 -113 124 -110 -147 -144 25 27 -26 -113 -92 -93 93 7 199 -107 -92 -35 32 -2
5882 -2 -211 -36 21 57 108 178 129 142 -112 -85 -69 72 165 0 -94 22 -60 124 103 -58 37 61 -111 -71 -77 -76 -38
5909 -38 -153 -236 34 -56 24 67 108 235 -35 -34 63 102 -131 21 93 14 -44 129 111 -36 47 -97 20 -263 -121
5934 -121 -69 -27 -56 153 -250 143 92 111 -14 -192 55 -177 -200 -40 29 67 71 -152 -163 192 145 14 -40 -26 55
5959 55 -138 -45 -191 54 21 -1 274 -75 -44 -354 10 -14 -106 123 -9 -101 77 69 -35 -71 -54 -58 61 4 64
5984 64 44 176 -15 -53 -23 -168 -86 -270 -44 244 -102 -36 67 -15 -89 -110 -144 62 117 192 -16 3 147 -1
6008 -1 -48 36 126 42 -20 -18 5 54 -143 -171 26 -20 -86 39 156 -110 -102 -49 -104 104 193 203 77 -73 115 36 95
6035 95 -88 -181 -141 28 12 -45 -76 -9 -74 -145 9 -174 -26 37 -168 -97 -85 -149 48 40 20 179 -40 61 15 -231
$$ packed form
5855d2J15Q9l4j09j90J64K%j08K37k34l7LJ69Kn3q7K1jJ86q6J92l06J5N7O7l4
5882bk09J75N7L6N1P0m9J3k54K7J6J41R3j65r4J16q2J84k1j61R5K4j72M0oJL8
5909c8j15q3K70r0Q0M3M1J27k70JR7L9k33J52P2p9n8J73j8j47Q3j44J17k83J42
5934a21N2M2k9K09m03L93n1J9j25j78K47k32k3J60O9L8Mk23j1L55m7j31n4J4Q1
5959E5j93R3j46K45l3k2K75l49L1l10L64k4r2K29j32r2J78qj04l6J7mJ19n7O0
5984F4k0J32j91l8L0j45Q2j84K26K88l46O6J03q2p4k1l4K06N5P5k08J9J44j48
6008am7Q4R0q4o2KK3M9j97k8J97m6o6J25J17k66QN3n5K08Q9J0j26j50J88p9N9
6035I5j83r3M0J69j6n7l1O7o5p1J54j83J48O3k05P1J2o4J97qk0J59k19J01m6k46
$$ plain form
6061 -231 25 -107 101 84 167 20 -78 -12 -27 -120 -120 80 -252 -9 -4 74 -45 -92 18 98 -38 -101 173 -171 -81
6086 -81 0 74 -143 70 -317 -214 127 -38 68 79 -5 -401 268 -232 -488 48 -102 -96 -288 -100 101 -92
6108 -92 192 307 -273 -292 -446 120 -73 208 -300 -50 -698 907 211 -126 -477 578 -901 -155 -229 -46
6128 -46 -38 -40 143 -182 -181 -190 119 75 -228 -9 -88 -155 114 -18 -55 -351 -184 94 -146 -114 -72 -88 35 -109 -88 -83
6154 -83 93 -138 -200 211 -16 16 69 -127 18 -93 -7 118 178 175 4 -26 122 -52 -129 3 57 190 98 -37
6178 -37 -61 16 165 -72 102 147 113 193 -13 30 70 -59 79 295 -69 27 -114 133 -78 22 308 133 174
6201 174 -183 -46 103 11 35 -52 87 145 -68 -45 -118 148 21 159 30 -167 170 238 -22 -161 -110 -30 154
6224 154 -88 26 73 -39 -150 102 113 -22 -201 89 82 74 167 85 302 28 156 53 -126 -116 -72 6 -8 97
$$ packed form
6061b31K56j32K08j7Q3j47r8O6j5r3%K00l32K43NP8j19m7J10Q0j36o3K74l44R0
6086h1Q1P4k17K13l87J03L41j65J06J1q4l96O69n00k56N36j50Oj92J88K01j93
6108i2K84J15n80j9j54N66j93K81n08K50o48J605o96l37l51J055j479P46p4J83
6128d6QkJ83l25JrL09m4l03K19p9o7K69j32l7k96J67K78k40L2M2j6J23j44K1N
6154h3J76k31o2M11k27L2N3j96J45j11Q6J25O0lj71l0J48j74p7J32N4J33r2j35
6178c7k4P7J49k37J74M5l4Q0k06M3M0j29J38K16l64R6j41K47k11J00K86j75M1
6201A74l57J37J49r2K4q7J39N8k13K3p3K66j27J38j29j97L37O8k60j39N1Q0J84
6224A54k42J14M7j12j11K52J1j35j79K90pqR3q2K17k74J28j03j79J0M4P8j4J05
$$ plain form
6248 97 44 25 52 -59 47 222 -9 -3 100 -1 -72 -11 -16 -245 78 107 21 100 9 4 98 -135 -41 239 -106 13
6274 13 -49 181 78 112 14 49 -11 12 -177 -182 105 -232 -90 -149 -45 16 88 -208 -14 22 -36 64 48 -165 123
6299 123 -4 -1 87 -275 -154 227 -23 -61 72 93 114 17 -126 -102 -124 -170 44 -104 50 -101 78 -247 -60
6322 -60 -91 -135 9 -107 -101 -92 95 1 -148 102 31 241 -215 -27 43 10 -64 1 60 -249 -181 -45 11 31 60 64 -197
6349 -197 -68 -83 -200 -17 -17 18 26 -101 260 -11 42 -223 56 -17 -173 99 96 22 26 -54 34 101 -54 162 -126
6374 -126 175 163 8 104 -13 76 113 -13 -173 -35 -113 57 -7 24 -38 86 117 -69 28 120 227 91 -175 -21
6398 -21 -76 -38 115 183 -14 27 -49 263 -84 -141 -132 -160 -1 -94 37 223 54 -248 -137 75 -45 69 4 -84
6422 -84 21 148 89 9 -14 51 88 -141 16 201 44 39 74 88 158 192 -155 34 -24 234 -10 14 -9 198 86
$$ packed form
6248I7n3j9K7j11J06J75k31OJ03j01p1O1nk29L23K9q6P9r1nR4k33R4K80l45J19
6274A3o2K30j03L4r8L5o0K3j89nK87l37J42n9J04O1P2k96J94L6n8J00j6k13K88
6299A23j27LQ8l62J21L81k50l8J33K1K1r7j43K4k2m6K14j48J54j51J79l25J87
6322f0l1m4J44j16ORJ87r4j49K50p1K10m56J88P0l3p4O5N9l09O8J36N6K0K9Mk61
6349a97J29j5j17J83%L5Qj27L61k71N3k65K79p3j56K72lp4Mq0Q8O7j55K16k88
6374a26L01j2j55R6j17Q9L7j26j60J38p8J70o4L1o2J24L1j86R7R2J07j36k66J54
6398b1n5L8J53O8j97M1p6L12l47n7Rk8J59r3J31J86j69l02J11K12j20J14o5q8
6422h4J05J27n9q0k3O5L7k29J57J85j57nL5J4P0L4l47J89n8K58k44K4k3K07j12
$$ plain form
6447 86 244 147 -151 -151 -154 -63 -17 34 13 -192 201 -23 -29 80 -113 51 171 39 34 90 42 -101 -145 59 -94 52
6473 52 -5 48 184 -80 -233 28 -59 117 -107 19 -186 21 3 23 112 -24 168 68 -129 88 62 133 -63
6496 -63 31 -35 59 42 -64 102 -15 -48 5 -38 -7 -63 134 -48 75 -113 -160 73 54 -93 -2 -27 43 -73 64
6521 64 29 129 222 -269 203 -110 -48 36 -128 79 189 36 155 -73 147 77 -63 -17 66 137 28 89 -80
6544 -80 -49 -88 66 -51 -170 17 -248 24 51 -126 -123 -84 -31 81 3 32 -236 -5 178 -239 -14 48 -146 139
6568 139 176 -202 33 -80 -129 -41 -210 -123 46 -22 -203 185 154 -73 65 -34 39 -242 27 -91 7 -31 -129 -134
6592 -134 -116 -143 7 -32 -134 61 -209 -50 -136 16 47 12 -110 -13 -117 76 -62 -83 42 145 -157 -169 -128
6615 -128 81 8 -45 103 17 -48 -88 -71 -81 84 -122 185 -126 -30 86 120 76 68 10 109 -76 57 42 -1 74 62
$$ packed form
6447H6J58r7k98%lR1M6N1k1k05L93k24oJ09j93J64J20j32nN6m8j43m4K04j53J46
6473E2n7N3J36k64j53K61q7J76k24J26k05K07j8K0Q9j36J92j00j97K17k6P1j96
6496f3R4o6R4j7j06J66j17l3N3m3L1n6J97j82J23j88m7K33j9j47R1k5P0j16J37
6521F4l5J00R3m91M72l13O2Q4j64K07J10j53J19k28K20p0j40M6Q3P1j09O1j69
6544h0L1l9J54j17j19J87k65K72K7j77LL9N3J12p8K9k68K31J83m17K25O2j94K85
6568A39L7l78K35j13m9Q8j69Q7J69o8j81L88l1k27J38r9P3k81K69j18R8l8r8n
6592a34J8k7J50l9j02J95k70J59q6J52L1l5j22R7j04J93j38k1J25J03l02j2M1
6615a28K09p3n3J48q6o5m0J7j0J65k06L07l11R6J16L4m4qn8R9j85J33j5m3P5j2
$$ plain form
6641 62 -61 150 -29 -312 137 -65 -8 40 -162 -73 -69 150 92 22 146 -228 188 -20 -37 99 -96 -87 -98 54
6665 54 -143 -24 -172 -114 -67 -14 -22 -64 189 98 118 184 100 29 63 -95 -21 -156 53 -100 77 84 157 135 125 50 -47
6692 -47 16 21 -168 -32 -50 283 -200 36 -162 21 32 -10 -106 10 -113 101 -10 -113 112 159 -83 -68 -144 254
6716 254 -237 -57 51 -82 27 -116 30 12 -29 5 -67 -313 145 132 92 -60 -177 -232 -48 -117 -12 -99 -151
6739 -151 10 104 100 259 -64 73 101 205 126 -107 3 -25 -59 85 176 10 -16 -42 166 -104 -150 -139 -15 119
6763 119 -55 -1 -75 -77 78 154 77 -137 90 167 27 16 -101 -154 9 37 -10 78 98 90 -127 156 -149 -49 -42 -29
6789 -29 4 -14 -21 -114 -67 -144 271 11 125 174 -3 58 -88 -200 246 -13 -299 -3 -130 48 -8 -177 -87 -194
6813 -194 -144 -96 -44 -59 -236 -163 30 92 -73 38 45 56 -9 -112 282 -1 -58 -49 -88 107 22 -127 -124 -11 -220 127
$$ packed form
6641F2j23K11j79k83M49k02N7M8k02Q9MK19n8p0J24l74M16k08j7J36j95Rj1J52
6665E4j97J19j48N8M7N3qm2K53r1K0O6q4p1L4j58P4j35K09j53J77PP3k2j0p5r7
6692d7O3Nj89J36j8L33m83K36j98J83J1m2r6J16j23K14j11j03K25M7k42J5p6L98
6716B54m91J80J08j33J09j43J46j8m1L4p2k46M58j3m0j52j17n5J84o9J05q7n2
6739a51J61R4mJ59l23J37K8J04p9k33J10k8l4J44R1j66k6k6K08k70m6J1J24J34
6763A19j74N4p4kJ55P6p7k14K27P7j40j1j17n3J63K8m7Q8K0qk17K83l05J00PJ3
6789b9L3j8pr3M7p7M15k60J14M9j77O1j46j12M46k59k86K96j27J78n6j69R0j07
6813a94N0M8N2j5j77P3J93O2j65J11PJ1o5j03L94k83n7Rl9J95q5j49LJ13k09L47
$$ plain form
6839 127 -123 191 83 -65 -136 -90 -183 -152 167 194 -393 -42 -38 15 178 -106 12 134 77 -27 3 10 -124 70
6863 70 -78 -9 55 -5 -55 91 149 3 110 -125 61 66 -16 29 5 190 -92 -185 -61 176 87 78 -7 -154 162
6888 162 -171 176 -71 86 -15 65 -136 50 25 -42 86 -126 -154 22 -118 -56 13 309 -141 125 42 171
6910 171 -47 -81 2 52 88 -152 6 -281 -56 66 216 44 -43 -104 4 80 124 25 88 -198 -214 68 -1 38
6934 38 -12 -34 -176 -120 2 14 -47 -1 63 6 8 -197 78 31 -130 117 133 -57 4 -111 -72 -34 -16 97 172 -113
6960 -113 -157 -139 241 43 14 158 27 -2 -179 -58 268 138 -89 245 -86 -129 -36 -90 0 -164 16 136 -119
6983 -119 -118 -8 90 -116 -59 75 129 112 61 62 20 81 -5 -6 -7 -90 -167 -35 -56 199 -91 47 -65 131 -26 50 119
7010 119 -5 -144 94 -196 -99 44 -51 -37 112 -222 -35 -68 92 55 -9 6 47 -127 39 18 -173 -179 88 -245
$$ packed form
6839A27k50L14j08j48p1M6r3L1L19K7n87L51MN3J63k84J18J22n7j04L0Pj34J94
6863G0j48O9O4o0n0J46N8j46J07k35J86Nq2M5k4J85k82r3J24K37q9rq5j47L16
6888A62l33L47k47J57j01Q0k01J86k5o7J28k12k8J76j40O2O9K96m50K66q3J29
6910A71k18l4Q3N0L6k40J58k87K25J22J50j72q7o1J08P6M4r9O3k86j6K82o9L9
6934C8n0k2j42N6J22J2o1M6O4n7Kk05K75m7j61K47J6j90O1j15L9L8J8J13P5k85
6960a13m4J8L80j98k9J44j31k9j77J21L26j30k27L34l31m3R3n4R0j64J80J20k55
6983a19JJ10R8k06N7J34N4j7n1Jm2O1q6jjq3p7J32k1K55k90J38j12J96j57P6O9
7010A19j24j39K38k90R7J43r5J4J49l34J87l3J60l7o4J5M1j74J66k1j91oK67l33
$$ plain form
7034 -245 -146 -83 -73 62 25 183 105 68 125 72 11 19 47 -114 -130 166 -8 63 -125 -137 232 -119 -118 -5 -78 -46
7060 -46 13 61 26 178 -190 249 32 107 117 10 -111 108 74 -27 -37 -174 39 -35 -118 64 10 130 -60 124
7084 124 59 84 21 139 -119 -3 6 7 93 7 23 138 -22 54 83 -104 108 -12 254 -125 34 -110 -82 -9 -230
7109 -230 -43 -100 59 58 -43 -61 152 -96 158 115 103 -128 144 -112 187 -37 -88 148 -23 -8 42 110 73 -70
7133 -70 89 173 -1 -55 -251 194 -145 -56 70 16 89 -77 -120 16 -70 75 -133 -250 21 10 124 -74 63
7156 63 -186 173 -66 69 -58 -26 187 2 -87 61 125 105 92 121 148 -157 57 -208 72 -133 158 -164 -2
7179 -2 -4 -108 104 -127 63 -81 251 -108 62 -206 105 -85 66 90 -67 20 -53 -112 -48 64 -177 -332 -41
7202 -41 -5 45 -67 42 -111 43 -37 -37 114 -162 -87 83 -17 27 46 217 -15 -125 148 86 80 -134 -330 -94
$$ packed form
7034b45R9O3J0J35l7J58p8l7N7n3o1QK8j61j6K96j74P1j88j2L69l51JJ13p3L2
7060d6N9M8l5J52l68M39k17P5J0j07j21K19l4j01j0j37K13p4q3J82n4J20j90J84
7084A24o5K5o3J18k58J16RJQ6q6J6J15j60P6K9j87K12j20K66l79J59j44K8P3k21
7109b30J87n7J59jj01j8K13k48K54m3j2k31K72k56K99k24n1K36j71J5N0O8l7j43
7133g0J59Q4j74n4j96M45l39Q9J26n4P3j66m3J36q6J45k08j17K71j1J14j98J37
7156F3k49L59k39J35j27L2K13j85q9J48O4k0j3K9K7l05K14k65K80k05K91l22J62
7179bkj04K12k31J90j44L32l59J70k68L11j90J51K4j57Q7p3n9O4J12k41j55K91
7202d1L6N0j12J09j53J54q0%J51k76P5J70j00M4J9J71k32j10K73o2ok14j96K36
$$ plain form
7226 -94 -94 107 90 -8 3 -93 -283 -30 -130 66 150 -47 -59 -288 -10 199 -148 -143 -46 -21 83 131 -49 -54 65
7251 65 152 178 42 25 -67 221 104 -74 -46 264 83 -130 115 -11 -157 34 -166 -133 25 -30 118 -46 -14
7274 -14 76 30 125 -95 164 -59 -51 62 -22 31 157 -187 19 145 -105 -23 98 189 -16 156 -59 36 -33 43
7298 43 -17 -1 55 185 10 -57 19 67 100 -6 56 141 60 129 -109 -157 -77 -163 21 -40 -232 10 -120 -126 -83 -194
7324 -194 -45 2 -78 -14 126 -97 -117 51 132 -77 -78 109 170 -15 -105 26 -236 -59 -19 120 17 4 47 -14
7348 -14 51 21 -68 -43 28 182 -5 4 25 -56 -25 42 20 -100 -101 -88 59 75 7 -134 82 -120 17 135 98 204
7374 204 -47 103 130 -87 147 39 252 190 -88 0 103 -21 -32 60 -24 72 93 -10 -22 -41 -185 -41 27 132
7398 132 -5 90 -83 -103 87 -129 16 36 111 1 42 42 90 -37 19 20 290 -182 -184 128 -12 -167 -167 17 15 -91
$$ packed form
7226i4%K01j7r8J1r6j90K53j00J96Q4j97j2k29K78K09l47NR7K5J04M8j80nJ19
7251F5Q7K6j36j7r2K88j17j78K8L10j81k13K45j26j46J91k00L3J58n5J48j64L2
7274a4R0m6R5k20K59k23QJ13q4N3J26l44K06J26k50Q2J21R1k05J72k15R5o9P6
7298D3o0J6N6J30j75o7P6M8L3j06O2Q5q1O9k38m8Q0q6J84o1j92K42j30oM3j11
7324a94J49M7q0O4J40k23k0J68Q1k09jJ87O1j85r0J31k62J77M0J39j03j3M3o1
7348a4O5l0q9K5P1J54j87RK1q1L1O7k2j20jJ3J47J6o8j41K16k02J37J18l7J06
7374B04k51J50K7k17K34j08K13o2k78Q8J03j24j1R2q4R6K1j03j2j9j44J44O8J05
7398A32j37R5j73k0J90k16J45K0P5j10M1%M8j27N6JK70m72kL12j40j55%J84kj06
$$ plain form
7424 -91 -75 42 208 44 34 -16 -21 42 -157 -16 13 118 142 -28 15 193 5 156 -138 -127 -203 83 292 -5
7448 -5 -132 11 56 -135 -107 -46 -19 98 85 109 54 -137 -145 -61 64 -182 -35 73 7 -238 37 65 -165 -68 78
7473 78 -189 69 -4 54 -125 -56 82 -75 -35 -45 -185 76 28 -213 -5 -52 -228 -105 317 168 193 20 -64
7496 -64 56 -71 -58 24 1 43 -23 130 -18 -50 -15 -153 -90 -139 -231 -57 -15 35 4 -92 25 173 -90 -11 157
7521 157 57 93 -38 114 33 -50 64 8 -157 -22 200 -34 -12 77 -94 -133 129 -32 18 -201 -55 84 135
7544 135 -49 102 -114 -25 47 -86 57 -161 34 136 -41 49 -14 -65 155 -8 40 -135 -34 86 -159 22
7566 22 -43 178 11 4 76 56 -3 15 13 93 -75 14 -104 76 2 256 80 -17 -170 -54 73 158 -60 -72 29
7591 29 75 -30 -20 -42 41 -33 -80 -207 -91 -264 138 -65 -52 -95 -17 168 -61 -108 -53 -75 -94 99 -35 -71 -21
$$ packed form
7424i1J6J17J66j64j0n0nO3j99J41K9J05K4j70M3J78j88J51k94J1p6K86K09k97
7448ej27J43M5j91K8O1K7J17j3K4n5j91qQ4J25k46J47J08o6k45K75K8k30R7J46
7473G8k67K58p3N8j79O9J38j57M0j0j40K61m8k41K08m7j76J23M22j49K5j73q4
7496f4J20j27J3Q2k3M2o6J53j48l2L5j38O3m9r2J74M2N0l1r6J17J48k63P9J68
7521A57j00L6j31J52q1q3J14n6j65J35K22k34K2Q9j71l9K62j61N0k19J46J39N1
7544A35j84J51k16Q9P2j33J43k18J95J02j77R0o3n1K20j63M8j75J01J20k45J81
7566B2o5K21j67pP2k0n9J8kQ0j68Q9j18J80p4K54j76r7j53J16J27Q5k18j2J01
7591B9M6j05J0k2Q3p4m7j27J16j73M02k03J3m3P8J85k29m7N5k2j9J93j34l6N0
$$ plain form
7616 -21 -148 71 -228 125 -32 -55 115 -170 95 32 -59 -37 46 -83 -58 -84 32 9 117 59 -112 -57 108 -50
7640 -50 49 -1 39 90 -80 -5 91 -79 8 -27 -7 -62 44 -181 -105 337 -16 361 -52 86 65 -175 39 48 195
7665 195 -20 -73 84 119 -249 14 -113 31 28 -75 75 30 -118 -124 40 73 102 26 -79 -23 30 114 -22 -37 -201
7690 -201 -144 -10 -131 -62 -43 -115 -205 136 17 137 234 42 -53 203 -116 131 32 101 198 -126 -34 -173 49 97
7714 97 -171 19 -27 45 -3 58 148 51 -18 -17 85 81 -58 159 -97 -66 -152 0 -138 116 17 131 25 58 58 -125
7740 -125 18 36 -39 -158 7 -51 78 -24 -18 -175 -115 55 42 -124 81 -97 194 -148 110 -200 -138 -8 -116
7763 -116 -86 -9 19 74 -13 -194 136 -91 -122 33 -1 87 -107 -18 -63 -62 -9 -51 -139 121 95 -173 67 78 -120 -65
7789 -65 131 91 228 -79 47 11 48 -39 50 74 124 28 117 34 33 174 -5 -80 15 165 -121 66 -36 130 -113
$$ packed form
7616b1j27K19k99L53j57k3J70k85K65o3r1K2Q3j29K5k6J16k3J08n8j71N5J65j58
7640e0R9n0M0N1j70P5R6j70Q7l5K0n5J06k25P6M42l53L77m13J38k1k40K14RJ47
7665A95k15n3J57L5l68K63j27J44lj03J50m5j48oJ64L3K9p6j05N6N3Q4j36j5j64
7690b01N7J34j21O9J9p2r0L41j19J20R7j92r5K56l19K47r9O9R7l24R2j39K22M8
7714I7k68J90m6P2m8O1R0r7o9JJ02mj39K17k56L1q6J52j38K54r9J14j06L3%j83
7740a25J43J8p5j19J65n8J29j02Oj57O0J70j3j66K05j78K91l42K58l10O2J30j08
7763a16L0P7K8N5q7j81L30k27l1J55l4Q8j94Q9m5JN3m2q8K60k6k68K40J1j98N5
7789f5J96m0J37l07J26l6L7q7Q9K4N0r6Q9q3jJ41j79p5R5J50k86J87j02J66k43
$$ plain form
7814 -113 -104 127 122 -22 60 45 114 -25 -57 -116 -116 7 56 90 -81 162 150 -234 31 199 -19 75 26 -133 105
7839 105 -91 -13 64 72 -79 -182 -145 147 133 -104 158 -18 82 114 -43 -92 182 79 -189 -85 -71 152 6
7862 6 4 -142 -134 -11 -153 -37 -61 68 -8 44 48 23 -17 -117 -33 -51 -50 -46 -72 -110 0 -1 -103 -93 -74 78 -206 -40
7890 -40 -51 -16 56 249 11 35 -82 -14 0 -111 75 79 72 -57 -9 123 -164 64 -89 -165 -105 129 111 -29 -47
7915 -47 -114 -206 -77 -42 20 -235 -30 166 -25 32 87 -4 143 -13 -152 0 -36 246 -100 90 89 348 -111 27
7939 27 194 137 -159 54 -57 15 -86 -134 22 -11 -200 59 -18 -113 45 101 11 -218 97 -5 -76 38 -188
7962 -188 172 113 -131 -81 -152 353 -147 -13 162 240 57 168 284 -49 -34 187 30 -212 203 58 -257 -83
7984 -83 37 -17 -196 -162 114 0 83 180 -66 -116 -149 41 28 37 -50 154 -163 -12 99 -11 -5 -30 -51 75 -25
$$ packed form
7814a13RK31nj44Q2j5O9j39l2n9%J23M9L4j71K43j2l84K65J68k18R4m9j59K38
7839A05j96P8P7Qj51j03L7K92j4k37K62j76J00L2j57m9K74j03k68J04J4K23j46
7862Fkj46QJ23j42J16k4J29p6N2Mk5m0j00Q4j8JMk6l8J10jj02J0J9J52k84J66
7890d0j1L5P2J93k38K4j17O8J4j11J86Mpj29M8J32k87K28j53p6O0K34j8j40j8
7915d7o7r2J29L5O2k55K05J96j91N7N5r1J47j56j39J52l6K82l46J90jK59m59J38
7939B7J67n7k96K13j11P2j01m8J56l3j89K59p7r5J58N6r0k29L15j02p1J14k26
7962a88L60n9k44N0p1N05n00J34J75P8j83J11J16l33J5K21j57k42M15j45l15J74
7984h3J20n4j79L4K76j14Q3R7k46n0l3J90j3Rq7K04l17J51J11j10Ok5k1J26j00
$$ plain form
8009 -25 -95 120 -12 182 -461 -296 -175 -174 25 14 372 315 41 311 150 -40 -283 237 134 -250 -146 115
8031 115 -496 -370 404 764 -273 -603 -226 -28 5 -78 101 -28 -72 29 40 26 16 79 -194 24 -196 -191 -270
8054 -270 -501 765 -458 -400 -860 470 78 187 87 -19 2 17 55 54 24 90 30 -97 84 -4 -138 -19
8076 -19 -98 45 89 174 -45 154 2 61 28 232 160 -93 89 -48 140 195 -16 8 184 -105 150 29 196
8099 196 51 36 161 121 8 332 44 -154 -37 -3 11 -109 -63 111 120 167 -138 -78 -82 82 -100 157 -66 144
8123 144 -39 -97 75 62 96 -76 -177 0 24 57 19 195 -102 68 183 21 -32 -47 -334 24 150 22 -67
8146 -67 -21 178 309 109 123 70 84 -128 2 199 86 123 134 -67 -61 180 -9 36 -21 -114 52 -270 -66 -121
8170 -121 -77 -184 -9 95 67 -38 -148 -55 18 132 65 -43 -52 -75 -57 -11 -222 172 -23 129 -64
$$ packed form
8009b5p0K15j32J94o43J65J21JJ99j1L58n7k74K70j61j90k43N20j03l84J04K61
8031A15o11J26P74L60j037l30L77J98L3q3J79j29m4J01J1j4j0O3k73K18k20Np9
8054b70k31J266j223N8m60J330l92J09j00j06K1J5L8jl0O6o0j27J81q8j34J19
8076a9p9J43M4Q5k19J99j52N9l3K04p2k53J82j37J88N5k11K4J76k89K55j21J67
8099A96j45j5J25m0j13L24k88j98J17L4J4j20M6J74RM7l05O0mJ64j82K57k23K10
8123A44j83n8J72j3L4j72j01J77K4L3l8J76k97J70J15j62n3j5k87L58J26j28q9
8146f7M6J99J31k00J4n3J4k12J30J97j13L7J1k01OK41j89M5n7r3J66l22K04n5
8170a21M4j07J75J04k8j05j10R3P3J14o7j08rk3J8M6k11L94j95J52j93
8191f4
$$ Imaginary data points
##PAGE= N=2
##DATA TABLE= (X++(I..I)), XYDATA
$$ plain form
0 0 0 0 0 0 0 0 8 -8 0 -8 8 -8 16 -24 24 -40 40 -56 64 -80 96 -112 134 -158 184 -215 249 -289 334 -383 438
31 438 -497 567 -641 722 -815 917 -1023 1148 -1280 1423 -1582 1754 -1942 2150 -2374 2621
47 2621 -2890 3184 -3508 3865 -4257 4694 -5181 5723 -6337 7036 -7838 8773 -9873 11195
61 11195 -12822 14873 -17555 21230 -26598 35215 -51341 92036 -422649 -530410 469548
72 469548 680317 379928 -251190 -562213 -468843 60616 488912 539834 148128 -281037
82 -281037 -467139 -206253 239769 503407 315780 -128569 -473061 -378294 23075 344120
92 344120 300819 8212 -296950 -370329 -145769 216523 357244 161770 -131641 -249476
102 -249476 -158237 73698 273602 250620 8805 -199809 -200256 -48929 109958 187350 103112
$$ packed form
0@%%%%%%Qj6QqJ6j6K4m0M8o4Q0r6J20j44J76k08K46k92L42l99M64n38O23p17Q21
31D38r35J064j208J363j537J732j940K171k428K703l005L336l696M092m524M995
47B621n511O074o692P373q122Q951r875J0904j2060J3373j4874J6611j8646K1068
61A1195k4017K7695l2428L8785m7828O1813q6556J43377n14685j07761R99958
72D69548K10769l00389o31118l11023R3370N29459M28296N0922l91706m29165
82b81037j86102K60886M46022K63638j87627m44349l44492R4767M01369L21045
92C44120m3301k92607l05162p3379K24560L62292J40721j95474k93411j17835
102b49476R1239K31935J99904k2982k41815k08614m47J51327J58887P7392q4238
$$ plain form
113 103112 -109382 -244948 -158390 45857 173036 127706 -21889 -137743 -137523 -26185 124288
124 124288 184608 79544 -92753 -141654 -33093 77934 102333 71295 -8657 -104126 -105935
135 -105935 -7240 69360 65381 20523 -40597 -98412 -78754 32359 108209 66180 -29341 -84131
147 -84131 -57249 24150 79461 60727 243 -44453 -42074 -8073 23262 36231 30059 4050
159 4050 -45763 -74186 -15635 70766 56951 -29698 -59678 -21640 7998 13580 24121 26572 -890
172 -890 -24502 -19512 -401 29246 47586 17104 -35727 -45870 -3992 35919 25726 -12545 -27770
185 -27770 -17616 -10287 -8741 5219 23426 7475 -27550 -22690 12104 25920 17485 8732 29
198 29 -6435 -2865 8184 10063 5905 4996 -11308 -32638 -17246 17368 17162 -13020 -26705 -7426
$$ packed form
113A03112k12494j35566Q6558K04247J27179m5330j49595j15854K20J11338J50473
124A24288O0320j05064j72297m8901J08561J11027K4399l1038p9952r5469j809
135a05935R8695P6600l979m4858o1120n7815J9658J11113P5850m2029r5521n4790
147h4131K6882Q1399N5311j8734o0484m4696K379L4001L1335J2969o172k6009
159D050m9813k8423N8551Q6401j3815q6649k9980L8038K9638N582J0541K451k7462
172h90k3612M990J9111K9647J8340l0482n2831j0143M1878L9911j0193l8271j5225
185b7770J0154P329J546J3960J8207j5951l5025M860L4794J3816q435q753q703
198B9o464L570J1049J879m158r09j6304k1330J5392L4614k06l0182j3685J9279
$$ plain form
212 -7426 11205 6200 752 10874 16194 3956 -9696 -865 19688 17457 -1292 -11246 -12401 -7276
226 -7276 3040 1975 -11124 -14200 -3194 -317 -11749 -6556 16555 16725 -6000 -10788 6670 21250
240 21250 14468 -1450 -4187 2932 4178 -126 -6220 -6190 -569 -1579 -10047 -15076 -6892 9787 9374
255 9374 -9908 -12435 6184 16779 7668 -2940 1605 9255 4442 -1810 -1593 -42 2152 -387
269 -387 -8670 -10370 -2389 4187 371 -8803 -5566 5585 3599 -3201 818 8753 6721 -4445 -5121
284 -5121 7786 9646 -2267 -7022 -1484 4747 1912 -5670 -5523 400 3781 1230 -6792 -7598 5363
299 5363 10034 -1616 -10421 -2893 10327 7206 -7257 -6684 5125 6441 -1517 -5831 384 6748
313 6748 1286 -4482 -2398 1959 4077 281 -5430 -1939 4019 1679 -4898 -6279 2754 6844 -3338
$$ packed form
212g426J8631n005n448J0122N320j2238j3652Q831K0553k231j8749r954j155N125
226g276J0316j065j3099l076J1006K877j1432N193K3111J70k2725m788J7458J4580
240B1250o782j5918k737P119J246m304o094L0N621j010q468n029Q184J6679m13
255I374j9282k527J8619J0595r111j0608M545P650m813o252K17J551K194k539
269c87q283j700P981O576l816r174L237J1151j986o800M019P935k032j1166o76
284e121J2907J860j1913m755N538O231k835p582J47N923L381k551q022q06J2961
299E363M671j1650q805P528J3220l121j4463N73J1809J316p958m314O215O364
313F748n462n768K084M357K118l796n711L491N958k340o577j381R033M090j0182
$$ plain form
328 -3338 -9436 -232 9124 5568 -5129 -5599 5988 9439 1186 -4684 -2597 4308 5442 -3460 -8100
343 -8100 -3254 2851 1819 -6113 -7985 857 5200 42 -3373 241 5915 5133 -443 1263 5178
358 5178 2754 -131 -1362 -562 1235 -1383 -5057 -4775 -1544 890 -2564 -6500 -942 4986 2407 -1976
374 -1976 -2032 4472 8849 2732 -3271 839 5543 3818 -2791 -4810 -452 84 -2402 -3843 -5427 -2348
390 -2348 1833 -1037 -3752 -31 4228 3479 54 1320 5529 4007 625 198 261 1877 613 -5419
406 -5419 -4537 1084 -1 -5232 -5483 -50 3079 216 -2254 -588 2779 6936 3134 -4250 112 7661
422 7661 3329 -4083 -3651 1102 1777 -2087 -3865 -3846 -1893 2305 -853 -5341 128 4486 728 -767
438 -767 1969 3221 2338 1338 1050 515 1832 2210 -3620 -4489 3054 1496 -6484 -4662 788 1280 -966
$$ packed form
328c338o098R204R356l556j0697m70J1587L451q253n870K087O905J134q902m640
343h100M846O105j032p932j872Q842M343n158l415L614N674p82n576J706L915
358E178k424k885j231Q00J797k618l674K82L231K434l454l936N558N928k579m383
374a976n6O504M377o117o003M110M704j725o609k019M358N36k486j441j584L079
390b348M181k870k715L721M259p49l425J266M209j522l382m27O3J616j264o032
406e419Q82N621j085n231k51N433L129k863k470J666L367M157l802p384M362P549
422G661m332p412M32M753O75l864j778J9J953M198l158m488N469M358l758j495
438g67K736J252q83j000k88n35J317L78n830q69P543j558p980J822N450M92k246
$$ plain form
455 -966 -2619 -2443 1401 5990 3492 -4769 -1947 7925 5041 -3053 -1789 664 1320 1954 -640 -4547
471 -4547 -2529 2068 383 -4027 -1474 1184 -2718 -483 4205 -390 -3295 1913 3189 389 575
486 575 1581 -321 -52 4160 1730 -4623 -1174 3392 -270 -1705 -735 -3502 -2256 3026 1020 -5419
502 -5419 -3864 3718 2533 -2346 -224 898 -408 3835 4035 -1637 -468 2871 371 -161 3251 819
518 819 -6143 -2883 5435 936 -6979 -3905 -238 -598 1780 -666 -5969 -1950 6188 4893 -1517 -1802
534 -1802 2050 3434 4957 3714 -4421 -3432 5994 4101 -5351 -5252 -722 -694 -1529 -1196 -3473 -4738 143
551 143 3447 -751 -584 2200 -123 1611 7078 3255 -3477 -51 6256 3838 -2222 -2972 -1521 -1166
567 -1166 1771 -461 -7420 -5097 1143 -306 -2497 -1179 -1935 -1241 3643 5456 -387 -2210 4893 6417
$$ packed form
455i66j653J76L844M589k498q261K822R872k884q094J264K453O56O34k594l907
471d547K018M597j685m410K553K658l902K235M688m595k905N208J276k800J86
486E75J006j902K69M212k430o353L449M566l662j435R70k767J246N282k006o439
502e419J555P582j185m879K122J122j306M243K00n672J169L339k500n32L412k432
518H19o962L260Q318m499p915L074L667l60K378k446n303M019Q138j295o410k85
534a802L852J384J523j243q135R89R426j893r452R9M530K8q35L33k277j265M881
551A43L304m198J67K784k323J734N467l823o732L426O307k418o060p50J451L55
567a166K937k232o959K323O240j449k191J318p56O94M884J813n843j823P103J524
$$ plain form
583 6417 1355 1289 1413 -1248 1144 2935 -1820 -5218 -2326 -56 -2080 -3314 -2783 -3780 -1328 3733
599 3733 321 -4212 415 5232 3849 1896 1266 649 2774 5100 1873 -3442 -1742 2499 -932 -3982
615 -3982 -2308 -3473 -4723 -884 -22 -3263 -2819 389 1563 1053 2865 3578 1468 2915 5129 2542
631 2542 1705 2769 -490 -1687 648 -493 -4681 -5092 -1896 -1518 -4152 -2985 -1555 -1807 1272 2797
647 2797 -71 1106 4899 4014 1810 2394 3365 1907 542 876 -862 -3035 -1583 -1864 -4447 -3649 -2565
664 -2565 -3029 -2099 -623 -724 -11 2408 3686 1681 2459 5070 3389 1396 2830 1839 -768 -316 -565
681 -565 -3067 -4216 -2874 -2392 -3476 -3387 -1939 -1673 28 1855 674 851 3749 3811 2852 2955 2674 1812
699 1812 1243 1080 295 -2565 -2329 -1747 -3056 -3022 -2283 -3546 -2798 -242 303 -250 410 2078 3220 2992
$$ packed form
583F417n062o6J24k661K392J791m755l398K892K270k024j234N31r97K452N061
599C733l412m533M627M817j383j953o30o17K125K326l227n315J700M241l431l050
615c982J674j165j250L839Q62l241M44L208J174n10J812P13k110J447K214k587
631B542q37J064l259j197K335j141m188m11L196L78k634J167J430k52L079J525
647B797k868J177L793q85k204N84R71j458j365L34j738k173J452k81k583P98J084
664b565m64R30J476j01P13K419J278k005P78K611j681j993J434r91k607M52k49
681e65k502j149J342M82j084Q9J448K66J701J827j181J77K898O2r59J03k81q62
699A812n69j63p85k860K36N82j309L4P39j263P48K556N45n53O60J668J142k28
$$ plain form
717 2992 2807 2518 1664 2512 2705 -519 -1446 -1205 -1537 -1987 -2977 -3613 -3212 -2145 -633 -1244 -1974 45 1803
736 1803 2202 2779 2056 1440 3191 3592 1974 -81 -300 699 -129 -1926 -2017 -2736 -2520 -1490 -1681 -2615 -1835
755 -1835 -676 521 1092 695 1163 1972 2835 2953 1502 902 1709 994 350 -73 -1758 -2464 -1478 -1514 -2022
774 -2022 -2855 -2432 -620 -94 -316 -246 355 1722 2789 1960 1656 1896 1712 2012 1185 202 -489 -982 -894 -1002
794 -1002 -2288 -2496 -1768 -1597 -873 -1028 -1327 157 1087 1088 1528 1178 1776 2324 1839 1763 1087 259 460 77
814 77 -1079 -1512 -1813 -1654 -1276 -2159 -1845 -942 -828 -84 205 546 1509 1491 1440 2197 1690 1265 1159 598 312
835 312 -336 -673 -1209 -1305 -1939 -1285 -1552 -1864 -1091 -1072 -333 289 361 658 951 1235 1965 1449 1172 1366 587
856 587 710 604 -794 -1099 -593 -1111 -1438 -1400 -1789 -1267 -1018 -170 -224 -591 647 1457 1114 1239 1425 1044
$$ packed form
717B992j85k89q54Q48J93l224r27K41l32m50r90o36M01J067J512o11p30K019J758
736A803L99N77p23o16J751M01j618k055k19R99q28j797r1p19K16J030j91r34P80
755a835J159J197N71l97M68Q09Q63J18j451o00Q07p15o44m23j685p06R86l6n08
774b022q33M23J812N26k22P0O01J367J067q29l04K40j84L00q27r83o91m93Q8j08
794a002j286k08P28J71P24j55k99J484R30JM40l50N98N48m85p6o76q28K01l83
814G7j156m33l01J59L78q83L14R03J14P44K89L41R63j8n1P57n07m25j06n61k86
835C12o48l37n36r6o34O54k67l12P73J9P39O22P2K97K93K84P30n16k77J94p79
856E87J23j06j398l05N06n18l27L8l89N22K49Q48n4l67J238Q10l43J25J86l81
$$ plain form
876 1044 1456 1506 455 -157 -431 -310 -392 -1480 -1264 -1114 -1486 -574 -591 -1005 -273 284 421 824 1035 957 814
897 814 1098 1496 580 93 684 269 -757 -425 -782 -1358 -799 -445 -932 -1550 -731 446 -287 -79 662 312
917 312 798 1610 425 30 1123 1114 304 -148 -329 -244 -856 -221 -460 -1781 -938 509 -733 -927 -179 75
937 75 356 803 693 -54 486 1459 1061 -262 315 637 -398 -146 332 -1217 -1256 145 -96 -1187 -1149 -296
957 -296 -13 132 699 -67 -362 1427 1273 123 567 1012 151 142 822 187 -1243 -691 497 -454 -1612
976 -1612 -578 -816 -946 466 -41 -942 -78 893 684 567 551 493 131 1191 1656 -1277 -956 1059 711
995 711 -977 -1164 -977 -1050 126 94 -1301 -1744 490 1358 -38 -40 520 -91 1150 2163 414 -949 347
1014 347 1004 39 -253 -438 -888 -993 380 -219 -1733 -782 258 -446 217 759 -682 -464 1298 1942
$$ packed form
876A044M12N0j051o12k74J21q2j088K16J50l72R12j7m14P32N57J37M03K11p8j43
897H14K84L98r16m87N91m15j026L32l57n76N59L54m87o18Q19J177p33K08P41l50
917C12M86Q12j185l95J093rq10m52j81Q5o12O35k39j321Q43J447j242j94P48K54
937G5K81M47j10p47N40R73l98j323N77L22j035K52M78j549l9J401k41j091L8Q53
957b96K83J45N67p66k95J789j54j150M44M45q61rO80o35j430N52J188r51j158
976a612J034k38j30J412n07r01Q64R71k09j17j6n8l62J060M65k933L21K015l48
995G11j688j87J87p3J176l2j395m43K234Q68j396kN60o11J241J013j749j363J296
1014C47O57r65k92j85m50j05J373n99j514R51J040p04O63N42j441K18J762O44
$$ plain form
1032 1942 75 -755 877 771 -56 460 -631 -1227 375 726 -1106 -1392 -474 -124 -194 142 -267 -1198
1050 -1198 -62 1754 624 -818 475 645 301 1167 858 -1142 -450 1024 701 -1310 -877 -98 -652
1067 -652 -133 616 -823 -1136 924 751 -404 9 459 12 390 978 186 -744 615 718 -594 -90
1085 -90 752 -937 -855 640 147 -850 -509 684 102 -451 576 1 -1012 813 1309 -668 -357 401
1103 401 317 320 436 48 -834 21 1009 -377 -1220 9 177 -334 266 66 -1130 -41 844 157 -545 -106
1123 -106 170 -398 330 1113 -573 -753 965 799 -494 -198 65 -233 163 332 -333 -726 114 778 -322
1142 -322 -359 209 -160 -86 937 -277 -818 370 688 -397 -219 299 360 -525 395 244 -810 -484 938
1161 938 -150 -562 299 -293 -400 44 434 -371 -544 573 547 -111 421 172 -365 230 766 -40 -245 271
$$ packed form
1032A942j867q30J632j06q27N16j091n96J602L51j832k86R18L50p0L36m09r31
1050a198J136J816j130j442J293J70l44Q66l09k000O92J474l23k011M33P79n54
1067f52N19P49j439l13K060j73j155M13M50m47L78N88p92r30J359J03j312N04
1085i0Q42j689Q2J495m93r97L41J193n82n53J027n75j013J825M96j977L11P58
1103D01q4LJ16l88q82Q55R88j386q43J229J68n11O00k00j196J089Q85o87p02M39
1123a06K76n68P28P83j686j80J718j66j293K96K63k98L96J69o65l93Q40O64j100
1142c22l7N68l69P4J023j214n41J188L18j085J78N18O1q85R20j51j054L26J422
1161I38j088m12Q61n92j07M44L90q05j73J117k6o58N32k49n37N95N36q06k05N16
$$ plain form
1181 271 -11 -202 64 45 -504 -329 565 28 -755 95 254 -380 -8 625 109 -277 321 532 -170 -206 335
1202 335 76 13 325 -353 -414 31 130 -288 -419 -162 -323 -50 260 190 -480 -159 830 117 99 441 74 394
1224 394 546 66 -162 -254 -18 112 -351 -414 -185 -498 -299 200 -432 -459 155 161 302 217 191 401 450 539 374
1247 374 -188 207 26 -36 -124 -120 -745 -133 -74 -364 -162 -364 191 223 100 86 323 154 607 333 189 283 166
1270 166 239 168 -141 -272 -151 -374 -337 -209 -411 -218 -251 -149 215 -180 -19 254 378 119 221 255 616 246
1292 246 70 258 18 -435 -196 -589 -352 -284 -648 -391 -184 97 -21 -25 389 512 334 523 327 317 390 193
1314 193 122 88 -29 -184 92 -342 -387 -241 -528 -221 -219 -571 -109 68 -187 467 469 251 515 333 336 328 89 58
1338 58 -192 -368 -163 -329 -480 -218 -509 -494 -108 -140 40 142 122 259 287 289 451 627 107 306 539 -125
$$ packed form
1181B71k82j91K66j9n49J75Q94n37p83Q50J59o34L72O33n16l86N98K11p02l6N41
1202C35k59o3L12o78o1M45R9m18j31K57j61K73L10p0o70L21R89p13j8L42l67L20
1224C94J52m80k28r2K36J30m63o3K29l13J99M99o32k7O14OJ41q5k6K10M9Q9j65
1247C74n62L95j81o2q8Mo25O12N9k90K02k02N55L2j23j4K37j69M53k74j44R4j17
1270A66P3p1l09j31J21k23L7J28k02J93l3J02L64l95J61K73J24k59J02L4L61l70
1292B46j76J88k40m53K39l93K37O8l64K57K07K81j18mM14J23j78J89j96j0P3j97
1314A93p1l4j17j55K76m34m5J46k87L07Kl52M62J77k55O54Kk18K64j82Lqk39l1
1338E8k50j76K05j66j51K62k91J5L86l2J80J02k0J37K8KJ62J76n20J99K33o64
$$ plain form
1360 -125 210 -506 -252 -215 -417 -572 -233 -473 -176 -105 -147 203 140 122 412 186 -29 183 286 391 100 91
1382 91 132 -412 -85 -168 -538 -338 -336 -376 -407 -158 -63 32 18 382 247 105 327 329 1 187 229 -363 -120 210
1406 210 -417 -401 -178 -238 -349 -403 -158 -212 -325 341 330 -82 211 242 228 317 244 54 71 144 41 -338 -317 144
1430 144 -420 -87 157 -451 -440 -64 25 -216 -21 380 66 112 677 834 -138 100 493 135 -186 61 -495
1451 -495 -550 -162 -251 -392 -433 -124 -73 -115 162 96 -184 567 623 149 59 445 51 107 198 161 -331 -278 356 -122
1475 -122 -566 -160 -432 -316 -17 46 -441 -17 560 280 -236 420 331 186 294 422 -54 -228 258 74 -277
1496 -277 -171 -165 -428 -45 -90 -399 -303 0 219 -117 -99 235 -60 -62 625 244 -183 153 308 32 -174 193
1518 193 -36 -398 -232 386 -226 -585 245 4 -42 247 -175 -446 38 543 223 -185 337 239 -16 156 35
$$ packed form
1360a25L35p16K54L7k02j55L39k40K97P1m2L50o3j8K90k26k15K12J03J05k91r
1382I1M1n44L27q3l70K00Km0l1K49R5R5j4L64j35j42K22Kl28J86M2n92K43L30
1406B10o27J6K23o0j11n4K45n4j13O66j1m12K93L1j4Q9p3j90J7P3j03l79K1M61
1430A44n64L33K44o08J1L76Q9k41J95M01l14M6N65J57r72K38L93l58l21K47n56
1451d95n5L88q9j41m1L09N1m2K77o6k80P51N6m74r0L86l94N6R1l7m92N3O34m78
1475a22m44M06k72J16K99O3m87M24N77k80n16O56q9j45J08J28m76j74M86j84l51
1496b77J06Ok63L83m5l09R6L03K19l36J8L34k95kO87l81m27L36J55k76k06L67
1518A93k29l62J66O18o12l59Q30k41m6K89m22k71M84N05l20m08N22r8k55J72j21
$$ plain form
1539 35 -313 -110 243 -245 -355 -366 -72 -392 -16 85 -83 -400 204 248 -151 284 422 -102 108 673 -1
1560 -1 -502 0 129 23 -16 -27 -361 -359 284 -38 -659 -180 347 -162 -127 153 16 85 280 415 -48 -42 208
1583 208 124 -19 273 -258 -389 -100 209 -200 -283 -196 108 -120 39 126 -328 222 752 191 -153 76 120 106
1605 106 117 -35 -86 -67 305 153 -366 -222 -18 -461 -132 190 -269 -179 187 -4 -115 138 432 43 -16 410
1627 410 204 -375 -49 264 -35 -91 101 -410 59 163 -188 -258 -279 324 42 -159 152 38 150 320 312 -200
1649 -200 -88 209 55 -18 -72 307 -281 79 69 -141 -232 -80 -53 9 197 178 -113 196 630 293 -34 -23 463
1672 463 -258 -237 373 -447 156 95 214 -438 77 -151 217 -94 -208 -25 -169 -198 1 -45 -130 245 -141 189
1694 189 27 47 -260 -193 -41 182 -97 -79 -2 31 50 132 -311 59 74 -1 -196 -42 182 23 -36 285 17
$$ packed form
1539C5l48K03L53m88j10j1K94l20L76J01j68l17O04M4l99M35J38n24K10N65o74
1560an01N02J29j06l9j1l34KO43l22o21M79N27n09L5K80j37O9J95J35m63OK50
1583B08q4j43K92n31j31K89L09m09q3Q7L04k28J59Q7m54N50N30n61l44K29M4j4
1605A06J1j52n1J9L72j52n19J44K04m43L29L22m59R0L66j91j11K53K94l89n9M26
1627D10k06n79L26L13k99n6J92n11M69J04l51p0k1O03k82k01L11j14J12J70qn12
1649b00J12K97j54p3n4L79n88L60j0k10r1J52K7O2J88j9k91L09M34l37l27J1M86
1672D63p21K1O10q20O03o1J19o52N15k28L68l11j14J83j44k9J99m6q5L75l86L30
1694A89j62K0l07O7J52K23k79J8P7L3J9Q2m43L70J5p5j95J54K24j59n9L21k68
$$ plain form
1717 17 -112 111 -205 -216 96 57 29 -32 -149 -230 35 -299 57 -24 -17 48 -150 469 -36 657 -299 230 -56
1740 -56 344 -109 -118 -205 2 56 381 -37 -97 137 -114 -151 40 74 56 -259 -98 134 173 -44 64 -143 -140 39
1764 39 -120 -380 362 -183 -10 -145 -113 197 -40 -124 -414 -24 -15 227 -166 -151 67 239 198 -25 -88 308 189
1787 189 -55 20 -90 29 -21 -117 -139 221 140 223 -18 -127 395 -105 90 -157 105 114 -237 -103 -102 27 -289
1810 -289 92 -108 -29 129 37 -241 -100 382 -333 391 -48 390 383 159 70 -357 -1 178 -87 49 92 -183
1832 -183 -239 -69 -270 117 -90 621 -499 281 226 75 42 -359 276 -202 -85 -292 191 -222 -389 -136 -189
1853 -189 131 -539 -570 -304 -223 704 48 -283 344 25 463 226 -363 -187 199 -69 112 -45 227 356 105
1874 105 -196 -260 -82 441 19 -317 -165 -168 274 -276 36 234 131 57 252 151 296 151 -19 -361 -138
$$ packed form
1717A7j29K23l16j1L12l9k8o1j17q1K65l34L56q1PO5j98O19n05O93r56N29k86
1740e6M00m53rq7K07N4L25m18o0K34k51l7J91L4j8l15J61K32L9k17J08k07LJ79
1764C9j59k60P42n45J73j35L2L10k37q4k90L90RK42l93J5K18J72m1k23o3L96j19
1787A89k44P5j10J19n0r6k2L60q1Q3k41j09N22n00J95k47K62Rl51J34JJ29l16
1810b89L81k00P9J58r2k78J41M82p15P24m39M38pk24q9m27L56J79k65J36M3k75
1832a83n6J70k01L87k07P11j120P80n5j51l3m01O35m78J17k07M83m13j67K53n3
1853a89L20o70l1K66Q1R27o56l31O27l19M38k37n89J76L86k68J81j57K72J29k51
1874A05l01o4J78N23m22l36J52lM42n50L12J98j03p4J95j01J45j45j70l42K23
$$ plain form
1895 -138 -96 167 -381 -225 373 342 -329 -65 353 297 234 -525 -458 197 496 -266 -453 208 333 453 -63 -279
1917 -279 -162 -436 -180 67 -291 -387 95 -157 215 340 201 -20 330 448 -35 -364 100 -300 157 180 109
1938 109 -398 -207 109 -126 -172 -119 -108 -25 -50 -119 -63 258 -100 -583 9 599 426 -145 -994 -174 -84 -285 -122
1961 -122 -191 -83 241 -44 -288 263 -174 217 -157 -71 123 212 142 64 -218 307 148 -293 -340 157 118 -187
1983 -187 -262 253 -14 -560 569 240 34 275 415 -145 -371 354 363 93 -47 -262 146 62 135 -402 64
2004 64 250 -107 175 -181 492 48 76 -108 312 195 90 205 -23 301 177 48 -193 -47 146 -37 -161
2025 -161 128 -17 29 -192 -40 -173 300 92 -160 -34 299 273 -214 -80 -79 -18 -88 -208 -120 89 88 -139 -368
2048 -368 57 153 -170 -80 24 86 2 115 -116 294 -37 144 -36 -139 -67 -75 -51 19 -254 -84 130 43 -321
$$ packed form
1895a38M2K63n48J56N98l1o71K64M18n6o3p59O7O55K99p62j87O61J25J20n16k16
1917b79J17k74K56K47l58r6M82k52L72J25j39k21L50J18m83l29M64m00M57K3p1
1938A09n07J91L16k35m6N3J1Q3k5o9N6L21l58m83N92N90j73n71q49Q20R0k01J63
1961a22o9J08L24k85k44N51m37L91l74Q6J94Q9p0p8k82N25j59m41m7M97l9l05
1983a87p5N15k67n46J129l29k06K41J40n60k26P25Rk70j40k15M08q4P3n37M66
2004F4J86l57K82l56O73m44K8j84M20j17j05J15k28L24j24j29k41J46J93j83j24
2025a61K89j45M6k21J52j33M73k08k52J26L33k6m87J34JO1p0j20Q8K09jk27k29
2048c68M25R6l23R0J04O2q4J13k31M10l31J81j80j03P2qK4P0k73J70K14q7l64
$$ plain form
2071 -321 -40 213 122 86 144 85 29 -47 -50 1 -14 -72 35 -160 188 154 -86 -232 -197 344 -182 -108 -217 86 -103
2096 -103 -86 -40 -255 312 167 66 -101 -3 126 39 -125 9 76 182 -106 -123 32 -3 -108 -112 62 100 -113
2119 -113 50 -33 282 190 118 -22 69 203 254 -64 8 154 86 92 -75 -49 118 -147 49 -169 -33 58 176 -41
2143 -41 -200 205 35 -110 278 -41 73 -11 127 -85 9 167 -66 5 -39 203 88 -190 -219 -12 66 -33 145
2166 145 -52 136 177 -4 -112 111 283 -24 -179 -191 -130 59 -220 -42 20 62 56 91 -112 173 62 67 -140
2189 -140 -57 -52 163 -178 -42 282 78 -56 4 71 169 2 25 29 -85 44 154 -185 -79 -46 10 -134 -39 185
2213 185 150 25 -9 -176 -207 154 30 -133 -66 28 -23 125 67 -344 -121 16 -9 -52 -16 18 34 45 -173 -9
2237 -9 82 68 166 94 35 -144 169 295 -6 82 -88 -30 123 102 15 -172 58 83 -13 -220 -31 -100 -91 166 -33
$$ packed form
2071c21K81K53r1l6N8n9n6p6lN1j5n8J07j95L48l4k40j46L5N41n26P4j09L03j89
2096a03J7M6k15N67j45j01j67R8J29q7j64J34O7J06k88j7J55l5j05mJ74L8k13
2119a13J63q3L15r2p2j40R1J34N1l18P2J46o8Oj67K6J67k65J96k18J36R1J18k17
2143d1j59M05j70j45L88l19J14q4J38k12R4J58k33P1m4K42j15k78k9K07P8r9J78
2166A45j97J88M1j81j08K23J72l07j55j2O1J89k79J78O2M2oL5k03K85j11Nk07
2189a40Q3NK15l41J36L24k04j34O0O7R8j67K3Mj14J29J10l39J06L3N6j44R5K24
2213A85l5j25l4j67l1L61j24j63O7R4n1J48n8m11K23J37k5m3L6L4J6J1k18J64
2237iR1j4R8p2n9j79L13J26l01Q8j70N8J53k1q7j87K30K5r6k07J89o9RK57j99
$$ plain form
2262 -33 -190 227 62 -1 -114 -168 -30 56 198 81 -271 90 -399 -78 -121 323 -250 22 260 -87 90 -2
2284 -2 78 -8 284 -97 -40 93 204 39 -95 -63 14 -106 -137 -101 -110 141 14 -31 -52 -95 -65 99 -221 -151 225
2309 225 -201 -146 -16 160 105 -44 -62 12 62 -107 -28 -83 45 18 -30 283 -52 113 147 253 -124 280 103
2332 103 -150 -46 -248 116 96 -194 82 147 20 158 -168 -123 20 42 -34 -159 135 -40 -198 -225 -9 87
2354 87 -16 85 60 -22 -69 -143 56 3 -110 -29 118 111 -114 -123 127 13 -137 -70 81 175 -203 -15 114 239
2378 239 90 -39 -141 -131 183 95 53 121 65 -44 57 67 151 17 -26 -1 -238 -12 -36 -83 43 182 -40 -5
2402 -5 66 134 -104 193 -80 -12 -257 -123 -88 -104 -61 157 49 88 159 203 91 354 -220 95 145 79 -198 94
2426 94 -108 115 -24 7 107 61 36 144 -87 123 80 -7 -48 14 86 -132 69 97 62 -33 58 35 121 -167 112
$$ packed form
2262c3j57M17j65o3j13n4J38Q6J42j17l52L61m89L21m3M44n73K72K38l47J77r2
2284bQ0q6K92l81N7J33J11j65j34L2P7j20l1L6rK51j27m5k1m3L0J64l20P0L76
2309B25m26N5J30J76n5j49j8P4N0j69P9n5J28k7m8L13l35J65L4J06l77M04j77
2332A03k53J04k02L64k0k90K76O5j27J38l26M5J43K2p6j25K94j75j58k7K16R6
2354H7j03J01k5q2m7p4J99n3j13Q1J47pk25rK50j14j50O7J51R4l78J88J29J25
2378B39j49j29j02J0L14q8m2O8n6j09J01J0Q4j34m3K5k37K26k4m7J26J39k22L5
2402eP1O8k38K97k73O8k45J34L5j6M3K18j08L9P1M4j12K63n74L15N0o6k77K92
2426I4k02K23j39L1J00m6k5J08k31K10m3q7m1O2P2k18K01K8l5r5R1k3Q6k88K79
$$ plain form
2451 112 -171 -10 21 77 38 -50 35 3 -70 140 -86 62 149 113 11 -12 -105 -85 44 -30 165 13 -23 103 44
2476 44 13 -24 169 58 214 -24 13 -188 -11 -84 14 12 13 52 38 145 -177 -197 -20 30 -51 -131 45 -34 10 186
2502 186 108 -84 -15 213 148 99 130 -108 -146 60 19 -73 -116 -64 76 127 61 -48 204 107 74 -131 -71 72 118
2527 118 -101 78 -19 25 -66 -8 226 -144 -101 11 -88 -98 -42 10 95 16 216 17 208 262 -60 46 -2 -10 71
2552 71 -123 74 239 -33 17 -9 -3 85 -349 78 -87 202 53 -98 -53 65 107 -1 54 83 359 -142 63
2575 63 201 45 174 -56 38 144 3 162 227 3 -56 -80 17 134 25 18 -101 -21 -56 120 51 -14 -2 -162
2599 -162 -55 -89 -241 -84 -17 -95 -175 -209 79 -123 54 361 204 3 354 124 -61 40 -41 -262 -112 121
2621 121 204 0 131 38 37 -167 -65 80 -101 141 -104 57 -20 70 -190 -42 94 -136 -137 79 -37 41 -113
$$ packed form
2451A12k83J61L1N6l9q8Q5l2p3K10k26J48Q7l6j02k3r3K0J29p4J95j52l6J26n9
2476D4l1l7J93j11J56k38L7k01J77p3R8kJL9j4J07l22k0J77N0q1q0J76p9M4J76
2502A86p8j92O9K28o5m9L1k38l8K06m1r2m3N2J40N1o6j09K52r7l3k05O0J43M6
2527A18k19J79r7M4r1N8K34l70M3J12r9j0N6N2Q5p9K00j99J91N4l22J06m8qQ1
2552G1j94J97J65k72N0k6OQ8m34M27j65K89j49j51M5J18M2j08N5K9K76n01K05
2575F3J38j56J29k30R4J06j41J59O5k24n9k4R7J17j09pj19Q0l5J76o9o5J2j60
2599a62J07l4j52J57O7p8q0l4K88k02J77L07j57k01L51k30j85J01q1k21J50K33
2621A21Q3k04J31r3jk04J02J45j81K42k45J61p7R0k60J48J36k30jK16j16P8j54
$$ plain form
2644 -113 -43 -6 -24 -7 63 -75 -30 -14 132 -19 119 119 -100 213 176 -48 -83 -124 42 -29 -95 263 193 -12 51
2669 51 -26 -141 190 66 44 138 -40 -80 53 -105 19 58 -98 -84 89 -306 30 -90 34 134 -117 -120 12
2692 12 1 -110 -63 27 108 215 80 -119 9 -65 82 129 -122 36 99 50 -128 2 -127 -66 2 50 8 -84 5
2717 5 -18 86 -196 -28 -130 -31 -123 -190 31 31 165 20 1 133 17 -124 -38 33 76 66 62 201 173 -50 -174
2742 -174 195 105 231 171 91 -93 -206 70 -122 -5 -269 -51 51 -109 -194 -113 122 47 20 -140 30 -53 -145
2765 -145 91 -65 12 198 -296 -246 68 -31 -73 33 37 8 94 -14 111 -176 113 138 -133 108 -3 -25 -64 19
2789 19 -33 174 -54 -42 169 -8 -48 37 92 61 56 162 29 61 -23 40 34 21 73 -42 200 -157 217 96 45 -96
2815 -96 27 -105 -62 154 -71 0 -1 97 53 148 -187 123 53 -74 82 26 206 82 -97 -240 -153 -32 35 135
$$ packed form
2644a13P0L7j8J7P0j38M5J6J46j51J38%k19L13l7k24l5m1J66p1o6L58p0k05O3
2669E1p7j15L31j24k2R4j78m0J33j58J24L9j56J4J73l95L36j20J24J00k51lJ32
2692A2j1j11M7R0Q1J07j35j99J28p4J47M7k51J58O3m9j78J30j29O1O8M8m2r2Q9
2717Ek3J04k82J68j02R9r2o7K21%J34j45j9J32j16j41Q6P1M3j0mJ39k8k23j24
2742a74L69r0J26o0q0j84j13K76j92J17k64K18J02j60q5Q1K35p5k7j60J70q3r2
2765a45K36j56P7J86m94N0L14r9m2J06Mk9Q6j08J25k87K89K5k71K41j11k2l9Q3
2789A9n2K07k28J2K11j77m0Q5N5l1nJ06j33L2q4O3oj3N2j15K42l57L74j21n1j41
2815i6J23j32M3K16k25P1jR8m4R5l35L10p0j27J56n6J80j24j79j43Q7J21O7J00
$$ plain form
2839 135 -12 207 -6 113 -50 -101 -70 92 -197 -122 117 -85 40 67 -87 18 181 148 110 42 85 100 -38
2862 -38 197 -59 160 90 -207 71 257 54 195 35 -32 -145 22 222 -96 65 -378 65 91 48 -25 154
2884 154 -109 2 -163 -71 -52 -54 14 41 -92 98 25 -262 17 -115 60 136 346 -81 -43 -43 205 -96 42 -14
2908 -14 9 -94 -171 105 130 -99 -1 76 54 58 -38 78 0 -121 244 -91 -127 15 28 20 -182 -26 78 -36 -101
2933 -101 44 28 -64 21 88 25 -46 -169 -51 146 21 -112 56 42 63 10 -41 -146 90 -206 23 -29 -44 138
2957 138 165 25 27 85 -64 -259 -4 -72 -167 146 -156 84 -138 143 224 -31 113 59 -85 -46 -26 104 100 -48
2981 -48 -73 -164 -24 -30 57 -104 33 -27 -36 -124 -51 200 -128 34 56 2 -28 65 35 55 117 116 -40 -107 30 21 -6 -43
3009 -43 66 150 -6 37 76 225 44 127 -48 -67 -61 26 -101 -132 27 -174 -46 47 44 -53 72 -65 -49 227 -67
$$ packed form
2839A35j47K19k13J19j63n1L1J62k89P5K39k02J25K7j54J05J63l3l8o8M3J5j38
2862c8K35k56K19p0k97K78J86k03J41j60o7j13J67K00l18J61m43M43K6m3p3J79
2884A54k63J11j65R2J9kO8K7j33J90p3k87K79j32J75P6K10m27L8%K48l01J38n6
2908a4K3j03p7K76K5k29R8P7k2Mr6J16p8j21L65l35l6J42J3qk02J56J04j14o5
2933a01J45j6r2Q5O7o3p1j23J18J97j25j33J68j4K1n3n1j05K36k96K29n2j5J82
2957A38K7j40KN8j49j95K55o8r5L13l02K40k22K81Q1k55J44n4j44L9K0J30mj48
2981d8k5r1J40oQ7j61J37o0rq8P3K51l28J62K2n4l0R3l0K0O2jj56o7J37rk7l7
3009d3J09Q4j56M3L9J49j81Q3j75j9OQ7j27l1J59k01J28R3lr7J25j37J6K76k94
$$ plain form
3034 -67 -209 -20 -262 69 -18 -54 83 47 67 -40 108 -175 27 30 66 48 81 17 68 -12 -41 251 -122 97 156
3059 156 -71 -125 -130 -90 159 -90 78 283 -169 -297 30 8 199 79 -143 -150 -79 36 -160 9 69 -76 26
3082 26 260 -93 -171 -58 7 75 198 113 91 -53 -92 -32 14 -31 2 50 -49 256 -130 -95 72 30 196 224 34
3107 34 95 -91 -62 -126 -99 -96 -13 72 -183 -158 -4 -216 -10 -55 -53 -13 -37 104 8 -184 14 42 -26 117 -25 -268
3133 -268 -92 4 83 142 -25 24 26 47 67 -155 23 3 40 22 -69 -113 -72 -24 156 108 68 121 -8 -124 -168 -17
3159 -17 -175 -156 -27 -283 -12 151 -207 -156 112 -24 32 111 -7 -121 51 35 146 -101 145 -137 -57 110
3181 110 191 90 -156 -82 -6 176 -50 -40 10 -44 220 148 -28 -34 24 -17 -94 166 19 48 34 -84 -42 95 112
3206 112 -54 -24 11 -18 171 6 16 -156 205 -8 120 -9 45 34 37 110 -90 -29 113 -15 12 0 26 104 -65
$$ packed form
3034f7j42J89k42L31q7l6J37l6K0j07J48k83K02LL6j8L3o4N1q0k9K92l73K19N9
3059A56k27n4nM0K49k49J68K05m52j28L27k2J91j20k22pP1J15j96J69O0j45J02
3082B6K34l53p8J13O5O8J23q5k2j44l9O0M6m5L3M8r9L05l86L5J67m2J66K8j90
3107C4O1j86K9o4K7LQ3Q5k55K5J54k12K06m5KM0k4J41r6j92J98K8o8J43j42k43
3133b68J76R6P9N9j67M9KK1K0k22J78k0L7j8r1m4M1M8J80m8m0N3j29j16m4J51
3159a7j58J9J29k56K71J63l58N1K68j36N6P9j18j14J72j6J11k47K46k82Q0J67
3181A10Q1j01k46P4P6J82k26J0N0n4K64p2j76oN8m1p7K60j47K9j4j18M2J37J7
3206A12j66L0L5k9J89j65J0j72L61k13J28j29N4j1LP3k00O1J42j28K7j2K6P8j69
$$ plain form
3231 -65 -159 71 13 -54 -102 -35 -64 -290 105 -17 -113 -203 105 168 -71 -67 81 -37 -46 178 -236 -184 146 7 -19
3256 -19 -56 83 -181 -102 -10 -108 -11 184 -114 51 136 -43 -95 -70 -63 8 109 -46 169 -23 -103 -206 66 -110
3280 -110 -62 -52 -129 -44 -139 -208 -9 141 103 -32 -239 50 189 189 11 84 -80 -153 -108 -139 -76 -78 51 -63 -16 246
3306 246 -110 37 83 -28 -86 -98 59 -29 -73 240 156 53 106 -43 182 -98 -2 -54 -97 108 -116 103 19 32
3330 32 -20 59 40 42 -49 24 262 -16 -97 20 -120 -87 40 43 34 -75 71 8 52 209 -27 111 -52 142 -84
3355 -84 -103 -173 -27 35 -87 -54 -243 -166 56 -13 57 -80 -233 42 26 67 -77 -106 -121 65 64 -143 -214 -106 -53
3380 -53 -2 167 -57 34 143 -14 62 -66 23 58 130 95 -95 -138 16 -219 113 22 19 4 -181 -120 -68 39 138
3405 138 58 -127 236 -84 137 191 34 -101 0 -5 43 -6 -83 -182 81 203 -126 108 -108 -198 48 163 -107
$$ packed form
3231f5r4K30n8o7m8O7k9k26L95j22r6r0L08O3k39MJ48j18rK24m14N2L30j39k6
3256a9l7J39k64P9R2r8R7J95k98J65Q5j79n2K5PP1J01j55K15j92q0j03K72j76
3280a10M8J0p7Q5r5o9J99J50l8j35k07K89J39%j78P3j64p3M5l1O3kJ29j14M7K62
3306B46l56J47M6j11n8j2J57q8m4L13q4j03N3j49K25k80R6n2m3K05k24K19q4J3
3330C2n2P9j9Kr1P3K38k78q1J17j40L3J27Lrj09J46o3M4J57k36J38j63J94k26
3355h4j9p0J46O2j22L3j89P7K22o9P0j37j53K75j6M1j44k9j5J86jk07p1J08N3
3380e3N1J69k24R1J09j57P6j28Q9L5P2l5j90m3J54k35L32r1lj5j85O1N2J07R9
3405A38q0j85L63l20K21N4j57j35J01nM8m9p7r9K63J22l29K34k16r0K46J15k70
$$ plain form
3428 -107 163 19 -205 -7 40 38 118 84 148 -128 -163 36 13 -162 81 148 15 -131 -121 -177 96 109 -58 -77
3452 -77 -42 -117 -18 -80 -105 35 -69 136 73 49 3 -109 163 59 -135 -135 91 83 -19 31 16 4 66 220 139 68
3478 68 60 225 -121 -90 -24 -2 36 10 -100 -132 123 -75 44 93 59 23 -59 27 74 -44 -63 -1 284 -16 168 211
3504 211 23 -74 -12 -116 17 28 14 30 -4 57 -93 -130 137 -73 120 -35 -123 -87 -28 129 90 58 -229 31
3528 31 -4 46 218 -70 -7 -53 -142 -103 79 71 -14 -27 -7 66 -11 24 87 104 78 142 9 147 43 -358 173 -18
3554 -18 150 23 178 -251 29 44 -224 75 -153 141 -119 -106 93 49 -13 17 -23 -27 146 197 38 -169 220
3577 220 58 -140 -135 -132 -43 -59 -243 -45 -23 85 -176 -73 -49 -99 -162 183 87 230 -87 -109 -32 -150 -67 -60 -80 -83
3603 -83 -2 -33 108 214 -186 82 -277 -111 54 274 -73 127 -121 2 -24 16 130 210 63 -85 -45 276
$$ packed form
3428a07K70j44k24J98M7kQ0l4O4k76l5J99k3j75K43O7j33j46J0n6K73J3j67j9
3452g7L5p5R9o2k5J40j04K05o3k4m6j12K72j04j94%K26qj02N0j5j2O2J54q1p1
3478F8qJ65l46L1O6K2L8k6j10l2K55j98J19M9l4l6q2Q6M7j18j9O2K85l00J84M3
3504B11j88r7O2j04J33J1j4J6l4O1j50l7K67k10J93j55q8L6N9J57l9l2k87K60
3528C1l5N0J72k88O3m6q9L9J82qq5j3K0P3p7L5O3J7k6O4j33J38j04m01N31j91
3554a8J68j27J55m29K80J5k68K99k28K94k60J3J99m4o2L0m0mJ73N1j59k07L89
3577B20j62j98NLQ9j6j84J98K2J08k61J03K4n0o3L45r6J43l17k2P7j18Q3Pk0l
3603h3Q1l1J41J06m00K68l59J66J65K20l47K00k48J23k6M0J14Q0j47j48M0L21
$$ plain form
3625 276 -55 -150 139 -15 -37 -312 154 -84 -34 52 119 73 64 -34 72 4 -134 14 50 -98 -151 4 -53 29 126
3650 126 20 163 137 -176 -1 -41 87 6 6 -45 -135 113 38 51 -225 8 -26 -15 89 -11 81 -56 49 95
3674 95 27 -107 -83 -133 -20 -28 41 -114 25 50 -103 11 -229 -43 -52 -119 129 19 28 -38 -36 -18 -18 -69 -204 257 -73
3701 -73 -211 -23 -7 47 92 -137 22 195 -178 -30 -112 -80 69 72 35 30 81 -11 73 86 -253 -20 3 -13 -16 96
3727 96 -117 117 94 5 18 -11 -64 -251 -39 51 -19 141 -26 23 148 -6 97 -190 -23 -95 -38 -33 -53 192 80
3752 80 -11 28 38 -51 39 -16 -165 -98 -60 111 50 13 21 256 -25 -19 78 55 113 -321 -334 -81 4 -146 -23 155 189
3779 189 220 139 163 177 26 -128 -47 249 -139 -99 -6 -27 82 -80 -68 -80 -11 -15 145 -49 16 169 -52 4 -229
3804 -229 -102 -118 65 309 -36 -90 133 -73 63 291 -144 -165 74 -116 120 138 38 -72 108 -153 -101 74
$$ packed form
3625B76l31r5K89j54k2k75M66k38N0Q6O7m6rr8J06o8j38J48L6j48n3J55n7Q2R7
3650A26j06J43k6l13J75m0J28q1%n1r0K48p5J3k76K33l4J1J04j00R2j37J05M6
3674I5o8j34K4n0J13qO9j55J39K5j53J14k40J86ro7K48j10Ro6KJ8%n1j35M61l30
3701g3j38J88J6N4M5k29J59J73l73J48q2L2J49Ll7nN1r2Q4J3l39K33K3j6lJ12
3727I6k13K34k3q9J3k9n3j87K12R0p0J60j67M9J25j54J03k87J67p2N7Nk0K45j12
3752H0r1L9J0q9R0n5j49O7L8J71o1l7QK35k81OR7k3N8m34j3K53Q5j50J23J78L4
3779A89L1q1K4J4j51j54Q1K96l88M0R3k1J09j62J2j2O9mJ60j94O5J53k21N6k33
3804b29J27j6J83K44l45n4K23k06J36K28m35k1K39j90K36J8j00j10J80k61N2J75
$$ plain form
3826 74 164 -25 -173 -105 144 -64 -136 91 -90 93 7 137 -50 -91 -83 104 56 80 -15 -42 13 139 263 -8
3850 -8 217 -130 38 -32 -149 154 -33 -103 40 -64 -38 -79 15 87 216 86 75 47 149 12 104 -73 25 -73
3874 -73 45 123 -72 34 -6 -66 290 -148 -94 -168 -148 85 231 -122 -2 -160 59 116 93 75 16 -28 203 31
3898 31 -60 -77 45 42 -247 65 -25 31 -30 -145 31 146 -163 -67 9 5 -9 -100 -32 -57 169 275 72 24 130 134
3924 134 -90 43 169 255 144 -12 57 0 51 -217 -8 144 33 -72 -92 96 -43 -216 87 -26 -237 -102
3946 -102 129 -105 38 96 32 -89 -16 -43 62 -77 -62 99 45 -146 -41 -102 -98 77 -8 -28 65 -8 154 -261
3970 -261 -13 78 -18 -41 -44 55 101 59 1 35 -65 281 -66 -254 78 123 60 -6 34 -51 -43 49 -118 -2 -102 65
3996 65 -155 6 -124 -199 37 103 -138 -200 -214 -231 -17 8 -64 -190 255 25 -192 30 150 183 -58 57 -183
$$ packed form
3826G4R0j89j48O8K49k08p2K27j81J83q6J30j87m1QJ87m8K4r5k7N5J26J24k71
3850hK25l47J68p0j17L03j87p0J43j04K6m1R4P2J29j30j1k8J02j37R2j77R8r8
3874g3J18P8j95J06m0o0L56m38N4p4K0K33J46l53J20j58K19N7k3j8n9m4K31j72
3898C1r1j7J22lk89L12r0N6o1j15J76J15l09R6P6mj4r1O8k5K26J06k03m8J06M
3924A34k24J33J26Q6j11j56O9n7N1k68K09J52j11j05k0J88j39j73L03j13k11J35
3946a02K31k34J43N8o4j21P3k7J05j39J5J61n4j91J05o1MJ75q5k0R3p3J62m15
3970b61K48R1r6k3lR9M6m2n8L4j00L46l47j88L32M5o3o6M0q5QR2j67J16j00J67
3996F5k20J61j30p5K36O6k41o2j4j7K14K5p2j26M45k30k17K22J20L3k41J15k40
$$ plain form
4019 -183 95 -94 62 103 -105 -82 3 75 -137 -68 -18 -10 -193 22 63 -48 54 -70 167 -72 44 143 57 185
4043 185 -176 -55 -20 -51 41 -120 58 87 1 -77 -127 116 -6 -50 61 -46 35 22 27 -65 -64 84 -160 65 -14
4068 -14 -100 251 126 -104 130 -66 -62 163 -245 89 107 -54 90 -57 -205 17 56 -64 184 25 -26 4 -122
4091 -122 25 1 -59 -248 133 -45 114 104 -17 239 188 123 63 196 -107 120 1 18 182 -157 59 12 -46
4114 -46 -34 98 15 -168 50 121 -30 -18 60 13 116 -5 -76 8 -38 -121 -181 4 -53 -264 -49 -31 9 -18 145
4139 145 173 -173 168 -102 -69 118 -181 15 122 120 -36 -43 -37 66 -177 -153 15 166 34 28 -7 -149 -252 24
4163 24 87 127 -114 64 67 -96 -10 -138 -49 -134 -192 151 -20 -146 141 -113 55 -99 -116 -10 -52 -66 47 -55
4187 -55 -16 -300 -126 56 54 -72 243 -89 -45 -62 -59 30 -46 53 -8 -143 -191 82 -21 -8 -132 27 -108 95 153
$$ packed form
4019a83K78j89J56M1k08K3Q5P2k12O9N0Qj83K15M1j11J02j24K37k39J16R9q6J28
4043A85l61J21L5l1R2j61J78K9q6p8n0K43j22m4J11j07Q1j3Nr2JJ48k44K25p9
4068a4q6L51j25k30K34j96MK25m08L34J8j61J44j47j48K22L9j20K48j59n1L0j26
4091a22J47k4o0j89L81j78J59j0j21K56n1o5o0J33l03K27j19J7J64l39K16m7n8
4114d6J2J32q3j83K18P1j51J2P8m7J03j21p1Q4m6q3o0J85n7k11K15J8M0k7J63
4139A45K8l46L41k70L3J87k99J96J07kj56pOJ03k43K4J68J51j32ol5j42j03K76
4163B4O3M0k41J78Lj63Q6j28Q9q5n8L43j71j26K87k54J68j54j7J06m2j4J13j02
4187e5L9k84J74J82kj26L15l32M4j7LQ9p6R9o1j35m8K73j03J3j24J59j35K03N8
$$ plain form
4212 153 -33 99 -234 110 58 -92 -42 70 1 -66 23 -218 -132 -38 -73 122 -106 50 72 7 -12 -168 -127 96
4236 96 -129 174 33 68 131 -8 55 171 -75 -144 10 -126 -50 91 -32 -69 -46 -105 120 -146 -78 -135 119 61
4260 61 -181 -6 -1 -31 66 47 -74 -28 182 179 165 -8 -133 -196 -129 109 -16 -86 -85 -14 8 177 45 119 24 -228
4286 -228 1 -4 82 45 -180 224 -91 -99 41 36 3 89 -137 148 -93 19 10 -217 -203 -74 -25 265 29 74 139
4311 139 -149 -33 -3 -82 -157 37 -113 -77 -113 88 -8 21 41 -26 37 12 -181 37 84 -192 -194 -48 133 71 48
4336 48 208 -76 -129 301 4 -137 87 -373 -31 63 307 78 41 136 -70 22 9 176 32 -37 -233 -90 -16
4359 -16 230 24 14 -220 113 -2 8 -148 136 25 -135 -101 -227 41 -179 -161 -132 -16 94 -65 -154 201
4381 201 46 189 64 12 42 101 -7 -16 -123 -12 -70 18 -75 -161 68 118 -49 177 -194 -61 -39 -32 52 65 15
$$ packed form
4212A53j86J32l33L44n2j50N0J12o9o7Q9k41Q6R4l5J95k28J56K2o5j9j56M1K23
4236I6k25L03j41L5O3j39O3J16k46o9J54j36P6J41j23l7K3n9K25k66O8n7K54n8
4260F1k42J75Nl0R7j9j21M6K10lj4j73j25o3O7K38j25p0JP1K2J69j32P4r5k52
4286b28K29nQ6l7k25M04l15qJ40nl3Q6k26K85k41J12rk27J4J29M9K90k36M5O5
4311A39k88J16L0p9p5J94j50L6l6K01r6K9K0o7O3k5j93K18M7k76kJ46J81o2k3
4336D8J60k84n3M30k97j41K24m60L42R4K44k29l7R5k06R2j3J67j44o9j96J43P4
4359a6K46k06j0k34L33j15J0j56K84j11j60L4j26K68k20J8K9J16J10j59q9L55
4381B01j55J43j25n2L0N9j08rj07J11n8Q8r3q6K29N0j67K26l71J33K2PQ4J3n0
$$ plain form
4406 15 -101 180 66 90 -40 -53 171 -15 -69 42 -78 55 68 22 2 -207 -65 -67 18 58 -42 -6 -122 7
4430 7 -214 41 -112 45 -300 -306 101 143 -38 -97 -142 157 122 -31 -89 -209 143 46 150 19 41 -49 20 -18 179
4455 179 -48 62 12 52 33 137 90 -121 96 14 218 64 19 -135 -109 -110 11 28 -154 -117 -84 78 48 159
4479 159 150 56 63 110 141 -33 82 -29 43 -114 11 58 -246 29 95 7 84 34 -130 -70 -121 118 35 174 148 -194
4505 -194 45 -50 30 -216 -180 -200 -98 -155 1 -48 13 -68 -174 -11 -177 67 196 237 -69 159 -137 -78 189
4528 189 -38 -9 131 -12 6 -116 29 -138 58 8 112 122 88 -148 -105 -14 174 171 66 -256 90 312 31
4551 31 -10 89 -159 -120 83 151 -9 -71 83 60 72 146 76 46 60 48 -101 171 5 -314 -68 66 -2 -160 92
4576 92 -8 57 57 -1 -15 64 -143 161 -20 46 -87 35 -20 -60 169 -130 263 -175 -83 4 161 82 241 240 -82
$$ packed form
4406A5j16K81j14K4j30j3K24j86n4J11j20J33J3m6k0k09J42kQ5M0j00L6j16J29
4430Gk21K55j53J57l45oM07M2j81n9m5K99l5j53n8j20L52r7J04j31K2r0O9l8J97
4455A79k27J10n0M0j9J04m7k11K17q2K04j54m5j54K6jJ21J7j82L7L3J62l0J11
4479A59rr4PM7L1j74J15j11P2j57J25M7l04K75O6q8P7n0j64O0n1K39q3J39k6l42
4505a94K39r5Q0k46L6k0J02n7J56m9O1q1j06J63j66K44J29M1l06K28k96N9K67
4528A89k27K9J40j43J8j22J45j67J96n0J04J0l4k36M3R1J88lj05l22L46K22k81
4551C1m1R9k48L9K03O8j60o2J54k3J2P4p0l0J4j2j49K72j66l19K46J34o8j58K52
4576I2j00O5%n8j4P9k07L04j81O6j33J22n5m0K29k99L93m38R2Q7J57p9J59jl22
$$ plain form
4601 -82 197 149 40 -93 324 185 -34 -89 16 -122 124 -59 27 29 -200 -361 -153 155 195 277 468 269 -63
4624 -63 -281 -149 310 217 181 -141 39 10 -197 -134 54 52 76 67 -19 115 210 22 -38 -11 39 74 126 -143 68 111
4650 111 -100 20 -95 -121 42 -256 -354 -184 329 -275 242 -287 -301 -46 675 477 -195 -354 -206 -157 94
4671 94 75 -250 -282 44 -567 700 -116 -244 416 225 330 -713 -182 281 -37 326 332 -207 410 544 208
4692 208 -372 625 285 71 -145 353 -179 68 130 244 306 650 -160 146 480 147 -253 132 -193 60 -47
4713 -47 169 119 -13 -11 14 -79 362 2 -112 38 262 -96 -166 15 120 -915 -202 345 366 -181 -310 -6
4735 -6 -105 330 1079 730 -50 327 -735 334 48 -3 -40 -243 142 0 57 37 156 146 -534 204 330 -126
4757 -126 295 238 -600 -259 -1 -94 -79 267 231 303 63 66 278 867 466 -29 287 -153 48 0 565 20 -76
$$ packed form
4601h2K79m8j09j33M17j39k19n5J05j38K46j83Q6Kk29j61K08L08M0Q2J91j99l32
4624f3k18J32M59r3l6l22J80k9k07O3J88kK4rq6J34R5j88o0K7N0L5N2k69K11M3
4650A11k11J20j15k6J63k98r8J70N13o04N17n29j4K55P21j98o72j59J48M9K51
4671I4j9l25l2L26o11J267q16j28O60j91J05j043N31M63l18L63On39O17J34l36
4692B08n80R97l40k14k16M98n32K47O2J14O2L44q10L06L34l33m00L85l25K53j07
4713d7K16n0j32KK5r3M41l60j14J50K24l58p0J81J05j035P13N47K1n47j29L04
4735fr9M35P49l49p80L77j062J069k86n1l7k03L85j42N7k0J19j0o80P38J26m56
4757a26M21n7q38L41K58r3J5L46l6P2k40LK12N89m01m95L16m40K01m8N65n45r6
$$ plain form
4780 -76 -297 301 112 575 81 199 -179 -58 -205 193 69 186 -377 367 627 -38 -104 493 -415 -200 -214
4801 -214 -209 -534 -169 40 -298 67 -99 332 261 18 -173 236 -307 7 -139 -382 -338 150 -599 72 -310
4822 -310 430 -378 259 -164 49 321 286 98 110 224 -162 14 29 -467 162 -160 -213 -141 465 171 283 236
4844 236 -276 -290 334 379 171 -385 473 -41 -96 89 209 -191 166 -40 169 249 -102 -572 166 27 299
4865 299 -237 -428 -254 709 62 354 -401 239 -426 492 298 -303 336 -753 256 417 332 -243 -258 222
4885 222 -29 -195 -378 -119 507 124 370 250 155 -601 -344 192 83 -12 162 -43 86 125 157 -40 213
4906 213 -78 30 73 173 -175 -55 96 6 -48 4 7 103 -113 76 -52 -113 -85 -13 132 67 -5 72 -15 -58 4
4931 4 83 -77 -171 -135 -48 -140 279 -70 -185 -2 -140 -101 -101 23 73 -85 8 -110 -228 30 165 -16 250 -133
$$ packed form
4780g6k21N98j89M63m94J18l78J21j47L98j24J17n63P44K60o65o6N97r08K15j4
4801b14Nl25L65K09l38L65j66M31p1k43j91M09n43L14j46k43M4M88p49O71l82
4822c10P40q08O37m23K13K72l5j88J2J14l86J76J5m96O29l22n3P2O06k94J12m7
4844B36n12j4O24M5k08n56Q58n14n5J85J20m00L57k06K09Q0l51m70P38j39K72
4865B99n36j91J74R63o47K92p55O40o65R18j94o01O39j089J009J61q5n75j5M80
4885B22k51j66j83K59O26l83K46j20r5p56K57N36j09r5J74k05J29L9L2j97K53
4906B13k91J08M3J00l48J20J51r0n4N2LR6k16J89j28o1K8P2J45o5p2P7q7m3O2
4931DP9j60r4L6Q7r2M19l49j15J83j38L9%J24N0j58R3j18j18K58J35j81K66l83
$$ plain form
4955 -133 -248 75 -5 -103 -149 321 33 72 79 -58 -36 38 129 87 -96 61 -3 -306 -78 121 -94 70 -48 35
4979 35 -105 -77 26 91 73 -32 29 -2 17 -79 139 -118 -10 106 -84 -191 -139 20 -13 -99 -17 10 -95 -4 94
5004 94 23 -136 19 95 94 -49 -239 -190 -85 163 75 151 144 95 -7 -14 -11 -35 68 -13 -9 -126 97 -65 120 -4
5030 -4 96 88 -91 32 -8 148 84 87 82 47 178 -119 136 -190 -128 13 107 63 -199 -26 210 -18 -45 -309 209
5055 209 97 -67 -36 75 -54 1 73 -24 33 -63 -80 -7 -125 -6 -47 -18 182 -107 136 -138 -103 154 -22 58
5079 58 -49 36 25 -80 -202 78 289 94 -146 36 151 -102 -34 122 -34 22 135 32 -58 146 -37 12
5101 12 -89 -212 91 -137 10 -55 23 -51 -87 47 7 -121 -124 -48 17 50 164 -71 -41 -7 109 10 -9 106 2
5126 2 58 25 182 160 -175 177 86 80 16 166 78 86 -125 5 -209 -26 32 -58 103 -67 75 56 -14 67 -95 -82
$$ packed form
4955a33j15L23q0r8m6M70k88L9Pj37K2P4R1m2j83J57o4l03K28J99k15J64j18Q3
4979C5j40K8J03O5j8j05O1l1J9r6K18k57J08J16j90j07N2J59l3q6Q2K7j05R1R8
5004I4p1j59J55P6jj43j90M9J05K48q8P6pm9j02pLk4J03q1Mj17K23j62J85j24
5030dJ00qj79J23m0J56o4Lnl5J31k97K55l26O2J41R4m4k62J73K36k28k7k64N18
5055B09j12j64L1J11j29N5P2r7N7r6j7P3j18J19m1K9K00k89K43k74L5K57j76Q0
5079E8j07Q5j1j05j22K80K11j95k40J82J15k53O8J56j56N6J13j03r0K04j83M9
5101A2j01j23L03k28J47o5P8p4l6J34m0j28lP6O5L3J14k35L0L4J16r9j9J15j04
5126BN6l3J57k2l35L52r1oo4J50q8Qk11J30k14J83N8r0J61j70J42j9p0Q1j62J3
$$ plain form
5152 -82 -8 -24 -298 -61 -112 25 278 1 -200 177 105 -64 143 -47 30 163 -223 50 -21 -192 -130 -56 86
5175 86 -9 -119 -76 57 135 47 -125 -81 195 222 -107 -112 -225 -189 19 211 73 -96 85 146 -9 306 51 -20
5199 -20 150 61 -31 252 -2 79 -60 300 -37 -88 -141 200 215 -186 146 -30 147 129 -98 -108 -222 5 144
5222 144 121 59 -109 -21 -50 -60 6 -10 -82 68 323 109 -50 100 -117 12 -43 186 66 204 129 5 88 -102
5246 -102 52 -62 -123 -109 7 133 -1 -99 11 189 -232 92 217 24 74 -78 -18 -25 34 -1 -1 79 63 -12 44
5271 44 -11 16 -34 -48 -95 -10 116 88 -95 -87 17 -32 -17 107 22 -125 -193 -61 130 -3 44 -170 85 77 -6 115
5297 115 -20 -103 15 -29 11 32 42 -56 -22 -78 -184 -89 -29 75 -261 -154 -121 62 178 16 -101 -36 60 8 59
5322 59 -112 -25 100 63 -104 44 -30 28 -179 -35 -76 128 132 -173 -57 263 71 -28 -121 214 -4 44 156 106
$$ packed form
5152h2P4j6k74K37n1J37K53k77k01L77p2j69K07j90P7J33l86K73p1j71O2P4J42
5175H6r5j10M3J33P8q8j72M4K76K7l29nj13L6K08J92j38j69J81O1j55L15k55p1
5199b0J70q9r2K83k54Q1j39L60l37n1n3L41J5m01L32j76J77j8k27j0j14K27J39
5222A44k3o2j68Q8k9j0O6j6p2J50K55k14j59J50k17J29n5K29j20J38p5j24Q3j90
5246a02J54j14o1J4J16J26j34r8J10J78m21L24J25j93N0j52O0pN9l5%Q0j6p5N6
5271D4n5K7n0j4m7Q5J26k8j83QJ04m9J5J24q5j47o8J32J91j33M7k14K55qq3J21
5297A15j35q3J18m4M0K1J0r8L4n6j06R5O0J04l36J07L3J83J16j62j17O5R6n2N1
5322E9j71Q7J25l7j67J48p4N8k07J44m1K04Ml05J16L20j92r9r3L35k18M8J12n0
$$ plain form
5346 106 -106 -197 -104 86 -142 158 -128 -55 24 85 -54 3 -149 -62 -158 -5 -46 10 40 -174 77 -20 -157 -56
5370 -56 -87 -1 175 131 125 135 96 44 24 -6 251 121 35 202 -123 -20 -44 54 105 -203 -111 102 -96 14 -11 157
5396 157 -141 185 131 12 -82 8 -109 134 38 81 6 207 24 -93 -50 21 102 -7 25 79 47 -252 -152 59
5420 59 -132 -171 42 -205 296 -363 70 184 -168 -43 147 154 263 -204 49 183 232 30 -397 -43 -242 228
5442 228 214 -266 71 34 -226 48 105 -182 -135 -218 -87 -46 133 129 194 151 -12 65 194 264 4 116 -32 -110
5466 -110 61 15 -16 -77 220 84 38 85 119 46 -122 10 -64 -20 -16 -194 40 -64 31 -23 39 175 -54 52 59
5491 59 -83 13 -18 219 -180 6 -4 86 -10 98 206 111 116 -27 47 91 81 43 -38 -8 -65 -119 29 -69 -33 26 68
5518 68 50 -23 -136 -131 -228 51 2 -76 222 -126 277 -167 134 114 -20 62 28 115 -31 57 42 64 494 -170 65
$$ packed form
5346A06k12r1R3J90k28L00k86P3P9O1j39N7j52Q7r6J53m1N6L0k14K51r7j37J01
5370e6l1Q6J76m4oJ0l9n2k0l0K57j30q6J67l25J03k4R8N1l08R2K13j98J10k5J68
5396A57k98L26n4j19r4R0j17K43r6M3p5K01j83j17M3P1Q1j09L2N4l2k99J00K11
5420E9j91l9K13k47N01o59M33J14l52J25J90PJ09m67K53J34M9k02m27L54j99M70
5442B28j4m80L37l7k60K74N7k87M7q3J31M1J79mO5m3j63P7J29P0k60J12j48p8
5466a10J71m6l1o1K97j36m6M7L4p3j68J32p4M4Mj78K34j04R5n4O2J36k29J06P
5491E9j42R6l1K37l99J86j0R0r6J08J08r5Nj43P4M4j0l8q1L0n7n4J48r8L6N9M2
5518F8j8p3j13Nr7K79m9p8K98l48M03m44L01k0j34Q2l4Q7j46Q8j5K2M30o64K35
$$ plain form
5543 65 -88 148 -259 -263 172 -424 260 -78 -16 -286 -51 -56 20 199 -27 31 57 -198 196 -182 67 56 -134
5566 -134 -54 155 -167 29 -81 -55 -185 -97 14 21 172 82 -188 -74 94 2 69 -40 -178 54 66 20 -68 -49
5590 -49 59 -140 -80 0 -148 -130 -143 -73 12 96 25 -47 -130 -325 -154 -210 -3 -180 -12 -121 -65 43 -30 33 43
5615 43 -1 -132 38 -52 -105 143 122 -27 -67 116 71 13 4 178 10 -75 -131 -57 -106 -41 -176 -91 -172 -64 -28 72
5641 72 -15 14 -110 116 -69 29 -118 -41 -8 14 30 -121 -28 -53 107 -143 15 134 13 81 28 -144 158 -262
5665 -262 103 258 -55 -4 25 97 17 -17 177 -178 -56 -237 9 -115 101 76 40 -204 -129 -1 -74 57 238
5688 238 119 90 39 53 66 -167 -129 74 -94 22 -156 138 -20 -50 -21 -8 -44 -175 -28 111 110 -97 -75 80
5712 80 47 15 83 188 9 -90 -115 77 223 166 122 17 90 -89 98 -145 -172 77 112 -117 -49 -119 177 101 3
$$ packed form
5543F5j53K36m07mM35n96O84l38O2k70K35nP6J79k26N8K6k55L94l78K49j1j90
5566a34Q0K09l22J96j10K6j30Q8J11PJ51r0k70J14J68r2O7j09j38K32J2m6q8J9
5590d9J08j99O0Q0j48J8j3P0Q5Q4p1p2q3j95J71n6K07j77J68j09N6J08p3O3J0
5615D3m4j31J70r0n3K48k1j49m0J83m5n8rJ74j68q5n6P4m9O5j35Q5q1J08L6J00
5641G2q7K9j24K26j85R8j47P7L3K2J6j51R3k5J60k50J58J19j21O8n3j72L02m20
5665b62L65J55l13N1K9P2q0l4J94l55J22j81K46j24K16k5l6k44P5J28p3J31J81
5688B38j19k9n1J4J3k33L8K03j68J16j78K94j58l0K9J3l6j31J47J39jk07K2J55
5712H0l3l2O8J05j79r9k5J92J46n7m4j05P3j79J87k43k7K49L5k29O8p0K96p6r8
$$ plain form
5737 3 -94 45 106 -91 -81 9 -93 36 201 27 -267 217 -32 55 84 7 -170 56 330 -114 243 185 -52
5760 -52 51 31 0 35 -63 -71 40 -60 -9 215 147 -87 65 161 242 -29 -95 180 -26 110 141 -5 -103 11 -37
5785 -37 110 -146 1 -90 2 40 33 8 16 -1 -55 58 46 24 0 9 -148 1 -39 -43 -198 -68 121 102 212 227 83
5812 83 148 -272 164 251 -135 39 73 -54 -55 129 -33 47 104 39 -200 96 -45 70 54 -65 84 -175 36
5835 36 77 343 15 -36 -84 16 -93 -75 30 16 12 172 -75 73 136 211 97 -204 113 173 -26 -184 -172 128
5859 128 95 -41 99 198 162 25 162 -32 -15 16 201 96 -26 63 22 49 49 40 -156 111 122 229 -52 25 0
5884 0 -201 94 75 11 94 171 246 20 40 -120 223 88 102 137 116 168 30 23 86 126 -18 134 121 25 -128 -235
5910 -235 -166 -65 55 -224 189 -8 42 -70 43 37 235 -1 -64 85 -21 132 -216 105 45 36 -99 120 -11
$$ packed form
5737Cr7J39O1j97J0R0j02J29J65j74k94M84k49Q7K9p7j77K26K74m44L57n8k37
5760e2J03k0l1L5r8qJ11j00N1K24o8k34J52R6Q1k71o6K75k06J36L1j46r8J14m8
5785c7J47k56J47r1R2L8pk5Qj7n4J13j2k2k4Rj57J49m0mj55J30J89j9J10J5j44
5812H3O5m20M36Q7l86J74L4j27jJ84j62Q0N7o5k39K96j41J15j6j19J49k59K11
5835C6M1K66l28n1m8J00j09J8J05j4mJ60k47J48O3P5j14l01L17O0j99j58J2L00
5859A28l3j36J40R9l6j37J37j94J7L1J85j05j22Q9m1K7%rj96K67J1J07k81P7k5
5884@k01K95j9o4Q3P7P5k26K0j60L43j35J4L5k1N2j38pO3M0j44J52j3r6j53j07
5910b35O9J01J20k79M13j97N0j12J13oJ98k36o3J49j06J53l48L21o0rj35K19j31
$$ plain form
5933 -11 -56 -49 185 -192 -55 48 119 108 63 -123 -121 44 117 76 98 233 -53 112 -43 -47 46 -37 -86 -134 104 -80
5959 -80 -44 39 171 83 -10 16 -59 48 190 -39 -76 -50 -23 12 33 8 -13 83 -7 -70 21 -2 201 113 -6 -61 -41
5986 -41 112 211 104 200 -73 71 10 103 1 98 -51 -121 -39 81 94 23 40 110 -85 -61 104 95 -158 121 52
6011 52 79 72 281 35 73 -76 -121 35 71 120 56 203 -64 -67 118 -86 91 141 174 -31 160 -68 94 53 20
6036 20 -50 98 53 -108 11 13 29 138 197 -68 78 20 -26 30 33 314 -108 105 20 -37 -24 88 -52 8 -153
6061 -153 107 145 -17 -208 230 -68 -28 -401 -32 -6 1 19 2 32 -164 -10 -205 -219 -90 -191 -67 3 -66 182
6085 182 -11 -244 -14 76 0 -214 -56 -11 -111 299 46 53 403 -118 -108 -153 -66 -112 -71 -113 24 330 -75 -151
6109 -151 -40 480 766 100 173 -318 35 249 272 -315 -492 634 -42 103 -553 75 -173 -119 -124 -88 -120 -3
$$ packed form
5933a1m5PK34l77J37J03P1j1m5j86KJ65P3m1K2J35k86J65j55mR3q3m9m8K38j84
5959h0L6Q3J32q8r3K6p5J07J42k29l7K6K7L5K1k5k1R6r0o3R1k3K03q8j19n5K0
5986d1J53R9j07R6k73J44o1R3j02R7j49p0Q2J20J3p1J7P0j95K4J65rk53K79o9
6011E2K7pK09k46L8j49m5J56L6M9o4J47k67lJ85k04J77N0L3k05J91k28J62m1l3
6036B0p0J48m5j61J19KJ6J09N9k65J46n8m6N6LK81m22K13q5n7J3J12j40O0j61
6061a53K60L8j62j91M38k98M0l73L69K6PJ8j7L0j96J54j95j4J29j01J24P0o9K48
6085A82j93k33K30R0p6k14J58M5j00M10k53PL50n21J0m5Q7m6M1m2J37L06m05p6
6109a51J11N20K86o66P3m91L53K14K3n87j77J126o76J45o56O28k48N4nL6l2J17
$$ plain form
6131 -3 -156 175 106 8 -27 77 87 104 120 -128 -135 198 -66 -191 -105 -51 -39 194 -134 -120 163 117 9 -173 -7
6156 -7 18 110 163 91 -106 81 -193 69 -5 -31 -13 93 -158 -211 95 -49 30 144 -23 -235 -7 16 -101 107
6180 107 172 106 158 -71 -111 129 52 72 125 104 60 -54 -49 -147 117 -226 -143 -63 -57 -17 256 123 99 -58 -136 29
6206 29 -64 159 136 -44 131 -23 139 -21 55 -141 -18 -144 -29 -117 -61 9 10 -65 77 131 -210 -37 30 -43
6230 -43 101 56 29 -3 132 -92 -10 -1 -187 -22 -111 -34 -56 -68 -153 74 -231 -5 -2 -175 24 38 230 20 -168
$$ packed form
6131cj53L31o9r8l5J04J0J7J6k48pL33k64j25Q6N4J2K33l28J4K83m6j08j82J66
6156gK5R2N3p2j97J87k74K62p4k6J8J06k51n3L06j44P9J14j67k12K28K3j17K08
6180A07O5o6N2k29m0K40p7K0N3k1m4j14Nr8K64l43Q3Q0OM0K73j33k4j57p8J65
6206B9r3K23k3j80J75j54J62j60P6j96J23j26J15q8N6P0Jp5J42N4l41J73O7p3
6230d3J44m5k7l2J35k24Q2Rj86J65q9P7k2j2q5K27l05K26Lj73J99J4J92k10j88
$$ [...]
8191f9
##END NTUPLES=NMR FID
##END=
