##TITLE=1H_Pr Pht
 200.13MHz,CDCl3,
 8 sc
 
 11.11.2025
##JCAMPDX= 6.0         $$ Bruker NMR JCAMP-DX V2.0
##DATA TYPE= NMR FID
##DATA CLASS= NTUPLES
##ORIGIN= UXNMR, Bruker Analytische Messtechnik GmbH
##OWNER= pz
$$ XWIN-NMR		Version 3.5
$$ Tue Nov 11 15:48:07 2025 Russian Standard Time (UT+4h)  she@DPX200
##.OBSERVE FREQUENCY= 200.1313
##.OBSERVE NUCLEUS= ^1H
##.DELAY= (6, 6)
##.ACQUISITION MODE= SIMULTANEOUS
##.ACQUISITION SCHEME= undefined
##.AVERAGES= 8
##.DIGITISER RES= 18
##SPECTROMETER/DATA SYSTEM= spect
##.PULSE SEQUENCE= zg30
##.SOLVENT NAME= CDCl3
##.SHIFT REFERENCE= (INTERNAL, CDCl3, 0, 14.3821)
##AUDIT TRAIL= $$ (NUMBER, WHEN, WHO, WHERE, WHAT)
$$ ##TITLE= Audit trail, XWIN-NMR		Version 3.5
$$ ##JCAMPDX= 5.01
$$ ##ORIGIN= Bruker BioSpin GmbH
$$ ##OWNER= she
$$ F:/spectra/data/she/nmr/H-C/1/audita.txt
$$ ##AUDIT TRAIL=  $$ (NUMBER, WHEN, WHO, WHERE, WHAT)
(   1,<2025-11-11 15:46:28.98 +0400>,<she>,<DPX200>,
      <created by zg, POWCHK disabled, PULCHK disabled
       configuration hash MD5:
       00 E9 B6 7A A2 85 ED C7 34 08 36 98 17 FE 4E 26
       data hash MD5: 16K
       DE D7 10 F6 28 EB 57 3F 23 D5 FD 21 9A BD 4B D0>)
$$ ##END=
$$ 
$$ hash MD5
$$ 9E DA 08 8F C6 AE 77 77 EC BF 7C 33 7B F8 0A 20
##$RELAX= 
##$RELAX= 
##$RELAX= 
##$RELAX= 
##$RELAX= 
##$RELAX= 
$$ Bruker specific parameters
$$ --------------------------
##$DU= <F:/spectra>
##$EXPNO= 1
##$NAME= <H-C>
##$PROCNO= 1
##$TYPE= <nmr>
##$USER= <she>
##$AMP= (0..31)
100 100 100 100 100 100 100 100 100 100 100 100 100 100 100 100 100 100 
100 100 100 100 100 100 100 100 100 100 100 100 100 100 
##$AQSEQ= 0
##$AQ_mod= 1
##$AUNM= <au_zg>
##$AUTOPOS= <>
##$BF1= 200.13
##$BF2= 200.13
##$BF3= 200.13
##$BF4= 200.13
##$BF5= 200.13
##$BF6= 200.13
##$BF7= 200.13
##$BF8= 200.13
##$BYTORDA= 1
##$CFDGTYP= 0
##$CFRGTYP= 5
##$CHEMSTR= <none>
##$CNST= (0..31)
1 1 145 1 1 1 1 1 1 1 1 1 1 1 1 1 1 1 1 1 1 1 1 1 1 1 1 1 1 1 1 1 
##$CPDPRG= <>
##$CPDPRG1= <>
##$CPDPRG2= <>
##$CPDPRG3= <>
##$CPDPRG4= <mlev>
##$CPDPRG5= <mlev>
##$CPDPRG6= <mlev>
##$CPDPRG7= <mlev>
##$CPDPRG8= <mlev>
##$CPDPRGB= <>
##$CPDPRGT= <>
##$D= (0..31)
0 0.7 0 0 0 0 0 0 0 0 0 0.03 0 0 0 0 0 0 0 0 0 0 0 0 0 0 0 0 0 0 0 0 
##$DATE= 1762861588
##$DBL= (0..7)
120 120 120 120 120 120 120 120 
##$DBP= (0..7)
150 150 150 150 150 150 150 150 
##$DBP07= 0
##$DBPNAM0= <>
##$DBPNAM1= <>
##$DBPNAM2= <>
##$DBPNAM3= <>
##$DBPNAM4= <>
##$DBPNAM5= <>
##$DBPNAM6= <>
##$DBPNAM7= <>
##$DBPOAL= (0..7)
0.5 0.5 0.5 0.5 0.5 0.5 0.5 0.5 
##$DBPOFFS= (0..7)
0 0 0 0 0 0 0 0 
##$DE= 6
##$DECBNUC= <off>
##$DECIM= 32
##$DECNUC= <off>
##$DECSTAT= 4
##$DIGMOD= 1
##$DIGTYP= 9
##$DL= (0..7)
0 120 120 120 120 120 120 120 
##$DP= (0..7)
150 150 150 150 150 150 150 150 
##$DP07= 0
##$DPNAME0= <>
##$DPNAME1= <>
##$DPNAME2= <>
##$DPNAME3= <>
##$DPNAME4= <>
##$DPNAME5= <>
##$DPNAME6= <>
##$DPNAME7= <>
##$DPOAL= (0..7)
0.5 0.5 0.5 0.5 0.5 0.5 0.5 0.5 
##$DPOFFS= (0..7)
0 0 0 0 0 0 0 0 
##$DQDMODE= 0
##$DR= 18
##$DS= 0
##$DSLIST= <SSSSSSSSSSSSSSS>
$$ [...]
##$SUBNAM0= <"">
##$SUBNAM1= <"">
##$SUBNAM2= <"">
##$SUBNAM3= <"">
##$SUBNAM4= <"">
##$SUBNAM5= <"">
##$SUBNAM6= <"">
##$SUBNAM7= <"">
##$SUBNAM8= <"">
##$SUBNAM9= <"">
##$SW= 18.0517328524113
##$SWIBOX= (0..15)
0 0 2 0 0 0 0 0 0 0 0 0 0 0 0 0 
##$SW_h= 3612.71676300578
##$TD= 16384
##$TD0= 1
##$TE= 0
##$TE2= 300
##$TE3= 300
##$TEG= 300
##$TL= (0..7)
0 120 120 120 120 120 120 120 
##$TP= (0..7)
150 150 150 150 150 150 150 150 
##$TP07= 0
##$TPNAME0= <>
##$TPNAME1= <>
##$TPNAME2= <>
##$TPNAME3= <>
##$TPNAME4= <>
##$TPNAME5= <>
##$TPNAME6= <>
##$TPNAME7= <>
##$TPOAL= (0..7)
0.5 0.5 0.5 0.5 0.5 0.5 0.5 0.5 
##$TPOFFS= (0..7)
0 0 0 0 0 0 0 0 
##$TUNHIN= 0
##$TUNHOUT= 0
##$TUNXOUT= 0
##$USERA1= <user>
##$USERA2= <user>
##$USERA3= <user>
##$USERA4= <user>
##$USERA5= <user>
##$V9= 5
##$VALIST= <valist>
##$VCLIST= <CCCCCCCCCCCCCCC>
##$VD= 0
##$VDLIST= <DDDDDDDDDDDDDDD>
##$VPLIST= <PPPPPPPPPPPPPPP>
##$VTLIST= <TTTTTTTTTTTTTTT>
##$WBST= 1024
##$WBSW= 4
##$XGAIN= (0..3)
0 0 0 0 
##$XL= 0
##$YL= 0
##$YMAX_a= 86661
##$YMIN_a= -202525
##$ZGOPTNS= <>
##$ZL1= 120
##$ZL2= 120
##$ZL3= 120
##$ZL4= 120
##$ABSF1= 10
##$ABSF2= 0
##$ABSG= 5
##$ABSL= 3
##$ALPHA= 0
##$AQORDER= 0
##$ASSFAC= 0
##$ASSFACI= 0
##$ASSFACX= 0
##$ASSWID= 0
##$AUNMP= <proc_1d>
##$AZFE= 0.1
##$AZFW= 0.1
##$BCFW= 1
##$BC_mod= 2
##$BYTORDP= 1
##$COROFFS= 0
##$CY= -3
##$DATMOD= 1
##$DC= 2
##$DFILT= <>
##$DTYPP= 0
##$F1P= 0
##$F2P= 0
##$FCOR= 0.5
##$FTSIZE= 0
##$FT_mod= 4
##$GAMMA= 1
##$GB= 0.15
##$INTBC= 1
##$INTSCL= 1
##$ISEN= 128
##$LB= 0.25
##$LEV0= 0
##$LPBIN= 0
##$MAXI= 10000
##$MC2= 0
##$MEAN= 0
##$ME_mod= 0
##$MI= 1.114404
##$NCOEF= 0
##$NC_proc= 0
##$NLEV= 6
##$NOISF1= 3.799351
##$NOISF2= 2.8
##$NSP= 1
##$NTH_PI= 0
##$NZP= 0
##$OFFSET= 14.38212
##$PC= 1
##$PHC0= -2635.191
##$PHC1= 23.99236
##$PH_mod= 1
##$PKNL= yes
##$PPARMOD= 0
##$PSCAL= 0
##$PSIGN= 0
##$REVERSE= no
##$SF= 200.129724274929
##$SI= 16384
##$SIGF1= 3
##$SIGF2= 2
##$SINO= 400
##$SIOLD= 16384
##$SREGLST= <1H.CDCl3>
##$SSB= 0
##$STSI= 0
##$STSR= 0
##$SW_p= 3205.1282051282
##$SYMM= 0
##$S_DEV= 0
##$TDeff= 0
##$TDoff= 0
##$TI= <>
##$TILT= no
##$TM1= 0
##$TM2= 0
##$TOPLEV= 0
##$USERP1= <user>
##$USERP2= <user>
##$USERP3= <user>
##$USERP4= <user>
##$USERP5= <user>
##$WDW= 1
##$XDIM= 8192
##$YMAX_p= 0
##$YMIN_p= 0
$$ End of Bruker specific parameters
$$ ---------------------------------
##NTUPLES= NMR FID
##VAR_NAME=  TIME,          FID/REAL,        FID/IMAG
##SYMBOL=    X,             R,               I
##VAR_TYPE=  INDEPENDENT,   DEPENDENT,       DEPENDENT
##VAR_FORM=  AFFN,          ASDF,            ASDF
##VAR_DIM=   8192,          8192,            8192
##UNITS=     SECONDS,       ARBITRARY UNITS, ARBITRARY UNITS
##FACTOR=    0.0002768,     1,               1
##FIRST=     0,             0,               0
##LAST=      2.2672688,     0,               0
##MIN=       0,             -202525,         0
##MAX=       2.2672688,     86661,           0
$$ Real data points
##PAGE= N=1
##DATA TABLE= (X++(R..R)), XYDATA
0@%%%%%%%%%%%%%%%%%%%%%%Kj0J6j6J6j6J6j6K1k9L2l2L6m4M9n4O1o8P6q4R3j02
44e3J13j26J38j51J66j82K02k24K47k72K99l32L69m12M61n17N85o69P76r17J108
65F09j383J820k626M583j7756k0407M2313M3029K9378P101p323o668k195J68J0045
80H0688q612j9317j0347j9468k3932k455L209l268j8935k4604j698P165l198N191
94c9581m66j1086p42P106J2220J2397J011M567M851n208J1401K2685P729O02m299
109B3187m113N409N467J1774J0671j6248j8140J189K963L899P4j1598j2323j3840
123a1629m568R085n100j3157j204l866k701L846J84J760J668K007J2470K010o926
138a6121R362J1856L834K265k563L916R031N3K257k31o682M562K934r299l240
$$ plain form
0 0 0 0 0 0 0 0 0 0 0 0 0 0 0 0 0 0 0 0 0 0 0 0 2 -8 8 -8 8 -8 8 -8 13 -16 16 -16 20 -24 25 -29 32 -36 40 -44 49 -53
44 -53 60 -66 72 -79 87 -95 107 -117 130 -142 157 -175 194 -218 243 -274 311 -358 418 -499 609
65 609 -774 1046 -1580 3003 -14753 -35160 7153 50182 79560 86661 79338 72670 70475 70643 80688
80 80688 72076 52759 42412 22944 -988 -3443 -234 -3502 -22437 -47041 -48739 -41574 -44772 -39581
94 -39581 -40047 -51133 -51875 -44769 -32549 -20152 -19141 -14574 -9723 -14931 -3530 19155 26884 27486 23187
109 23187 19074 24483 29950 41724 52395 36147 18007 19196 22159 26058 26132 14534 2211 -11629
123 -11629 -16197 -7112 -12212 -25369 -26573 -30439 -33140 -29294 -29110 -27350 -25682 -23675 -11205 -9195 -16121
138 -16121 -6759 5097 8931 11196 8633 12549 21580 21633 23890 23659 16977 21539 24473 15174 11934
153A1934Q53R31m244j6328l643J1333k32o121o506q777L425O385j319j171m776
168a8256J319P410p519n129J1980R810L518l475p715N542J1120P594Q440o527
182A8112j1504L585M139L373L612o454p214o812n991Q449N597p589n982o970n112
197a6761O482N052J544k600j1995j835Q408L786P411K600q055k607K322P457J1971
212A3180n90n218j471o592K063J0064J264k225n998p908R64J228L412R101m457
227F817j1581l008L85Q713Q753n578q771p133m52J2361M642p790l105k578j61
242h486N345M18L415L510n806k671K014J815R794K915q782m553o86N692P386n095
258F225n357N71l889M98K373k242K030n72m541J32j461L084P936l036m964Q44
$$ plain form
153 11934 12787 13718 9474 -6854 -10497 836 604 -5517 -12023 -20800 -17375 -10990 -12309 -13480 -18256
168 -18256 -16937 -9527 -17046 -22175 -10195 -385 3133 -342 -8057 -2515 8605 16199 24639 18112
182 18112 6608 10193 14332 17705 21317 14863 7649 837 -5154 3295 8892 1303 -4679 -11649 -16761
197 -16761 -10279 -5227 -3683 -6283 -18278 -20113 -11705 -7919 -508 2092 -5963 -8570 -6248 1209 13180
212 13180 12590 7372 5901 -691 1372 11436 12700 10475 4477 -3431 -2467 -1239 2173 11274 6817
227 6817 -4764 -7772 -7387 1326 10079 4501 -4270 -11403 -11855 506 5148 -2642 -5747 -8325 -8486
242 -8486 -3141 -2723 692 4202 -1604 -4275 -2261 -446 9348 12263 3481 -1072 -1758 3934 11320 6225
258 6225 868 1439 -2450 -1952 421 -1821 209 -363 -4904 -4772 -6233 -3149 4787 1751 -3213 -2369
274b369j70M247L369l020k3j949k546M411r0k612K103k411j832K022j581K126
290c25J746l849K312J480k977K523N48o05K799k294j121J549k819K157K537m405
306g44l01L38k164K154o99n83L574l494k268L029m71L146K927m253j398M26Q57
323G6N386j715m088J452j826r57K837j931J66J008m102j7J164L54M936p14m707
340b678P43R52K977L830l509j495L33k226K251J556k888M97j376k900J613J33
356b187J780K848m163j534K459K33L297J705l714K5m46k36L494j742j616J431
372A634l324j008K100j100J006k90l169J697O51KL064j174j099K647r89J061J912
389C621j845J008M5k913J193L07j920J315j793j096J841j798K63J958k160J566
$$ plain form
274 -2369 -2539 1708 5077 2057 2034 85 -2461 1950 1860 -752 1351 -1060 -2892 -870 -2451 -325
290 -325 1421 -2428 -116 1364 -1613 910 1458 853 3652 1358 237 1786 -1033 1124 3661 -744
306 -744 -1045 -707 -2871 -717 -1416 -1999 1575 -1919 -4187 -1158 -1629 1517 4444 191 -1207 -781 76
323 76 5462 3747 -341 1111 -715 -1672 1165 -766 -600 408 -3694 -3711 -2547 -2193 2743 2029 -2678
340 -2678 -1935 -983 1994 5824 2315 820 1153 -1073 1178 2734 -154 343 -1033 -3933 -2320 -2187
356 -2187 -407 2441 -1722 -3256 -797 -564 2733 4438 724 749 303 67 3561 1819 203 1634
372 1634 -1690 -2698 -598 -1698 -692 -982 -4151 -2454 -1803 -1801 1263 89 -1010 1637 648 1709 3621
389 3621 1776 2784 2829 -84 1109 1416 -504 811 -982 -2078 -237 -2035 -1772 186 -1974 -408
405d08J213k007J043O41p06J658j198j134J846j674k47J934j582K69P79k482J580
422d75K09o64K150j117j505K207m89R34K027j579j15J074j922J730L85k672Q56
439A034j634j797J034j381j59R07k108M56J494p88K430J183j296J691L00j3J810
456C163j343l04J020j969j45Q10j731J209M6j590J075q7o26K165j367n95J638
473A369j537l47P40j895J270L78j582P09r71m74K026l02n67R97j704L58J858n90
491b64J545M70k318J310L15k02K387o95j185l8j604O52K463j593m50j220k319
508b746J766Q39l42Q13j987j199R29n00J503J949k038j111k31k7L489J308j635
525G80M0j568Q6L023M11O4l64l074m35J001M34K122r08l136p16K32J780L040j462
$$ plain form
405 -408 805 -1202 -159 482 -224 1434 236 -898 948 -726 -973 961 -621 -352 427 -2055 -475
422 -475 -266 -930 1220 103 -1402 805 316 1250 3277 1698 1583 2657 735 2465 2850 178 1034
439 1034 -600 -2397 -1363 -2744 -2903 -1996 -4104 -3648 -2154 -2942 -512 671 -625 1066 1366 1353 3163
456 3163 1820 1516 2536 567 422 1232 -499 710 756 -834 241 154 -472 1693 326 -269 1369
473 1369 -168 -515 225 -1670 -400 -22 -1604 -895 -1866 -2340 -314 -616 -1183 -186 -1890 -1532 326 -264
491 -264 1281 1751 -567 743 1058 856 3243 2548 1363 1325 -279 373 2836 1243 793 -427 -2746
508 -2746 -980 -141 -483 330 -1657 -2856 -1927 -2427 -924 1025 -1013 -2124 -2355 -2382 1107 2415 780
525 780 820 -748 -662 2361 2772 2836 2472 -602 -1037 -36 398 2520 1612 -1524 -2240 -2008 -228 2812 1350
544A350j574n75j396J809J736n34j14k025k231J306J274J027J266k495j390J086
560a480P57K303J234k057o51n51j30K488O06j036k6k204k52J856K96N83l96k769
578a429m38O06K09J654q26j884K04k43Q90J823p69K29J50j158J379R47j18P37
596A963j083j438N92l87M95P16j285j28N23r01Q51O19n16J336q89o80P98l94J85
615C77P88j282j98L74j002l8J87Q0P52m78j556P81N34P56J313j440l79K77K93
634A39J152O94p81p9q41j106J129M96K70j04k372o99Q64J061J379j01k044p01
652a644J92J046K036j78j167n58j243O72J962j19L65j291j913L31J230J019J231
669A971j593j687m15M74J913J555j568j095q90k02K158J211j31q63j819o51J477
$$ plain form
544 1350 -224 -799 -2195 -386 1350 816 702 -1323 -3554 -2248 -974 53 1319 -1176 -2566 -1480
560 -1480 -723 1580 2814 757 106 -445 -575 1913 2519 1483 1457 -747 -999 857 1153 1736 1340 -1429
578 -1429 -1867 -1261 -1052 602 -224 -2108 -1904 -2147 -1257 566 -203 26 176 -982 397 1344 1226 1963
596 1963 880 -558 34 -353 142 858 -427 -555 -32 -933 -82 537 21 1357 468 -212 586 192 377
615 377 1165 -117 -315 59 -943 -981 -794 -714 38 -440 -1996 -1215 -681 75 1388 -52 -431 -154 139
634 139 1291 1985 1204 1125 284 -822 307 803 1073 969 -1403 -2102 -1238 -177 1202 1101 -943 -1644
652 -1644 -1452 -406 1630 1452 285 -273 -1516 -844 1118 999 1364 73 -1840 -1509 -279 740 1971
669 1971 378 -1309 -1724 -1250 663 2218 650 -445 -1335 -1537 621 1832 1701 838 -981 -1632 -155
686a55J235N25q00j942r85P05R58J475J50j667j013k40J153K082L90r64j189r94
704a276P52J529M87k28j164j304J07N58P58P52r51q19l30m60J526J234m84p08
722b1q45k41J649O93l14l49j142l49J087K2N04l60p73j2k76l3J060L35l88m47
742b00p82M28J227o4P3n26p29P00L26j94J96j92m75J25k56j23M72k07K41K27p00
763d33j4L56J14L59lo75M56o3M9N72p92L63j3o75K57J28k91O60l46o66k7K04M34
786d6R12o25n73J9O0N24N04m26L7o13k40N60K93j3P0n59n13q0J72P07K47n40l56
809d79k58L28R29N46o42l77l34MP06n3J96o22l53k04K86K17M58j8q00l00J65M80
831a25Q84J6o68n22l10P70P51L8m25o55k87M96J94K31J5m92k89j09P5M30N02k50
$$ plain form
686 -155 1080 1605 805 -1137 -2122 -1417 -459 1016 1166 -501 -1514 -1754 -601 1481 1871 907 -282 -1276
704 -1276 -524 1005 1492 1264 100 -1204 -1097 -539 219 971 20 -799 -1129 -1589 -63 1171 687 -21
722 -21 -866 -1107 542 1235 921 572 -570 -919 168 190 694 334 -439 -451 -727 -760 300 635 247 -200
742 -200 -982 -554 673 609 682 156 -573 127 453 259 455 263 -212 -87 -343 -466 6 -201 40 267 -433
763 -433 -447 -91 23 382 379 -296 160 97 146 718 -74 289 276 -399 -142 -14 -305 355 9 -657 -684 -480 -46
786 -46 866 241 -332 -313 -253 271 775 349 386 -227 -467 93 386 373 443 -116 -629 -709 -537 170 417 -123 -479
809 -479 -737 -409 520 1066 424 47 -287 -283 423 370 566 -56 -409 -613 -327 -110 348 330 -470 -770 -605 -125
831 -125 759 775 107 -415 -725 45 796 834 409 -246 -533 -37 157 388 403 -89 -378 -487 -412 18 520 270
853B70n43k30J7P36J87q8k0r36K81N27K45K9l98l35j7K4J98K57j51k56J86m83
875e00K83O99j33m9k21k34K50MK56o7n69O9K05J9OK51k84L6k51O9K59j14M4Q5
899A13j12k47K96J33j60K76l71J04L2k0J35k53L0J41k68J19l7j50J43J92j60r4
921a58M0q0L30Q5Ok07q2N1K76k07r2J74k21L8l6j91M08M0l33K2J06j85L47J10
945B41k28K31n23J67M64m41m6J01R2J06p3Q9j54J58l33K17k26M0M3r0P5J10k66
968b46M50m2j3J08m03K9O8%K12j9k74L9q7J16K26j63p0k8K8K9M5J93l42J99j77
993a22J55P4J27k08j32K80k48K07J09oq0j74O6j65J61l93M51j28qN1o6J52j61
1016e8L9r6J60R0j56j08j7N6L03j90j27J01O9Pp8J07j31j30J06m9K20q8RP3k01
$$ plain form
853 270 -273 -503 -486 250 437 349 329 -607 -326 201 446 475 77 -258 -275 -251 -53 204 53 -203 -17 -500
875 -500 -217 482 349 300 79 -155 95 99 355 288 -281 -212 -7 12 18 269 -15 21 -230 -161 98 -16 28 113
899 113 1 -246 50 183 23 299 -72 32 64 44 179 -74 -44 97 -171 -52 -89 -239 -96 96 -64 -158
921 -158 -118 -198 132 217 223 16 -66 -15 261 54 -38 136 -85 -47 -83 -274 134 174 -159 -137 -31 -216 131 241
945 241 13 244 -279 -112 352 -89 -135 -34 58 164 91 180 26 184 -149 68 -158 -118 -75 -165 -90 20 -246
968 -246 204 162 149 257 -146 -117 -49 -49 163 144 -130 -91 -178 -62 164 1 -69 -97 -69 -40 5 198 -144 55 -122
993 -122 33 107 234 26 -106 174 -74 133 242 236 156 -18 48 -117 44 -349 102 -26 -34 17 -49 103 -58
1016 -58 -19 -115 45 135 -21 -129 -146 -90 213 23 -104 -3 66 73 -5 102 -29 -159 -53 -102 118 30 39 112 -89
1041h9N8J3m1n3P5n9N1l2l9J00l5J75j82j7J12K71l53M31l26j83L74m34K43q3
1065b3j29K08q8J9Q2m2O5k3m8J08o7j57o5J15QP3j61j15K47P8n5R5j13n4m4mQ
1092h2RL32l41p1n2N5K71r8J8J0J63j45N1j66j19K94J04j26k30K14J26m21P8J71
1116D5n5k3Q6j25R7l9J32k15J3N2J36j15p0K39k29J90k47K39m0j6j13j17J32J44
1140A01j59j18J56p6J01J5K59j64l87K62K19j80j96L70k40P0j89Q4L19l92L05
1161A60l28J19p8N3l0N4K24j87j90K16j21m2o5L92j01p5r3N2J14o9j21J57k1j12
1185i2K20j09nM7j49J66j03K07l08P2r5rK14P4p5m0m9J39K3j11K02l03M4J57J01
1210B18k21J43lk30P6L6j88N6n1J15J73k70L45l10J69N3m02K45J44n0q8K28p1
$$ plain form
1041 -89 -31 -18 -59 -112 -37 -96 -45 -77 -116 -16 -51 124 -58 -75 37 308 -45 386 60 -123 251 -183 60 -23
1065 -23 -152 56 -32 -13 69 27 92 69 21 129 62 -95 -160 -45 -37 36 -125 -240 7 85 30 125 12 -42 -86 -90 -82
1092 -82 -73 259 -82 -153 -205 -150 121 23 41 51 214 69 120 -46 -165 129 233 107 -123 91 217 -204 -126 45
1116 45 -10 -33 53 -72 25 -14 118 -97 -84 -32 104 -11 -81 158 -71 119 -128 111 71 55 -58 -175 -43 101
1140 101 -58 -176 -20 -96 5 20 279 115 -272 -10 209 29 -167 203 -37 33 -156 -72 247 -145 160
1161 160 -168 -49 -127 -74 -104 -50 174 -13 -203 13 -108 -150 -215 177 76 1 -92 -40 74 5 -116 41 20 -92
1185 -92 128 19 14 61 -88 78 -25 182 -126 -54 -149 -158 56 130 55 15 -34 105 128 17 219 -84 -40 117 218
1210 218 -3 140 137 -93 -17 19 -169 -113 -164 -49 124 -146 199 -111 58 111 -291 -46 98 48 -40 188 117
1233A17j95Q6j77p1L42j99J01j08J47R3k9M7r7j27Rjn7K0K29jK5m6o5m3N9l2K6
1260E3k68R7J03o7J74m7K1k53P4K15K70l82J82j69k05K31qj92J54Q1j14k7O2o6
1284h1m5K10r5j03j12L51P0k0r1k27pJ94j56K86P7l52J36k63K21J36p3r6mj65
1308b09M3J51J38k78n2J67l8J09P2j85q3J41QJ5j91M54j75l28J66KO1J3J45k48
1332a02R6k22K75P9j87J19J32j06q6r4J63j40L4J54m7r3K8K90m99J49k5J85j22
1355a9O8q6P8q6J38P9k45J49Q3k66J90l09K38J46m07J95K20m50M33j80K0j93M9
1378a55K26q0J58k44K92j94n0O6O8k2Kq6j99J90O7L0l87K91P7o5j80J73j7j26
1402a65K40j25L20j63k07J78r6N7L6j34j12L20q3j7j18j96J65j20J39J65o0K4
$$ plain form
1233 117 -78 8 -169 -240 102 -97 4 -104 43 136 107 154 57 -70 -61 -62 -119 -99 130 129 154 108 43 0 59 27 53
1260 53 -215 -118 -15 -82 92 45 66 -187 -113 102 372 -10 172 3 -202 29 21 -171 -17 64 -50 -77 -15 -81
1284 -81 -126 84 -11 -114 -226 125 195 175 84 -143 -150 44 -112 174 251 -101 35 -228 -7 129 56 -40 -44 -209
1308 -209 -166 -15 123 -155 -207 -40 -78 31 103 -82 -165 -24 -16 -1 -192 262 87 -241 -75 -73 -12 1 146 -102
1332 -102 -6 -228 47 126 -61 58 190 84 -2 -96 67 -73 -39 115 68 -25 3 293 -206 -57 -82 103 -19
1355 -19 49 -37 41 -45 93 172 -73 76 159 -107 83 -226 12 158 -249 -54 166 -284 149 -31 -11 -204 -155
1378 -155 71 -9 149 -95 197 3 -47 19 87 65 67 -19 -218 -28 39 69 -318 -27 50 -15 -195 -22 -39 -165
1402 -165 75 -50 270 107 -100 78 -18 39 75 -59 -171 149 66 49 -69 -265 -100 -220 -81 84 24 48
1424D8j1k02j32K11J1K74r3n9o4K6j34M76k98k0l33N41K1j89K57k60k03K17j16
1447c2L0P1J29k60j4j47K82j52K28j27l63L93Qj43J51j12J75k31J0K12j52K37
1469A93k08p8J65j0k66K76q7L1N2j26K26n7j07j8O4j54K28q1J1J34l77J49j75
1492b15K38J24l0j46J6j02O7K88j36m4j56K61j34n7Q7k51L13m97N55l3k29Q9n
1515CMj16K07q9L3M6k5ql6k65L99j05J45k2n1j34o4o3J48n8J93j36p8Q6p1K43
1541A86j46l10L28J33j33M9J52l00j14K16k9J27j18k0n5p0k6n0K15j00k4K2K0
1564d7qk8J13j7K90m24p1K14j5j9m0L7J2j18j0m7N4J80k35O3J49mP1k12K56K6
1590A70k84J82KM7q8j60j14M17P6k89l9L2o6mrR2J55l6r4k1l3N7j71J65QL6KJ76
$$ plain form
1424 48 37 -165 -297 -86 -75 199 106 47 -17 9 -125 351 53 33 -300 241 262 73 330 70 -133 84 -32
1447 -32 -2 69 198 -62 -76 -223 59 -93 135 8 -355 38 46 -97 54 -58 117 -114 -104 108 -44 193
1469 193 -15 -93 72 62 -204 72 -15 16 68 -58 168 111 4 -14 50 -104 124 43 54 188 -189 -40 -215
1492 -215 23 147 117 -29 -13 -115 -48 240 104 60 -96 165 31 -26 61 -190 123 -374 181 148 -81 8 3
1515 3 7 -109 98 9 42 88 63 55 19 -246 153 48 193 171 120 -14 -78 -141 7 -51 142 6 -72 14 -57 186
1541 186 40 -270 58 191 58 107 259 -41 -155 61 32 159 41 21 -34 -104 -130 -180 35 -65 -89 -67 -47
1564 -47 -55 -83 30 13 303 -121 -192 22 7 -12 -52 -15 -3 -121 -131 -178 -124 56 -179 -116 33 29 100 -112 144 170
1590 170 -114 68 70 117 29 -131 -245 172 248 -41 -80 -48 -114 -118 -127 -35 120 84 -10 -31 -64 -7 -178 -13 -5 31 33 209
1618B09k28P9j01m1p6J75M2n7K4k77L65n5oK3p9P2n3j66N5O1j33J19%l8J95m8
1644F1Q2n6j35j7k3L4N3m3j12N7J49R7k17J84O9j47M7j73J53L1R4p2k75K91k80
1669a48J94m4j55K14Or8J73j03nL9p8mJ32Ol2J9J23k96J66j41O4J54l61Q8m4J11
1695b0j68J00K66p3j50l5P3q1J5L38k97M8j30M4l2J20Oq6O1J53l51N7J99L5k57
1720a65J73j14k41K97O0k53P6j00L28O4j45N8q7k0K1J79J2k98n1K09j83L89Lk95
1744h3J04q7Q6J14l61M16j66k0m0K08k54K95l74P4J01r4L05k15o0O1j06K49k25
1767g2R8q8J12l2j31m9K32J34k30P3j14P5oK0O6J4k20K19p9N7j32j05K40L53l22
1792A13j58M0K07l22J78nl8j2p8J92Ko8j50q8O8J49N0j22P1j80K78k61K17mL1
$$ plain form
1618 209 -19 60 -41 -82 -158 17 59 2 26 -251 114 59 53 76 -3 69 16 -150 -95 -34 -167 -48 -48 -86 109 61
1644 61 143 87 -48 -65 -88 -54 -1 -44 -156 -99 50 147 -70 114 183 36 83 -90 63 94 188 116 -159 132 -148
1669 -148 46 2 -153 61 67 -31 142 39 34 73 -5 -9 123 129 97 116 239 -57 109 -32 32 186 -175 -87 -131 -20
1695 -20 -188 -88 178 105 -45 -80 -7 -88 -73 265 -32 16 -114 -70 -102 18 24 -62 -1 152 -199 -142 57 92 -165
1720 -165 8 -106 -347 -50 10 -243 -167 -267 61 125 -20 38 -49 -69 -48 131 143 -155 -206 3 -180 209 212 -83
1744 -83 21 -66 20 134 -227 189 23 3 -37 171 -83 212 -162 -88 13 -81 224 9 -51 10 -96 153 -72
1767 -72 26 -62 50 18 -113 -162 70 204 -26 47 -67 8 2 22 88 102 -118 101 22 79 -53 -158 82 435 113
1792 113 -45 -5 202 -120 58 53 15 3 -75 117 119 51 -99 -187 -119 30 80 -42 29 -151 127 -134 83 79 110
1817A10q4N2j36R8Mk15K51j70K29n4r6J42k15K38k63jJ67j43M4j23J68K1J7J9
1841F0O6k27N6K88j12L3j57j56J75r8J75k14P0j21K84p1j60K5k9L9K37j54K37
1864B46j32Pj96j72K07r6nJ83j4j52K30k05L8l3J39k03L13k55K6LN2k5Ro4M9L1
1890a9K10j48P2J1q5J99k67j57L6N0m0N8L44l45L9j45J82O5L8n9o2J53k18K0K73
1915B05J0Jk09n4Q7K5q4M1m0q7K74k67K05n2pO2j20m1J26m9r9K07j81J31k06n5
1941a77J99q0lj3r8j6J19o9R1n0r6K09j23N4N9q3K3O5j9o0j43K15j89J46JL4Q9
1968H5J44j02j38Nl00N42l91L91k16P5j53Ol5O0m4K3kq3Q3J0j53J7M5k32N73m44
1994b34K68K80l38O8n5j10J89j25N0L4j84J47j05O2o7J11k22L14L1k33K81n7k36
$$ plain form
1817 110 26 78 -58 40 44 -171 80 -90 139 85 -11 131 -84 154 -109 -110 57 -86 -42 -165 3 24 41 60
1841 60 126 -101 -45 243 131 164 7 -149 26 -72 103 -111 -41 -162 122 51 -109 -84 -113 -74 163 9 246
1864 246 114 121 -75 -247 -40 -136 -141 42 28 -124 106 -99 -61 -94 45 -158 155 -100 -74 -71 -19 -44 -35 -99 -50 -19
1890 -19 191 43 115 126 41 240 -27 -184 -148 -98 -138 -80 264 -81 -42 -187 -5 60 98 39 -23 130 -88 -68 205
1915 205 215 216 7 -47 40 65 -19 22 -18 -105 169 -98 107 55 48 110 -10 -51 75 26 -73 134 -47 84 -122 -177
1941 -177 22 -58 -61 -74 -172 -188 -69 -138 -47 -97 -193 16 -107 -53 6 -77 -54 11 -8 -68 -211 4 -185 -39 -38 -4 85
1968 85 229 127 -11 -6 -306 236 -155 236 20 95 -58 -52 -87 -27 -71 -48 -50 -133 -50 -40 -193 -176 -131 -363 210 -234
1994 -234 34 314 -24 44 -11 -121 68 -57 -7 27 -157 -10 -115 -53 -120 -9 -231 83 114 -119 162 105 -131
2017a31p3K23O2k67N4J69k0k02K39m6J02K13l28L9N8P5j62n0p5J10K68j78R7k13
2041c6L1P4j06j8J65q7O4m0L5j59N7J7q0J74j88P6q4n7J39K0j22J16k26K65Q1
2066A11M1jl94l2N21l00O6P6k75P4J75k3Q1R8j52l29M5J95N4k39M74r8J16k97
2090a3J37ROj14j75O5L06l10J44j14r8J47j42J59R4j67J69P4l30J29J46M7k37
2113f8j01P6K02k05L53mj21k90J14j67n7J68K5K29k82J67j04r7L18r7j40j15L14
2136A18o4R7j55l7o9N4k14L18o9lO6o2j07K90l83M06l27J63j03k3K74J6p0k5N9
2161A50k78M3o6K38j21k6m5l0P5O0M7J18j92J4K21l21K45m0l8j11M7M8P7k26J05
2186fJ75k47K45j55J36k95J25M7m4R9j30J77j48l3P1Q6J30k07k4q3Q6R2l02K77
$$ plain form
2017 -131 -204 19 81 -186 -132 37 17 -185 54 8 110 323 -5 34 92 167 5 -45 -120 -10 258 80 177 -36
2041 -36 -5 69 -37 -55 110 23 87 47 82 -77 -20 -3 -83 91 -97 -21 -105 -162 -23 -3 -125 -9 -235 30 111
2066 111 152 151 -243 -275 246 -54 12 88 -187 -113 62 39 120 218 66 -263 -218 -23 31 -208 266 168 284 -13
2090 -13 124 133 139 25 -150 -85 221 -89 55 -59 -157 -10 -152 7 101 -66 103 177 -153 -24 122 169 -68
2113 -68 -169 -93 109 -96 257 253 132 -158 -44 -211 -268 -100 -75 154 -128 39 -65 -162 156 59 -81 -196 118
2136 118 54 151 -4 -41 -110 -56 -270 48 -21 -24 42 -20 -127 163 -220 186 -141 22 -81 -104 170 186 116 91 150
2161 150 -128 -85 -151 87 -34 -60 -105 -135 -60 0 47 165 -27 -13 208 -113 132 92 54 -57 -10 38 115 -111 -6
2186 -6 169 -78 167 12 148 -147 -22 25 -19 80 -50 127 -21 -54 17 103 233 26 2 -81 5 97 -205 72
2210G2j20J16k04J74J48j24P5K15l87r6L3R0L2K71j75r0j20M1J73j10Q7j53O1
2233Iq6m9J05J02j69P1J2j13J78J61j54j09J25L2mp2l5R1j36N6Ml0J94k55M5J37
2259A10l35J80l8J68l27N6J5J50P6j09J60Q1j35o1Q3j81L19j87R7k34nP5K26j84
2283@M8p1rk16M34k84J91J48j16j44n8J64j06J3N8N5k58K70j97J68m5k67K02J69
2307A49l30J70J37j47N3L8j24j11J77N8p4o2K48J12l12J40%p4K5Rj30J65k28P9
2331c2p0L02j21j61Q0J32k08J96r0L7L0j36K40j96K30m58M28k56K03l33J42k19
2353b60M27l7k89K30P0k57P8l8J4Kj86L20j4K02m15K01o6j53K07r4N6j6l9J90
2377A33k69O3M1K81l28N6qJ76O3m03R9R9R7j13J08j25j7J38k32R7J32q4l30M15
$$ plain form
2210 72 -48 68 -136 38 186 62 137 352 -35 -131 -98 -8 24 295 120 30 -90 -49 124 14 101 -52 9
2233 9 -77 -126 -21 81 -88 -17 -5 -118 60 221 67 -42 83 115 111 39 4 95 -41 15 19 -11 183 -72 -27 110
2259 110 -225 -45 -83 85 -242 -186 -171 -21 55 -54 106 187 52 -9 74 -107 212 25 122 -112 -117 -42 184 0
2283 0 48 -23 -32 -248 186 -98 93 241 125 -19 -77 87 -19 -6 52 107 -151 119 -78 90 45 -222 -20 149
2307 149 -181 -11 126 -21 32 70 -54 -165 12 70 -4 -66 182 294 -18 122 122 48 73 82 -48 117 -111 -32
2331 -32 -102 200 79 -82 -2 130 -78 118 28 65 95 -41 199 3 233 -225 203 -53 150 -183 -41 -260
2353 -260 167 130 -159 71 141 -116 -38 -76 -62 -60 -246 74 60 262 -153 48 -18 -171 36 -58 -2 -18 -57 133
2377 133 -136 -73 -32 249 -79 -23 -31 145 208 -195 -96 3 100 -13 95 -30 -47 91 -141 -44 88 4 -326 89
2401H9p7m1N06n73J86m6n5m6J27l00L49j21j57J27J43R3m79L32j32J85r5j48J44
2424A1J03k21J98Rm8o8J31j54K02j01k61L66n9k16J21k62K55L9J43k04j29O0J40
2447E5m3L6j06J39L6j43n2J93k46K9J77k12J33P3J4j25J18k30J51j68J48J30q9
2470A8j01J65j59J43q0p3J05J1J10j49n4N8M9j01k7O9j09M4L95n81M17k83j0J37
2494fO0j84R4n6J25J43j99L6K28k09j80K36k84J28J45o2K8L8j96N3K71Jj98l%
2519IJ28k07m3J75m9J41O7l99K20n4Mj07J32k01K09l20J31J29j50L83k18J08j63
2542g5J53j20J18o5P3K13m63K20k30K97P7q4o1q5J5k%N4k5J58k15j21J65jJ80
2567A76k18J18j31J73j70J70n5m4r3j16M5J15J31j96J34j27j02L06n0j01KL52
$$ plain form
2401 89 12 -29 477 -96 90 44 -11 -57 70 -230 119 -2 -159 -32 111 204 -275 57 -75 110 15 -133 11
2424 11 114 -107 91 100 52 -16 115 -39 163 62 -199 167 108 -108 13 -249 6 45 188 -16 -145 -85 55
2447 55 12 48 -58 81 117 -26 -78 115 -131 -102 75 -137 -4 69 83 -42 76 -154 -3 -171 -23 107 18
2470 18 -83 82 -77 66 -14 -87 18 29 139 -10 -64 -6 43 -58 -85 -16 -125 -81 314 -267 150 -133 -143 -6
2494 -6 54 -130 -36 -92 33 176 -23 13 241 32 -148 88 -196 -68 77 15 43 81 -115 -62 209 210 12 9 9
2519 9 137 -70 -113 62 13 154 221 -178 42 -12 -8 -115 17 -184 25 -295 -164 -35 -185 198 -20 88 -75
2542 -75 78 -42 76 11 84 297 -166 54 -176 121 198 114 53 -32 -17 -19 -19 35 10 168 -47 -168 -3 -4 176
2567 176 -42 76 -55 118 -52 118 63 19 -74 -190 -145 -30 101 -95 39 -88 -190 116 66 -35 -33 319
2589C19m15j50J82L7J60r4n7J70k09k4K29j05q7J0j1J73J08k53L75j56k22%J47
2612A27k2r4j38m4Q3RJ5M6K05j20j57J30k1M7k13J85j7p7Q7j12J90j90K66l45
2636a60J98j63P3q7J69Q0j65J91m29K05p9J01qJ25P3j68J4P0j63K82j55k0J4j03
2660a05o3Q6K6N5j23Q1K5O1m0K1K15j97j62L71l31l9J63j24J13r4J34j38r5Q5
2684g5n3Q5K46k76N5R0o5jq4J97k21J33K83k17j61J35P0M5k72P2L4j40K23j34
2708c1Q7l2k56L87j69O1l00L22k44K68l1r5J33j35q0N8J44j15N7j41J81J2j4j44
2732g7L0r0J32q0J33k54K21j33j78L75p3R3j9J4r2j1n1M12j24k22N2l47M08k44
2756a25L24k34P3J4K14k50J51j69o7J55j16M0N8q1K07q3J1j67l4J57j58O3N4p0
$$ plain form
2589 319 -96 -246 -64 -27 133 39 -18 152 -57 -81 148 43 -44 -34 -45 128 236 -17 358 202 -20 -20 127
2612 127 105 11 -127 -171 -88 -79 -64 -18 187 67 -90 40 19 66 -147 38 21 -56 31 -81 109 -81 185 -160
2636 -160 38 -125 -52 -139 30 110 -55 136 -293 -88 -167 -66 -74 51 124 -44 -30 40 -123 159 4 -16 -2 -105
2660 -105 -168 -82 -56 -1 -124 -43 -18 43 3 24 239 42 -120 251 -80 -119 44 -80 33 -61 73 -65 -160 -75
2684 -75 -128 -43 203 -73 -18 72 7 6 -78 119 -102 31 314 97 -64 71 141 186 -86 -14 20 -120 103 -31
2708 -31 56 24 -232 155 -14 47 -253 69 -175 93 62 -33 100 -35 -115 -57 87 -28 29 -112 69 81 67 -77
2732 -77 -47 -137 -5 -85 48 -206 15 -118 -296 79 6 99 80 94 2 -9 -60 352 228 6 58 -289 119 -125
2756 -125 199 -35 38 52 266 16 167 -2 -69 86 -30 10 68 -13 194 111 122 -45 -79 78 -80 -17 37 -33
2780c3m1Q0o1P6k1j08Q7R3P9j32J53k64K28j63M5j16J53L2k19K29j76rN7J38j32
2805b5K58l18L30m28J7J65P6j06K66l23R3M6p2Q4l0n3L7L3j10qK6J21Q7k51J03
2830A8k7N1j64J07K38k26j4J93l09J28M8K0j90J1J79Lk9j60J87n7L7j15J72k78
2854a77R8J31R7j83j0N8j1r3r4K09M7m8N2R5k42J71P4k06J95k14Q6r0Q2M2p6o7
2880g4Q4J53j35o2J04K0j43j50L47N4l25K21j57J60j56J36j93K6R0J57j47P1k84
2903b03J89R5p2Kl7l7K17k37Qj89K47j20J59m3J62k90J4R9o9R7j47J06k56J68
2927a37N4Q2p2O1p3J01J6j04J13J41j74k4j11J52J0K2J93l38J16K4j81K93Kj03
2951F3j03O4q1M0r3K34j70n5J07p4J26r4p6O0N2PP0m7r7J34L6o0J01j94j08K35
$$ plain form
2780 -33 -74 6 -55 21 0 -108 -21 72 151 19 172 -92 136 -27 18 -98 55 87 -132 97 -79 -88 -31 107 -25
2805 -25 233 -85 245 -183 -166 -1 75 -31 235 -88 5 51 -21 63 33 -20 17 50 -60 -68 -42 79 166 -85 18
2830 18 -9 42 -122 -15 223 -3 -17 176 -133 -5 43 63 -127 -116 63 66 37 -123 64 7 44 -71 101 -177
2854 -177 -79 52 149 -34 -44 14 3 -90 -184 25 72 24 76 171 -71 100 174 -32 163 -51 35 -55 27 69 -7 -74
2880 -74 10 163 28 -34 70 90 -53 -203 144 198 -127 94 -63 97 -59 77 -116 -90 0 157 10 81 -203
2903 -203 -14 81 9 11 -26 -63 154 -83 -75 -264 -17 -137 22 -21 141 -149 -135 -36 -105 -8 -155 -49 -305 -137
2927 -137 -83 -1 -73 -12 -85 16 32 -72 41 182 8 -16 -127 25 35 57 250 -88 28 52 -129 164 166 63
2951 63 -40 24 -57 -17 -110 124 -46 -101 6 -68 58 -36 -112 -52 0 7 77 30 -67 67 103 43 144 -50 -158 77
2977G7j22om3J98j97pJ56R0j32P6J9j31k08J73N7k33J26J78j73j5OJ30N4o6O0
3002F7P6k43R9j2k08J96M3J11K4l9J94m90K76p3K6N9n1n3r3L21k48J4n9j18J94
3027A3J48j95KJ78j30Mk51J66J7o2J63k9Q5j1j62J03j6o4K85r6o1Rk02O7K26j54
3053C3j4lj04L04m60O4J85L1j13j11L27m89M58J47l31J73n1J0j03JO1j24m7K2
3077a34J48M7J1l21K68J25K6j52p1jrJ61j51l5P8o0J77m6m6m0K37l27r3K87j2
3102F7K2r6k35Q3m8J73rj13M76j01l29NM0m6K41k19J27l7r9j19L46j86p0J63p6
3127d0J76q4l4q7qJ24J5j42L01o06M32P6j60J0L5oK6J90j56r1O3k07P5K20k8l37
3153b43K72q6M1J70r9j63J74l77J22Q6MN6jk7P7j00M9mo6r3J53J40%j01p2N1P5
$$ plain form
2977 77 -45 -51 -94 104 -93 -100 56 146 14 90 109 -22 -230 -57 0 -233 -107 71 -102 -117 -111 19 73 7 67
3002 67 143 -100 -1 -13 -221 -25 18 129 153 114 308 -182 94 21 47 106 55 2 -91 230 -18 -4 -63 -181 13
3027 13 161 -34 -32 146 16 20 -231 -65 -48 -110 53 24 109 98 -64 39 23 -41 244 148 87 96 -106 -39 187 33
3053 33 19 16 -88 216 -244 -180 5 36 -77 -188 139 -350 108 255 -76 97 46 56 -47 -46 15 -109 -156 -134
3077 -134 14 61 72 -249 19 144 170 18 -53 -54 -63 98 -53 -88 -10 -70 107 61 15 -25 212 -115 -208 79 67
3102 67 89 -7 -242 -159 -207 -34 -43 -156 320 219 -110 -105 -65 -111 130 -89 38 1 -98 -217 129 -57 -127 36 -40
3127 -40 136 52 18 -69 -77 47 62 -80 221 -385 47 123 -37 -27 8 2 28 218 62 -29 34 -173 -98 122 94 -243
3153 -243 29 -57 -16 154 55 -108 66 -311 -189 -103 -99 -43 -44 -71 6 -94 -45 -49 -115 -208 -55 85 85 -16 -88 -37 38
3180C8l0J4J08l65M47j61J61k03L4q0o4K92j74p1J57j07O8kj26k76M27q8J32k47
3204a16P3k1k9O7j14J07P7L0p5l1J77l8q9R2j4k22L13j17oj06j8o4M0L9k02J49
3230i8J13P1J4j90rK41q0j00J21j40N8J30l97J72K32j53J24n3k37J77R7k2q7J73
3254A57j98J54m7j34k7J64j95J88K47l79K03k32K94j39j00K9R3m7k6K19k22J82
3276A84k12P0r5R8M0o7m2J48k18K10J14k6j46j96R9J21j9j8j4r6J37m1p7J08J
3301F3j48J42k01J74m6NP3k22K12RJ60j39N3r0k64J43J51j74K18j19O3q3n0PJ11
3326D8j72m9J5J23j58K06J28j26O7m8k55J67N3q0J03m3j80M52k7j02O9p5k08J
3350i1pK4L49k33J13j53j2J02m2Q1l9p6j3N0l8K3m0J5j63m9J06J31N7k88K60l9
$$ plain form
3180 38 8 22 130 -235 212 51 212 9 43 -37 -101 191 17 -54 103 -4 64 62 -64 -340 87 -1 131 -116
3204 -116 -43 -64 -93 -26 -140 -33 44 74 -1 -32 145 107 18 110 96 -126 187 70 64 -42 -60 -124 -84 -45 -247 -98
3230 -98 15 86 100 -90 -99 142 62 -38 83 -57 1 131 -266 -94 138 -15 109 56 -181 -4 93 71 -16 157
3254 157 -41 113 66 -68 -95 69 -126 62 309 -70 133 -99 195 56 -44 -15 78 31 5 224 2 184
3276 184 -28 42 -53 45 85 18 -24 124 -94 116 230 204 58 -138 -39 82 63 45 31 -65 72 31 -46 62 63
3301 63 -85 57 -144 30 -16 -11 62 -160 52 61 221 82 135 45 -219 -76 75 -99 119 0 63 -20 -70 -63 48
3326 48 -124 -173 -158 -35 -193 13 141 15 82 34 -221 -54 -1 -81 22 -21 -201 251 224 122 191 116 -92 -91
3350 -91 -98 -74 275 42 155 2 -10 92 50 131 92 16 3 53 15 38 -2 13 -150 -199 -93 38 95 -193 67 28
3376B8J45k76q1J19M8j21N2J36n3j63K77o8k40K18M1N2k45J5n1K58n9L2J91j96
3400E9k49K5J72r2J61k19J45r1m9O7J92J19k22J03m1k23J09o6M4p5lJ74j91L36
3424A85k27q3j4J66J01l14kL15Q6k65L9K69q1k66J43k05J57O6l34K44J92l23K11
3447F0O7k41J08R3j16J45p9j4l5j02R1J08k01j26J00R7J47k21P8J29n3k2J0p2
3471d9j9J78j71k29L81j67N0j46J00Nk6J17k4K8m5J15j04J47q6k3J0m1J10M9%
3496A60k47J14mJ3j12nq3K15o4O0p1m0K4j8Q8r2l0j65j4K27K35j36Kk26K52j20
3522c7J07q2R0k50M7J26J56j40o2K02j93o4P8J27j59R4p3J31o0j48J83oL6q4k81
3547b62N5J98j12J08K1j24K29p4Q0j30o0J9O5j84M4j1K27M6j02J48j98j6J62k1
$$ plain form
3376 28 173 -103 -184 -65 -17 -138 -86 50 -3 -166 111 43 -197 21 62 114 -131 -116 -167 91 32 64 255 59
3400 59 -190 -165 7 -85 76 -143 2 -89 -138 -71 121 240 18 121 80 -143 -34 -100 -56 -131 -134 40 -151 185
3424 185 -42 -125 -139 27 128 -186 -188 127 213 -52 -13 256 175 -91 52 -153 4 70 -264 -20 172 -151 60
3447 60 127 -114 -6 87 -29 116 37 23 -12 -114 -23 85 -116 -242 -142 -45 102 -119 -41 88 35 13 23 -49
3471 -49 -68 110 -61 -290 91 -76 -26 -172 -72 -67 -93 24 0 28 -17 98 -6 141 55 32 42 1 111 160 160
3496 160 -87 27 23 36 -76 -81 -164 51 -13 47 -24 -64 -40 -58 30 -62 -92 -257 -271 -44 191 55 57 -169 83 -37
3522 -37 70 -12 78 -172 -125 1 157 17 -45 157 -36 -100 -22 105 -54 40 -33 98 38 -110 73 67 103 19 -262
3547 -262 -207 -9 -121 -13 8 -116 113 39 119 -11 -71 -52 13 -171 -127 -138 89 135 33 181 -17 -33 129 108
3571A08r5l7J77q2k89J39P0r2K52l06K04k3P7r7j73L9%K37J5o5k08J08N6r2j19
3596a96K58K4l4K2k52L03j57j4Qj21K17j15l9J59o3O7j57K31J0l7j28j10L12k27
3620c9J03K75m54J75P8j3J26k69Pk7J28j73jJ76k08j4M3M9M3J24j50J66l02J74
3644A7Rj44J78n3j6J67j38n2%J39j51J11M8j18m9j2J85j21J18Pl08J58J23j63
3668f5K12n6j40l6rq0N6p8L00r3J1m4r5K6O2p9J21J19M1j20j2L7j87m2J34Pm2
3695e2N1m8Q4nL5L8o5O6Lm5j44K4Q9Kr0J08o7j75K58m7L1K6j46J3R5Q5k77K46
3723I3m4N5k8l4Pj80L42k16r5m0N0J07J98j55J02l10J24J56j36JQ9n2J4r2L82
3748C38l30O8Q2k58M3m8P6N9j06J02m9lr9Q0J51j35k4J62k52N0J46N0j20p0M9
$$ plain form
3571 108 13 -24 153 71 -218 -79 -9 -101 151 -155 49 26 103 6 -167 -128 -128 109 124 59 -149 -41 15 -77 -196
3596 -196 62 86 52 74 -178 125 -32 -46 -38 -159 58 -57 -96 63 0 67 -90 141 151 114 -14 -124 188 -39
3620 -39 64 339 -115 60 138 125 251 -18 -11 -38 90 -83 -84 92 -116 -130 -87 -38 5 129 -21 145 -157 17
3644 17 26 -118 60 7 -9 158 20 -32 -32 107 -44 67 115 -3 -52 -64 121 0 118 125 -183 -25 98 -65
3668 -65 147 91 -49 -85 -94 -174 -118 -196 104 11 22 -22 -117 -91 -29 -108 13 132 173 53 41 78 -109 -151 -17 -10 -52
3695 -52 -1 -49 35 30 65 103 38 104 107 62 -82 -58 31 33 -57 51 -16 -191 67 20 51 77 -69 -56 39 124 -153 93
3723 93 49 104 76 42 49 -131 211 -5 -100 -140 -90 17 215 60 162 -148 -24 132 -4 -3 86 34 48 -44 338
3748 338 8 76 158 -100 -57 -105 -29 30 -76 26 -23 -26 -125 -45 106 -29 -53 109 -143 -93 53 103 -17 -87 -38
3773c8j0R1q9O9NRn5L22l62j8j19K5J45J55J9q8l4O4J0j09P7j31J21k04J82j24
3799h7J38K7Q4j17k6J99j21k31K12j07K07j19j74K35J81l87n2J70K1J09q2p3k44
3822b37K11J35j58Q3J83o1k27j6J03l8Q9o7n5J00Q1j75J45k44O4P9M4j51Q8%J18
3847I4mk78n4L11P2j68J03j86J67q2K0J09j48M8O4M0k51J97J54l39K19qk18J12
3871b6L7j5K9J20n3J7k5j86o2M47k47NP0j46R3k35K14n0L7K20k06Ko5k5J60j62
3897e2L21k84J38k07m7J83q6r1J28J66k04N8j30J8J58r7K23k29P7n4J1O1j03j8
3921f0K46k02R6j43K67p3M1k74K34k6m9n1J1J5j41J18o1J67o6J53k04j36L11l20
3945a47J76j44j04J63J3P0K8o8J66O7j98N3j77J58j58K45j58j9K6N7K27k18QJ0
$$ plain form
3773 -38 -48 43 -46 23 28 37 -18 304 -58 -76 -195 -170 -25 130 149 61 27 91 101 -8 69 -62 59 -145 37 -87
3799 -87 51 78 162 45 19 218 97 -134 78 -29 178 59 -115 120 301 -86 -138 32 53 162 80 7 -237
3822 -237 -26 109 -49 34 217 156 -71 -87 16 -22 67 0 -55 45 126 -49 96 -148 -84 -5 39 -112 -24 -24 94
3847 94 90 -188 -242 69 141 -27 76 -110 57 -25 -5 104 -44 4 68 108 -143 54 208 -131 88 80 -138 -26
3871 -26 11 -4 25 145 92 109 84 -102 -164 283 36 41 111 -35 58 -177 37 -13 24 244 38 40 -25 -50 110 -52
3897 -52 269 -15 123 -84 -131 52 -34 -125 3 169 -35 23 -107 -89 69 -28 195 -34 43 -11 0 61 -42 -60
3921 -60 186 -16 80 -63 204 131 172 -102 132 106 57 6 17 32 -109 9 -52 115 49 202 -2 -138 173 -147
3945 -147 29 -115 -219 -56 -43 27 55 -13 153 220 22 75 -102 56 -102 143 -15 -34 -8 49 276 58 66 76
3969G6M1o3p1J67j96Q1j50m7M8R7j52L01k30J85j47n0Q3om8L45q9K0j43k3o3j04
3995a38J97j09P5J11r5Q4M5ok60J62j11O1o3r1J66o1m0K4m2K55j30K6kP2k1r0
4021A9p7J01q1Rqr1N5j16K62l82K55J10p4k19L37o4l8J19o1j23J49j43N0k6Q6
4046D9m9o4j6O8j36K36r2j43K28k15M8L6j10K14M8n5N6n5J5j37K61j38l30K16
4070f5K5K58k43J0j27Q1J5J48L1j08J4k33J61k14K07L36m3k03O1k1Q6l21J94k28
4094a79J36p7n7K11j59J02P6o1j09M4L00l95R0R2r6K19j96J54L3j53j8r2J29n7
4118f3p1R8j42J91Qo0J73J8r7M0j08QJ12o6j02j16K89m5j70J87P9j0j08j14p4
4143a43R9LO1P7j9j35p2K4K17l46K41j66M2J85j08O6j39N8lK59k45J82j3nj46
$$ plain form
3969 76 117 54 -17 150 -46 35 -115 -162 -114 -17 -169 132 -98 87 -60 -110 -27 -33 -81 264 175 195 52 29 -34 -138
3995 -138 59 -50 25 136 41 125 170 164 -96 66 -45 16 -47 -138 28 -33 -73 -49 -91 164 34 60 58 130 109 19
4021 19 -58 43 -38 -29 -37 -128 -73 -189 73 -309 -54 56 -18 -237 100 36 -2 117 56 -67 82 -61 -11 -37 49
4046 49 0 -64 -80 -12 -148 88 -4 -147 81 -134 -86 -50 -160 54 102 47 103 48 63 -74 187 49 -281 -65
4070 -65 -40 218 -25 -15 -142 -61 -46 102 133 25 39 -194 -33 -247 -40 296 253 50 111 90 176 -145 49 -179
4094 -179 -43 -120 -177 34 -125 -23 53 -8 -117 -73 227 -168 -78 14 -82 137 -59 95 128 -25 -43 -135 -6 -63
4118 -63 -134 -36 -178 13 21 -39 134 152 55 95 -13 -5 107 41 -61 -177 112 67 -103 84 163 153 45 -69 -143
4143 -143 -44 -41 20 97 78 -57 -129 -105 112 -234 7 -159 -117 68 -40 26 -113 -55 -58 201 -44 138 125 120 -26
4168b6l8Q0L4j1j54M3J84k55K00J1r0K09j91j26O8L31l10J11j07r6K92j99j6n7
4192a13K74j21qM5j41j14J62o5p0L26o3r5M4j60n7L13k04q3j23K91j15N1O5J02
4216A41j42q5Q7K76l83K60q9r4O1J58k02l1q5P2K30r9j31L2J32q7L9j99J88mp0
4241b5Q6l9L0j11j3%J94J15k65K7j35J66J32k95J10J6k6J52k53J2K15k06Q0J17
4265H4k57J83k64L41n5K2j08J10nj42K82j91J89k65p4K60j97K46k18j63J60M8
4287a4J16j25P1j86P8J7J12O1m8j18QN7o4P7l2K36k02m5qj62J21J33j06L2k9N5
4313C5R6n3j95J80J6r2j00L72k80R0Q5l54J41j6P4j54Q9P9jj05Q4r1j68L12K09
4338B53j88j7j23j39J07P1K0l2j88K85k9k9J41l30K40l7j0j69K64n5J80j19l39
$$ plain form
4168 -26 -64 16 50 39 -115 -72 112 -143 57 68 -22 187 -4 -130 -62 269 -41 70 -37 -133 159 -40 -56 -113
4192 -113 161 40 32 77 -64 -178 -16 -81 -151 175 112 17 61 -99 -156 157 -47 -130 -253 38 -77 -26 39 141
4216 141 -1 -86 1 277 -106 154 65 -29 32 190 -12 -43 -128 -56 174 75 -56 -24 108 21 60 -139 49 45 -25
4241 -25 61 22 52 -59 -72 -72 122 237 -28 -1 -136 30 162 -133 -23 -7 -33 119 -134 -122 93 -113 -33 84
4265 84 -173 10 -254 87 32 54 -54 56 51 -91 191 0 189 -76 -150 110 -87 159 -59 -222 -62 -14
4287 -14 102 -23 48 -138 -60 -43 69 130 82 -36 -28 29 -35 42 10 246 44 -1 -9 -171 -50 83 -23 9 -20 35
4313 35 131 78 -117 63 79 -13 -113 259 -21 69 154 -200 -59 -75 -1 -155 -66 13 12 -93 -9 -100 -268 44 253
4338 253 65 48 -75 -214 -107 -36 -16 -48 -236 49 20 -9 132 -198 42 5 -5 -174 90 35 215 96 -243
4361b43K38M1k5m6q4N0R8o1k6R5q8J12p1N0M3j22K91k70j29L13j97R6j24j7J8
4386e8K26k55N6J20j87p1L56Ll34K02l7Ol9j12J98k7k4j61j06J45R4mK7J77q9
4411A06j14j08J21j6J24M9k46M61k56k17J66L1j78J29L8j68%J04q7Oj2o9J28J23
4435A15j60l3J11j57J34%J55k3L9r9k16J45r7Q8J09k19M5J3J08l7R9k02J81l5
4459F4q8J50k15RO1r9K30p5k0J53j00N5j32o6j6J08l8q9J19J00l40M8J74l9J14
4484F8k6r0J74k61P4j14J58Q6J22o8j95K54o0j31J67j97K03j54q1J10j57J06L2
4507B0Kj33o9J37J96j13j0M1p5N6J14j76K79k93K79k72J3j0j35J82K19k59J16
4530A09k5J12k85J64p8n5n6O2J16n5Oj00Q9p5J86p0N6J4k9M7k9k28%P4K6R3j77
$$ plain form
4361 -243 -5 36 11 -35 -119 -69 29 -32 -58 37 -51 61 -10 40 83 -39 252 -18 -147 166 -31 65 -59 -76 -58
4386 -58 168 -87 -31 89 -98 -169 187 190 -144 58 21 27 -12 -124 74 47 23 -138 -244 -99 -5 -9 18 195 106
4411 106 -8 -116 5 -11 113 162 -84 377 121 -96 70 101 -77 52 90 -78 -78 26 -61 -55 -67 -136 -8 115
4435 115 -45 -78 33 -124 10 10 165 142 181 82 -134 11 -86 2 111 -108 -63 -50 58 21 120 -82 99 64
4459 64 -24 126 -89 -80 -19 -118 112 37 17 170 70 125 -7 -73 -89 19 -19 -108 11 111 -229 -181 -7 -46 68
4484 68 42 -48 126 -135 -61 -175 -17 69 191 123 -72 182 122 -9 158 -39 164 10 -71 39 -118 -12 20
4507 20 22 -111 -180 -43 153 40 30 71 -4 52 166 -10 269 -24 255 -17 -4 -14 -149 33 252 -7 109
4530 109 84 196 -89 75 -3 -58 -114 -52 64 9 15 -85 4 -71 115 45 101 115 86 133 104 -124 -124 -50 -24 69 -108
4557a08J21n0J0j0J10j54k4J47K47k38j23K73j18K21k53M0qn2k43P3k5L18q2k34
4581a62K81j18N6r9j7j31K46J0k2J56j65p4R9q5R6l2o6J03o0m1j25J46J00n2J00
4606A44j33J5J04o8pN7j94L0j41n2J29O0N0J53j05O2p1N1j03j5R8k2j26Q1N1j30
4632h2K93j06j77J78K0j89M3m7J18l7j35J00j75J86Q8R6j12K6l4m8J90j11O7o4
4656H8k56K68o2j93m2K14j10J18j5r1J47p8J4n4J30j50n3OR1L4o3K43r8j33M6
4681AM7J72m25j9M38j15j44lO7J16k03PJK84r5j25r7n9J42j5L6J5m2J24q0k1m4
4708c7k40L8K61j5n9j29J24J25p1j25K0R1Q6k3j59L5O4mq1J9J76k3k9q1j14L35
4734A84l01j6J06N4J66j89j11J64k5J01k17O5k3O0j1L42o14L92k38J06n0J5J96
$$ plain form
4557 -108 13 -37 -27 -37 73 -81 -105 42 289 51 -72 201 83 304 51 91 83 31 -212 -139 -164 154 72 -162
4581 -162 119 1 57 -42 -59 -190 56 66 44 200 35 -39 60 -25 71 39 -27 76 16 -25 -150 -4 96 44 144
4606 144 11 26 130 62 55 112 -82 -52 -193 -245 -116 -56 -6 147 42 104 33 84 -19 -34 64 42 -84 -3 48 -82
4632 -82 211 105 -72 106 126 -63 -20 -67 51 14 -121 -21 -196 -10 78 174 62 88 54 6 196 85 152 88
4656 88 -168 100 38 -155 -197 17 -93 25 10 -81 66 -12 2 -52 78 -72 -125 -119 -28 6 -57 186 88 -45 1
4681 1 48 220 -205 -224 214 99 -45 -48 19 135 -68 -61 -60 224 129 4 -93 -152 -10 -25 11 26 -16 108 28 7 -37
4708 -37 -277 -239 22 7 -52 -181 -57 68 -3 -128 -108 -17 69 46 -113 -78 -14 -18 -99 -80 96 73 44 -37 -151 184
4734 184 -117 -133 -27 27 193 4 -107 57 32 133 -84 -19 -42 18 7 349 -265 127 -111 -5 -55 -40 156
4757A56J7k61n2L01j14m9j49J30N0O5k15J50J56k67K38j47k0r8K37p6j24J30k34
4780a76L51k11m1J26Qk08J91nq7J13O6k24K11l3m5J27j78O9m3J4j08P3R8j9j75
4805a06P9M5j76J41p4R4J11M7o2j54q0J96p3J3j54o7J32J04l0J14j4j71rP1rl9
4831g1L36l90N6J42k18K59l3j87J06j81K15n1J82k05j9j0J99o5k76L00k65K63
4853H7L1k33jK14k19Q5P2k03L87n6k61Q7M3J72n16Q0K91Q5j41j80J05J6j6j7Q2
4878fM3j73J79J42j95N8j47J3K25k1k11lJ3J90k07J30k6r5J25j54K26r6j9K1j41
4903a29K07j20R0M1r7j8L45l66K18k19K26l22R5N3rJq6j87K37q7J10J07p6j18
4927a04M9M7j23L4M9l3P6K38l29L75k65%k6K61k94rJ22j01%J7K2J23o3k24J23
$$ plain form
4757 156 173 -88 -140 161 47 -2 -151 -21 29 94 -121 29 185 -82 156 9 -11 -109 128 52 -72 58 -176
4780 -176 175 -36 -77 49 57 -151 40 35 -52 61 127 -97 114 81 36 163 -15 54 11 25 -83 -10 88 69 -106
4805 -106 -27 18 -158 -17 -91 3 114 161 99 -55 -135 61 -12 1 -153 -220 -88 16 -14 100 86 -85 -94 -23 -32 -71
4831 -71 265 -125 -69 73 -145 114 81 -106 0 -181 34 -17 165 -40 -59 -69 130 65 -211 89 -176 87
4853 87 118 -115 -116 98 -121 -36 36 -167 220 164 -97 -10 33 205 -311 -231 60 145 4 -176 -71 -55 -71 -88 -6
4878 -6 37 -136 43 185 -10 48 -99 -86 139 118 -93 -96 -83 107 -100 30 4 -91 34 -120 106 10 -9 12 -129
4903 -129 78 -42 48 89 -8 -26 319 -47 171 -48 178 -144 -49 4 -5 -4 -90 -277 -40 -127 -17 90 14 -104
4927 -104 -55 -8 -131 -97 -48 -81 -5 233 -96 279 14 14 -12 249 -45 -54 68 -33 -33 -16 6 129 66 -158 -35
4952c5J81j62JL8K39k06J2j11J53n9j24J92J71l99j39M44l64J7%Q3RM6L5M5m9
4977A8k2q1K58J20k90j47P1M1K30l45K96q3q8j4J18k23J15J58j48k5N7J47m05
5000b42K06J34k36J39K8j80J00O6k09L5J92m9m8J26j34r2P8J84j90KJ3J33j67
5023a11L6J19r7P0j11K24Qj63J80pj18Q1j0k20P0q2J71p5kl6J37J62j44l2j25
5048g5j08L34q0k61j36J70J86k9M1Q0r8l21L26l4K47k49LJ21n4j21Q2k04J92j76
5072a64L03o6M7K0k88M30l32PN4j43J67J96K2l24J8J79j30j9M0n7L5p9nn9J87
5097C9q4k28K03J86j44l4L26j03j12J13j19Q8j57J45j53J17M3j50J47l27K58k9
5119B5k21K30L0q2j1K09k09J4j8L8J47j48J10j10k1J3M9l03K69K06l25J87j48
$$ plain form
4952 -35 146 -16 -15 23 262 56 68 -43 110 51 -73 119 290 -109 -248 196 -168 -151 -151 -68 -59 -13 22 67 18
4977 18 -4 -85 173 293 3 -144 -73 -32 198 -147 149 66 -22 -36 82 -141 -26 132 -16 -41 16 163 -242
5000 -242 -36 98 -138 1 29 -151 -51 15 -194 -159 33 -16 -64 62 -72 -164 -86 98 -92 -90 -77 56 -111
5023 -111 -75 44 -53 17 -94 130 138 -25 155 148 30 111 101 -119 -49 -131 40 -35 -37 -73 64 226 82 50 -75
5048 -75 -183 151 71 -190 -326 -156 30 1 42 122 24 -297 29 -5 242 -7 -4 117 63 -58 24 -180 12 -164
5072 -164 139 73 120 140 -148 282 -50 -43 11 -132 35 231 253 -71 -53 126 -4 -23 17 -40 -5 -84 -89 -148 39
5097 39 -45 -273 -70 116 -28 -62 264 161 49 162 43 131 -26 119 -34 83 126 -24 123 -204 54 25
5119 25 -196 34 64 -18 -29 180 -29 -15 -33 5 152 4 114 4 -17 -4 45 -258 11 217 -108 79 -69
5142f9J74l00K27j05LN2N9L9M3k48lJ06J10j03n9J42j85R1j74K19j36R3O2j51
5166a13J46ll5N1k05J15J64O5j13L2j12LjJ55O4l07K4K47k36k10J97J36j3q5j56
5191a90J27J77o0Q8k02K38k58j10K45r1m8N6p1O9K0J64j63j11Q4l8J19l22L57
5214H0j01j60j81J93L27Q2j63L18l60R7j24j31Q8J07j72J80j18j5Lk0l3p9P9J68
5238F5j61PK12k20J92j9q7n2K23j57q3k6j26L82j63j5k44P1L42j82J19j21j26
5261a69J04K6mO2n6M2k04l2J55M8o0J36j69p7L47j95O8K5j46J38N9rq1j07K9j0
5287h0K78j82N3j63L16l43J29K63l26l2P5j16J34j29J95J8j69K41j90qp3K98l74
5310a85K14l3m0R1l3qq0R7Q5Q3k92R8k2l8Q6l2K18l37J31l9K19j82J14j17j57
$$ plain form
5142 -69 105 -195 32 -73 -70 -18 41 80 123 -125 -128 -22 88 -15 -74 68 -117 -26 -200 19 -117 -24 38 -113
5166 -113 33 30 -5 46 -159 -44 120 185 72 104 -8 -5 -6 149 213 -94 -70 177 -59 -269 -72 64 51 -34 -190
5191 -190 -63 114 54 142 -60 178 -80 -190 55 -36 -84 -28 -99 -30 -10 154 -9 -120 -36 -74 45 -277 80
5214 80 -21 -181 -362 -169 158 240 77 395 35 132 8 -123 -35 72 -100 80 -38 -53 -50 -70 -103 -182 -103 65
5238 65 -96 -89 123 -97 95 76 -11 -63 160 3 -80 -106 -232 150 -13 -28 -272 -201 141 -41 78 -43 -169
5261 -169 -65 -39 -43 19 -37 5 -199 -231 -76 -28 -88 48 -121 -198 149 -46 22 47 -99 39 98 89 8 -99 -70 -80
5287 -80 198 16 69 -94 222 -121 8 271 -55 -87 -12 -128 6 -123 72 90 -79 162 -28 -36 -109 189 -185
5310 -185 29 -4 -44 47 14 6 -74 23 108 191 -101 -3 -25 -63 23 -9 209 -128 3 -36 183 1 115 -2 -159
5335a59K49p8J78k28m0QJ98k98K08m4j27J96l8j83J94p0J39m3k03mJ13J41j62
5358e3Q1o2J64j81rj59L07j46j0n7O0J54r2m1J16l7P4j33l9j3R1p4j81K10M8j22
5384a04L4K03k04J61K0n8j91L2L0j7J7rL06M6j89j40O3LN5R0j79J84k90J66K2
5409E1J9j11p2J09k5Q3j86J88P3Mj17q5j6k4K59k11L0O3r0M6K02j82L0j22J1j49
5435b22kK05k8J71j16J9j87J64J32q4m5r5J12O4o1M3j53K43k09J40n9k9o3K8j05
5460a37J62l7Q4j0j56p8K89j01J2m1j86Q8O9J06M3j55J44k70MM1J56r3o1J03q9
5485a13Q4O4l5L0q6JP1j39r7K25K16r0k42J47M9Lj55J11K9j34r3j06L21O5m2k04
5511a20Q4l9K9j1K8M7j10LP0N6J98k09J79j18o9j17J0J59j7J9j12J9j14J88k62
$$ plain form
5335 -159 90 12 190 -38 -78 -70 128 -170 38 -6 -133 63 25 -158 36 -34 105 62 -141 -145 -32 109 -53
5358 -53 28 -34 130 -51 -60 -219 88 -58 -68 -125 -65 89 -3 -44 72 35 109 -24 -63 -76 15 -59 -240 -30 18 -104
5384 -104 -70 133 -71 90 110 52 -139 -107 -77 -94 -77 -86 220 266 77 -63 0 3 58 148 -31 153 -137 29 51
5409 51 70 -41 -113 -4 -29 54 -132 56 129 133 16 -69 -85 -109 150 -61 -31 32 -58 -12 190 8 38 -84 -73 -222
5435 -222 -224 -19 -47 124 8 27 -160 4 136 52 7 -88 24 88 27 70 -83 160 -49 91 32 3 -60 -32 -137
5460 -137 25 -12 72 62 -94 -172 117 16 28 -13 -199 -111 -42 64 107 -48 96 -174 -170 -129 27 -66 -127 -24 -113
5485 -113 -29 35 0 30 -56 -55 16 -123 -220 5 221 131 -111 36 85 88 -67 44 73 -61 -154 -260 61 126 84 -120
5511 -120 -36 -75 -46 -57 -29 18 -92 -89 -19 37 235 26 205 87 18 -99 -89 70 53 72 -40 -21 -135 53 -209
5536b09K0K09k28j6L31J09k92J27m9N5r9N4o1%J8J79o7k8j70K39lP0m11J00J11
5561a1R4N3j01j44N6L0r5J78k21J47n9J06j73K13O2j90M7k19N3K90P4j03K3k01
5585i1R7M5J19k22K7J6J4m4L8o3r0K66j86N8P1L7j72J72j84M1J45N1j78J66J0
5610A43j44P4n5L3l1j14p8J52j06J53n6o6P9Q2K02n5k30J19k33Q4K76n0k15r1
5634a27L2J34J7j81J66N9j18K2J65l37K30j86J91j39mr6J56J20j19M2j13K94m10
5657b02K04J9J96k67K8J79P4j54J5K26m09K76k14j88J99J11j41J46k39K36l54
5678b59P1nK09q1Q1K10l00Q1N7J19j83J26r6p6P0m7J22J4r2P0j22J41k53K19o
5703G0m9j20l7J63k34P9L81k47L9oP3k22K11l5Q0k39K37k1k98J74K3k3j32L4K22
$$ plain form
5536 -209 -189 20 -208 -224 107 216 -76 51 2 57 -42 12 -49 -49 -31 148 81 53 -117 122 119 189 -222 -122 -11
5561 -11 83 136 35 -109 -53 -23 -118 60 -161 -14 -73 33 -140 73 135 -55 -8 -227 -174 116 190 87 110 -91
5585 -91 6 51 170 -52 -25 -9 5 -39 -1 -64 -154 112 -74 -16 55 92 -80 92 -92 -51 94 145 -33 133 143
5610 143 -1 73 18 51 20 -94 -172 -20 -126 27 -29 -95 -16 66 268 213 -17 102 -131 -47 229 179 -36 -127
5634 -127 -95 39 56 -125 41 100 -18 4 169 -168 62 -124 67 -72 -76 -172 -16 104 -15 27 -86 208 -202
5657 -202 2 21 217 -50 -22 157 231 77 92 318 -91 185 -29 -217 -18 93 -48 98 -141 95 -259
5678 -259 -188 -193 16 -65 16 226 -74 7 64 183 0 126 30 -46 24 -23 99 113 21 91 -31 110 -143 76 70
5703 70 21 -99 -136 27 -207 -128 253 6 45 39 112 -110 101 66 146 -93 144 123 -175 -1 22 -1 -133 -99 123
5728A23o9k0J13k06P0L2o4K5q1L5oJ08k1M6j9j86J89l3j18N7J22j98Q0j54J43
5753c2K4j95J66k2j01J48p2K31j98K33j49N9J6m10K86k33J23J12L0J48k46LJ97
5776A18j21j31M1J79l08P2J05N9K00j94r2O5O9pm6K6k08L48l51P8L33k36k32J88
5800d5N9J1j29K5K25j55j36K65k36pK15j24M0r6q3N8P6jl1J6R7R1J24k86o7J10
5826A6j93J55J58j04J21l51N06k64o3Q8m6j45L12O4j48l33M10j46P2k11K54j56
5848dN9N7j94O1J26kl03LN5J97j49L6M7J38j19l3k9J09j37M1n2K27q2O7j00j02
5874h3J32j51l9L0R7p6K64j76K2j17Q8N0j52q0K09o9j70J68j8N1J79j00J27k74
5898h8L3J06l6k45J02K10k41J80R4k72rJ17Ol6j34K63j36J01k5J23k19R5j19P8
$$ plain form
5728 123 54 34 147 -59 11 43 -21 4 -77 -42 -48 60 39 85 66 -120 69 36 -82 -25 97 -101 -21 -175 -32
5753 -32 -8 -203 -37 -59 -160 -12 -84 147 -51 182 33 92 108 -302 -16 -249 -126 -14 16 164 -82 -79 118
5776 118 -3 -134 -93 86 -222 -150 -45 14 214 20 -72 -7 62 55 9 35 -173 175 -176 -98 235 -1 -233 -45
5800 -45 14 25 -104 -79 146 -9 -145 120 -116 -123 92 -32 8 -88 -171 -113 -37 -38 -69 -53 44 135 259 -27 -94 16
5826 16 -177 -22 136 32 153 -198 308 44 -19 69 23 -122 190 254 106 -227 183 37 109 -102 152 -4
5848 -4 55 112 -82 -21 105 103 -200 -197 -142 55 -94 -58 -11 127 8 -25 -54 55 -82 -41 -93 134 52 119 19 -83
5874 -83 49 -102 -141 -111 -14 -90 174 -2 20 -97 -9 41 -111 -191 18 -51 -221 -53 -71 -20 159 59 186 -88
5898 -88 -55 51 15 -230 -128 82 -159 21 115 -157 -166 -49 -43 -79 -213 50 -86 15 -10 113 -106 -11 -130 -52
5922e2R6o6J60k3k79Q2j76K34N3j56K23j85N5K20k51J88n4k1j3j2K3j34k38M09
5946H3j22j14J79m1J78l81L26k35J70O0pj18J46q5p1J6K21j11j80K72r7j25n2
5969h8J04L1j16M4J15pjj54K33j63p3p3O4J76l04J08N9J04k1kJ1J45Ok45K4K8
5995Ej82K93j23Q5O6k09J55k51K23k1N6j77n6J7J80j36j08K70j31m3k8J17QL4
6019D4J01k22r6J05Q8j9K41k10l9rl7J34l9p3J90j57M8jj60J25l0p9j48K62J6
6044C5K0r8J60j39O4j74K08j04j51J69l8M2j70J05J06q0M1K3J9J73k03k8l2kO3
6069IR7O2k39R9q5j5J88o5l6K24k24j48L9J28l1n6J2j40K32n9O9j12J21k32Q4
6094g8K30n0J31k72r0K12o2P0j24j09K10j81k1J36K42m19K12N7k35J50j34m4L22
$$ plain form
5922 -52 44 -22 138 115 -164 -82 -258 -24 29 -127 96 -89 -34 186 -65 123 69 48 35 23 46 -88 -326 83
5946 83 -39 -153 26 -15 163 -218 108 -127 43 103 96 -22 124 39 -32 -16 205 94 -86 186 89 -36 -88
5969 -88 16 47 -69 -25 90 83 82 -72 161 -2 -75 -148 -84 92 -212 -104 -45 59 38 36 47 192 198 -47 -23 5
5995 5 -177 116 -7 78 144 -65 90 -161 62 41 97 -80 -136 -119 61 -75 -183 87 -44 -87 -115 2 10 44
6019 44 145 -77 -173 -68 20 1 242 32 -7 -16 -53 81 42 -31 159 2 50 49 -111 14 -16 -95 -243 19 35
6044 35 55 -43 117 -22 42 -132 76 -28 -179 -10 -48 -6 -176 -71 35 -45 -4 19 38 211 8 -20 -52 -54 9
6069 9 106 168 -71 28 -57 -72 116 51 15 239 15 -133 -94 34 3 -53 -41 -181 51 -8 61 -51 70 -162 -78
6094 -78 152 102 233 -39 -129 83 21 91 -33 -142 68 -113 -134 2 244 -175 37 94 -141 9 -125 -169 153
6117A53l68L17r9N7j05m5j29K30L1k5K0J34N6j91p7J05j89P3J14r2J56J01j84
6140D3j15K19k91L17m0l33K97l34L25n2m5k7k1J57k32J19j3k02L82q9J5j67k2
6163a09J76k39N5K23j15j4N1j4R2q0j84K44j25J40j54M1j0K17j07K8J1k43N3j01
6187a64K35j97K46j21n8q6J52p0K01k94L7K03j6P7o3k12J98k8n3J91k90j8J84
6210E4J5K22l28K0j58K1P1L9R5R4j27Q6m3l05K74m7P6pQ8j25J15k34J03N0k65
6235b16K15M2r1J33j2j36L3n7J24J2o2K99k6j78J27k41P5j3j72L2J39j2n1K48
6259B12l65N5M9J10O6j19Pjq5P5l1N6Ok2k0j39J18p0L9J28nj40N3N6J20j78R9
6286G4R0j46OJ9j47J2K74j97O3l4Q3k60J38Q4k39L07k55J71k28L49l55K05j5q
$$ plain form
6117 153 -215 102 3 60 -45 -90 -219 11 42 17 37 171 227 36 -41 64 -125 -52 62 -30 126 227 43
6140 43 -72 147 -144 173 133 -200 97 -237 88 36 -9 -36 -57 100 -132 -13 -26 -228 154 65 80 -87 -109
6163 -109 67 -172 -117 106 -9 -23 28 14 106 26 -158 86 -39 101 -53 -12 -22 195 88 116 127 -116 -63 -164
6187 -164 71 -126 120 -1 -59 -145 7 -63 138 -156 -119 84 68 145 82 -130 68 40 -13 178 -112 -130 54
6210 54 69 291 -37 -17 -175 -154 -83 -44 51 145 18 104 61 -244 30 -17 59 52 140 15 130 -104 -1 49 -216
6235 -216 -1 41 -50 83 71 -65 -32 -89 35 47 -15 284 258 80 207 -34 41 28 -144 -112 27 15 -36 212
6259 212 -153 -98 -49 61 127 8 15 14 -71 4 -27 29 35 13 -7 -146 -28 -98 -59 69 64 -76 -23 33 153 -25 74
6286 74 164 18 24 43 -104 -92 182 -15 48 14 97 -163 -25 59 -180 127 -128 43 -185 164 -191 14 -1 -9
6310ij35J78NJ28k47K3O3O0j10p6NK6K2Q0R2K0l09Q6J22k6k63K19RJ3j82O0K26
6337H0j45r5R4R8n4j23J71j16Q1R2j05J69k19j01L55k27P7RJ8J38j55j02K17k13
6361e6J60k82L44j62L0j12J69L4l50P5K64k91J81Q4p4J05l01J52n1RJ47j13j54
6384a92M14r4j00p1N2N6J42k39J22j28K3J2K23k42j9m9M2J14ml5LLj60J06J84
6409A63q6L1l5p1k29K03pJ1R5l0J15k11Nl3K36o2m7M1j19o1J17Om3k26K91j70
6435a16J12J9K0n9j03J14J6N3j25j12K80j83J49n7j40J49J85l87L75j0j51R2m8
6458G3p8k4K15j67O6k09n9l4K38j4J91k31K19k82K18r7q9p8J73q2Rj8Q2j19J26
6483B9J86k12J3P6Q5l25N8J08N2p0o3k0OJ97p7O2m7j16n8Q8j6p7J49k46J28k7
$$ plain form
6310 -9 -144 34 39 167 -80 -57 6 66 -44 -120 -115 -89 -67 13 105 125 -184 -98 24 -2 -265 -46 -37 -24 -206 -146 80
6337 80 -65 -160 -66 32 -22 -145 26 -90 -9 83 -22 147 -72 -173 182 -45 32 41 59 197 42 -60 157 -56
6361 -56 104 -178 166 4 34 -78 91 125 -225 -150 114 -177 4 88 14 119 -182 -30 -81 -72 75 -38 -192
6384 -192 222 128 28 -43 9 65 207 -32 90 -38 -15 -3 220 -22 -41 -90 -48 66 62 27 30 33 -127 -21 163
6409 163 77 108 73 2 -227 -24 -31 -20 75 45 160 -51 -46 -79 157 95 48 89 -30 -91 26 32 -11 -237 54 -116
6435 -116 -4 15 35 -24 -127 -13 3 56 -69 -181 99 -84 65 8 -132 17 202 -185 190 180 29 121 73
6458 73 -5 -29 186 19 85 -124 -183 -217 21 7 198 -33 186 -96 122 25 -64 -142 31 -51 -42 -60 22 -97 29
6483 29 215 3 16 92 177 -148 -90 18 70 0 -63 -83 -77 120 43 105 58 -58 -116 -28 -44 -121 28 -218 -90 -117
6509a17m1Q3J39j01j02J33qJ63r1L0j39M0m0J11J30k91R6l9J13k80K91o5N8k4
6533D9k6o3L66k34j27J5j32N3J2L2l1O4J03o2K3J57j69O6l14K50J59j39J34k36
6557e0J23P2p0j44J81o5J42n3j53l6K9o8l9K4K36j12L5J8J4j81Q1L7r3J50o7J46
6583A57l03o3J20Q9J75l87K68O6j21km3N9K91n40J7L69k01L6p7o9K29j97M6J61
6607H0k72K39m0k09QL9O8J80j61Q3q7K4O7J22m2K0P4j41J35j9r1k54K33K7k24
6632a41J11j30J83l8J4N5j5J5j25r8K84o3N9o1M8l18K38j72K71j39J9L1j29K09
6656A08j39J99j74j27l1K74o1j01J24k84K74k18L02k33Lo0K33j69M8N4l0m0Q5
6679C7L0j59J90j23O3k75L25p0j35K4K54j99L7n2r8J96q4J6r0L11l18L1J46K23
$$ plain form
6509 -117 -158 -75 64 -37 -139 -6 -14 149 58 88 -51 -11 -51 60 190 -101 -5 -44 69 -211 80 15 73 49
6533 49 23 -40 326 92 -35 -20 -152 -99 -87 -55 -86 -22 81 19 42 199 30 96 -218 32 191 52 186 -50
6557 -50 73 145 75 -69 112 47 189 136 -17 -53 -24 -92 -131 -107 129 17 52 70 84 -97 -16 21 -72 78 11 157
6583 157 -146 -209 -89 0 175 -212 56 122 1 -1 -44 15 306 -234 -217 152 -49 -13 -90 -159 70 -127 -81 80
6607 80 -192 47 7 -202 -194 -155 -87 93 -68 15 -72 -48 19 141 99 119 193 52 187 168 77 -177 56 83 -141
6632 -141 -30 -160 23 -15 -1 54 39 54 -71 -169 115 52 111 50 98 -220 18 -154 117 -22 -3 28 -101 108
6656 108 -31 168 -6 -133 -164 110 49 -52 72 -212 62 -156 146 -87 -84 -144 89 -80 -32 22 -8 -48 37
6679 37 67 -92 98 -25 38 -237 88 18 -117 -93 161 -38 -1 -53 -151 45 -39 -23 -113 198 -120 -89 57 280
6703B80j14p0o8P5j46L2k9R9Q9j86Q1M2r9jJ31j7K3k05L7n4K72j89j18L64k08
6728B1k3p1Q1R3j46Jj25J37J0Q1k60K66pr0L7q8MP0J61l61J36k4R9j4n7p3L87
6755B45l51K2L2P3l06L25l2P7J03j57p7j93J20J06oJ6N0j6m9j4j04JJ00m0R1j22
6781a06J1J78j65J4r3J03J06j31n2J44p2R8m7M2r5j8J0JJ88k40J68j39P8K3j9
6806a3j72K54j03pR4L17l71K22k64N8j61R3m2K70j0j74J12k78M11k47R8J7j21
6829a7J43o8j18j02P3J6l7J96n9J6j27P6J83k16M5R1J4k46K48N0J34k39o2m9J26
6854G1k70n2L53j66J90Pj94j83K89J76l35K95l48p4K44L1j6p2LJ21j7K02l11M5
6878a1R1M1j36p2N5K3j2j7kNJ05J19q8j0k53pK62j78O5j3J56j11j56J26J93l89
$$ plain form
6703 280 166 96 28 103 -43 -11 -40 59 148 -38 43 85 -14 -15 116 99 122 -83 -46 -100 172 -17 -135 229 21
6728 21 -2 -73 8 101 -45 -44 -169 -32 -22 59 -201 65 58 -32 5 -83 -79 -9 152 -209 -73 -97 2 -12 -69 -142 245
6755 245 -106 -84 -52 21 -285 40 8 85 188 31 -46 -239 -119 -13 -19 -3 47 31 -18 -32 -136 -135 -35 -75 16 -106
6781 -106 -95 83 -82 -68 -161 -58 48 -83 -135 9 -63 35 -12 30 -65 -83 -73 -72 116 -124 44 -95 -17 6 -13
6806 -13 -185 69 -34 -41 53 370 -1 221 -43 15 -146 -53 -95 175 165 -9 103 -175 236 -11 87 104 -17
6829 -17 126 58 -60 -162 -89 -73 -110 86 27 43 -84 -8 175 -41 4 95 109 -137 111 161 295 56 -6 -55 71
6854 71 -199 -251 102 -64 126 133 -61 -244 45 221 -114 181 -167 -241 3 34 18 -54 -51 70 53 255 -56 -11
6878 -11 80 121 -15 -87 -32 -9 -21 -38 -40 -35 70 189 101 91 -162 -169 93 -85 -20 -33 123 12 -144 -18 175 -214
6904b14J10J44l6pl9K26q6l6j98J69r2J25n1l0r4J18j26P4J52k92L50k04LJ45
6928A11l75o0J41K39r3L0j39J59j05J69r0l6O9o3J36k05J24J49k57P0j8R2J02
6951A50K1j47j33N0J40j24J46l63J63J32j17J16J09o2j12J11Jj4M6j13l2pn0J09
6975B0j7q3Q0r0rL27k50oJ01j70J37O4j44J44N8k38m7j44J13K01p4J2R0k1j90
7000a36L04R3k71pP9j83L1K03j3j3j94O2Q1p4j04J33O3j1k29J28k07K81j1m9n9
7025a03j76K73p5K09m9m68K29M1K73j64p9JM4J45k27K35q9O3k17P7Q9r5L5r8J58
7050C2J0k25K11q7K31k25J98m45K43R9L1k68M31l85n7K63j25j24K55P4p5R5k29
7073g2P5j27J24J11j50l2N9j03J19K9J15k19p5J86q0m4pN9Q2j50r4J32K60j06
$$ plain form
6904 -214 -104 40 4 -3 -42 184 98 62 -136 33 -59 66 15 -15 -109 9 -117 -43 109 -183 167 -37 -34 111
6928 111 -264 -324 -183 56 -37 -7 -146 13 -92 77 -13 -49 20 -43 93 -112 12 161 -96 -26 -44 48 150
6951 150 171 24 -109 -59 81 -43 103 -260 -97 35 -82 34 143 81 -31 80 81 67 113 0 -32 -39 -89 20
6975 20 3 -80 0 -90 -99 228 -22 -28 73 -97 40 104 -40 104 162 -76 -123 -267 -154 47 -27 -15 75 54 -136
7000 -136 168 261 -10 -17 62 -121 -90 113 100 87 -107 -45 36 -38 -142 -9 54 43 -186 -58 -265 16 5 -44 -103
7025 -103 -279 -6 -81 128 79 -389 -160 -119 154 -10 -89 -88 -44 101 -126 109 20 83 -134 -57 32 -63 -28 -126 32
7050 32 42 -183 28 -59 172 -53 145 -300 -57 42 73 -195 236 -149 -206 57 -68 -192 63 137 62 157 -72
7073 -72 3 -124 0 111 -39 -71 -12 -115 4 33 148 -71 -146 40 -40 -84 -91 -32 50 -100 -194 -62 198 92
7097I2k58L03l32M0J90j09l0J31j33O4J75j48k4oPO0Q3j92J69j12J01p3k96L15
7121A7j62K52j30p4J2J34k03J91Q2k60K20q2l4J93m38K89k5K12K6j12L2j10Q3
7144A13k4J19j43k3k34J59o7J41l0J17k41K05k33Q6J23J1j3n1M3j79J50J8j82
7167a35J37J5J94k20Q7r2R7M0n7j23n7O9O3J17j01P2k8j42K94l81L74l07k3p4
7191a81K64q8k51L51j94J92p0r5rN5opJ0p3K51o1r4k2n8J14O7j36j58pK98j79
7217h7K95l49J06J59k63J53M0j34P6k83K19J77l0O4j21n7N0L1j1o6J52p3L3oj92
7242a17K06P8k01O9r0j70K33mo2k69M52j45N2l7J77j52J9J25k85K9K62k20K67
7265B17k43j35L8J50j94J51Q0j94J41r1k3P0J29j26K7K7J4j54K09j29j15J73Q1
$$ plain form
7097 92 -166 137 -195 -155 35 -74 -104 27 -106 -42 133 -15 -39 -45 -38 22 105 -87 82 -30 71 -2 -298 17
7121 17 -145 107 -23 -97 -85 49 -154 37 119 -141 79 -3 -37 156 -282 7 -18 194 220 108 140 30 113
7144 113 89 208 65 42 -192 -33 -100 41 11 128 -113 92 -141 -55 68 79 66 15 58 -121 29 47 -135
7167 -135 2 17 211 -9 78 -14 83 123 66 -57 -114 -45 18 135 34 106 78 -64 230 -151 223 -84 -107 -181
7191 -181 83 -5 -256 95 -99 93 23 -72 -81 -26 -32 -39 -29 -102 149 88 -6 -28 -86 28 95 -41 -199 -206 92 -87
7217 -87 208 -141 -35 124 -139 14 54 -80 -4 -287 -68 109 79 143 22 -35 15 46 35 -31 121 48 81 75 -117
7242 -117 89 167 -34 35 -55 -225 8 4 -58 -327 125 -20 32 -5 172 20 39 164 -121 -92 170 -50 217
7265 217 -26 -161 -123 27 -167 -16 64 -130 11 -80 -103 -33 96 -30 -3 24 38 -116 93 -36 -151 22 103
7288A03lk87L03k88J98K37l86O0R5J3k47J99R0m8o7p6J16L4J9p2R6m1nK4nL0k82
7315a90P3K08j16O3K17j60J3q7j22J50j9q0r2N0Q1o7L14l44K6K65j55m2J13k2
7339G7k5N7l27M65k65m9n8K54p3Q0j91r1J17k9oJ09oJ32l03K67o2j80J1p1P1J16
7365B0j35oJ17j91L64j72Pj49Q3J21o4%L6l5J75k61J47k21L08j40j4j12L07m0
7389A45j66%m1J00m3J13o3M9r4J25k15PN2K6k17J09l9J98o7p6J90n6QL22k61j52
7415d6M0j22J34n1J08j69j38K11M8P5j75K1R3j1P2j24L5J1j15O3j39L7K93k05
7439e4K9J13q5M4q6J03n1o7j95J67J74j27l3j25M24k90O5L2K51l89j06j09J86
7462a29P6K4p6J91L0j68n4j28L46R3l50O7L75j57k72J83j3J36m30M16l32J10Q8
$$ plain form
7288 103 100 -187 116 -172 26 263 -123 -63 32 45 -202 -3 87 39 -28 -104 12 46 65 -7 89 48 43 67 62 92 -190
7315 -190 -117 91 -25 38 255 95 108 21 -101 49 30 -50 -142 -92 -11 -78 236 -108 -82 183 28 -14 99 77
7339 77 52 109 -218 247 -18 -67 -125 129 56 136 -55 -146 -29 -58 -64 45 39 171 -132 135 73 -107 -96 -167 -96 20
7365 20 -115 -121 -4 -195 169 -3 4 -145 -62 59 -5 -5 31 -4 171 -90 57 -164 144 4 -10 -122 185 145
7389 145 -21 -21 -62 38 -5 108 45 94 0 125 -90 -83 -31 -5 -222 -113 -152 46 -21 -97 93 37 45 367 106 -46
7415 -46 -6 -128 6 -45 63 -106 -244 -33 15 90 -85 -64 29 18 90 -34 1 12 -103 -40 -179 -142 151 -54
7439 -54 -25 88 3 47 -39 64 13 -54 -249 -82 92 -35 -68 -193 231 -59 6 38 289 -100 -206 -315 -129
7462 -129 -53 -29 -105 86 116 -52 -106 -234 112 205 -145 -78 297 140 -132 51 38 174 -256 160 -172 -62 26
7485B6Q2j00K6m2k5j13J89J9j26K03j66j39K01O5r5K24r4l96K55j1M1O0M3r2j71
7510a36K20M2o3k80L34j92j08J82j81J61J23m2j1R4R6l08P3q2p4L1K03m3k8m5
7534c4j22L26j45o5lR8P3j37R3l9j82l4J45j32M4M4P4K42j65j63K8m2K92l25j08
7559b37L61j99m6j25K15l6L8R9j05m0k02K14P4m4M0L6r3pO0m7O2m8p3K32n8k57
7585a86K42n3J0Lm7m4J75J56r6k65K71k12j46K33KL2oj64K03k9j77M4J39Lj63
7610g5J96l01J54pL2mn1K33m03M03k81l8j16N6K06l9k5m2K1K00l9p3k01K88q0
7635A4lJ15k05K30k35J07q8Lk5P4J98l83L93l89R2J19M1n1N5j03O0j07M9j80M3
7660a76J26J27k36P2M5P3j5K49k49k78L46r0kj94L65m13K23O6r0j41K35J9o6j83
$$ plain form
7485 26 108 8 34 -8 -33 -146 43 62 -64 139 -27 -166 35 100 5 229 135 -261 -6 -17 24 84 127 35 -136
7510 -136 84 126 63 -217 117 -75 -183 -1 -182 -21 102 60 49 143 239 -69 4 -78 -152 -121 82 39 11 -34
7534 -34 -156 170 25 -40 -43 55 128 -9 84 45 -137 -171 -26 -158 -114 -70 4 246 81 -82 -54 -96 196 -129 -237
7559 -237 124 -75 -121 -246 -31 -67 -29 70 -35 -75 -277 -63 11 -33 7 43 -50 -57 3 -44 18 -30 -103 129 71 -186
7585 -186 56 3 13 16 -31 -75 100 256 160 -105 166 -46 -192 41 43 75 69 -95 108 79 -98 -54 85 88 -75
7610 -75 121 -180 -26 -33 -1 -5 -56 177 -226 177 -104 -142 -258 -202 4 -35 -60 -102 -81 119 80 7 -194 94 14
7635 14 11 126 -79 151 -84 23 -65 -62 -87 -13 185 -198 195 -194 -102 17 58 7 62 -41 19 -88 -39 -219 -176
7660 -176 -50 77 -159 -87 -42 31 16 265 16 -262 84 -6 -8 -202 163 -250 -27 39 -51 -192 43 62 -4 -187
7684a87K49j37J16j90K52L4J4j57Q8l20J98P8nj6j41K1j34q8K94L3k08J74N5n3
7708c0k9j70J42P8K9k0R7k00k0l8K92K7m56R4K38J30k09q7k2Q9J63rk24K73q5
7733E3j4j25K54l34K01J2j3p3J55k6j51l7L10k72M5o4K81j59j36J79k59L95j35
7756H7J6J29k74N3J03k82L2L85r6l19L17k09j15K17R8n0r0o5K55l61J13m1LN8
7780c6N4M6q5o1K88k44k2k16J51J42n4K22j40j04L7l0J0NJ1K34k54J14j60J29
7804C7K9j16J15L5Q2j54O5k47J00K47r7j85k8K82K3m09J88J4Ok10K08J02M6k50
7828a17K48n0j76M8L4J46j28K1l7J78l32N5RK14p5j20L34k53k90K39m1K22j88
7851e9L68k51j12J04Lp7N7j22l9L25j09j77J77J9j30p3n6K09J00k11K10l00K03
$$ plain form
7684 -187 62 -75 41 -149 103 137 151 -6 82 -238 -40 38 33 17 -124 -103 -237 -325 -31 2 -206 -32 23 -30
7708 -30 -59 -229 -87 -9 20 0 97 -103 -123 -161 131 158 -298 -204 34 164 -45 -132 -154 -65 98 89 -135 138 53
7733 53 39 -86 168 -166 35 47 34 -39 116 90 -61 -98 212 -60 -15 -79 202 43 -93 86 -173 222 87
7756 87 103 232 -42 11 114 -168 -136 249 153 -166 151 -58 -173 44 142 92 2 -63 192 -169 -56 -97 -94 -36
7780 -36 18 64 -21 -82 206 -38 -60 -276 -125 17 -37 185 45 -59 -22 -52 -42 -37 -26 208 -46 68 -92 37
7804 37 66 -50 65 100 182 28 93 -154 -54 193 96 -89 -117 165 188 -221 -33 -19 -13 -223 -15 87 133 -117
7828 -117 131 81 -95 -47 -13 133 5 26 -11 167 -165 -110 -101 113 38 -82 252 -1 -291 -52 -93 129 -59
7851 -59 309 58 -54 50 53 -24 33 -89 -128 197 88 -89 88 107 -23 -96 -152 57 157 -54 156 -144 59
7874E9J09k08L0n0p0K08j47j08P6J60mj90J16j58K73k11L47k29P1j32L88l04r3
7897f7Qj16J95j19J18%j95M0K54l05K78J02k12m1oJ28j27K02j25j51K78j18NR
7921C5K7j43n3mj4K11J70n2J33k04r8Jj5J43j98OQ3J24q8J2JN6m2j04O6n4J06
7948A05j16J7RR2o1l4j15J13j02L0J39j31O5j2J78Pj69q4j88L59j40j41N5J12
7972a2N2o9m5J22J6l0j66N7j2K49k35J22l06J52P1L97j84l56K67K2k46J31j5J15
7996I7j88%n0R0N2m8J62l6j06L9K9j25j9O6J36k69J58k33L55j33R1J88k94J26
8020H8j24j97J08k7J68j29O3N1N1J55k00J44q1j45K70j82M1p1l6Q2J32j32O9J
8044I9k72R0P0K7Oq3o8J30k9L6j62J37j07L0qJ45l8J51j79k1P8o2J02Kj05K07
$$ plain form
7874 59 168 -40 -10 -60 -130 78 -69 -177 -101 59 55 -135 -19 -177 96 -115 232 3 74 -58 330 26 -67
7897 -67 -59 -175 20 -99 19 19 -176 -136 118 -187 91 193 -19 -60 -66 62 -65 137 12 -139 139 21 26 35
7921 35 62 -81 -134 -138 -152 59 229 177 310 106 8 9 -6 137 -61 -55 28 152 64 76 77 133 91 -13 53 -1 105
7948 105 -11 6 15 107 46 12 -103 10 -92 -62 77 -54 11 -1 177 184 15 -69 -257 102 -38 -179 -124 -12
7972 -12 40 -29 -74 48 64 34 -132 -75 -87 162 -73 49 -257 -105 -34 363 179 -177 90 112 -134 -3 -18 97
7996 97 -91 -91 -141 -51 1 -47 115 79 -27 12 41 -84 -103 -37 99 -170 -12 -245 110 -23 68 256 -38 88
8020 88 -36 -233 -125 -152 16 -113 -50 1 52 207 7 151 70 -75 195 13 54 -17 -53 29 161 29 98 99
8044 99 -173 -83 -13 14 20 -63 -131 -1 -30 6 -156 -19 -126 -96 -104 41 3 154 -25 -46 32 -30 72 74 -31 176
8070A76j08j40K61m0k55J81R5l31J22k1K39o2k53Q0qL3J89K3j37L0p2m2j30J53
8094a7mr3K55j69P8n1RJ81j63j6K24J11l02j22n8J69j10K97k27K44j07k82J0L42
8118A99k65L47j58k16J21J44k15J10j43QR5j54J21J3r7J34q3J22j59J24J30m30
8140b52qK74N1O3q2J17j38l4M7k3J19l10L27j18q9j86K48N7j29q8J09Oq6p1Q0
8165a16Jj7l5NL5J39Q5k55R2K16j65J92j40q5j36p8M22j78R8o5j91J09J76K8p1
8190F6j37
$$ plain form
8070 176 68 -72 189 149 -106 75 170 -161 -39 -60 179 117 -136 -56 -64 -31 158 181 44 74 2 -40 -170 -17
8094 -17 -21 -114 141 -28 50 -1 8 189 26 10 234 345 43 -79 -137 32 -78 219 -8 236 129 -153 -143 199
8118 199 -66 281 123 -93 28 172 -43 67 -76 -68 27 -127 -6 7 -90 44 -39 83 -76 48 178 -252
8140 -252 -260 14 65 128 46 163 25 -9 38 15 134 -176 151 33 -56 -242 6 63 -66 -154 -45 -39 -125 -196 -116
8165 -116 -115 -132 -167 -162 -127 12 97 -158 -66 150 -15 177 37 -48 -184 -262 160 -18 80 15 -176 -67 109 137 66
8190 66 -71
8191g1
$$ Imaginary data points
##PAGE= N=2
##DATA TABLE= (X++(I..I)), XYDATA
0@%%%%%%%%%%%%Qj6J6j6J6k4L2l2M0m8N6p2Q5r6J10j30J51j71J95k24K56k89L28
35A75l70M15m66N21n81O49p22Q01q88R84j087J199j327J463j607J769j951K150
53A127k374K623k898L213l576L994m482N063n772O656p793R324j1503J4881k0898
68a2415L4953j34098r0965R8940J489K2250p127K5864K1046L5683K4281K0101
80D0002o954J3422L507N11R660J6007p411j5134k1573K816P211q696j1822p953
94A3593k1176p704J069k21l676j1637j0622p60o769M953J7006J12r464k460J308
109c6448J2979J2773R824R210r484r953J6890J7818P841M078o032m818N59M141
123B9378J1838k502j6497k880j824q005j711n629q093m444n877M82k738j2968
$$ plain form
0 0 0 0 0 0 0 0 0 0 0 0 0 0 8 -8 8 -8 8 -16 16 -16 24 -24 32 -40 45 -51 59 -71 80 -91 104 -120 136 -153 175
35 175 -195 220 -246 275 -306 343 -379 422 -466 518 -569 630 -697 766 -841 928 -1023 1127
53 1127 -1247 1376 -1522 1691 -1885 2109 -2373 2690 -3082 3574 -4219 5105 -6398 8483 -12415
68 -12415 22538 -111560 -202525 -103585 -102096 -79846 -86973 -61109 -40063 -4380 19901 40002
80 40002 33048 46470 49977 50488 60148 76155 68744 53610 32037 34853 42064 33368 21546 13593
94 13593 -7583 -15287 -14218 -14439 -18115 -29752 -40374 -41134 -47903 -42950 -25944 -25832 -35296 -37756 -36448
109 -36448 -23469 -10696 -872 8338 -1146 -11099 5791 23609 31450 35528 29496 24678 25237 29378
123 29378 41216 38714 22217 19337 17513 9508 7797 2168 -5925 -10369 -16246 -15764 -18502 -31470
137c1470K840R529l307k784j615K877J0145J984M75N142n57P048J0393l201Q41
152H340Q994K734r56p596R7J4678K78j1673n030m415L197O322n024o055m725l020
168c854L195o770r627Q406M842p618q769p683N074J2121K729J075m939q015R887
183i946J3217M205L870k961m693K459K046R320P222j0365p405j062j121P001L786
198A5573n820o319j0041k620R790P24k768k916j1170l426N962N923O861l224q543
213a2014J561J017N008J2044J041n865l234l662M574O309Q39M028n519j2308J218
228d963O922O807N465q547j0395m21M203J0770K756j2507n155J077K52M178p6
243C66k455N75o187l730N456K565M982J427r769k683N558O568O444m588o671L851
$$ plain form
137 -31470 -28630 -19101 -22408 -25192 -26807 -23930 -13785 -11801 -11326 -6184 -6741 307 10700 7499 8340
152 8340 17334 20068 19112 11516 11613 26291 26569 14896 9866 5451 8648 14970 9946 3891 -834 -3854
168 -3854 -659 -7429 -17056 -8650 -3808 -11426 -20195 -27878 -22804 -10683 -7954 -6879 -11818 -19833 -9946
183 -9946 3271 7476 11346 8385 3692 6151 8197 17517 24739 14374 6969 5907 4786 11787 15573
198 15573 9753 3434 -6607 -9227 563 1287 -1481 -4397 -15567 -18993 -13031 -7108 -247 -3471 -12014
213 -12014 -10453 -9436 -4428 7616 8657 2792 -442 -4104 470 6779 7618 11646 6127 -6181 -4963
228 -4963 1959 8766 14231 5684 -4711 -5132 -929 9841 12597 90 -5065 -3988 -3736 442 366
243 366 -2089 -1514 -7701 -11431 -5975 -3410 1572 2999 -6770 -9453 -3895 2673 9117 4529 -2142 1709
259A709P55N41L882k072j060Kn293j05J305Q5M975m044p990K109K774K449L060
276C082m003j379J406j080M127J955l915J346m31k763K476l50p15J945m177L32
292b144K455l147J201K204k092K082p04j978K922m47O25L575l559j649K703j493
308E54R24P68k241J838k527l658L468N85l07K162m693k251L669J500L145k44m992
325b300K101J679j163L163m95j786J003l225r04K685q30J574j027o183Q96L371
341a441J229K590l154k784L418J94J794K886l148l64K78k558J877J032j152J043
357A740l990l110L708R15O29J497m092l17K825K8K899j72k565K300j112j202L034
374C015l88j262P3l331L34J807k041J045p44k922K128K74n37K527o41l21K298
$$ plain form
259 1709 2464 3005 6887 4815 3755 3757 -1536 -1641 -336 -251 4724 680 -7310 -5201 -2427 22 3082
276 3082 -921 -2300 -894 -1974 2153 4108 193 1539 1108 -1655 821 471 -244 1701 -2476 -2144
292 -2144 311 -2836 -1635 569 -1523 559 -145 -2123 799 352 977 4552 993 -656 2047 554
308 554 1478 2246 5 1843 -684 -4342 -874 -289 -596 1566 -3127 -5378 -1709 -209 2936 2692 -2300
325 -2300 -199 1480 317 3480 2985 1199 2202 -1023 -1927 758 -72 1502 475 -5708 -4812 -1441
341 -1441 -212 2378 -776 -3560 -142 52 1846 4732 1584 1220 1498 -1060 817 1849 697 1740
357 1740 -2250 -5360 -1652 -737 -108 1389 -2703 -3020 -195 -167 2732 2560 -5 2295 1183 -19 3015
374 3015 2627 1365 1438 -1893 -1559 248 -1793 -748 -1492 -4414 -2286 -2012 -2549 -22 -663 -984 1314
391A314j850J529K593k014O07O5k023J727p70j861J746j688m97J975k415J39J857
408D34j285J096K80j904K102k36j358K271j163j262J699j863P0J843j837Q86j04
425c31k399J768K22r75K101j114j159K251o16J511K028j974J252P50j609J780
441C486k30k008J054k096j963J268j474l56P48k532M49J569m95J885J52q52K347
458I52m97o57K075j089k14J222k361N99P97j334J263k73q98J767m92r47J707q03
476H17J13J281k101k1M79j506J791o7k162N91j015l42K093j126j63P41k373O25
494b345J680l41J769k94j700J190k9Q28K745j540j166J87j387J855J767j428j30
511A661j584j520J613M95j24J201k688j834Q18R4K136O53k819j071r2P07L251
$$ plain form
391 1314 -536 993 3586 1572 2179 2244 221 1948 1178 -683 1063 -625 -1122 853 -1562 -1423 434
408 434 -851 245 525 -1379 723 487 -871 1400 237 -1025 674 -1189 -1119 724 -1113 -227 -331
425 -331 -2730 -962 -740 -1715 386 -728 -1887 364 -252 1259 3287 1313 2565 3315 1706 3486
441 3486 3256 1248 2302 206 -1757 -489 -1963 -2319 -1571 -4103 -3654 -2085 -2580 -695 -543 -1395 952
458 952 455 -202 1873 784 570 1792 -569 30 827 -507 756 483 -415 1352 860 -87 1620 817
476 817 930 2211 110 89 568 -938 853 786 -1376 -785 -1800 -2142 -49 -1175 -1338 -597 -2970 -2345
494 -2345 -665 -1006 763 469 -1231 -41 -70 758 3503 1963 797 984 -403 1452 3219 1791 1661
511 1661 77 -1443 170 665 541 1742 -946 -2780 -1962 -1868 268 921 -1898 -2969 -3061 -2354 897
528H97N12j245M6j691K88L175K44N20q73l665L73J715P53J804j864k767N53L68
546h57J646K132j269j057q03j564J539K328p63n14k556j971J867J209Q92L55k532
563a918o40P45O59K481M88j913l22n94J14K841L45o45l20j856M01J782O3N23r59
582A275k409M21J41nJ254j096j333M54r13R98J847r21M97j95j253J530N51k24
600F19N36j218n88Q55o84J25Q41q62J27L7p83J041K65J42Q67q40m24Q25p33N3
620B01O79j52j62k91j739L60R49p2L92j283j092J044L75P46P03j219L2L74k66
639d21J338J202q42R0j830m49J730N48M28j072k239o95J569O48J179l65k028K0
657a189J19O86J988l41o68r22j396Q35J862M62m9j551k095P28J553J260L89j876
$$ plain form
528 897 1409 164 210 -1481 -1193 1982 2226 2746 1873 -1792 -1419 296 1049 2853 989 -1778 -1225 -857
546 -857 789 2921 1652 595 -208 -1772 -233 2095 1332 818 -1738 -3709 -1842 -633 259 614 -1918
563 -1918 -2558 -1813 -1154 1327 1815 -98 -420 -1014 -900 1941 2286 1641 1321 -535 -134 1648 1711 2234 1275
582 1275 -1134 -713 -572 -577 677 -419 -1752 -1298 -2211 -1213 634 -287 210 15 -1238 292 843 619
600 619 1155 -63 -651 204 -480 -355 486 -376 -249 -212 -995 46 311 453 1320 480 56 881 148 201
620 201 880 728 566 275 -1464 -1104 -155 -227 165 -1118 -2210 -1166 -791 -45 658 -561 -529 -155 -421
639 -421 917 2119 1277 1367 -463 -912 818 1366 1794 722 -1517 -2212 -643 5 1184 819 -1209 -1189
657 -1189 -1070 -384 1604 1263 595 -327 -1723 -888 974 1436 1387 -164 -2259 -1531 22 1282 1671 -205
675b05j561J28Q48J789R95j363j313l20k33K195J173n87o58j738m09J475R53O26
693A795p09k511m20M97J071J753n54j731p86m0J145K283k13j176o30r49R32J084
711H41L06Q2j089j243K19J63J098Q55j372j077l10M60J618N81q68k89n76M6J451
730H96j30K6m34o60qM95j56M71m5o34o91P5O9J204k62k22l55m38Q86N31j71k8
752D19j36n32N04j85k34M44m8j84L9q17r8Q17j07J97k89k65K54L57k83O50m11
773I2o0K24o1k47O27k47Q5l33n53J42J42L20K57o86o54K79M28M79N03o35l84q
795b90r9P70L46l07R5n07p18O42J27O41n5r93m19j36O69Q49j18r98l9n6M47Q93
817G44Q1n84k52m77K84O91R0K0l53p91j67L48M57M49m94m82n22L01Q41L98j91
$$ plain form
675 -205 -1766 -1638 -790 999 1994 631 -682 -1002 -1235 960 2133 1546 888 -850 -1259 216 1169 1795
693 1795 1086 -1425 -1845 -1348 -277 1476 922 -809 -1595 -1635 -490 1793 1580 404 -226 -1175 -243 841
711 841 1147 1229 140 -1103 -884 -721 377 1232 -140 -1217 -1527 -1067 551 1132 264 -25 -601 -555 896
730 896 766 792 358 -302 -310 185 29 500 455 -179 -870 -795 -726 478 216 -6 -361 -799 87 618 447 419
752 419 283 -249 255 70 -164 280 232 48 87 -730 -828 -11 -118 79 -210 -475 -221 136 -147 503 92
773 92 32 256 195 -52 575 328 413 80 -473 -331 -189 131 388 -298 -952 -673 -245 234 737 102 -282 -290
795 -290 -389 381 727 420 515 8 -710 -68 59 700 645 -348 -767 -903 -234 615 497 -501 -540 -596 -149 744
817 744 825 241 -11 -488 -204 487 577 597 244 -547 -714 -366 91 540 46 -436 -958 -657 184 582 391
838C91m29l67j21P62M47k30j89m45j85L47j31J46M88m00l35l75J8J027K03m66
858A56l44n30L98P90j15n1n26J6J46K44k5K97l30m56jJ10K00K86l95k4j12l20
880e86N94M85m43rk2l70N16l6NQ8j57r0J72k78J03K29j57L1j72k28M92k28J96
903A35J77o21P1L14k1J12Rk15k3J52k1J1j8J67j98j33j37L54k10J52O3l83J10
926a53K2J12J57k41J5L52r9j24O0l19L76J0j75j25k5j8K57o2j25j03l6K22J29
949A07R1j02k85N2K89K31o8k81M5k22K25r0O0J19o7j5k48J33RL8J40l40K4M0K14
974I9J2j58R7k7r1M7J02K27j42r1l7j59K34J50j66l1k16q5K30J24r7j35%mK14
999I7N4p7Mj72j01J38n0J09R1n1k01Q3O1m00L84K31j92n8j08J69p0J32P3j59L2
$$ plain form
838 391 -38 -405 -526 236 683 453 264 -181 -366 -19 -150 -4 484 84 -251 -626 -608 419 622 156
858 156 -188 -718 -320 470 355 304 -222 -206 -60 184 159 456 126 -330 -331 -221 -21 265 -130 -154 -266 -586
880 -586 8 493 50 41 19 -351 165 129 134 222 65 -25 147 -131 -28 201 44 75 -97 -325 167 -61 135
903 135 312 -309 -238 76 55 167 176 -39 -62 90 69 80 62 229 31 -102 -239 115 -95 57 120 -263 -153
926 -153 -131 -19 138 -103 -88 264 165 41 101 -218 158 168 -7 -132 -157 -175 82 20 -105 -208 -244 -22 107
949 107 198 96 -189 -137 152 383 315 34 79 -143 82 -8 52 171 104 89 -159 -26 -17 21 161 -179 -155 -115 99
974 99 111 -47 50 23 -68 -21 81 308 166 75 38 -121 113 263 97 66 -150 -235 -5 119 22 -113 -113 -117 97
999 97 151 74 78 -94 -195 -57 -107 2 93 42 -159 -76 -15 -415 -31 200 8 -50 -158 11 -59 73 146 -13 19
1024A9p6J78j59p7J7M0k6J48J22l29Q1o3J7O4J68p7j18j74L0L21m2j72L77j49
1048A20k76J59P8j00M4k96K43o7%J74l8j77J04J13k8Kn9k8K36j11j59N2J53K8
1072A67j7p3k94n4K14n2J8K29Qj67k52J73N7K8k17K38Jj82N8L12j89k19K08j24
1096a29J03J01j03K8M1M1j26r9J11J39Mk11P4J3R4r3K60k86m9m3J43M2l2l4J50
1121A39j43k12K3J08J12l9N6m7l73N07J2j56J5J26j10l4K0p2k3K18r3J6j53K25
1145A22l18J66K6o9n4K89J9j88K1j83J61k3R2k41L39l50J74N5K29j96j5k17J10
1168e1J74l7l7j78L39l67P6j17J76K81m04J58j70R2J80KRj22J29j12j7j15J59
1191D8j48J64n9o5M0M7p0N1l8j10l4K29p1M5k70L39J17j27J0J39k05J78j15j04
$$ plain form
1024 19 -57 121 -38 -115 -98 -58 -84 64 186 -143 -62 -125 -108 -44 124 47 -71 -245 -215 106 64 -108 269 120
1048 120 -156 3 81 -19 25 -271 -28 -95 -95 79 41 -136 -32 81 53 55 -4 -32 204 93 -66 -14 139 167
1072 167 150 77 -217 -271 -57 -109 -91 138 146 -21 -273 -100 -43 -15 -232 6 7 -175 -117 195 6 -213 -5 -129
1096 -129 -26 75 -28 0 41 82 -44 -143 -32 107 111 -100 -26 -13 81 -12 248 -38 -87 -130 13 55 23 -11 139
1121 139 -4 -216 -193 -85 27 -12 44 -3 -376 131 143 -13 2 128 18 -16 4 -68 -91 127 34 50 -103 122
1145 122 -196 -30 -4 -73 -127 162 181 -7 14 -169 -8 -31 61 -180 159 -191 -17 38 267 71 56 -161 -51
1168 -51 123 86 49 -129 210 -157 -81 -198 -22 259 -145 13 -157 -65 115 117 126 4 133 21 4 -111 48
1191 48 -100 64 5 -60 -20 27 -43 8 -30 -140 -174 55 -16 29 -241 98 215 88 98 237 32 210 95 -9
1215iQ2L8j6o9J57l84L63k61K39K16k96K3R4j53N7j62M7J78j50j06l5K41O7O1
1239B22m04L12j6o8j09J32q5J94j32N2j63o3K56k94J87K11r0j39R0O6l70J38K31
1262A58l13J64j40J01K24N9n02L44j79P6P9p5j28J00J73j1j93k9K14j29N8K51
1284C02j61l22K87k95K01l6J34k19j90K07J24p3K94j06l28K03j00Q2J25j1j03
1305A5j32J89r3J13m4L9k18K6L1O3j3n5J10j99K1L04j44N2J80l96J96M6L8J5q0
1330F4j62l6k2K24j78K36m8k37P6J26j59O2J08k20p1m9L46o9P0O2N3q5l02K83
1354G2n5j02qK27j15j19L0RJ76J82j05k50K65l13J18n1K8L7j17Q5m4R7k31J23
1378f1n5J45j1Q4j73o7n0J40j10K14k12K34j07J4j01J2j2J5R8n2o8l6L45j18K4
$$ plain form
1215 -9 73 111 95 26 183 -201 162 -99 140 356 60 83 177 24 81 -81 -34 144 -6 -112 -147 94 161 222
1239 222 -182 130 114 46 -63 69 -16 178 46 98 -65 -128 128 -166 21 232 142 3 93 159 -211 -73 158
1262 158 -155 9 -131 -30 194 253 -249 95 -84 -8 71 -4 -132 -32 141 130 -63 -92 122 -7 51 302
1284 302 141 -181 106 -189 12 -24 110 -109 -299 -92 32 -41 253 147 -181 22 -78 4 129 118 15
1305 15 -117 72 -21 92 48 87 -131 -105 -74 -11 -24 -79 31 -168 -147 157 13 65 245 -151 45 91 129 144 64
1330 64 -98 -134 -156 68 -110 126 78 -159 -83 43 -116 -54 54 -166 -237 -286 60 -9 61 123 176 91 -211 72
1354 72 17 -85 -93 134 19 -100 -70 -61 115 297 192 -58 207 -106 12 -39 -11 26 -91 -6 -50 47 -184 -61
1378 -61 -116 29 18 102 -71 -138 -188 -48 -158 56 -156 78 -29 -15 -116 -104 -116 -101 -3 -55 -123 -159 186 68 92
1403I2l44R6J84j69K94J01k91l4k5J33L1p8J40o3o7q8N3J49O2j05J9j81K80kO1
1428B48j17k27R4rj13J51P2j73K07j45K90r4k10p5R5k19J60L35j27k00M5q9j04
1451b05O2K31k12J41q4j20N5Q4K91k89j5K90l00K29j15r8N6l6n8Q7k4J34k77J05
1475f8L3m6P7j69K68j09j12O3L14p4Pj72l5p9P6Q8JR8pl53J50j03K16k09L23l55
1501a77J68J47k25J07J82j18m26O15l37J69N0j05o4M7L4J89l82J92j78O9J06j30
1523f7J46j48K70r8r3j88R5Q1j1K7L0%j63J78J98j92O1k9p9kk96M74j13j28J10
1548F3pQj83K16r2L3j24j03Q9J3J01p7m4R8LN6K8P6o6j77J21K4Oo7m9kQ3J29j99
1577d3K65j80n3L2k09K78m7j62J17O0j09Jj5Q3K29o8j18R9R8m34kJ55O2rl5L7
$$ plain form
1403 92 -252 -156 28 -141 153 254 -37 -71 -96 37 68 -10 130 67 0 -88 -35 114 176 71 90 -91 189 187 248
1428 248 131 -96 -2 -11 -124 27 99 -74 133 -12 278 184 -26 -101 -6 -225 -65 270 143 -57 -12 -101 -205
1451 -205 -143 88 -124 17 -67 -187 -132 -48 243 -46 -61 229 -71 158 43 -55 1 -35 -93 -6 -30 104 -173 -68
1475 -68 -35 -81 -4 -173 95 -14 -126 -63 251 177 184 12 -23 -102 -26 62 63 161 154 -199 -49 -152 64 -145 178 -177
1501 -177 -9 138 -87 20 202 84 -342 273 -64 105 155 50 -14 33 67 256 -126 66 -112 -43 63 -67
1523 -67 79 -69 201 103 10 -178 -83 -2 -13 14 44 44 -119 59 257 65 126 97 18 16 -280 194 81 -47 63
1548 63 56 64 -119 97 5 38 -86 -189 -100 -87 14 -63 -107 -9 -6 50 78 154 88 -89 32 56 62 -5 -54 -56 27 156 -43
1577 -43 222 42 -11 21 -188 90 43 -119 -2 58 -51 -50 -65 18 247 179 61 160 258 -176 -178 -23 39 30 -5 32
1603C2k02L1K31j90N0j66Q4lL26j89O0l1j35J15P1k00J07J02j70R0j74j5J87J36
1627A47j23r1K47j65j14P5K2k11L72M2j87r3N7O4k2O0j35J59k8j23J96k59K91
1650A81n6m4j42K28k57o7J36O8q2j95L19k04K34m2m9p8J81j84k2RJ60N4j54j71
1674a77L11k13R9n4L2K8j2P4j52K69j13k90Q3Q6Q4J63k56M7J45k81J15R5M8j37
1698fN8q6o9J68L5j07l4J76j50J88k31o1K56j49j43J05P9N0j9j91Q5J13k28J19
1722d2J88K4l31K00r8N4j85J85QJ95k36J05j66J20j43Q6P7m6Q0j83l5J60q2P5
1746A0RJ61j05j34N0J57l70J99P4k65L56N7O1M2j01j71M3j43j65J60P1J08j78
1769g4L2r9P1P2j22K24Pk03P8J12j67o0J73o3j67L94l47J97k03J11K76k63J28
$$ plain form
1603 32 -170 -139 92 -98 -48 -214 -130 -133 193 4 64 33 -102 13 84 -116 -9 93 -77 13 -161 -176 11 147
1627 147 24 -67 180 15 -99 -24 -2 -213 159 201 14 -79 -22 42 20 80 -55 104 76 -47 149 -110 181
1650 181 125 81 -61 167 -90 -157 -21 47 -35 -230 89 -115 119 77 28 -50 131 -53 -75 -66 94 148 -6 -177
1674 -177 134 -79 20 -34 -2 26 14 88 -64 205 92 -198 -115 -29 55 218 -38 9 154 -127 -12 83 131 -6
1698 -6 52 -34 -103 65 100 -7 -41 135 -15 173 -58 -119 137 -12 -155 -50 29 79 60 -131 -46 67 -161 -42
1722 -42 146 170 -161 39 -59 -5 -190 -5 3 198 -38 67 -99 21 -122 -36 41 -5 75 -108 -143 17 -65 10
1746 10 19 180 75 -59 -9 148 -222 -23 51 -214 142 199 260 302 201 30 73 -70 -235 -75 -4 104 -74
1769 -74 -42 -141 -70 2 -120 104 111 -92 -14 98 -69 -129 44 -19 -186 208 -139 58 -145 -34 242 -21 107
1792A07k21MN3J09N2k2p2L5K39l95L14k68K07k72QK76p7N0j49J6J48k42J90O0
1816A50jj75J91k12j7J13Oj94J02m7Q8K02l49K65P4m26K92k00L42m82J45L38o5
1839A40j57o8M7R0n1L9q7J78k18J96R0k35O3LK12k61j07P7l3J17N4p1M3j13N7
1864Ek46L35r8J46k8j02j65K36l7K13j43M1k34N8J03j10j0n6p4K44k11J86Q5k26
1888h8K27j30j78K18M7J63j78k8n9M0N6Q5o2q7O6l86J79K35np6Qk15K06o8n4J75
1914I1O8l03J37R1j74J41j42j36L05L8k75K30J49l77R2O1Q9J16N5j60p0j79J09
1937d4j04K61k23K23m86K40k4K02J57j74K82o69J22J94K9J39j28o2O3J0J00Q4
1959A92k71J18J11j41r4J36j83J18J74j81M4o3K61j18n2Mm21M01J30j30R0j65
$$ plain form
1792 107 -114 -110 -57 52 104 82 10 45 284 -111 203 -65 142 -130 -122 154 77 127 -22 -6 142 -100 90 150
1816 150 149 -26 165 -47 -64 49 55 -139 -37 -84 4 206 -143 122 196 -230 62 -138 204 -278 -133 205 140
1839 140 -17 -85 -38 52 1 40 -47 131 -87 109 199 -36 27 30 242 -19 -126 -49 -82 35 89 18 61 -52 5
1864 5 -241 94 -4 142 114 12 -153 83 46 259 116 157 -77 -19 84 -26 -36 -92 -166 78 -133 53 138 -88
1888 -88 139 9 -169 49 96 259 81 53 -6 34 90 175 113 26 92 -294 -115 120 115 39 47 -168 38 -30 -84 91
1914 91 159 -144 -7 84 -90 51 -91 -227 78 116 -159 71 220 -157 -65 -4 85 201 256 96 26 -153 -44
1937 -44 -148 113 -110 113 -373 -133 -157 45 202 28 310 -359 -237 -43 -14 125 -3 -65 -2 8 108 192
1959 192 -79 39 150 9 -85 51 -132 -14 160 -21 23 -40 221 103 51 55 -366 35 165 35 125 -40
1981d0K9j27L2N5K50J05k27j57Q4lP8j08J96j32q5M5L4k9q3J12P4o0pj76K65j68
2007d3lj18K9L20j46R2L0j64J18j78k7J19J76k34%q9N4J26k0k43j1J53j96N09
2031B54n9k51p5J60j26K31J95k27j16j43J06Q2n1O0L6k76J63N1l1K38k54L6K35
2054B38l23rk3J09L7J2j77K14k27J41J7J05j34q6J61p7K21R6l41NP6q2K43o1j54
2079a9l3n8k23M31Lk27N3K9J20l23Q5J59k18K38j52jJ26M0L3M4J4p1O5k80l1J14
2105h2j5J54j02J02k35J34N6r6R4J4J43p2J15j77q6J24M9J15q5P1j82j18m0J30
2129A1j71O9K54p0j19l8J72n8j05K8n4J52j95L82j73k86J48k28K48J23j23k7K6
2152c4j59pK61m8o9Q3p0j28K69o4n2J12j52J25p5L75m39J37o4j58m9L71k81J5
$$ plain form
1981 -40 -11 -138 -106 -51 199 304 77 -80 4 1 79 -29 167 35 -50 -5 29 0 -83 29 103 43 36 -140 125 -43
2007 -43 -46 -164 -135 185 39 131 161 -3 115 -63 -90 29 205 -29 -29 -118 -64 62 42 -201 -212 -59 -255 254
2031 254 195 -56 -131 29 -97 134 329 102 -14 -157 -51 31 -20 40 76 -200 -37 14 -17 221 -33 3 238
2054 238 -85 -94 -117 -8 29 41 -136 78 -149 -8 9 114 -20 -106 55 -22 199 295 -46 -41 35 -47 196 135 -19
2079 -19 -52 -110 -333 98 101 -126 -73 -44 76 -247 -162 -3 -221 17 -135 -136 -10 30 63 107 121 50 115 -165 -196 -82
2105 -82 -97 57 -45 57 -178 -44 12 -84 10 24 167 95 210 33 -53 71 120 235 150 221 39 -79 -119 11
2129 11 -160 -91 163 93 -26 -64 108 50 -55 -27 -81 71 -124 258 85 -201 -53 -281 -33 90 -33 -60 -34
2152 -34 -193 -200 61 13 -56 27 -43 -171 98 34 -18 94 -58 67 -8 367 -72 65 1 -157 -206 165 -116 -101
2176a01J44l2j03M8J19k24P6J22M7l2p2J44k48J5j06J71j29NK20K0J3j79K1J03
2200D2l6o7K00k78J79k20K48K29k32K37k03l83J62J46J41k11q8K8O4q9J15L4J93
2223B11k55L5Jl2M7l6J41%r1m2J79O5m47J21J45j67K92j58J03ok7r9j03O9J68
2248A14lMk25J50K03k74K53j39k7k4J8nj27p6J75o3Nj0Q1l6l0o3M7Mk4N1k0M8
2276GQ0lk86N22p8m66J85PL3j20K6K84l21l8J33k25K21K1K5m6O4l3j45M10j98
2301E9J5k34J20J16j59O4L37l63J18m5KM3n1P0J20k30K07l48K79q0j17p7K32m7
2325C1r2L22k51qM0j23J35N1o4K24l84K4L3K36r1k02J28J5l31K80J6r3J42r1R3
2350D0K0R8J78l71k18L51k09L53j93J10k74R0O7j08j7K45j83k0n7K26j7j64J66
$$ plain form
2176 -101 43 11 -92 -44 75 -149 -73 49 96 64 -8 136 -112 -97 -203 -32 -161 -156 64 84 97 -82 -61 42
2200 42 6 -61 139 -139 40 -180 68 297 65 302 99 -284 -122 24 165 -46 -134 -106 -42 -131 -16 18 211
2223 211 -44 -9 -8 -40 7 -29 112 112 21 -21 158 223 -224 -103 42 -125 167 9 112 106 79 -20 -123 -54 114
2248 114 111 115 -110 40 243 -31 222 83 56 32 50 45 -82 -158 17 -46 -41 -51 30 -6 -36 -99 -52 -48 -72 -21 -41 7
2276 7 87 84 -202 320 242 -224 -39 -32 1 -119 -93 191 -130 -168 -35 -260 -39 -18 7 -39 25 -8 -153 257 59
2301 59 74 -160 -40 76 -83 -19 318 -45 73 28 30 73 22 92 212 -18 189 -159 120 40 -77 -154 78 31
2325 31 -61 261 10 2 42 -81 54 105 41 265 -119 -95 -62 174 83 -119 9 24 -307 -27 -11 -104 38 -53 40
2350 40 60 158 336 -35 -253 98 -111 242 49 159 -115 -25 42 -66 -83 162 -21 -41 -98 128 111 -53 113
2373A13j16p8L23k72l6K9r0J74k84K55J90n8j40M0J72k15o8m4J05PJ17j85n1K94
2397A82k3k94J44j53J25J02o1qj36J42k9j31O7K98j22k49J03L9n2O5R0m1n2q9
2421h3R4M5pj54K3M14m90J29J44j90K35k11j05K22J12j48K9k6j26J47J6l07L85
2444A48j42J83m37K92P1j63O3J52j17j51J10j15J44M0j47K36n8j62J23j20O5o6
2466e1P0j36N7k3k0J08j33J90M7Nj47L29l13L26k78L5K9M1k16K64j12J30k50l5
2490h3J91j56Q7o9J0J12k10O1j13K09P8l8J17k88K40q7q4J1j14O7L20k29l2j65
2514a65J16r9K25m8j44J97k38M5pJ67p9P1m2P5n6O9j87J98k57K1Q5K04j66K7J07
2539A19Rp2k80L06j53l4M0L07j81l9J26l20o5M30p9p0n9j28K52k64m6J03K30j53
$$ plain form
2373 113 -3 -81 242 -30 -66 -37 -127 47 -237 18 208 150 10 50 222 7 -61 -105 0 7 124 -61 -112 182
2397 182 159 -135 9 -144 -19 83 22 14 -122 20 -9 -140 -73 225 103 -146 -43 -4 -56 9 99 58 6 -83
2421 -83 11 56 49 -105 -82 332 -158 -29 115 -75 160 -51 -156 66 178 30 59 33 -93 54 70 -237 148
2444 148 6 189 -248 44 115 -48 15 167 50 -101 9 -106 38 78 -69 167 109 -53 70 -50 15 -51
2466 -51 19 -117 -60 -83 -103 5 -128 62 109 114 -33 296 -17 309 31 66 95 136 -80 184 72 202 -48 -83
2490 -83 108 -48 39 -30 -20 92 -118 -57 -170 39 117 79 196 -92 148 61 -23 -12 -126 -59 261 32 0 -165
2514 -165 -49 -148 77 29 -115 82 -156 -111 -118 49 -30 41 -1 74 18 87 -100 98 -159 -138 -53 151 -15 12 119
2539 119 128 56 -224 82 -71 -105 -65 242 61 22 148 -172 -237 193 114 44 -15 -143 109 -155 -201 -98 132 -21
2563b1J04M6k4o7Q0j90q8N01p52K00K34n2mP7%J19p7j31J15j95J95r6O5P9p5m5
2589bl0J0M5j96J90J44r2k6L5p5qm6J15p3J92j87pj36J25J5J31J10l43J93k10
2614a26J66N0K7j63L6J37j54m2J77j79J97q3k93K20J05k06K41r3j6l6R3r6K00
2637A62J9k8k74J31J20k20o7L89k87j13J36J10m4o9J16j55J02J29k11j34J98m2
2659c2O7k75L70j32j6R5j45m3K31M3o6Qj6q1p4jR3j26K01k41K22j50J99j72pJ
2685d7j40J31j60L18p5j53P3K36k94P9M6M2k2j45L8J9J4K47k75K21k59J33j7p
2709CK02l19J48R9m01J41k1K19M5Q9q1j33j2j20K51j15l30M85L7o7l05J53J55
2732A23j62J7m3J5K7K5o5n2P5J91P7r4j79j2J65j76K60j18j26J9J15O5pj22J81
$$ plain form
2563 -21 83 129 105 38 118 -72 -160 341 -411 -211 23 -29 -33 44 44 163 86 -45 70 -125 70 -26 39 118 43 -2
2589 -2 -32 -22 23 -173 17 161 69 43 78 3 -5 -51 64 -9 183 -4 -11 -147 -22 -7 124 234 -109 84 -126
2614 -126 40 90 117 -46 -10 127 -27 -69 108 -71 126 43 -250 -30 75 -131 110 17 1 -35 58 -38 162
2637 162 181 153 -121 10 130 -90 -157 232 -55 -168 -32 78 34 -35 81 -74 28 157 -54 -188 10 -32
2659 -32 35 -240 130 -2 -18 77 -68 -111 120 163 97 105 89 8 -66 -67 26 -100 101 -140 82 -68 131 -41 -48 -47
2685 -47 -187 -56 -216 102 27 -126 -53 183 -111 -32 14 56 34 -111 -73 -54 -40 207 -68 153 -106 27 10 3
2709 3 205 -114 34 133 -268 -127 -148 71 116 205 124 -9 -21 -141 110 -5 -335 150 187 120 -185 -32 123
2732 123 -39 -22 -65 -50 -23 2 -63 -115 -40 151 228 134 -45 -57 108 -68 192 74 -52 -33 82 147 140 18 199
2757A99k39k6J52Q8J11j26l53J07j2Q3n0j4P3j35n1k8K91K0p9j44K06j96J88n2
2781A3L9j76J28k05O2J13J61j17m0J00j00j52K52q3J29j39j5j61K24j21J3K7n
2804e3J29j23jn7J74o6o4L01j61j53m7J09P4N1k2j23n8J65p1l9J21j1j41J11k03
2829a58K09m1Rp3K22o7j58J78j93J48r8N1p8R0k28J72J2J91L5q3l57K80j80Q1
2853c6J13O9o5Pj78N6J22Pj3N8O0k01QK10k97R0j3j08LJ96M1l8j81M4k1P0Q0r
2881G4k9j39N2J2M3J5r0K3K15l15O9L9j0RK24j93L3j10J26n7k6p4%J44j72R8n2
2908i1J52%j42J50J34j45L2j23P5j05k02J93P9P4k4nO9j5r5n5jRJ10J32l64J50
2934hj91J66j57K75L3q7o3J0j7PJ87n6j19j04j60K12J38k08J11R4M8j19J50j76
$$ plain form
2757 199 -40 -66 86 174 285 159 -194 -87 -99 -16 -66 -80 -7 -142 -193 -221 70 90 11 -133 73 -123 65 13
2781 13 52 -124 4 -201 -139 -26 135 18 -22 78 -22 -174 78 -5 124 -15 -30 -191 33 -88 -75 -48 -53
2804 -53 76 -47 -48 -105 69 3 -61 240 79 -74 -121 -12 62 113 91 -32 -90 75 4 -35 86 75 -66 45 -158
2829 -158 51 10 19 -54 168 101 -57 121 -72 76 -22 29 -49 41 -187 -15 -3 188 223 140 -217 63 -117 -36
2853 -36 77 146 81 88 -90 -34 88 95 82 140 200 -1 7 217 -80 10 -3 -111 -108 88 129 91 -90 -46 -67 3 83 74
2881 74 45 -94 -42 -30 13 28 -62 -39 176 -139 -70 -31 -41 -32 192 -1 32 -78 48 -9 -35 -109 -109 35 -137 -39 -91
2908 -91 61 61 -81 69 203 58 90 -33 42 -63 -265 -72 7 81 57 52 121 106 11 -44 -45 -36 74 206 -158 -8
2934 -8 -199 -33 -190 85 118 31 -32 -22 -39 -32 155 99 -20 -124 -284 -72 66 -142 -31 63 111 -8 142 -34
2958c4o7m9J56J9q0J28J5K7j06j12J2Q4R5j02J71q4o5j42K77k04k3j05L23k06
2982g2J5j18J13k1R1J04j7j46K28n8j57J08M3j8jj58P5J07k72O5n8J86l4P7M2
3007A24n4k0k96L08l0P2J19l86nn9K83N6j37K08m29J33L75j72Q0k10L6J18L7j41
3031A0j16P8mq1J08m6J00o1J56k03J55m1j27K10k05J8j21J10n6J76O1j5j10o3
3055f7l3J17m2mj12J0M6J59k35K03j4Qk2J9J93k86K46l03J06m5J98k28K83l56
3079a59K41o4r9L33m76J81o1J58P6l03J53o0j03JK01M3j14R5l4p4l9M4K27K6l45
3104a52J69J70m6O3j23j00K09j56P1j3j8j28J0K82k42J43k81P9J27J09J39j80
3126A32K7q9j42l3O5l9L83l22k6k2J31K8j3p1J23r7m7L0%o4J7J63l43K78K05j52
$$ plain form
2958 -34 -101 -150 6 25 -55 73 88 115 9 -103 -91 -7 88 -14 157 73 8 -134 143 -61 -84 -189 134 -72
2982 -72 -57 -175 -62 -83 8 112 95 -51 177 119 -38 70 113 95 94 -64 11 118 -154 -89 -147 39 5 82 124
3007 124 70 50 -246 62 32 104 223 -163 -168 -227 56 112 -25 183 -246 -113 262 90 170 -40 -4 114 151 10
3031 10 -106 -28 -32 -113 -5 -51 49 -12 144 -59 96 55 -72 138 -67 -49 -170 -60 -116 60 121 106 -4 -67
3055 -67 -100 17 -25 -29 -141 -131 -85 74 -161 42 28 36 14 33 226 -60 186 -117 -11 -56 142 -86 197 -159
3079 -159 82 18 -81 252 -224 -43 -104 54 130 -173 -20 -80 -183 -182 19 62 -52 43 9 -65 -104 -60 167 193 -152
3104 -152 17 187 141 204 81 -19 190 34 105 92 74 -54 -44 238 -4 139 -142 -63 64 173 312 132
3126 132 159 70 -72 -105 -40 -79 304 -18 -44 -66 65 93 80 9 132 35 -12 18 18 -46 -29 134 -209 69 274 122
3152A22n1J35l61r0J99j6K65k68k3J60l32J28J71M1j34J48j69Q1j22J14J70p3
3174I5q6l6j7N3r2J28L8p8o2n4J06J49j8q1q0J34k45K54J40j89p0k58L84m8o0
3199GJ2j3l9L3O2J16k92K68k75J60Q4J17l37K08q3rk09J36l9L31n8j83o1l7K3
3224g8K7Q9K02k60K2J66k39J81j94L13p2k18o3K84j40Q9J03l29J00N9l14K25P0
3247B3m5Q5l21M20k34M6j5pl7J77n7L6n6N4j60J85j3q3Q0j49J51Pj60J8l4P2N
3274a2l9K50j36L3ok14P0J23n8r6L55l79j19L23n9O1k21Q6j03L59k23J57l36J29
3298e5O7Q1p8j31J3K13r9J43j18%m6q3J41j43J32j21K29q5j21J11k3NQ8o2o5l6
3324d3J38j50J13q4J21R2j92l9J8K4p5J33j21NJ09j31M3K56k37j06J93m2J94m99
$$ plain form
3152 122 71 206 -155 -245 -46 -62 203 -65 -88 72 -260 -132 39 80 -54 94 -75 6 -116 -2 168 95
3174 95 9 -27 -44 9 -83 45 83 5 -57 -111 -5 144 126 45 -35 99 -146 108 248 59 -11 -269 115 67 7
3199 7 19 6 -33 0 62 178 -114 154 -121 39 123 240 -97 111 28 19 -190 -54 -93 238 180 -3 -64 -101 -78
3224 -78 -51 38 240 -20 2 168 -71 110 -84 229 157 -61 -124 160 20 109 212 -117 -17 42 -272 -47 23
3247 23 -22 63 -258 162 -72 -26 -41 -48 -85 92 35 71 15 69 -91 94 81 -2 78 -71 80 87 -73 -55 -89 -17 -12
3274 -12 -51 199 63 96 90 -124 -54 69 11 -85 270 -109 -228 95 36 97 -124 -38 -141 218 -5 152 -184 -55
3298 -55 12 93 15 -116 -103 110 11 154 36 36 -10 -93 48 -95 37 -84 145 60 -61 50 27 32 120 58 -7 -43
3324 -43 95 -55 58 -26 95 187 -5 -44 -26 -2 -77 56 -65 -60 49 -82 -39 217 -20 -126 67 25 219 -280
3348b80J77J26J44j32R6o1m1p1r0J29p8j57J66J42q4J68k63O7J87k30J27K2j67
3371a03M9J22q3O9q0L15m43K67p7r6J69j64J15j70K07r8l3O0m0K02o0j92J64j79
3395g9R8J63j06j51J39l9QQk3O0k17J06J19L5k21K26q8nq6l7J06J3J51j54j73
3420a47K11n4j63O4o9K48q8j20M2n5J3P0J91p3l8k4Q6p7O9j27k29M41k55J76r3
3445aJ49oj42LR8j79j2j03K21j61K05j14J23j56M4M0m4MK05p1j96K48q9k50J54
3470c0N2M9J12k61k0K31j11l5J66j83L5R0j73J01j19P0KJ64k71O2P2J73k65J76
3494H7j3J9k40K02O0j88K35j06k4j04P6K1P9M7k37j9j10L42q7j18P7L5j54P2L9
3519ip6Q3n6Q2Q7q6j1j11J64m4P7j21L5R7Q6l22J24L1O1p7j41M1j14L82j19r6
$$ plain form
3348 -280 -103 23 167 35 131 70 29 -42 -132 -3 -81 -238 -72 70 -14 154 -109 -42 145 -85 42 64 -103
3371 -103 -54 68 -15 54 -26 289 -154 113 36 -60 109 -55 60 -110 97 -1 -34 26 -14 188 128 -64 100 -79
3395 -79 19 182 76 -75 64 25 33 41 18 78 -139 -33 86 121 -100 126 38 33 -53 -90 16 29 180 26 -147
3420 -147 64 10 -153 -89 -158 90 2 -118 -76 -131 -118 -48 143 70 32 8 94 17 86 -41 -270 171 -84 92 -1
3445 -1 148 142 0 3 101 -78 -90 -193 28 -133 72 -42 81 -75 -31 9 -35 -31 174 103 -93 155 66 -184 -30
3470 -30 22 71 183 -78 -98 133 22 -13 153 -30 5 95 -78 23 -96 -26 -24 140 -131 -69 3 176 -89 87
3494 87 74 93 -147 55 115 -73 162 56 32 -72 4 25 104 151 -86 -105 -215 127 40 -78 -1 34 -120 -48 -9
3519 -9 -85 -2 -58 24 111 25 14 -97 67 23 100 -21 14 111 197 -125 -1 30 91 14 -127 -86 -200 182 63 -33
3545c3N2J97j96O2q5j25L22k29K47k78q3O8J08J20m37L95k1j53j19L10r2J09j44
3568ek27K43p6L04k22j77K03j16O8J95k32j93L11k12J11j11J49p2L2n9J7J11n4
3591a2OK2j19K76k93J93m1L4J1l34J64J59k73J53K8j24J52j20J24jj75K36N8l3
3615I1J8N4k63LK50j45k0P7K26j47k31L12k55j35P7R5l1N4R6j34L6j7J13l6j56
3640f8j68J42L4Q2M1j08J00n1N3l2j45K44k49K21q2J34J7j56J16j11o5J47jj1
3664H4o3J2JK5n8j99M14k45O2p2j51J11L33k62p4p8N0K25p0k56J99N8M6kq3m5
3690c8J32J45j42m9K1j54k2Q9j6J99m70M41p1P6k85L06j79p6K17j79j11J17J21
3713G2q9J04j06P4k58lJ27K6R4j6m3k08Q7M3R5J91j67J23j83J02r5n3p0J20J63
$$ plain form
3545 -33 19 216 20 82 -3 -128 194 -35 212 -66 -149 -81 27 147 -290 105 84 -69 -188 122 30 139 -5
3568 -5 -232 11 -65 239 17 -160 43 -73 -5 190 -42 -235 76 -136 -25 -136 13 -59 -27 -86 -69 42 -12
3591 -12 -6 16 -103 173 -120 73 32 66 77 -257 -93 66 -207 -54 -26 -150 2 -118 6 5 -170 66 124 91
3615 91 109 163 -100 -97 153 8 -12 65 291 144 -87 225 -30 -165 -88 7 -24 30 126 -8 28 11 124 88 -68
3640 -68 -236 -94 -60 22 63 -45 55 4 57 25 -120 124 -125 96 14 148 165 9 125 14 -51 96 95 84
3664 84 21 33 34 59 1 -198 216 -29 33 -39 -190 -79 254 -8 -82 -160 -110 115 45 -211 -12 46 92 90 7 -38
3690 -38 94 239 97 48 69 -85 -107 -18 -34 165 -305 136 65 141 -144 162 -17 -93 124 -55 -166 -49 72
3713 72 -17 87 -19 55 -203 -206 -79 -53 41 25 -18 -226 -139 -96 -1 190 23 146 -37 65 -30 -83 -153 -33 130
3738A30k25r6J76n4K14k19J55n0k16L66j62n3P8J26K5k32QrJ52n1j6OJ40j83J74
3763A84l71J33j42K08Lj64J87Q%j39J92l5r2k9j24L71l79O6L52k49k67L42k32
3786a77K73j07l7m3L1J73j97K70j96q3j35K97R8j91Q6j7l4J07q4q6m0K30k68J87
3810E7j75J09j48K96k01K97l6l49K12Qo9j31L16j9J8j83pK50j30j30n3J05Q3l04
3834a84K18j38lO0k17L15j7k9J9m9n1j25L86j30K00j92j97R7j05J18J94r1K8P
3858A14n0k91J25R4o3k7K73M8k96J84k01q5J38J23j07K8k39J40J7J84k31K25k9
3881G4J25k13J01L3j43p0J7l7k0K15o8lj8j71J45J16L6j39mJ87j15j7m0k7N2m1
3907b5P1j31q1J68J26k97m4J78J2J67l0k25K18k78R9L11j97J09k23K50j32l3L02
$$ plain form
3738 130 -95 -191 -15 -69 145 -74 81 31 -185 181 19 -34 44 170 195 -37 -29 -38 114 63 47 53 193 10 184
3763 184 -187 -54 -196 12 15 -149 38 46 46 -93 99 64 -28 -57 -181 190 -189 -123 229 -20 -287 55 -177
3786 -177 96 -11 -48 -91 -60 113 -84 186 -10 -93 -228 69 167 -24 62 45 11 118 34 -52 -92 138 -130 57
3810 57 -118 -9 -157 139 -62 235 199 -150 62 70 1 -130 186 167 185 2 -5 245 115 -15 -68 37 120 -184
3834 -184 34 -104 -107 -47 -264 51 34 5 24 -25 -76 -201 185 55 255 63 -134 -37 -142 -24 170 79 107 114
3858 114 64 -227 -102 -8 -71 -98 175 223 -73 111 -90 -175 -37 86 -21 7 -232 -92 -75 109 -122 103 74
3881 74 199 -14 87 120 -23 -93 -76 -113 -133 82 14 11 -7 -178 -33 83 119 -20 -24 163 48 31 -9 -36 16 -25
3907 -25 46 -85 -166 2 128 -169 -213 -35 -23 144 114 -111 107 -171 -72 239 42 151 -72 178 46 13 315
3930C15l43J47q8N9k21K76j51K31k13O4np5Np2K34j66J7j05J46j61L34j67l98
3953c37J94O3K20N5k69K71l31J95M4j94l1L89k90P4Q3k33L8J4lK13j69%J61j97
3977d0J8J88j19j20K5J30j12N3R3J4m17J65J88r3N1l8l9J6J00n6JJ51j53m7J8
4002b3p8J50rj99J20K7k4MJ51k49K00j40K5N2j72KK66p2m7j0p9J99j11N4l4j4
4028a1j61kJ50R0p8k63K61K14l40J1L60j87k1J45j19J29j68p0l6P8Q2k47J84J00
4052A01l5j47Q4k2k4R3j25P1j01j6K37k89Q7nJ75k39J33M3p0p1K00j19j64J9J13
4077g1P2O6k16K1K05j37J21R8r3J14M6m3jM5k59P3n3L3l2l5k2N1J38l7k08P8K83
4104B37j24o6J07k92R2L1m3qp5L87J0l42O7K38m19J24J5J43j26K5J75O6l35j8
$$ plain form
3930 315 -28 119 31 90 -131 145 -6 225 12 76 71 -4 1 -71 163 -3 14 -91 55 -106 228 61 -337
3953 -337 -143 -80 140 195 -74 197 -134 61 105 -89 -120 269 -21 53 136 -97 -59 -45 -48 165 -4 -4 157 -40
3977 -40 -22 166 47 -73 -48 82 -30 23 116 130 -287 -122 66 -27 24 -14 -53 -37 63 7 8 159 6 -41 -23
4002 -23 -101 49 40 -159 -39 -12 -36 -32 119 -130 70 -70 -45 7 -165 -163 103 31 -16 -26 -105 94 -17 37 3 -11
4028 -11 -172 -174 -24 66 -12 -275 -14 200 -140 -129 231 44 23 168 49 178 10 -60 -96 -18 64 -183 1 101
4052 101 66 -81 3 -19 -43 50 -75 -4 -105 -121 116 -173 -86 -91 84 -155 -22 21 -49 -120 80 -39 -203 -184 -71
4077 -71 1 67 -149 -128 77 -60 61 159 66 180 226 183 182 227 -32 41 -12 21 -11 -46 -68 -17 121 84 -124 -46 237
4104 237 113 47 154 -138 -46 -15 -58 -66 -141 246 256 -86 -19 219 -200 -76 -61 82 -44 -19 156 222 -113 -131
4128a31J64j41J09J82p3M5r7l03K73J47r8%j01O8O1l91K24P0k91N52k67j7M1j6
4152A0n4J38K3k77k0l6L30N3k20P5p6J46k03K67k16J1J08j02J09j94K21j33m8
4175h8p6O5K42k12J07l6j41L01k25k1L59l50K65l22K67n1j35K67l14J03j0mo2
4198g1K9lL0l8P8J86k96J66j24J08Lj83OK42j02j56mkK22o1L4j42N9J82rj03k7
4225B4j7J13k07J6k7J88j43J24n6K3k1j23R3k31L49j35M2J3M1j23K16J0kk61j78
4250b72K77l1o0m9M8J66q7M9n0Q3j2m2m0Jj76J92J78j17k3j08O8Q1j34N6r8Q4
4276a6k2o8J38J26k41J56R1j71j4L0K15m66J32R4J12k52K74j88N0J23j1j19Qp2
4300i1J86k7K0r5O5Rn9J33l68K21N9L2j19J22k31J40O1M0o6lo2k0N7p1J52n0r5
$$ plain form
4128 -131 33 -108 1 183 110 155 58 -245 28 175 77 77 -24 44 105 -286 -62 8 -283 269 2 -15 26 10
4152 10 -44 94 117 -160 -180 -216 114 167 -53 22 -54 92 -111 156 -60 -49 59 -43 66 -128 93 -40 -88
4175 -88 -164 -99 143 -69 38 2 -139 162 -63 -84 275 -75 190 -132 135 84 -51 216 -98 5 -5 -9 -71
4198 -71 -42 -45 -15 -53 25 211 -85 81 -43 65 68 -115 -109 133 31 -125 -129 -131 91 30 64 -78 -19 163 154 51 24
4225 24 7 120 -87 -71 -98 90 -53 71 15 38 17 -106 -13 -244 105 -30 12 25 66 -57 159 169 167 -94 -272
4250 -272 5 -26 -86 -135 -87 79 -8 41 -9 74 62 20 -20 -19 -195 -3 175 58 35 -73 -5 76 -58 -2 -100 -16
4276 -16 -38 -106 32 158 -83 73 164 -7 -21 9 224 -242 -110 -16 96 -156 118 -70 -20 103 92 -27 -19 -91
4300 -91 95 68 88 -7 58 67 8 141 -227 -6 53 85 -34 88 -143 -3 58 98 32 29 -33 -53 4 -67 85 35 -60
4327f0J73r7L7j37K18n4L4L9p8j03OK87k50L4j4m3o1lK5j07J78q8o5J33k0P0o0
4354fq4M8M1K30k26o6j65K32j14J82qQ0O3K5j83K6k4j11M3q3L3M2n1M5j38J81
4380A2k16J32j5j10K98j42JK37n9l30L33k79J4J36j75J50j41K12J14k16K1k27
4402b50J11K15Nj17J43l4j91P3J21j45Q1j23K34k98K08MJ40k90J83j07j03J41
4424Aj05J97n2k6q2J13j19j27P6J68p9K02k10NJ31oj68Q4j25J00m0J73j73L3J1
4449a8j67K47j08K06k49N5NK24k42j89P9K20j89J36L4l80K73K25k72Q4N1k9j09
4472a13J13k08K28o6j73K06J0N2P4p8p5J10m2n7j38J24j34J61N7j81N3j57K49
4495A5J91j99J15j32r2J76k27L51j25j62J04OR3p3o9j65J02J67j75J20l2k9Rm9
$$ plain form
4327 -60 113 16 53 -84 134 80 114 153 75 -28 -22 265 15 49 35 -8 -69 -72 -47 -154 24 -64 -129 4 -16 54 -6
4354 -6 -90 -42 -1 229 3 -63 -228 4 -110 72 64 144 207 232 49 75 51 -60 -17 -100 -67 -25 -76 -31 -169 12
4380 12 -204 -72 -87 -197 101 -41 -40 197 138 -192 141 -138 -124 12 -163 -13 -154 58 172 -44 -23 -250
4402 -250 -139 76 81 -36 107 73 -118 -45 76 -69 12 -111 123 -175 33 37 177 -113 70 -37 -140 1
4424 1 -104 93 41 15 -67 46 -73 -200 -124 44 -35 167 -43 -38 93 87 -81 3 -122 -22 -62 111 -62 -29 -18
4449 -18 -185 62 -46 160 -89 -34 -29 195 -47 -236 -157 63 -126 10 44 -336 -63 162 -110 -26 25 -4 -113
4472 -113 0 -208 20 -46 -219 -13 -3 49 123 45 -30 80 38 -19 -157 -33 -167 -6 51 -130 -77 -234 15
4495 15 206 7 122 -10 -102 74 -153 198 73 -89 15 21 114 41 -28 -193 -91 76 -99 21 -11 -40 -31 -80
4519h0L09j73K21l88L02j40R7r5j24NJ94k34J28o1K5o0L21m07j1j7J49J04j08
4542d3K31k01j45J36Oj7J12k29K17J4l1p4L3j01K28j68L5L6r8K72l98j41j22M55
4566Gk8J59j08K4P4k29k7P7K60l32nn8L09q6%k42M47l56L1p6R2J62n9j0Q4J5j23
4593BL0Ok5j07K6J06j20J19j42j60L39n5l07K96j72J20q0n9L42j48q5O3l27K39
4617i9L0K95q8k22R8O6mkr0J8j36J32J02k52K64j43J74k58j0J40m0j23J33K39
4641B24k46QJ46m7k02J91j29K1K21k37Qk2K17k16O0n1o0kJ44j93K15R9k87L4k0
4666a24M27l20k5O3p9rj08J29K48l25J65j22k46K08j03M41m23K67n5K37j85k00
4688a39L53j85o2L8J56k0k34K60j46o6J74k63K34j87J25l1J79m84J83L32j74j78
$$ plain form
4519 -80 229 56 277 -111 191 51 148 53 -71 -66 128 -106 22 -39 -14 -74 247 -160 -171 -188 -39 65 -43
4542 -43 188 -13 -158 -22 -16 -33 79 -150 67 81 50 -24 9 -92 136 -32 3 39 -59 213 -185 -326 -448 7
4566 7 -21 138 30 54 128 -101 -128 -51 209 -123 -128 -186 123 37 37 -205 242 -114 -83 -159 -67 95 36 26 110 125 2
4593 2 32 38 13 -94 -68 38 -82 37 -105 -265 74 19 -288 8 -164 -44 -124 -183 159 11 -74 -11 -338 -99
4617 -99 -69 226 138 -84 14 80 76 74 -16 2 -134 -2 100 -152 112 -31 143 -115 -125 15 -25 -148 -15 224
4641 224 -22 -14 132 85 -117 74 -55 -34 187 -50 -42 -64 153 -63 -3 -54 -114 -116 28 -165 50 149 -138 -104 -124
4666 -124 303 -17 -42 21 -58 -67 -175 -46 202 -123 42 -80 -326 -118 -221 220 -203 64 9 246 61 -139
4688 -139 214 29 -33 5 161 141 -93 167 21 -45 129 -134 100 -87 38 7 186 -298 -115 217 43 -135
$$ [...]
8191b8
##END NTUPLES=NMR FID
##END=
