##TITLE=1H_Pr NCO-Mat
 200.13MHz,CDCl3.
 8 sc
 
 10.12.2025
##JCAMPDX= 6.0         $$ Bruker NMR JCAMP-DX V2.0
##DATA TYPE= NMR FID
##DATA CLASS= NTUPLES
##ORIGIN= UXNMR, Bruker Analytische Messtechnik GmbH
##OWNER= pz
$$ XWIN-NMR		Version 3.5
$$ Wed Dec 10 15:15:51 2025 Russian Standard Time (UT+4h)  she@DPX200
##.OBSERVE FREQUENCY= 200.1313
##.OBSERVE NUCLEUS= ^1H
##.DELAY= (6, 6)
##.ACQUISITION MODE= SIMULTANEOUS
##.ACQUISITION SCHEME= undefined
##.AVERAGES= 8
##.DIGITISER RES= 18
##SPECTROMETER/DATA SYSTEM= spect
##.PULSE SEQUENCE= zg30
##.SOLVENT NAME= CDCl3
##.SHIFT REFERENCE= (INTERNAL, CDCl3, 0, 14.3821)
##AUDIT TRAIL= $$ (NUMBER, WHEN, WHO, WHERE, WHAT)
$$ ##TITLE= Audit trail, XWIN-NMR		Version 3.5
$$ ##JCAMPDX= 5.01
$$ ##ORIGIN= Bruker BioSpin GmbH
$$ ##OWNER= she
$$ F:/spectra/data/she/nmr/H-C/1/audita.txt
$$ ##AUDIT TRAIL=  $$ (NUMBER, WHEN, WHO, WHERE, WHAT)
(   1,<2025-12-10 15:14:06.45 +0400>,<she>,<DPX200>,
      <created by zg, POWCHK disabled, PULCHK disabled
       configuration hash MD5:
       00 E9 B6 7A A2 85 ED C7 34 08 36 98 17 FE 4E 26
       data hash MD5: 16K
       5E C4 D3 09 25 45 05 A5 2A BA 4C 33 AF 1F 51 70>)
$$ ##END=
$$ 
$$ hash MD5
$$ DA 48 C1 59 1D CD 1D D1 76 CC F0 13 2A 1B 26 03
##$RELAX= 
##$RELAX= 
##$RELAX= 
##$RELAX= 
##$RELAX= 
##$RELAX= 
$$ Bruker specific parameters
$$ --------------------------
##$DU= <F:/spectra>
##$EXPNO= 1
##$NAME= <H-C>
##$PROCNO= 1
##$TYPE= <nmr>
##$USER= <she>
##$AMP= (0..31)
100 100 100 100 100 100 100 100 100 100 100 100 100 100 100 100 100 100 
100 100 100 100 100 100 100 100 100 100 100 100 100 100 
##$AQSEQ= 0
##$AQ_mod= 1
##$AUNM= <au_zg>
##$AUTOPOS= <>
##$BF1= 200.13
##$BF2= 200.13
##$BF3= 200.13
##$BF4= 200.13
##$BF5= 200.13
##$BF6= 200.13
##$BF7= 200.13
##$BF8= 200.13
##$BYTORDA= 1
##$CFDGTYP= 0
##$CFRGTYP= 5
##$CHEMSTR= <none>
##$CNST= (0..31)
1 1 145 1 1 1 1 1 1 1 1 1 1 1 1 1 1 1 1 1 1 1 1 1 1 1 1 1 1 1 1 1 
##$CPDPRG= <>
##$CPDPRG1= <>
##$CPDPRG2= <>
##$CPDPRG3= <>
##$CPDPRG4= <mlev>
##$CPDPRG5= <mlev>
##$CPDPRG6= <mlev>
##$CPDPRG7= <mlev>
##$CPDPRG8= <mlev>
##$CPDPRGB= <>
##$CPDPRGT= <>
##$D= (0..31)
0 0.7 0 0 0 0 0 0 0 0 0 0.03 0 0 0 0 0 0 0 0 0 0 0 0 0 0 0 0 0 0 0 0 
##$DATE= 1765365245
##$DBL= (0..7)
120 120 120 120 120 120 120 120 
##$DBP= (0..7)
150 150 150 150 150 150 150 150 
##$DBP07= 0
##$DBPNAM0= <>
##$DBPNAM1= <>
##$DBPNAM2= <>
##$DBPNAM3= <>
##$DBPNAM4= <>
##$DBPNAM5= <>
##$DBPNAM6= <>
##$DBPNAM7= <>
##$DBPOAL= (0..7)
0.5 0.5 0.5 0.5 0.5 0.5 0.5 0.5 
##$DBPOFFS= (0..7)
0 0 0 0 0 0 0 0 
##$DE= 6
##$DECBNUC= <off>
##$DECIM= 32
##$DECNUC= <off>
##$DECSTAT= 4
##$DIGMOD= 1
##$DIGTYP= 9
##$DL= (0..7)
0 120 120 120 120 120 120 120 
##$DP= (0..7)
150 150 150 150 150 150 150 150 
##$DP07= 0
##$DPNAME0= <>
##$DPNAME1= <>
##$DPNAME2= <>
##$DPNAME3= <>
##$DPNAME4= <>
##$DPNAME5= <>
##$DPNAME6= <>
##$DPNAME7= <>
##$DPOAL= (0..7)
0.5 0.5 0.5 0.5 0.5 0.5 0.5 0.5 
##$DPOFFS= (0..7)
0 0 0 0 0 0 0 0 
##$DQDMODE= 0
##$DR= 18
##$DS= 0
##$DSLIST= <SSSSSSSSSSSSSSS>
$$ [...]
##$SUBNAM0= <"">
##$SUBNAM1= <"">
##$SUBNAM2= <"">
##$SUBNAM3= <"">
##$SUBNAM4= <"">
##$SUBNAM5= <"">
##$SUBNAM6= <"">
##$SUBNAM7= <"">
##$SUBNAM8= <"">
##$SUBNAM9= <"">
##$SW= 18.0517328524113
##$SWIBOX= (0..15)
0 0 2 0 0 0 0 0 0 0 0 0 0 0 0 0 
##$SW_h= 3612.71676300578
##$TD= 16384
##$TD0= 1
##$TE= 0
##$TE2= 300
##$TE3= 300
##$TEG= 300
##$TL= (0..7)
0 120 120 120 120 120 120 120 
##$TP= (0..7)
150 150 150 150 150 150 150 150 
##$TP07= 0
##$TPNAME0= <>
##$TPNAME1= <>
##$TPNAME2= <>
##$TPNAME3= <>
##$TPNAME4= <>
##$TPNAME5= <>
##$TPNAME6= <>
##$TPNAME7= <>
##$TPOAL= (0..7)
0.5 0.5 0.5 0.5 0.5 0.5 0.5 0.5 
##$TPOFFS= (0..7)
0 0 0 0 0 0 0 0 
##$TUNHIN= 0
##$TUNHOUT= 0
##$TUNXOUT= 0
##$USERA1= <user>
##$USERA2= <user>
##$USERA3= <user>
##$USERA4= <user>
##$USERA5= <user>
##$V9= 5
##$VALIST= <valist>
##$VCLIST= <CCCCCCCCCCCCCCC>
##$VD= 0
##$VDLIST= <DDDDDDDDDDDDDDD>
##$VPLIST= <PPPPPPPPPPPPPPP>
##$VTLIST= <TTTTTTTTTTTTTTT>
##$WBST= 1024
##$WBSW= 4
##$XGAIN= (0..3)
0 0 0 0 
##$XL= 0
##$YL= 0
##$YMAX_a= 440042
##$YMIN_a= -376756
##$ZGOPTNS= <>
##$ZL1= 120
##$ZL2= 120
##$ZL3= 120
##$ZL4= 120
##$ABSF1= 10
##$ABSF2= 0
##$ABSG= 5
##$ABSL= 3
##$ALPHA= 0
##$AQORDER= 0
##$ASSFAC= 0
##$ASSFACI= 0
##$ASSFACX= 0
##$ASSWID= 0
##$AUNMP= <proc_1d>
##$AZFE= 0.1
##$AZFW= 0.1
##$BCFW= 1
##$BC_mod= 2
##$BYTORDP= 1
##$COROFFS= 0
##$CY= -3
##$DATMOD= 1
##$DC= 2
##$DFILT= <>
##$DTYPP= 0
##$F1P= 0
##$F2P= 0
##$FCOR= 0.5
##$FTSIZE= 0
##$FT_mod= 4
##$GAMMA= 1
##$GB= 0.15
##$INTBC= 1
##$INTSCL= 1
##$ISEN= 128
##$LB= 0.25
##$LEV0= 0
##$LPBIN= 0
##$MAXI= 10000
##$MC2= 0
##$MEAN= 0
##$ME_mod= 0
##$MI= 1.114404
##$NCOEF= 0
##$NC_proc= 0
##$NLEV= 6
##$NOISF1= 3.799351
##$NOISF2= 2.8
##$NSP= 1
##$NTH_PI= 0
##$NZP= 0
##$OFFSET= 14.38212
##$PC= 1
##$PHC0= -3503.727
##$PHC1= 11.39234
##$PH_mod= 1
##$PKNL= yes
##$PPARMOD= 0
##$PSCAL= 0
##$PSIGN= 0
##$REVERSE= no
##$SF= 200.129724274929
##$SI= 16384
##$SIGF1= 3
##$SIGF2= 2
##$SINO= 400
##$SIOLD= 16384
##$SREGLST= <1H.CDCl3>
##$SSB= 0
##$STSI= 0
##$STSR= 0
##$SW_p= 3205.1282051282
##$SYMM= 0
##$S_DEV= 0
##$TDeff= 0
##$TDoff= 0
##$TI= <>
##$TILT= no
##$TM1= 0
##$TM2= 0
##$TOPLEV= 0
##$USERP1= <user>
##$USERP2= <user>
##$USERP3= <user>
##$USERP4= <user>
##$USERP5= <user>
##$WDW= 1
##$XDIM= 8192
##$YMAX_p= 0
##$YMIN_p= 0
$$ End of Bruker specific parameters
$$ ---------------------------------
##NTUPLES= NMR FID
##VAR_NAME=  TIME,          FID/REAL,        FID/IMAG
##SYMBOL=    X,             R,               I
##VAR_TYPE=  INDEPENDENT,   DEPENDENT,       DEPENDENT
##VAR_FORM=  AFFN,          ASDF,            ASDF
##VAR_DIM=   8192,          8192,            8192
##UNITS=     SECONDS,       ARBITRARY UNITS, ARBITRARY UNITS
##FACTOR=    0.0002768,     1,               1
##FIRST=     0,             0,               0
##LAST=      2.2672688,     0,               0
##MIN=       0,             -376756,         0
##MAX=       2.2672688,     440042,          0
$$ Real data points
##PAGE= N=1
##DATA TABLE= (X++(R..R)), XYDATA
0 0 0 0 0 0 0 0 0 0 0 0 0 0 0 0 0 -8 8 -8 8 -16 16 -20 24 -28 33 -39 46 -54 62 -70 79 -92 107 -120 136 -154
36 -154 171 -195 218 -243 273 -302 337 -373 414 -455 505 -557 615 -678 745 -822 906 -996
54 -996 1100 -1214 1344 -1489 1658 -1853 2082 -2356 2685 -3096 3622 -4318 5263 -6574 8091
69 8091 -8445 405989 333103 -144116 -34574 197447 -49954 -291301 87708 440042 163733
80 163733 -217016 -105012 61138 -105320 -188670 88297 199539 -97296 -265324 -35445
90 -35445 100735 -43310 -52603 149211 124332 -127850 -135884 123531 185455 14501 -9973
101 -9973 98453 15659 -156305 -90073 100714 84432 -61263 -81676 -44628 -95046 -103556 28163
113 28163 131304 77613 -19091 -42715 -35801 -32716 25136 117352 121507 24091 -53088 -54428 -33579
126 -33579 -10745 36330 59357 411 -80121 -97214 -60546 -8617 44930 64584 21097 -37685
138 -37685 -38880 3476 27887 40604 63341 43996 -35531 -72588 -6552 62055 42422 -170
150 -170 -2267 -23365 -80950 -76407 11552 65935 27415 -25698 -31501 -23378 -21101 12644 65308
163 65308 66735 11904 -31459 -34154 -20502 2723 39650 52659 12919 -34786 -42001 -25689 -13529
176 -13529 4185 26416 17584 -26984 -50000 -18916 21206 30309 26860 24022 1957 -29651 -26615
189 -26615 11112 33342 23665 7166 -9022 -27340 -25664 2860 26580 20521 -3205 -22687 -31853
202 -31853 -27392 -3733 26051 34266 12705 -15290 -23590 -11144 5009 17407 24543 15650 -9028
215 -9028 -25434 -14865 9449 23093 19534 6455 -10659 -24678 -22243 -4865 10171 10841 281
228 281 -11218 -15491 -10125 3758 18018 18744 4390 -10273 -10520 130 7534 13234 20199 14018
242 14018 -7219 -19087 -9400 2603 1559 -3539 -3909 -8801 -18605 -15871 1286 13786 11519 3928
256 3928 1876 758 -2970 1202 13706 16702 6269 -2301 -1437 -551 -4492 -3787 1124 -3769 -15231
271 -15231 -17200 -9290 -2581 -240 3277 7665 5689 574 2353 8602 10522 6676 3166 2723 581
286 581 -3511 -1946 3233 1523 -6077 -10338 -8730 -6894 -7207 -5004 362 2254 458 586 4707 9854
302 9854 9528 4675 3059 3630 1207 -1862 -664 2638 534 -5747 -6391 -2863 -3286 -5364 -4495 -2166
318 -2166 -2543 -4410 -926 5993 7067 3629 3761 6070 4308 -714 512 5235 1551 -6428 -4868 823
334 823 -833 -5056 -1967 2693 -2120 -8865 -4075 3618 1974 -1390 2302 6371 2124 -2807 2260
349 2260 8433 3179 -3755 -1872 1247 -2773 -5644 429 5479 -585 -5954 -1981 964 -2090 -1736
364 -1736 3100 2914 -2989 -3627 1927 3217 669 2405 5140 605 -5591 -3617 2867 2589 -1935 -239
380 -239 2963 -657 -4790 -1500 3893 2404 -2349 -2366 -523 -1746 -1660 1748 2742 436 -432 284 -524
397 -524 -1122 2086 4250 496 -3403 -1583 1456 972 -12 1672 2570 -955 -5193 -4239 -384 1581 1105
414 1105 263 -398 -1038 -849 -336 207 1996 4591 2449 -2715 -2329 1897 1934 -1209 -744 2480 1363 -3051
432 -3051 -3726 -874 -105 -1323 -1335 -282 56 1224 2087 528 -1379 851 3284 86 -2994 1751 6405
449 6405 1244 -5938 -2985 3559 332 -5503 -432 6754 1577 -7472 -5185 2347 1645 -1788 2103
464 2103 5830 896 -4128 -2184 707 122 1168 4410 2679 -3113 -3131 1458 362 -3658 -312 5252
480 5252 1501 -5472 -2879 3409 262 -5158 -904 4681 1518 -2789 5 3056 -352 -3154 877
495 877 3463 290 18 3682 2261 -3863 -4458 836 1069 -3208 -791 4824 1957 -6321 -6924 20
511 20 3036 512 1510 5383 3291 -3196 -4712 -135 4080 4889 3109 -46 -2622 -2404 -2071 -3428 -1757
528 -1757 3032 2942 -3306 -6348 -863 3951 -76 -3893 1202 6082 1807 -2925 1869 7069 1888 -5160
544 -5160 -2378 2943 1449 -1504 204 664 -4010 -6859 -3258 683 712 1621 3735 778 -4511 -3200
560 -3200 3135 4798 2078 3382 6071 1411 -5968 -4849 1818 2484 -1864 -1633 1639 -1881 -7621 -4822
576 -4822 2210 2715 -905 419 3133 637 -2312 2116 6313 2822 -1930 10 3471 970 -2763
591 -2763 -6 2324 -3997 -9095 -3677 3825 2219 -2688 -1265 1314 -2241 -4970 1372 8877 7155
606 7155 351 -1662 440 -286 -1515 1574 4755 1767 -3970 -5805 -4090 -2376 -1066 668 979 -788
622 -788 -1761 -454 1167 2054 2949 3317 1726 -431 136 2190 2318 409 -1152 -2007 -2560 -2946 -2143 -271
640 -271 743 -620 -2789 -2937 -523 1696 2415 2991 3400 2031 -873 -1989 386 3153 2672 492 -461
657 -461 -1499 -3605 -3889 -628 1926 390 -2077 -1811 -856 -708 521 3079 3698 963 -1242 -170 1388
674 1388 1269 1183 1472 -18 -2810 -2795 -290 1023 237 -537 -869 -1973 -2755 -779 2128 2645 1264 231
692 231 -34 -685 -450 1419 2154 861 -110 -581 -1298 -1778 -411 1148 606 -927 -1027 -192 -857 -1072 230
711 230 1565 701 -671 31 858 143 42 1162 1192 -639 -1480 -276 473 -59 307 1149 2 -2256
729 -2256 -1730 466 1349 514 188 406 -919 -2146 -472 2295 2330 308 -651 -417 -908 -1376 309 2243
747 2243 1271 -717 -1252 -277 -1 -346 188 872 41 -1096 -865 169 566 190 -177 17 207 -216 -114
766 -114 274 598 34 -558 60 628 270 -58 320 380 -373 -1118 -365 228 -285 -682 116 718 -171 -924 -43
787 -43 1038 132 -710 541 1182 -157 -1161 223 1346 156 -832 357 793 -1005 -1824 -93 867
804 867 -284 -1004 274 890 -436 -852 843 1400 19 -651 636 946 -323 -741 770 799 -684 -882
822 -882 198 -20 -1175 -1003 440 365 -607 -327 697 659 -129 62 925 726 -416 -494 428 386 -77 -48
842 -48 155 -131 -820 -812 -44 230 -145 -413 -388 -163 112 262 549 882 549 -122 -371 13 293 174 225 314
864 314 -232 -771 -557 143 253 -288 -167 57 -480 -796 -69 996 664 -284 -28 552 168 -581 125 947
884 947 414 -884 -583 254 99 -357 114 552 -82 -834 -519 248 353 103 417 348 -343 -551 273 664
904 664 302 -173 109 -7 -738 -791 431 828 43 -450 -102 204 -456 -484 324 770 37 -649 -150 224 369
925 369 -50 257 391 -333 -526 -168 218 214 193 85 -175 -486 -70 369 275 -97 -38 10 -450 -518 45 820 554
948 554 -155 -290 -72 -189 -300 56 681 398 -294 -396 -56 -4 72 271 354 -271 -384 -217 38 -127 24
969 24 410 170 -288 -258 379 393 -172 -274 64 -40 -267 -50 491 540 -165 -483 -330 -58 -59 46 192 152 -51
992 -51 -360 -306 -119 183 491 373 -185 -344 -92 -183 -258 3 518 235 -266 -379 89 37 -188 -173 166 204 -89
1015 -89 -216 53 253 -107 -79 -1 77 190 88 3 -139 -221 -39 -64 -38 103 223 117 -297 -309 -103 -11 -22 261
1039 261 412 81 -121 -184 59 61 -94 261 336 -48 -89 -38 38 -237 -160 215 259 -97 -234 -69 -14 -336 -8
1062 -8 291 322 -51 -44 66 2 -98 -282 -6 95 -1 -60 -6 50 -157 -271 -86 -40 56 231 245 -78 -212 -25
1086 -25 103 -7 130 387 288 33 -362 -229 7 -168 -117 63 136 18 -248 -303 -92 8 -136 116 292 219
1108 219 -59 -254 -63 210 173 -59 66 158 1 -80 -182 -65 59 -129 -54 143 81 -42 24 -182 -87 -39 112
1131 112 277 246 208 -32 -185 -158 -42 163 155 70 47 -102 -390 -235 37 125 103 95 -20 -85 -140 6 -6 -46 71
1156 71 331 304 -43 -130 -57 -142 -300 -131 25 101 -189 -163 -112 -81 -154 -90 247 230 15 133 154 11 -228 77
1180 77 239 363 -18 39 85 -283 -454 -82 163 203 -30 -68 54 -148 -271 -39 255 266 -33 -41 95 21 -157
1203 -157 80 139 70 -116 -187 -3 8 -67 -169 10 16 137 162 193 38 -33 -71 -61 236 200 122 166 90 -116 -173 -181
1229 -181 28 -1 -70 -79 22 -168 -291 -69 153 134 -103 43 260 88 -168 -108 210 58 -52 158 98 37 -255
1252 -255 -126 94 -121 -82 -53 131 -80 -174 -111 10 75 -16 31 141 48 -13 -9 27 -118 -112 24 107 77 -65 -223
1277 -223 -80 -88 -15 0 70 -46 23 -92 24 -24 58 124 -21 51 -106 -5 40 69 85 -105 -9 34 -41 -40 -77 -43 -109
1304 -109 -105 82 131 12 -169 -19 70 66 43 93 87 86 -203 24 90 -9 -14 -6 -13 -118 -122 -10 -88 -68 -102 -65 45 7 4 58
1334 58 164 47 4 40 64 24 19 56 -91 -20 -50 -78 -59 -7 -39 -112 -77 -76 -79 84 -58 119 233 -70 93 26 11
1361 11 28 125 198 18 -108 -131 -82 -63 -51 -14 57 -203 -279 -79 212 48 48 111 109 -7 -87 237 329 14 -208 -66
1387 -66 83 14 -146 107 204 -181 -374 -116 65 -23 -20 115 131 -53 -131 238 364 108 72 44 -52 -126 -73 150
1411 150 98 -186 -67 -80 -75 -165 -76 199 50 -127 -88 0 176 51 187 286 52 -117 -101 -33 -24 -27 -27 -29 -248 -282 36
1438 36 101 149 104 26 -23 -90 11 187 161 140 21 31 20 -88 -2 -29 -75 -125 -69 -124 -92 54 -83 17 -32 -58 -44
1465 -44 -100 114 365 107 -94 -23 83 1 -13 -7 22 -97 -195 -209 -115 109 11 176 100 -53 -119 -66 28 41 239 211
1491 211 15 -170 -81 15 114 -3 82 101 -177 -294 58 112 -2 -136 -125 22 43 19 34 103 56 -157 -2 6 -119
1516 -119 85 181 4 -295 -177 -3 37 173 145 233 -115 -214 -62 108 129 172 164 40 -125 -225 -80 162 -17
1539 -17 24 184 -124 -284 -85 136 -28 22 87 4 45 -99 -45 153 104 -80 21 99 18 -38 31 45 -42 -225 -153
1564 -153 69 80 118 -11 -80 -209 -94 90 79 118 207 148 -163 -274 -43 97 97 87 50 49 -159 -215 -179 158 96
1589 96 -12 12 -64 -64 -67 23 49 60 -25 -62 1 -131 -21 -12 41 -133 8 -7 168 68 46 73 -143 -28 -23 23 180
1616 180 151 61 -85 -162 10 68 108 189 111 4 -276 -277 -27 -5 75 24 108 -22 -115 -57 -7 189 26 60 43 21
1642 21 -4 78 -49 29 -25 -64 -81 -104 3 -71 -138 -91 -58 11 64 130 170 114 -94 -154 -134 56 198 219 36 84 -159
1669 -159 -147 -66 -35 152 169 21 -181 -100 -191 127 90 183 19 -43 35 16 -23 21 183 164 -91 -55 -61 -58 -29 -68 56
1696 56 4 -55 59 143 21 -54 -82 18 -18 44 20 273 32 35 13 -41 -8 69 67 116 0 -297 -184 -48 -87 -57 196
1723 196 60 -127 -32 48 -5 116 67 172 114 -70 -82 41 -38 31 -55 -67 -107 -61 80 22 102 -171 -53 -60 -16 -25
1749 -25 0 93 -67 16 -80 62 20 -15 13 25 -100 -217 -117 -116 -32 36 96 63 -39 -70 -13 166 90 137 48 -1 44
1776 44 16 40 88 28 -54 10 -113 11 64 33 -106 -37 -95 14 -6 111 19 -25 -75 2 222 -43 115 71 54 -151
1802 -151 -64 39 21 -62 15 81 -110 -186 -47 143 32 -16 39 26 -82 -9 168 231 -46 68 19 -9 41 44 147
1827 147 54 -9 -173 -5 5 5 2 106 -93 -175 -53 90 5 67 66 117 -86 -88 33 202 8 -61 6 -127 -146 -23
1853 -23 -15 -18 -134 -180 56 14 -35 82 147 26 -10 110 133 144 64 -32 9 8 -19 -114 59 84 -49 -116 41 -127 -150
1880 -150 -55 35 -75 89 64 32 83 34 188 200 -34 -92 102 -44 -51 -96 23 -97 -83 -151 -51 -47 -98 102 -9
1905 -9 98 -56 -41 79 107 11 29 50 -49 -56 -37 -19 15 -101 -117 -106 -120 -64 6 87 -66 -51 -78 36 71 249 82
1932 82 139 136 69 6 36 154 -28 -45 -64 -142 44 -57 -13 78 29 -51 -39 -7 71 -23 74 112 -148 -39 114 180 28
1959 28 27 8 53 -68 -43 25 23 10 -68 33 -85 -48 -30 204 217 -42 -35 84 34 79 -7 192 19 -155 -27 -16 -53
1986 -53 -72 1 33 -173 -69 46 92 74 45 72 79 12 23 118 190 16 -36 -107 -48 -60 -59 19 26 -50 -149 -105 53 11 79
2015 79 66 -37 25 58 10 60 -70 106 100 -86 -116 -32 27 137 -77 37 7 -95 120 -46 112 81 59 24 4
2040 4 -32 -66 103 13 75 68 34 124 -48 74 101 -93 -95 -61 30 48 -23 -50 -22 -11 -138 -99 68 27 4 63 5 -25 -86
2069 -86 -41 -22 55 29 31 -64 -58 60 45 -91 -53 -68 -167 -97 152 -3 14 10 26 94 74 3 -26 18 -3 20 67 -67 44
2098 44 62 -7 70 -115 -108 -15 -35 17 32 46 -68 -29 -62 -102 -12 5 126 24 7 12 87 -47 -30 30 25 2 35 -154 -76
2127 -76 130 0 60 -51 127 51 -61 -41 61 -48 74 20 52 5 31 29 -7 2 11 16 60 -82 -82 26 -11 -128 -78
2154 -78 -27 14 88 80 101 -108 77 -42 63 174 65 30 74 19 -51 -53 -23 0 -17 -19 117 -193 -6 22 26 36 -7 71
2182 71 10 50 33 -19 54 49 -43 8 -21 58 -69 77 -99 8 41 47 50 -71 -95 -5 25 65 67 36 165 34 -75 115
2210 115 -21 -44 61 6 -110 5 -69 -30 -112 -50 -27 -66 -17 -56 62 -4 -22 -113 27 67 -64 15 -19 95 157 -45
2236 -45 -25 26 44 -57 -119 18 32 -12 -23 62 72 66 -33 28 -11 103 43 -10 67 151 -45 6 -2 -113 -31 34 -49 -19 -51
2265 -51 111 -41 -78 -28 16 110 6 -79 -17 21 -52 -33 117 71 18 35 -31 18 50 -81 -19 13 125 -24 22 1 -3
2292 -3 -16 56 35 -99 -21 86 9 31 67 18 63 12 -55 17 -70 -4 58 -50 -3 -57 -24 10 -66 16 -45 -26 -31 14 22 -7
2322 -7 -101 17 -13 36 32 -97 -53 -30 -53 -17 59 -25 -54 -12 8 -77 94 24 67 51 -10 77 -64 109 85 -103 82 34
2350 34 5 39 36 87 20 -43 -74 -56 -13 89 85 89 -38 -74 36 3 83 174 59 -69 112 -12 11 -13 15 -90 -48 -12
2378 -12 108 -50 -61 -40 16 105 2 44 12 -28 40 52 -62 60 89 -37 15 -28 -10 29 -69 -65 71 -3 -77 -79 -44 -6
2406 -6 -21 -19 10 23 -25 -99 -160 28 -40 35 45 88 -55 -120 60 -142 -60 32 -22 -3 28 -97 30 48 -6 -26 -49 54
2434 54 20 16 29 -112 24 -14 -17 38 -5 1 30 -75 -78 -81 58 -62 -12 12 -72 -32 31 86 -28 16 17 109 -13 -131 -49
2463 -49 0 40 -35 -65 -29 114 144 66 -36 -23 -16 21 -28 111 -1 98 -4 7 68 31 71 -11 52 35 -102 -1 39
2490 39 1 -44 -84 -71 59 18 -4 -21 23 -87 -43 -3 31 23 80 69 2 -179 -105 -39 25 -71 21 73 95 -13 -20 -14 103
2519 103 -38 -9 74 67 -198 -59 -25 142 31 -64 13 -63 -117 -64 -53 0 83 -57 128 30 -9 33 -19 1 -63 56
2545 56 -69 68 99 74 106 12 3 -63 -75 -81 102 33 -73 44 47 -47 -7 9 122 -46 -15 42 111 6 0 65 -45 63
2573 63 -3 -81 -15 16 -114 47 22 -63 -15 86 62 -35 -17 86 -30 -25 51 38 1 42 127 21 3 -2 -25 69 49 -44
2601 -44 35 50 -80 2 57 46 -35 -79 55 -65 -47 57 10 -75 56 28 -2 -110 -87 -98 52 87 -78 20 44 -44
2627 -44 -29 -62 -13 -8 -52 -5 -100 -84 -18 37 -87 -37 22 33 -43 -139 116 -41 75 27 -60 64 -94 -105 23 69 -133
2654 -133 -58 -9 -56 -37 -55 88 -38 -100 14 0 -29 -2 28 -65 -91 17 17 51 34 -51 50 12 -27 -54 3 -28 22 59
2682 59 -33 7 -20 -34 -6 37 11 -14 -12 81 -47 -61 -14 -176 119 40 -42 -54 -12 86 54 186 32 -12 -117 16 46
2709 46 7 16 34 -27 67 0 -23 38 -19 71 64 1 -12 -90 -93 -13 82 107 -25 89 150 36 13 -19 3 -77 5 12 -42 -36 52
2740 52 5 80 -35 -5 -46 35 -58 42 112 15 -46 -7 -8 37 -27 27 22 8 -25 -54 -23 107 9 74 117 -52 73 -4 78
2769 78 -16 -92 60 0 -75 -5 -81 -26 42 -15 52 2 2 -23 145 -24 29 15 -27 31 86 -12 -91 -67 10 -24 58 25 -36
2798 -36 53 66 58 -123 48 47 -44 98 -17 35 11 5 -36 67 23 -19 147 -27 68 48 -92 37 51 2 24 -43 8
2825 8 -84 69 -75 -40 -129 -9 96 -86 37 97 12 -27 -134 -23 54 -54 127 -27 1 80 12 113 -4 23
2849 23 -77 -45 -43 -42 24 18 138 -4 -117 67 20 -6 15 82 -43 71 33 -29 -71 19 22 -105 -3 -19 -30 17 27 20
2877 20 -3 73 -7 -14 64 -36 48 31 48 -165 -74 -15 19 -43 -63 -14 12 -67 -9 -25 60 93 10 98 23 40 69 -36 33
2906 33 25 110 83 -34 -52 -15 59 -61 -93 -29 -21 24 -45 91 -49 -65 64 67 14 78 -27 -71 129 40 1 55 105 -3
2934 -3 -12 -83 50 -17 46 37 14 -57 52 -100 -24 26 -15 -21 7 -4 24 -16 -104 17 2 -143 -26 -61 -3 74 -45 86
2962 86 91 0 -33 42 -44 -149 62 54 -31 4 -60 36 -79 80 -71 89 56 -56 18 27 85 -45 55 59 58 -12 131 5
2990 5 -98 68 30 -35 -29 69 34 -1 -44 -25 30 -20 -80 36 22 -5 -33 -74 62 25 4 -64 57 -48 -43 -20 79 -92
3018 -92 -77 -35 3 42 44 -2 29 -48 -37 31 -2 -13 52 -4 -7 72 -27 -14 -21 -19 -19 77 -36 -20 -42 83 11 24 -31 -2 -15 -19
3050 -19 10 -50 5 90 66 43 -12 -78 71 -64 79 7 116 -34 -2 -54 -88 -53 76 -33 113 -69 34 -24 -9
3075 -9 71 -19 -75 1 39 58 66 -3 -26 -66 -88 -107 -34 -50 -54 -99 -38 19 6 -61 -94 25 -14 109 85 43 -76 -21 -104 70
3105 70 1 37 43 90 69 8 -27 -38 3 42 72 -17 -2 -27 -53 32 -34 -77 -63 -25 -3 34 -6 -4 -64 -24 16 -14 -11 -103 -112 69
3137 69 4 12 20 73 73 -6 -58 107 89 77 51 36 67 32 59 49 75 23 -122 14 -24 46 44 -11 24 -83 56 30 -72
3166 -72 88 84 30 100 108 -13 57 85 -94 -42 72 20 -12 -12 -126 93 83 128 -42 -12 -1 4 25 137 42 50 -12 -51 42
3195 42 0 20 -25 46 -26 -76 13 -25 24 28 5 30 56 18 79 -56 -24 -98 4 -75 21 -60 -63 17 27 6 -50 -105 -53 1
3225 1 -18 -31 -36 41 -23 -2 20 42 -155 -63 54 12 -69 19 44 -31 -32 -122 37 -2 28 -27 -26 -64 -132 0 62 106 -85 -32
3255 -32 43 29 -27 114 72 35 53 -13 16 -22 -18 -51 -55 -9 88 6 37 -51 -16 41 41 -104 -58 10 35 -63 -35 -24 39 40 -10
3286 -10 113 -12 23 -61 -2 -59 -64 101 -62 10 -62 61 -21 28 -55 -52 30 9 -60 -26 29 -31 43 12 36 -40 -20 31 -38
3315 -38 -1 45 12 26 -56 127 -48 65 2 70 -99 -166 -70 2 27 -13 34 -57 91 9 12 128 -37 89 34 55 88
3342 88 14 67 22 -29 104 67 0 14 -45 -12 66 97 -24 8 6 -1 -77 -6 18 -39 242 41 2 53 -105 7 -100 14
3370 14 37 0 23 75 21 -15 28 138 18 -19 -4 -63 90 17 -65 13 -14 -31 34 11 46 -65 5 -23 2 -68 -48 -72
3398 -72 18 -15 -12 -30 30 22 -87 -60 -85 45 -5 57 -41 38 37 -17 -35 15 10 -24 -9 -67 22 -6 -98 -11 -20 4 -68 12 49 8
3430 8 -5 71 13 15 -73 -29 53 43 -25 123 34 -19 68 -63 101 12 1 -28 15 -64 -15 20 0 7 -39 7 18 -41 109 -76
3460 -76 -27 10 78 68 -92 -90 122 24 24 65 -47 0 -70 28 74 19 -71 -10 41 -62 -64 150 -63 31 -22 -21 10 -25 16
3489 16 -45 82 14 -49 93 118 -58 -1 49 106 -31 -42 22 90 12 -20 40 82 127 -26 49 67 -52 41 -114 -36 -36
3516 -36 44 -24 -15 -36 76 -13 70 106 37 4 44 43 30 36 -56 -44 89 -99 -36 4 -2 73 17 -152 -44 -40 32 -53 26 107
3546 107 -35 66 31 -45 45 -10 -127 -79 31 -16 30 -45 0 95 -88 39 -71 -16 -8 -28 29 13 14 -46 -72 -33 64
3573 64 -65 7 6 -113 -30 9 182 -63 -36 26 34 118 -22 -33 58 56 10 -10 101 118 67 93 17 -69 -32 116 26 -7
3601 -7 -19 -109 44 -21 50 47 77 33 -7 -85 85 -17 -52 -45 21 -30 95 -105 84 36 11 130 31 79 59 -53 -9 32
3629 32 -35 1 -73 -47 44 -69 70 76 -72 -33 75 -5 -55 -96 -21 69 -18 -7 -108 -5 -24 36 70 71 -21 3 56 -21
3657 -21 -60 145 -17 -34 -19 -97 82 6 -127 -31 52 42 17 60 46 34 -50 24 -1 -1 -87 79 -35 -104 5 151 -79
3684 -79 -12 17 -59 -3 -70 19 -56 25 -14 1 2 5 18 16 -51 107 88 86 6 -4 8 30 56 -36 -30 138 -7 21 122 -39
3714 -39 75 53 109 61 34 12 18 118 -58 -95 60 96 22 -7 63 -6 23 59 -29 18 -11 -6 -6 136 -14 -83 6 -39 -13
3743 -13 -74 -72 4 -63 -14 -56 29 -42 -54 11 44 53 103 -109 -124 107 -67 -39 -12 -51 31 68 -54 -3 38 -34 -7 -21 42
3772 42 -33 15 -67 52 -60 6 4 23 60 58 73 -7 -11 -58 -16 4 -37 3 -2 5 3 -19 -12 77 53 67 -47 69 176 -40 45
3803 45 -84 -28 -87 36 -49 -7 -71 -110 -16 48 -25 -87 -93 -17 83 -38 -44 -118 88 25 37 9 -5 -32 35 50 48 57 85 56
3833 56 -57 7 -14 -99 35 37 -20 152 15 -166 -68 -45 -53 30 36 64 36 60 -82 39 26 30 90 61 20 -72 19 -53 -30
3862 -30 -81 -23 157 -44 38 -47 -41 -19 31 -18 90 8 -2 -34 31 -73 -47 43 115 175 104 48 78 19 -7 12 -103 -14
3890 -14 -32 -32 31 73 11 153 -92 -58 -31 -27 2 -104 -94 43 42 65 -3 34 -24 39 -4 -89 -112 -107 17 77 32 14 65 -4
3920 -4 137 2 68 -123 46 -86 -6 -36 7 -23 29 -38 59 -21 22 67 60 -75 -27 -29 25 -10 -67 -68 31 -37 -3 -27 7
3949 7 -61 -5 -124 -83 55 144 -50 -59 65 90 -19 -33 89 25 -9 -13 -55 -7 -11 23 39 -30 -72 -8 108 21 -18 -158
3977 -158 -99 -44 -10 -5 -26 -120 -74 28 -10 3 -46 31 121 53 47 92 -69 -115 62 -69 -47 -17 61 48 -55 -54 45 -73
4005 -73 5 6 -35 -78 -39 42 -82 -14 55 64 -127 44 -58 -81 10 79 23 15 -80 -29 68 -43 2 -34 107 -70 160 -24
4033 -24 12 -9 -3 27 -109 -19 -118 -13 5 -44 65 -34 60 6 -91 26 -18 74 38 -65 -21 -8 -5 -47 27 -73 117 -11
4061 -11 -20 -45 52 -57 -65 26 -71 -25 91 77 -13 28 -31 -32 41 -2 74 -49 -41 95 86 -10 -128 -76 5 64 -72 -168 3
4090 3 33 -86 -49 21 29 31 71 -41 -5 78 36 2 10 -5 51 -65 124 -9 -70 -17 33 40 83 29 48 55 -83 49 92 0
4120 0 -13 -27 2 -32 3 23 -9 -2 1 40 -63 85 21 -50 -59 45 -32 1 96 63 50 -3 -5 38 54 14 -45 -47 -64 -75 -109 -8
4152 -8 128 -101 -25 4 -28 17 -11 -25 -96 3 38 -96 27 26 -87 56 -25 1 24 -21 -10 82 -10 46 -75 -95 -31 -22
4180 -22 89 68 -6 -48 -1 -139 -34 156 73 34 66 -25 26 21 50 -8 -24 -44 -135 -29 129 8 28 75 27 6 67
4207 67 44 -8 -96 20 -88 37 139 99 73 -17 14 14 94 -4 64 61 41 86 11 35 80 46 96 30 63 -152 19 0
4235 0 -58 -31 -26 -58 11 94 73 -8 -4 -114 -51 -31 83 23 53 -56 -19 -93 106 26 -59 40 -123 -10 36 14 88 -41
4263 -41 29 41 14 -66 29 77 -48 -10 -47 35 -26 32 -82 -35 45 2 -48 -11 5 57 -63 -26 42 -37 11 -13 1 -10 -55
4292 -55 2 -165 15 -47 10 -91 45 28 77 51 -105 40 -88 70 -21 -9 29 -27 49 41 144 -4 129 -43 -63
4317 -63 64 -77 -9 -89 -23 32 -70 35 81 19 -63 87 17 -6 52 -3 -4 6 46 -81 -71 -30 1 -39 -55 -14 8 -72
4345 -72 62 0 64 86 -99 11 -17 36 18 49 108 1 -80 3 19 -13 -25 59 16 -169 62 21 -131 -153 -11 55
4371 55 -159 23 25 -23 77 -77 -29 42 -80 -25 -62 30 -28 -1 -72 58 35 32 81 111 -19 -76 32 161 -46 -33
4397 -33 -8 124 21 36 -77 -38 -26 23 28 -44 46 53 -22 -25 56 52 -150 79 -6 42 -167 -173 71 -81 26 33 -16 -24 17
4426 17 148 -37 -13 -9 35 -46 69 95 -13 -16 65 30 -4 37 64 -44 54 37 -111 -60 21 53 -3 27 -55 -46 45 -11 -75
4455 -75 44 -10 37 76 42 -28 27 -20 131 -6 35 98 -91 -16 -56 41 92 -7 12 48 -42 90 95 -43 16 -24 69 -51
4483 -51 -11 -28 24 -63 31 -75 68 -15 -4 -82 -41 -37 -5 5 -27 50 50 -36 -63 -51 94 -7 164 -47 -30 39 65 -67
4511 -67 -60 54 35 -4 -95 -47 52 39 50 11 -38 -111 -55 156 -58 -61 54 -3 46 121 -23 -42 -13 97 41 75 -40 -6
4539 -6 58 -54 -7 36 -125 106 105 -1 56 61 -55 86 26 -67 3 13 89 -97 -71 64 -32 -37 -2 10 39 -29 -27 46 6
4568 6 14 -70 -76 0 -12 -36 38 97 27 -7 38 -40 -14 2 -6 58 51 -60 -13 -36 51 -6 10 29 87 48 -51 -9 8 112 47 -14
4600 -14 80 -77 -55 35 81 72 -72 -76 65 -7 100 27 -55 -58 -60 15 -37 38 3 -63 21 83 -9 46 -22 -64 6 -12 -34 -28 -13
4631 -13 16 -41 28 -30 11 59 4 -14 -52 31 -7 -73 -13 26 67 -42 9 -118 -72 16 -75 5 -55 -54 -114 52 65 -72 -73
4660 -73 -49 90 92 70 96 -107 -13 -14 18 37 -72 -125 -75 -67 -12 51 -101 -102 -44 -26 69 -5 -11 34 45 -94 17 42 -67
4689 -67 49 24 55 43 4 -91 47 21 -91 18 44 -16 -3 80 -49 -20 62 24 -127 -134 6 -9 -67 -51 -133 -86 -42
4716 -42 15 -45 -29 -85 -47 -66 21 33 8 54 52 119 -36 -16 -25 56 80 131 -21 88 -25 57 -66 8 62 -12 -40 -2 31
4745 31 -69 -36 16 -50 -3 -117 -101 -69 -39 -74 54 -135 16 -5 0 -37 -88 -3 -14 -43 36 91 30 139 76 -32 -133
4772 -133 10 22 3 41 56 -49 -60 -82 23 33 -84 62 -24 -71 42 -6 18 -45 -141 67 60 42 -9 -23 100 3
4798 3 -16 -38 51 -73 46 -79 -64 110 51 -53 -12 -123 -16 -13 -21 76 33 7 -63 55 14 -101 53 112 18 55 -42
4825 -42 -50 112 -7 34 39 77 3 -131 -6 22 89 77 -40 117 -26 73 -55 -9 75 35 26 -2 43 -26 -16 -20 -69 58
4853 58 -27 -25 -18 28 -65 26 -1 108 88 41 -82 44 50 -45 54 -29 20 -58 13 19 87 -47 11 -54 -40 25 101 -82 41
4882 41 -159 96 28 -79 -72 -23 95 32 -41 -48 -68 22 -14 -37 -72 -2 -27 -39 -19 -125 144 -4 76 -55 -62 82 43
4909 43 -88 -8 62 66 53 22 -13 28 4 -29 -80 -26 75 19 155 -52 51 -14 102 -20 -74 15 44 -1 55 43 0
4936 0 -79 31 -71 52 63 -34 1 -5 83 50 -27 5 -78 44 62 33 -34 -1 27 47 -18 -10 -47 106 15 26 1 -95 36
4965 36 108 17 90 -45 17 -51 -14 -49 0 -94 -64 -18 -41 -77 18 -69 12 2 -51 -37 104 92 41 -23 5 -12 -58 26 156
4994 156 67 -76 -121 39 102 66 94 -59 33 -16 -85 -108 11 -27 14 50 52 -27 -110 -47 -65 51 44 -41 -7 9 -102 -126
5022 -126 17 -85 109 -111 55 5 -10 -56 -85 -71 73 68 21 46 -110 -94 106 17 62 42 -21 46 -113 -74 -50 -5
5048 -5 88 -141 -4 50 -36 66 -52 53 -38 -23 6 19 65 -37 -80 40 -87 40 47 -114 -48 -68 -82 -104 -30 16
5074 16 45 104 61 -37 33 29 -80 68 -28 -7 -7 -111 38 -82 61 75 -39 19 28 132 -20 -71 -80 18 -21 4 -20 74
5102 74 -63 27 50 12 40 82 16 -112 -36 -2 -2 39 -17 -2 -12 47 -140 66 5 30 32 59 -28 12 -4 38 180 39
5130 39 -40 16 -3 66 -6 40 -152 -87 -30 82 10 -76 -13 22 60 -36 -36 1 63 30 -21 -50 -61 -31 49 9 -22 15 -74 -70
5160 -70 -13 72 -4 -94 74 -102 -75 36 117 -52 8 17 59 60 96 -48 104 5 108 82 -6 20 -23 -62 -36 110 -22
5187 -22 -6 -98 -17 16 -76 -191 -22 62 -39 99 -23 22 -76 34 33 -11 -3 155 -76 13 -18 2 -43 54 -74 26
5213 26 51 -10 -36 30 -26 27 -19 -46 -3 -32 -23 21 7 90 -37 20 -12 -35 -123 -8 1 -11 57 -47 54 94 42 29 -18
5242 -18 29 76 -6 -96 -11 -1 -21 53 -64 47 -4 53 120 -10 88 -35 13 -49 -39 -121 32 -52 -53 -31 -70 34 -43 -114
5270 -114 80 -87 -31 90 -146 23 -46 21 19 -60 14 30 -22 29 -131 -47 -50 23 -68 -101 -62 22 17 -56 -31 -32 -45 22 66
5299 66 -33 52 27 85 -14 -55 -28 -93 29 12 -90 29 55 38 11 -48 63 71 -16 182 -33 -7 -11 73 19 -29 85 -20
5327 -20 4 34 -26 -54 11 -118 25 101 49 -45 26 -29 8 29 -100 -25 -46 -113 25 -42 -71 -1 -13 -11 -111 71 -19 74
5355 74 105 -44 9 -20 49 -55 -14 -137 -107 15 -94 -47 27 10 -26 -48 -41 35 -65 19 65 33 50 25 -30 125 -127
5382 -127 40 42 30 4 21 -4 -117 23 10 -21 -121 -129 -88 -37 14 17 -57 7 -91 24 67 -13 -197 -43 -1 -15 38 -60
5410 -60 13 31 60 25 61 -1 89 83 -3 -10 34 12 -48 26 3 98 -46 -103 44 4 -82 -76 -1 -41 55 18 -98 -62 9 -85
5440 -85 -38 -41 51 68 -26 -60 39 24 86 -63 -5 27 -74 -23 13 -65 -117 9 100 -40 -165 -113 -33 20 -72 10 9 -65 -73
5469 -73 -29 -91 -64 59 104 22 -88 85 -54 -71 -70 -8 -4 110 84 -14 -81 -2 25 61 8 42 -8 -51 -109 -120 -63 -26 33
5498 33 -74 8 -32 -14 24 -58 -11 -2 -6 16 -30 61 28 48 -18 -7 -24 -110 -50 -19 -115 -1 25 -53 7 -17 0 19 -24 4
5528 4 -20 35 30 -78 105 49 -45 22 -23 61 -16 38 37 -73 14 62 -113 -50 40 3 -76 24 10 18 -91 -73 11 -20 77
5557 77 -149 33 -71 104 79 57 -151 -8 1 -25 2 45 -57 -12 -54 -210 -45 -15 -10 14 25 -54 -42 -35 -49 16 6
5584 6 -95 71 -35 26 -30 -42 16 54 -9 46 68 116 -53 1 18 30 -4 -46 86 -66 -10 -31 -40 -45 94 18 5 75
5612 75 -73 59 -3 42 60 85 71 3 84 50 -2 9 -74 156 -70 60 11 -49 60 -63 78 23 28 91 -20 -76
5638 -76 12 82 -24 -48 39 102 43 182 -18 -88 -41 -36 24 -96 -145 48 -81 41 14 6 -103 -71 47 -38 39 -136
5664 -136 49 -41 81 -104 -27 87 -36 58 0 52 -54 -92 61 6 164 10 -50 -34 62 -24 35 -12 -5 146 56
5689 56 124 37 -94 -123 116 115 49 41 -40 16 -78 65 -25 -41 -52 -52 -94 -23 -26 -127 53 -41 -2 32 -50 -70 -13 29 -29 -24
5719 -24 7 20 -24 -12 -136 -23 4 15 2 13 52 71 -51 -21 -48 95 78 -110 10 58 -36 -42 68 -46 -2 -90 49
5746 49 -15 2 -39 123 118 126 -87 -63 3 77 20 5 35 -38 83 14 65 -89 -2 70 -16 15 21 -2 -7 -22 -29 24 -9 -36 -18
5777 -18 -9 -123 16 -70 -101 -120 -26 -25 -16 14 -56 -25 88 -13 -104 -50 38 33 24 70 -117 -33 68 43 -72 31 50 188
5805 188 -43 -1 -14 22 18 -61 -27 15 34 36 1 -59 -10 133 71 20 117 60 -3 9 -64 5 -119 -64 -47 -91 -77 -9 -96
5834 -96 -102 52 19 14 44 -33 -52 -45 82 30 67 97 -37 92 43 71 19 58 134 -55 78 -20 48 -111 0 28 -12 -43
5862 -43 32 -94 -46 -20 -39 32 22 -7 0 15 -11 26 18 -23 -73 21 -2 -3 -55 37 2 4 -2 63 25 100 1 -28 75 -68 161
5893 161 -44 -32 18 35 41 -14 34 53 31 57 -29 2 55 -99 82 -82 -62 -31 32 13 15 3 -46 -62 -22 77 -44 44
5921 44 46 4 4 9 104 -101 -62 94 19 -37 32 -56 31 17 -6 -37 -7 -15 0 14 -18 -73 49 13 15 -13 28 32 34 -4 10 -4
5953 -4 124 -90 1 15 -72 -15 -154 43 42 -128 -44 39 -42 3 1 -17 -1 87 143 -9 -25 -29 117 96 -47 112 55 -17
5981 -17 31 -31 -21 -92 60 -67 8 7 -183 16 -56 -79 39 -90 19 48 18 -62 27 -21 -125 -51 -39 45 6 -92 137
6008 137 -39 -26 6 28 24 77 27 -35 -19 -23 -34 -13 -51 -12 103 27 -35 53 -67 -81 -98 -49 11 15 -108 -31 -163 29
6036 29 59 17 -37 -47 7 55 82 10 35 -35 41 -17 24 77 72 -28 3 -19 -114 -63 28 -8 128 -57 -73 50 -21 -16 139
6065 139 -32 44 -82 -115 -67 104 115 -25 93 62 22 43 65 -69 -144 -15 74 -23 -41 -71 30 -23 17 57 50 -40
6091 -40 54 64 79 27 -33 28 -57 -44 11 26 0 -16 111 25 -55 -106 103 16 -24 -4 -10 27 45 -3 -64 83 -77 -38 -1
6120 -1 34 -39 63 77 -54 -21 41 -46 71 -59 14 14 -36 -22 -129 -100 -32 75 -30 -103 -59 -67 61 -51 22 98 -131
6147 -131 -65 6 9 30 162 26 89 14 -52 24 50 26 -72 -44 -35 -15 40 50 -64 -37 -23 -77 171 -79 -26 2 -5 15 -63
6176 -63 -21 -55 129 39 84 -104 96 -162 -9 13 -33 20 1 52 75 -97 -74 -88 101 -41 128 -21 -23 76 -16 57
6202 57 108 85 79 58 -53 105 -58 115 8 -9 69 6 43 48 -105 -3 106 112 88 47 -126 -73 46 118 20 25 19 8
6230 8 -61 20 18 -14 87 14 -8 -37 -33 -58 54 -17 -63 -33 -36 -89 71 -127 -33 -18 -25 48 -84 94 -33 52 -43 48 -10
6259 -10 15 0 89 -101 22 -10 -19 -24 1 23 88 -28 -18 -4 -74 56 28 -21 1 10 36 -29 81 60 -42 -1 41 0 38
6288 38 -18 -74 15 35 35 -34 60 36 -85 69 -104 8 -41 27 25 25 71 29 37 -18 47 -62 -63 87 130 -33 65 -24 21
6317 21 47 -16 -65 -28 67 -103 52 -4 -6 47 25 -13 8 -22 1 18 -96 28 1 -32 6 -22 -54 1 82 -91 -118 21
6345 21 56 -94 -25 -74 -76 36 -52 -37 -119 81 119 -58 96 31 37 24 -24 52 36 -57 -25 50 35 2 -11 29 27 -70 -60
6374 -60 -23 47 -17 0 -33 35 9 -125 84 -32 27 -138 1 95 31 -9 -154 46 -60 27 -87 -124 85 79 -27
6399 -27 -27 -62 -47 46 -58 -80 16 -72 158 131 75 3 -55 -52 -62 47 59 -15 -56 -44 -19 -39 -22 70 -78 99 42 -27 27
6428 27 -26 120 59 -27 21 -160 23 -19 34 -92 -29 11 42 70 120 -8 35 -29 -35 13 -26 75 -15 20 -83 86 -9
6455 -9 31 -61 -35 14 41 84 9 -75 -35 57 21 22 44 -5 -22 -39 -21 -4 36 18 -14 -25 -3 0 45 -78 -61 23 16 -70 -49 74
6487 74 -122 9 106 74 47 -57 -38 64 -25 96 176 18 -135 -56 12 -37 -18 119 -16 39 48 -69 45 -91 30
6512 30 -119 110 -26 48 47 95 47 -144 4 139 87 -72 -68 -18 6 105 -54 -66 54 1 104 -105 -6 78 -30
6537 -30 0 37 47 -43 -18 -5 45 23 -62 -124 51 -35 56 1 -48 7 -57 102 -31 -34 2 -7 -87 57 -15 64 -5 -43 25
6566 25 40 30 -78 -38 -66 -76 19 30 -19 15 -89 56 17 -13 -74 12 -22 -86 14 52 78 38 -112 -80 5 -118 -56
6593 -56 -39 17 -19 -17 103 -28 0 1 -15 43 -1 -14 15 12 107 44 -48 -37 65 39 -83 -72 59 -71 20 77 -70 -98
6621 -98 -68 125 3 -55 37 -28 -5 -44 38 29 -112 37 68 -102 21 -65 63 -46 2 -12 81 16 3 53 15 -17 90
6648 90 14 -5 78 -20 17 14 33 73 46 33 -15 11 15 55 -64 71 53 44 -1 -48 -75 -32 -59 57 -59 -51 96 -84 53
6677 53 -52 19 -85 16 -55 72 68 -24 55 -2 8 45 -104 24 -41 -55 52 -44 -50 34 135 -29 -33 98 -58 49
6703 49 63 -4 67 -38 14 21 35 4 101 -40 -13 112 -62 4 -24 41 -46 -32 -111 40 -40 0 -44 -46 -34 7 17 58 -50
6732 -50 -44 88 15 81 -100 60 -3 -25 -118 61 44 -18 72 -69 46 37 -38 99 -52 -14 -18 83 -34 19 31 -89
6758 -89 5 -61 31 -22 -76 9 -24 94 78 42 39 -21 28 1 65 -15 90 57 -75 103 81 -73 95 16 48 -43 26 34
6786 34 -74 -39 98 -71 -20 -33 -79 89 73 -88 -2 -7 -90 19 -146 -42 -18 -9 41 29 61 53 93 -16 36 60 29
6813 29 -40 -24 -52 -1 -35 -65 17 8 -29 -32 -12 14 -69 -109 -65 -14 56 0 -19 -88 35 88 -62 82 25 -3 -57 -9 -30 -30
6843 -30 73 -63 -26 -41 36 11 -98 -45 19 120 51 8 -84 -62 -28 10 -35 56 -11 -8 76 130 4 96 -60 -8 -12 44
6871 44 51 -125 3 69 -115 26 -45 26 46 24 -9 33 -51 47 -6 -3 -1 12 20 60 -51 105 -42 -44 14 -99 -3 -91 -128
6900 -128 86 -10 -17 -29 7 -70 -24 15 124 63 58 -137 -51 132 33 -19 149 133 -81 -32 -28 -85 -1 63 -21 -72 -83 1
6928 1 -23 79 41 -15 -7 18 39 30 -17 29 -60 -25 39 1 71 92 29 13 39 -60 -21 -22 -80 -79 -8 -43 -39 71 -4 -95 6 42
6960 42 -70 -37 -27 -60 38 73 11 -16 53 86 -116 -52 60 12 33 19 -94 34 -46 59 -39 -7 2 -88 -14 77 46 23
6988 23 172 -102 73 75 -42 21 71 6 8 -99 -22 -82 -13 101 -68 29 65 62 90 4 52 132 8 95 -7 36 153
7015 153 32 0 -74 79 -9 -42 -39 -33 64 76 -89 -48 1 120 -26 -6 98 -17 -83 19 75 -67 43 47 -24 -5
7041 -5 -15 16 27 130 -31 -35 4 69 137 -78 -70 90 31 -10 104 48 -141 9 31 -8 -56 -42 26 29 -67 28 13 32 -58
7070 -58 -22 38 -29 -77 73 0 27 85 -125 -14 -52 102 26 -60 42 -45 -38 -71 -23 4 38 -30 -17 11 -10 97 -72
7097 -72 -35 -149 -45 -128 70 120 -80 -68 -150 -72 0 24 -16 -98 -31 69 17 19 -50 102 -16 26 88 33 -44 59 -17
7124 -17 -8 52 -17 35 17 -18 24 -77 5 0 -1 -18 61 -2 -42 -75 4 167 -32 33 -45 48 -9 -10 -164 -3 8 47 -91
7153 -91 -61 -101 43 17 -64 9 -29 28 -62 -43 -23 62 -41 24 -88 91 44 13 93 -14 -56 -89 39 57 -96 -32 -59
7180 -59 6 39 76 -101 -2 -55 56 36 46 45 -43 111 -28 -61 8 36 -35 81 -33 -30 -75 18 -48 26 81 150 108 18
7208 18 19 -77 24 7 -7 88 -43 -52 -14 42 25 29 -133 -65 -62 7 26 55 -38 -10 -21 2 49 -29 21 0 34 42 -50 -104 -50
7239 -50 54 22 -51 32 -37 -9 -22 -61 90 25 -49 -65 -40 -64 113 61 -49 159 -101 12 28 21 -61 26 -88 158
7265 158 -93 -17 18 47 78 13 -3 -66 -30 22 -90 -40 18 -77 -102 -90 35 -74 1 -63 -119 112 -66 7 -36 9 105
7292 105 126 -28 -18 87 30 -68 -32 117 9 -1 52 37 109 83 -114 13 -64 4 50 29 -27 16 14 -55 -118 -25 -48
7319 -48 -121 -66 69 -13 68 13 68 -45 27 -52 13 96 86 26 31 49 -17 -31 45 47 -67 -51 4 -51 -68 -37 -64 85 -21
7348 -21 77 -80 23 9 -92 19 -7 -87 -70 -2 33 -44 42 -19 -75 -35 94 -35 -42 -58 -51 83 -19 -93 37 -75
7374 -75 -39 32 37 42 41 -89 -47 79 -121 -127 -30 48 83 13 -82 -18 38 -41 51 61 19 43 -46 -41 -41 1 -43 2 11 1 -63 -2
7406 -2 -74 2 78 -40 -25 -27 13 -47 -43 -26 35 -23 -62 36 135 101 -111 10 10 -15 -25 24 36 65 41 58 17 70 -25 56 32
7437 32 89 15 -42 32 12 -77 -30 38 -55 38 125 10 -139 -53 -13 51 49 -1 -60 8 -81 -58 -40 -20 30 -2 27 24 79 -23
7467 -23 -43 -20 78 82 102 -46 -130 -92 -42 -114 -13 73 10 112 18 57 -27 -83 18 -90 -64 -13 32 25 94 8 31 91 -68
7496 -68 -26 -67 7 -13 21 25 -13 -28 105 -83 -55 -73 44 12 -52 -93 22 -16 4 39 103 11 39 59 -32 68 90 -67
7524 -67 -41 7 -36 40 19 19 6 33 -27 51 -25 10 -116 21 -23 22 9 -4 -95 -79 19 -2 -52 -20 3 30 -147 28 71
7553 71 -16 36 80 24 111 -16 -32 -13 -48 -56 -28 -56 34 -34 45 86 36 68 -24 11 -61 55 1 65 -44 -39 9 96 -48
7582 -48 -25 11 -41 10 53 88 -25 -29 102 75 -14 31 -51 80 -44 5 119 -15 49 -46 29 -84 23 7 36 -73
7608 -73 6 1 -66 -80 57 -74 37 -91 41 -63 -97 39 -72 -28 2 -43 16 56 -31 100 -57 33 -16 -21 35 -43
7634 -43 -21 -25 -4 -57 -57 -16 -29 -41 -24 39 110 43 52 3 -36 -122 -17 40 -15 16 30 -150 26 40 -22 -133 -71 74 -132
7663 -132 -2 110 -101 -22 -11 18 113 -25 -24 -42 -124 -58 53 17 53 -125 -79 27 23 78 35 48 74 70 153 -6 35
7690 35 80 63 75 -7 48 -45 -19 -10 -53 -24 44 76 -46 -11 -33 -82 30 55 38 3 -26 -81 -34 49 -56 -14 91 43 -12
7719 -12 -34 -70 26 13 58 30 37 -97 24 48 -45 119 118 -41 -70 -12 -45 -118 -85 -48 146 -13 37 -74 61 -62 1
7746 1 15 80 -8 4 -62 31 9 -6 -26 16 -27 23 -59 -52 -62 -5 -69 -43 87 20 59 -164 -11 -15 12 10 -42 -76 -56 13 18
7777 18 -53 -25 16 -5 121 -84 -66 -32 29 125 -44 -37 -40 -79 25 -58 1 17 104 9 9 -39 -62 39 129 112 -22 18 -57
7806 -57 -1 -29 -31 4 -8 59 -20 -7 72 -41 -48 -154 -66 -103 -17 -93 105 -25 56 120 97 77 -84 36 12 2 41 -27
7834 -27 125 -70 39 77 -23 -92 -62 -64 9 -8 100 -49 -4 -76 -8 81 44 -12 -9 90 -71 -8 -49 163 -8 -33 137
7861 137 -58 -74 7 62 -92 74 27 -1 -56 53 -7 31 23 0 -24 -21 50 64 -20 9 -20 -17 69 -36 -28 48 -58 -51 33
7890 33 21 77 -43 40 53 17 4 23 17 44 -8 -133 81 -37 21 18 3 -11 33 -45 25 14 -76 135 26 -62 17 -49
7918 -49 -29 55 19 97 -56 48 0 121 -84 -15 82 -150 120 67 -35 54 124 -32 -13 -1 -17 -12 -11 -99 22 -54 81
7945 81 63 -7 -11 -10 -50 -60 -113 58 76 92 29 -3 22 69 -21 16 -37 19 -3 -49 13 -156 -80 -61 -105 -29 5 48 13 -79
7975 -79 20 37 -1 -52 53 17 32 5 -29 109 -36 -10 -51 20 28 13 122 -42 77 -19 -107 119 70 -55 6 22 -102
8002 -102 35 -94 -102 -12 -60 55 99 -66 -80 105 -64 -18 -27 28 95 -33 139 22 -105 76 -29 -41 -33 -28 -67 58
8028 58 89 46 10 17 -41 -38 38 125 -20 -24 -148 -50 -43 32 21 38 67 -79 60 -84 9 47 3 23 69 -36 22 -6 56
8057 56 -60 40 -69 -61 -121 -41 -27 8 -42 -20 22 -1 44 95 -83 34 -10 -137 16 -12 27 -26 99 86 -49 16
8083 16 -52 -9 -2 -4 -12 -22 67 -39 53 -100 -106 53 -10 23 -8 61 15 -18 44 -66 43 29 12 -12 -30 -29 203 89 13
8112 13 -76 36 -29 -34 -10 -12 43 -26 63 2 16 35 71 -23 33 -29 -20 -69 -68 68 -112 -11 -13 -77 -71 84 -4 55 -19 -37 45
8143 45 -58 -18 -27 12 18 -2 92 1 7 30 114 122 -50 69 96 -140 85 -85 69 -75 146 -73 108 -48 -13 84
8169 84 -23 106 -97 26 -3 1 -20 -29 -122 -9 -20 -13 -8 -9 9 -16 5 -172 4 -93 -36 32
8191C2
$$ Imaginary data points
##PAGE= N=2
##DATA TABLE= (X++(I..I)), XYDATA
0 0 0 0 0 0 0 0 0 0 0 8 -8 8 -9 16 -17 24 -32 40 -48 56 -64 77 -89 107 -128 145 -170 199 -227 259 -298
31 -298 340 -386 436 -492 556 -623 699 -781 870 -968 1076 -1192 1322 -1461 1615 -1781 1963
48 1963 -2163 2384 -2626 2893 -3189 3519 -3891 4306 -4782 5332 -5969 6726 -7629 8747
62 8747 -10160 12013 -14561 18297 -24331 35679 -64483 295291 420631 -259973 -151286
73 -151286 125191 -18882 -262071 92679 367749 32882 -376756 -184257 84248 -23443
83 -23443 -137771 96882 177606 -112243 -255731 33096 208650 49128 -20430 146157 116450
94 116450 -120990 -119653 138331 165648 -61841 -125463 2652 -29056 -155868 -65143 128543
105 128543 84449 -94930 -108980 -17230 -18906 -17212 94436 157538 57599 -55058 -49193 4597
117 4597 26670 56839 92266 43086 -76481 -131045 -79557 -13453 17361 40052 37160 -26474
129 -26474 -86190 -62600 7791 55540 71096 52877 -1786 -44162 -19020 40652 59766 41003
141 41003 25919 -8151 -72461 -83195 -3340 57970 18083 -41038 -36852 -25379 -45333 -20792
153 -20792 60619 84981 13547 -49607 -36371 863 17282 40642 68098 43937 -23023 -56927
165 -56927 -35387 -4544 12687 24977 15505 -28908 -61248 -39468 3281 23069 28319 29919 8719
178 8719 -31308 -38904 4181 43045 36310 13830 3741 -9839 -25693 -11762 23771 31041 686
191 686 -26446 -34040 -32696 -15485 17321 33628 15689 -12301 -23365 -16777 -1669 18432 32233
204 32233 21788 -7775 -27442 -18221 7596 24757 25110 15625 -3111 -26075 -32339 -12342 12886
217 12886 18285 4825 -9887 -17541 -16911 -3995 14372 20387 8960 -7883 -15967 -10906 2446
230 2446 16932 24038 16345 -1393 -12881 -8178 3511 6879 2981 198 -7617 -22060 -22267 -2488
244 -2488 13314 9518 -608 -3150 -5183 -10236 -3910 12882 20173 11378 961 297 3192 1609
258 1609 3081 8727 4407 -10832 -18982 -13442 -6491 -5568 -2739 3473 1238 -6942 -5128 5014 9997
273 9997 7875 6149 7085 4697 481 3176 8795 7280 -299 -6330 -7683 -8563 -10900 -8250 -1938 -1815
289 -1815 -6180 -5480 719 5300 5153 5044 7330 5811 1595 875 4371 7593 5350 -658 -2724 -1726
305 -1726 -3729 -6962 -6215 -3714 -5205 -8749 -6065 1130 3511 2315 3635 5784 4348 1625 2856
320 2856 6734 4968 -767 -1471 1402 486 -3290 -2569 1221 -2235 -10017 -7550 -30 -291 -3835 46
336 46 5773 2674 -2355 2480 9467 5384 -1313 60 2792 -1348 -5275 -255 5750 422 -6747 -3905
352 -3905 710 -2313 -5249 130 4491 -1066 -5719 439 5713 2882 1570 4648 3053 -3464 -4357
367 -4357 1308 2581 -1246 -726 1931 -1460 -5701 -2160 4312 3253 -2642 -2234 1343 -882 -3918 496
383 496 5921 3495 -2058 -1904 854 -44 -1167 959 1384 -1520 -2173 -146 365 246 2331 3393 -758
400 -758 -4394 -1687 1997 1281 -472 579 1400 -1445 -4150 -1803 2683 3235 579 -1395 -1820 -1498 -540
417 -540 867 1676 2579 3287 658 -3676 -2821 1851 1941 -1752 -1553 1775 784 -3106 -2737 984 1867 -387
435 -387 -709 318 572 763 1289 137 -1383 534 2912 257 -2662 1180 4656 -879 -6998 -2847
451 -2847 4409 1811 -4140 -26 6160 502 -8018 -4381 4619 3865 -1445 756 4132 -801 -5277
466 -5277 -1487 3073 2199 1367 2855 525 -4365 -3742 1823 1797 -2253 -273 4217 235 -6272 -3170
482 -3170 3726 1171 -4310 -244 5644 2132 -3071 -249 3439 323 -2596 1276 3951 135 -1624
497 -1624 1127 220 -5042 -4626 1322 2238 -2247 -1249 3579 489 -6403 -4749 4016 6687 2539 1103
513 1103 3452 1146 -4487 -3984 2154 5294 3051 -949 -3843 -4826 -3269 -1222 -1289 -329 3122 2235 -3507
530 -3507 -4654 1801 6293 1905 -2228 2264 6326 1306 -3885 315 4632 -762 -6988 -3222 3206
545 3206 975 -3404 -2117 -768 -3743 -4763 370 4971 3734 2465 2954 546 -3410 -1022 5285
560 5285 5584 937 -485 1142 -2738 -8120 -4732 2942 3011 -2685 -3277 200 -1579 -5388 -1171 6302
576 6302 5565 373 655 3603 1429 -1645 1585 4863 309 -4949 -2325 1569 -734 -4450 -2075 602
592 602 -3818 -6903 -160 7003 3768 -2468 -1048 2899 785 -1053 4401 9383 4344 -4147 -5504
607 -5504 -1510 -601 -1789 300 2326 -1323 -6265 -5756 -1404 1405 1962 2384 1936 55 -425 1439 3337
624 3337 3317 2506 1521 -362 -2216 -1483 498 -57 -2380 -3416 -2892 -2024 -1387 -82 1535 1536 -163 -1487
642 -1487 -529 2298 4019 3424 2323 1465 -222 -2233 -2242 309 2217 549 -2539 -3131 -2734 -2897 -1733
659 -1733 1445 3294 957 -1709 -994 908 1418 1924 3223 2509 -620 -2181 -378 1557 741 -375
675 -375 -774 -1925 -3497 -2431 790 1811 236 -944 -719 -875 -754 1216 3311 2512 41 -1025 -651
692 -651 -370 376 1875 1753 -206 -1613 -1656 -1487 -1258 -39 1159 221 -1138 -941 350 201 -17 992
710 992 1797 445 -1048 -242 1110 524 -73 753 770 -947 -1613 -274 635 -91 -575 32 -666 -1920 -855
729 -855 1659 1934 278 -468 -270 -826 -1344 536 2746 2074 -525 -1448 -445 -163 -345 775 1601 116
747 116 -2105 -1967 -203 355 22 173 758 -101 -1099 -500 618 879 283 -75 412 562 191 168 612 339
767 339 -380 -882 -358 157 -349 -671 -218 45 -429 -626 59 732 199 -370 373 886 -26 -557 588 1486
787 1486 477 -507 180 731 -809 -1727 -240 767 -391 -1344 -250 577 -703 -1179 561 1471 96
804 96 -715 559 1166 -48 -419 1231 1506 -81 -943 33 463 -959 -1291 209 319 -1069 -1043 362
822 362 661 -501 -269 970 909 -408 -132 999 867 -42 39 798 321 -884 -780 133 -24 -758 -910
841 -910 -273 -240 -688 -367 606 762 243 -82 42 209 527 344 386 494 56 -456 -430 16 188 -51 -329
862 -329 -423 -692 -836 -185 473 576 125 88 391 9 -142 527 946 488 -407 -426 367 117 -505 -144 660
883 660 -114 -1223 -786 185 218 -371 -21 507 93 -504 68 856 609 81 118 79 -437 -559 259 638 -26
904 -26 -507 -195 -151 -758 -647 409 726 -264 -723 -36 501 1 -60 739 771 -174 -822 -299 455 187 -155
925 -155 64 136 -423 -562 3 360 93 -152 -303 -421 -314 213 703 519 -75 -43 5 -100 -274 369 742
946 742 249 -575 -500 -53 14 -106 229 386 18 -822 -606 72 188 146 360 331 -172 -263 115 141 -39 -48 154
969 154 30 -364 -328 428 252 -222 -377 103 126 -243 -106 330 287 -232 -415 22 398 319 259 198 41 -304
991 -304 -394 -137 40 411 399 172 -390 -355 -96 41 -112 168 384 62 -408 -345 271 362 129 -48 233 190
1013 190 -176 -294 10 180 -105 -102 73 157 126 25 -136 -228 -148 -73 -1 -42 257 130 22 -272 -222 65 170
1036 170 118 260 302 -65 -386 -111 72 2 49 214 212 -242 -359 -111 36 -86 36 266 285 -79 -246 8
1058 8 102 -99 -149 171 162 -219 -244 -11 125 -71 -163 42 283 -26 -162 40 -124 -213 -127 144 137 150 183 80 -163
1083 -163 -296 -102 141 65 89 276 95 -177 -385 -97 119 -105 -31 76 145 -212 -289 -210 161 204 66 22 112
1106 112 -57 -331 -348 -87 89 111 -20 -9 4 -81 -196 -127 117 74 -29 -30 242 100 -126 -102 -27 -4 49 160
1130 160 77 80 -208 -176 -153 -102 128 249 201 -61 -215 -264 -152 -119 254 230 195 46 27 -172 -137 28 204 -49
1154 -49 51 124 35 -187 -163 -17 -15 -18 -80 248 13 -10 -122 21 -31 -72 114 327 174 -112 -125 -94 -19 -352 41
1179 41 265 118 -98 -137 -61 -215 -291 21 402 186 -180 -161 -8 -19 -95 209 326 162 -64 -114 -122 -12 -114
1202 -114 -113 135 30 -17 -82 -6 75 -5 -83 -128 87 193 32 59 -80 -219 -172 11 -7 120 101 -291 -161 -227 -147
1227 -147 -53 139 178 -6 -40 -39 -78 -21 7 241 -33 -78 49 59 -39 -178 0 42 150 -59 -27 170 25 -231
1251 -231 -17 183 75 -140 -32 45 -39 -93 -3 16 85 -57 -84 150 133 -9 75 68 -98 -115 100 173 -52 -195
1275 -195 -133 -60 3 -69 -90 105 -105 -139 -119 60 99 168 42 -70 12 -58 -24 169 93 20 -110 53 108 -35 -109
1300 -109 2 -35 -188 -109 197 109 99 -146 80 58 92 42 137 45 -206 -151 -31 74 116 -85 1 50 -255 -245 96
1325 96 103 -60 -74 54 23 -9 -34 160 181 32 -43 -46 125 65 46 -5 -55 -54 -200 -3 122 47 -96 -62 -2 27 68
1352 68 50 98 182 115 -101 -49 -4 8 162 38 66 -177 -237 -61 -54 -44 -7 24 -8 -109 -168 81 277 149 -14 139
1378 139 209 -16 -77 200 131 -135 -333 -33 20 -56 -91 24 42 -202 -261 17 330 89 -4 115 146 -147 -195 225
1402 225 248 50 -92 -183 -5 -285 -51 85 53 -186 -156 -21 -34 84 180 298 140 -105 -5 185 119 18
1424 18 144 206 -163 -131 -138 95 -4 55 -203 -179 -207 27 27 129 265 217 -48 -96 -68 122 328 72 87 -10 -172
1449 -172 -277 -49 -9 92 -29 -96 -41 -113 60 150 198 39 -69 -3 60 30 -15 204 211 -230 -114 -86 23 -40 -44
1474 -44 50 -71 -203 -187 -21 98 110 80 18 -191 -16 52 112 66 155 -5 -179 -159 14 159 6 -124 44 24
1498 24 -126 -307 122 242 38 -164 -74 75 25 -30 144 124 -179 -56 -17 203 15 106 31 -197 -281 -132 135
1521 135 154 97 17 80 -164 -293 -26 147 36 105 34 20 -140 -181 -34 243 -8 41 98 -93 -231 -62 80
1544 80 77 -8 -134 82 -21 -83 -13 116 141 -155 -91 67 140 -68 -64 -93 -111 -143 136 84 95 -24 -16 -214 -106 -93
1570 -93 59 149 28 34 -41 -166 -264 -27 169 154 86 43 -78 -169 -91 77 216 152 -110 -47 -124 -71 -138 -24 30 -18
1596 -18 -23 -84 32 -22 15 -73 -72 21 -33 160 114 111 -34 -95 3 -94 32 132 128 -63 -135 -271 -283 101 172 120 97 30
1624 30 -142 -175 -64 10 253 93 63 1 -75 -32 16 140 36 118 -55 -77 -57 -231 -43 67 41 -10 -4 71 -118
1649 -118 -23 73 -53 -79 11 182 165 85 57 -48 -114 -249 -152 111 153 209 61 -103 -205 -75 -35 111 169 79 -102
1674 -102 -103 -197 50 130 242 64 -47 -249 -130 16 -22 -28 -31 9 -119 -71 54 16 -6 -111 20 -29 -19 43 61 111
1700 111 -161 -92 -5 73 8 56 104 -54 -256 -156 -82 1 4 3 147 -123 -103 -38 55 189 83 299 81 -108 -94
1725 -94 -31 58 -52 -39 56 -5 -46 -48 36 88 -24 -65 66 -74 -133 49 114 68 -2 18 18 44 92 111 75 -151 -197 -24
1753 -24 57 38 75 63 54 -107 23 134 180 151 182 87 27 -13 46 -7 106 -17 -169 -68 -16 -109 87 20 -176 -97
1779 -97 23 -135 0 180 0 -85 -109 -98 71 88 115 -17 87 -35 -80 65 -23 89 36 -24 -124 -128 -34 147
1803 147 -19 16 -35 -63 -69 -22 -47 148 62 -4 16 -118 -133 -28 55 77 26 -132 -129 -25 -59 46 0 3 -105 -117 10
1830 10 -86 1 70 31 -63 -50 16 140 26 -87 90 46 -136 -129 160 152 6 -160 -26 -50 -71 97 47 -12 -207 -218
1856 -218 146 0 -86 -41 98 43 -52 -57 135 34 -29 -19 -34 -83 -137 -121 37 -35 -172 11 -33 -53 22 134 137 105
1882 105 -63 9 -32 -19 -61 148 -1 -10 -108 134 26 9 -38 11 -15 -48 92 -56 109 99 -76 125 -33 5 -41
1907 -41 -91 47 -17 -101 46 -41 -125 68 63 19 -92 -5 23 -21 -3 -23 -43 76 57 -5 126 138 164 -25 -30 -41 -37 -41 -36
1936 -36 57 147 -99 -50 -73 -6 -54 14 114 28 -132 58 116 143 -47 74 3 -56 -73 113 76 -125 -75 43 92 -272
1962 -272 -31 73 16 -111 -53 -28 -57 -116 32 113 121 -23 -87 -45 32 64 -21 51 -89 -122 -50 69 70 -59 13 -76 -198
1989 -198 -45 185 38 95 9 -69 17 -23 -94 -38 65 83 -66 -28 61 -21 -50 112 159 -122 -21 81 84 -66 65
2014 65 25 -24 -148 -64 142 17 0 84 -1 50 -160 -79 -8 -56 -40 -9 70 -9 -25 -52 -18 -54 74 -2 -12 -17 -116 45
2042 45 -66 -93 -11 -2 146 9 -40 -67 26 -131 -109 50 167 124 80 68 -60 -33 -62 108 208 100 27 65 -105
2067 -105 -127 -14 25 -69 -84 -9 -16 29 -53 90 -26 -32 133 -52 43 -72 -28 20 3 22 126 46 -43 -65 34 30 -23 55
2095 55 -28 72 35 -55 -22 -20 -92 14 11 19 117 -27 23 -23 71 76 109 46 78 -79 -63 -113 -147 -46 -51 22 -33 31 -47 34
2125 34 -100 52 -72 6 30 96 -118 -52 -61 -88 -126 -16 98 73 -59 -15 12 1 -37 39 72 17 -46 -70 56 25 42
2152 42 82 100 59 -4 13 73 8 -90 10 81 57 21 -56 14 -71 -70 -41 31 -31 26 109 10 -102 -14 131 14 161 9
2180 9 -46 -100 26 -110 22 -39 16 87 26 -112 36 -48 -116 -8 -39 -4 22 16 -52 4 11 26 13 4 -29 -76 -49 -87 -66
2209 -66 -145 -21 -68 16 46 -54 -48 -33 -8 -134 77 -25 -44 -9 80 19 88 -28 40 37 -35 -5 77 -18 21 24 1 43 139
2238 139 -65 -81 60 -39 22 17 41 -22 -64 86 85 -1 -20 13 46 102 3 -47 -54 -41 -151 23 -19 102 -16 115 33
2265 33 -99 29 11 98 6 -14 128 -19 69 149 34 55 31 49 -38 28 124 4 46 -31 -58 -36 -96 -35 -11 -24 -5
2292 -5 1 2 27 0 -59 -46 -80 -81 26 -7 23 64 -41 -90 -38 48 121 27 -14 -62 95 3 -7 -16 105 -32 88 70 26 71
2322 71 0 16 1 47 70 -49 -74 3 9 -14 -7 6 73 22 -117 21 40 -11 -46 29 0 13 -4 -71 34 -167 -93 -19 83
2351 83 -52 33 7 -15 -33 -91 29 21 1 42 -79 -51 46 19 -11 84 43 3 -29 -11 6 41 -55 -124 -79 -32 58 -47 8
2380 8 -96 39 -78 146 26 110 -75 5 23 17 25 8 -50 114 -68 -77 -44 28 -117 -87 84 72 121 98 -3 24 -26
2407 -26 78 -25 -32 83 -34 49 -29 66 6 -10 22 -32 -5 -76 -24 -10 -101 25 72 7 107 6 -32 25 33 -72 110
2434 110 -67 -36 65 -18 -83 -64 84 -30 46 -44 -57 -29 -10 20 31 -55 67 -5 -34 -87 179 57 -20 44 -65 -2
2460 -2 -10 -21 -27 -9 29 -66 48 -52 -99 30 33 -31 -21 10 17 29 30 14 8 -34 -13 22 -70 34 -81 6 64 -28 -177 7
2490 7 120 -14 -19 -11 15 -34 5 -4 -42 -30 75 92 -15 52 113 -1 -51 -53 1 33 106 -26 117 -62 -101 -135 13 169
2518 169 38 -35 -41 10 -74 28 123 48 30 67 -50 -37 -88 8 5 51 -21 30 0 -42 -57 51 86 -10 -11 -44 51 18 87
2547 87 54 136 11 -75 10 86 -1 24 -13 -74 -72 -2 6 -30 11 -96 -66 -49 -1 3 -19 22 36 -80 -54 -53 -40 -10 -50 84
2577 84 -21 12 24 -72 25 -23 -54 68 47 -25 -67 0 30 -91 31 -79 126 -77 16 -90 -70 -7 2 -23 -65 -21 -3
2604 -3 -20 56 -23 -94 82 52 -35 -77 27 58 45 17 -28 -27 94 0 94 75 11 32 -61 -57 -17 -28 92 -24 -56 -42 -98
2633 -98 29 28 158 31 -51 -100 11 128 6 -29 59 -141 -147 -14 -30 -1 -47 -38 60 -63 -8 -40 23 20 -68 -20 36 97
2661 97 35 -13 -17 -121 -25 -13 -26 -87 106 -62 -1 -77 22 12 -73 -128 89 -66 49 65 -30 -15 -84 -36 -1 37 -138
2688 -138 -40 -88 -210 36 -39 -34 74 -94 -92 74 38 -83 106 -56 41 14 64 42 45 -82 -79 32 -5 84 3 -47 -105
2715 -105 0 71 67 -88 -1 59 63 -50 -40 35 -202 -57 -29 77 51 5 -29 82 -32 -62 2 1 -63 42 58 95 4
2742 4 65 -10 7 35 -37 76 53 51 52 -1 27 43 -10 56 27 -13 44 99 72 -75 12 29 79 2 87 0 0 72 -31 -68 -116
2773 -116 31 67 -58 40 69 -8 11 24 62 53 -4 -22 -19 -19 45 32 144 32 -35 15 125 -94 -74 -15 -69 -125 21 -64
2801 -64 42 63 32 -3 56 -95 -49 14 -43 -103 -20 93 -29 223 -55 -34 -76 -189 -80 14 -82 0 -20 -22 68 -26 73
2828 73 -67 19 -105 -1 15 46 -4 -138 52 69 -9 -18 44 -60 0 26 -63 19 30 -101 -34 -56 2 -63 -2 -79 -73 -26
2856 -26 -151 -91 -120 34 -134 -110 16 -12 22 70 54 20 -47 -36 -61 100 -54 -107 8 -22 -82 -46 32 27 27 117 40 -54
2884 -54 -38 6 -21 69 122 -52 64 -14 141 -13 73 -25 26 16 37 -140 1 89 -45 32 53 67 23 -45 64 98
2910 98 80 -51 84 -15 -24 -6 63 -42 -120 -36 -111 139 -84 0 -25 -36 33 -95 -25 27 18 -56 16 -44 -17 -12 -90 -44 14
2939 14 -133 -88 -69 -125 43 5 -94 44 -11 -61 -19 44 14 -81 -3 36 39 31 -68 64 -9 0 30 3 44 -132 16 -27 50
2968 50 -27 162 -127 -23 62 -28 -36 -6 -9 -50 22 -31 4 -15 14 -63 44 -92 0 32 38 -73 13 28 -3 -16 37 103 10
2997 10 3 -34 -40 16 31 13 -14 92 35 -30 11 -53 -46 -11 -104 11 32 88 81 -28 -4 -13 -184 16 -105 -60 15 42 5 -15
3027 -15 -18 1 58 8 -120 -13 3 42 124 30 -72 23 -6 -6 -15 -18 90 -79 -49 99 -74 14 -50 82 48 -32 5 -108
3055 -108 3 -19 -144 68 28 -79 93 80 -79 -18 52 -28 -60 7 -90 -82 -54 -103 93 99 -7 174 -1 61 -37 24
3081 24 50 35 42 -8 -17 19 -24 97 29 0 47 73 -7 -99 -36 -39 -61 90 93 -65 28 46 19 -15 -21 30 -18 -21 41 -27 -17 -33
3113 -33 113 -43 -59 -56 49 -106 1 5 -90 -59 -133 47 -20 -81 41 38 36 71 -39 33 -26 -4 -60 -9 -11 144 -64 -11
3141 -11 59 -60 -28 14 11 -20 74 -44 -74 -57 10 139 -32 38 22 -60 -34 -86 145 -17 -47 93 -17 -6 -28 91
3167 91 -40 -60 121 47 -8 15 5 -46 58 -67 16 -68 -20 65 -77 28 8 43 -11 9 66 66 -51 0 -47 39 58
3194 58 -61 21 30 -59 79 -33 45 36 -61 -1 4 19 -30 25 95 20 27 -27 41 -4 43 132 -72 60 54 23 -20 48 -19 2
3224 2 0 22 -13 14 5 24 125 74 -70 1 175 4 37 -43 24 98 -32 -125 5 22 63 86 151 -33 -26 -43 109 -94
3252 -94 -29 -95 -4 70 6 81 64 -65 -27 27 -13 136 -59 164 -29 -77 -5 75 2 43 89 -70 16 35 147 -75
3278 -75 0 78 50 97 -39 42 -97 22 -38 34 -29 21 5 -19 42 46 0 24 40 44 23 2 43 83 52 118 -10 -61 90
3307 90 -27 -4 51 -14 14 -71 21 -26 -32 17 -53 9 -69 -14 94 77 -45 65 28 -49 -19 -104 -6 -55 22 -65 92 30
3335 30 -86 50 -94 31 5 128 19 82 55 -72 -81 15 18 -22 49 -54 48 50 -62 109 38 -54 -86 -72 84 41
3361 41 -32 -135 -31 -32 17 108 -43 -98 -30 1 63 -79 99 28 -43 -40 16 -17 -25 65 42 19 -20 31 94 -8 12 -19 13
3390 13 -24 83 11 24 2 -52 28 -26 1 -66 -54 5 29 -7 -29 -38 -20 -1 -3 46 38 -41 3 31 -46 -115 25 -108 135 67
3420 67 67 -31 74 53 -53 62 -39 79 44 94 102 -17 -84 -22 -79 -5 -13 -72 -28 7 13 -45 -120 38 16 -23 57 24 -44
3449 -44 -13 18 -6 -11 -24 11 36 12 88 -36 -43 63 -36 -104 -71 -41 -54 -59 123 -32 -88 -55 20 34 2 36 149 -69 70
3478 70 37 -68 24 36 -13 35 127 -84 -103 -16 -49 51 -49 33 -86 -3 41 -33 -93 31 89 5 100 -56 -2 -88 60
3505 60 9 -88 75 106 -1 -52 -40 84 15 -42 8 17 -43 2 -92 72 -23 46 -6 -91 37 -57 8 -70 -92 44 -171
3532 -171 -68 -4 -1 -15 -107 13 2 -37 13 60 3 75 -73 -87 1 -57 198 -86 -92 -33 17 49 31 -58 83 61 -22 -53
3560 -53 -22 68 58 27 50 -32 -109 112 -1 123 5 49 -107 -26 -24 70 38 -47 -7 -43 -74 146 -27 -142 65 31
3586 31 35 -37 34 20 14 53 -68 -35 -28 37 38 -125 -30 70 48 8 -44 -70 -34 109 -7 23 76 -10 33 -46 39 30 -11 24
3616 24 -35 -194 -6 43 -1 -78 -96 -64 40 -59 -28 -46 -96 -33 26 16 -17 -20 45 83 58 97 42 54 -2 -23 -26 128 116
3645 116 47 85 -65 15 -43 24 63 84 -31 37 75 68 -64 30 59 -125 -9 1 -64 -84 -109 29 100 87 -30 -62 40
3672 40 -5 75 -27 -77 -116 45 0 -63 -90 -16 79 46 64 33 64 34 13 99 124 25 -163 10 10 45 36 -120 129 26
3700 26 -42 16 -36 -34 -82 13 2 -42 -14 94 9 -37 -98 81 76 70 -94 -12 -145 12 -31 -50 23 -11 -20 48 -62 -42 -15
3729 -15 -31 -6 102 59 50 -51 -17 81 11 -56 -46 58 140 77 46 2 -24 -82 -68 22 29 79 -45 48 -70 -2 68 23 -29
3758 -29 -112 79 -79 32 89 33 -25 22 175 -133 47 20 -110 1 -29 -44 10 -32 -64 -55 -4 53 -74 82 86 20
3784 20 137 33 33 63 -22 9 -117 -104 11 127 -22 -55 -46 -68 -38 -56 46 3 84 55 -7 -112 29 -48 -62 34 51
3811 51 90 30 -10 16 -95 128 -65 21 11 11 25 21 14 33 61 91 93 -30 86 35 -13 27 12 -73 45 39 67 49 -62
3840 -62 -96 -9 19 63 127 15 -109 -133 28 13 158 -16 25 69 3 -34 69 1 -3 -54 27 -24 -59 -9 108 22 37
3867 37 -76 56 -32 25 118 45 -66 61 21 -35 -58 -79 -59 65 2 19 46 128 42 164 7 -54 209 16 0 -56
3893 -56 60 -4 46 -111 5 49 35 12 -86 11 7 25 -17 94 4 1 -9 -47 100 39 28 71 -44 22 -18 29 -78 -59
3921 -59 68 35 106 83 133 -21 -19 -67 -81 -110 -90 -63 -61 1 82 17 -36 69 28 106 22 40 74 -61 -65 93 2 -23 18
3950 18 -49 10 106 97 -21 -47 5 43 -34 -108 68 -27 -67 -16 31 69 2 14 -29 -92 -70 35 -10 28 47 13 46 -69 -36
3979 -36 88 137 35 20 -18 -53 -5 35 -67 -58 10 -4 -48 9 -110 -74 -10 -66 24 63 -22 84 -57 -78 -25 -22 72 38
4007 38 0 31 -9 -10 31 -84 17 25 -12 -21 49 -3 14 153 -36 -33 1 40 -14 26 102 152 -45 -39 -6 -29 65 -74 -136 -55
4037 -55 21 77 -4 30 43 7 -102 -30 -78 -91 15 1 15 -143 33 70 12 38 14 36 -57 -56 -26 126 -24 -67 117
4064 117 84 14 64 -76 -77 116 -9 -26 -11 -4 -14 -57 20 -21 28 -34 -26 -10 -30 4 6 89 -29 52 -36 80 -40 -51 -13
4093 -13 -1 59 -87 70 68 21 -16 -43 24 -27 -2 21 22 -6 5 -123 55 38 44 -39 5 -51 77 131 -23 7 -30 -72 -12
4122 -12 21 -57 -64 -17 -18 -75 29 -35 82 -40 -8 -19 -63 -12 -9 -13 -66 95 60 -63 -11 -31 16 -32 22 -71 58 40 -57
4151 -57 -9 4 0 -81 -64 58 31 53 41 -43 -107 26 -16 -106 59 -27 28 77 65 -21 -9 -56 -58 25 -48 -56 22 62 69 -30 -99
4182 -99 -48 113 60 26 18 20 -112 23 -24 -18 27 -12 -47 -77 99 4 63 -24 39 23 -14 36 31 19 53 -31 39 0 -81 -6
4212 -6 -58 -112 -25 3 78 -84 -18 149 55 41 76 26 34 -20 -49 5 4 -95 38 86 -79 9 -27 24 42 93 -18 136 -5
4241 -5 -103 41 3 29 76 94 16 -59 -25 -19 -11 -51 -47 21 36 -68 -56 25 -23 -155 100 9 -11 67 -31 -128 -2 -49 49 -32
4271 -32 -49 17 -101 83 46 -53 -98 -42 -2 -10 -179 31 -30 -57 7 -3 -6 -75 -53 -37 -3 -153 24 32 -44 -17 -155 -64
4299 -64 63 -13 -69 -57 115 -23 12 17 -31 -2 -157 -58 -96 -21 52 55 30 45 23 -49 -31 76 -16 23 22 -22 -50 -45 -58 92
4329 92 49 49 -88 -43 35 47 85 61 -48 91 -32 -44 -15 -76 30 -101 -16 156 -107 -125 -72 -139 -15 -46 104 48
4355 48 -36 56 79 -12 -75 -46 40 21 -158 -115 97 -22 128 -8 51 -7 67 74 56 4 25 34 -83 85 60 -45 77
4382 77 -101 -16 30 -27 59 110 26 -109 102 -50 68 113 -60 -14 -7 127 72 0 42 -22 65 54 -45 -129 72 108 38
4409 38 -86 -76 -27 28 -10 40 -108 17 27 -14 59 8 -3 76 -32 -8 9 -21 92 -24 -66 -109 -6 16 13 -8 -81
4436 -81 -15 41 -24 -64 -32 -54 65 3 -115 23 2 33 51 57 21 -38 14 9 56 -24 83 14 -112 -111 -26 66 142 -50 -39
4465 -39 76 -45 98 -113 16 6 90 29 -78 1 -17 -19 -51 -64 -9 28 -51 -13 -121 28 48 -36 14 41 -9 6 -19
4492 -19 -58 69 -29 -21 -106 -111 -110 61 -27 -75 -4 107 73 2 131 144 -115 41 -31 -40 -71 -58 10 -69 48 -83 -42 -76
4520 -76 -74 -29 49 -12 10 -7 -28 -5 23 -20 -54 -12 47 87 -54 74 47 -34 48 -1 28 91 -107 -25 -36 44 69 50 -21
4549 -21 83 -35 86 68 109 30 -52 -110 4 69 74 12 4 -120 129 -24 -86 55 9 22 -83 53 -6 112 -35
4574 -35 30 49 19 24 136 44 9 53 50 5 -63 -47 -3 71 -21 -68 16 56 -61 -42 30 90 7 -13 -6 -23 68 -49 0 -34
4604 -34 20 84 -22 57 -17 -20 19 -24 -55 22 -75 -10 -4 44 -108 96 69 -39 65 -53 -46 105 4 21 -84 -37 -101
4631 -101 -37 -50 -6 70 16 104 64 -7 -4 41 -74 44 56 89 -24 -57 31 -31 -1 -59 -130 54 -42 133 16 -59 33
4658 33 -70 28 9 -12 -20 51 -89 43 -24 -45 18 -49 17 -88 66 52 -93 -44 85 -145 74 100 -81 -13 -89 -53
4684 -53 14 -27 -65 -54 -47 -35 68 -82 161 -19 55 -101 -36 36 3 -22 -59 -62 -50 68 99 -116 51 69 -7 2 46 15
4712 15 37 52 106 -26 -2 -18 -104 -22 -21 -77 -68 1 22 79 -49 -43 -3 -2 40 95 21 25 -19 62 -39 -33 -62 121 -19 11 -97
4743 -97 110 -9 -29 27 -55 2 -70 66 51 43 22 6 -77 24 128 -27 -26 95 -102 -27 41 -79 -45 62 -20 111
4769 111 26 102 36 -1 38 13 121 -101 1 -17 58 -26 -11 -39 -78 -56 3 12 22 13 66 138 -103 -10 -39 43 -50 -86 85
4798 85 55 -17 20 91 -2 -51 13 -81 61 26 -12 -3 97 93 -29 80 -35 -89 -87 -3 10 31 -41 -18 -28 -8 -78 -31 -25 -38
4828 -38 -37 -70 14 -23 -81 -36 -28 -13 36 35 -4 -40 115 -102 71 39 -116 74 -28 -16 62 -12 11 -75 71 35 -108 -66
4856 -66 72 -14 -106 67 -50 58 -98 44 -61 -81 91 -27 23 2 -91 45 -39 -34 46 16 13 23 3 -33 35 -24
4882 -24 -1 -102 37 -88 17 26 -22 -18 72 -72 58 47 -52 60 -128 -41 -108 8 -25 -78 53 -23 128 18 38
4907 38 -55 -119 112 -115 -20 -16 17 -39 -5 -48 41 118 62 -36 -7 -139 55 -53 109 -102 28 87 -22 -7 68 54
4933 54 40 -25 -127 19 22 32 40 75 -87 101 -21 -26 161 -163 65 -62 20 31 -104 -29 -19 99 -58 -94 16
4958 16 -69 -79 -54 -28 13 42 87 102 1 -81 45 115 66 -50 4 -37 -20 -69 -5 -56 66 22 -103 -30 -45 67 41
4985 41 -11 -47 -16 33 -48 18 0 -25 -69 -24 -34 -48 -2 89 36 -92 -5 51 -4 13 5 -18 -32 25 -7 19 -95 -81 55
5014 55 24 -3 70 -108 -54 -40 -86 6 13 28 5 20 40 -49 -8 -13 -14 -9 24 -46 22 30 -19 69 -16 -102 35 -97 57 131 88
5045 88 -74 55 59 -54 46 72 76 68 -3 -19 35 110 8 -21 -48 -34 -67 -32 -25 58 101 37 47 7 -36 -103 -94 -54 -28 6
5075 6 66 44 0 60 -100 -60 -92 -29 79 40 59 -2 -10 -5 111 101 63 69 -10 95 -43 -32 -23 -29 -12 -48 -19 -71 -89 75
5105 75 -75 -11 21 66 -11 26 51 18 14 -126 92 -61 -13 -9 5 106 31 124 -25 -20 18 14 53 45 37 10 58 -71 -162 72
5135 72 0 47 48 -81 34 -27 -17 20 33 -17 91 -30 -80 -17 -30 -82 -45 -48 -22 -25 -3 89 71 -22 -28 -43 25 -94 -59 -91
5165 -91 -10 -90 59 18 62 -18 9 30 -37 -30 0 -16 -11 -32 43 -68 31 -12 -50 102 52 11 64 23 4 -41 4 93 44 -76
5195 -76 -73 16 -47 -17 38 -20 -22 -102 -89 -29 -2 83 9 -26 -76 23 -47 -35 37 -104 0 25 1 -43 -79 -54 40 29 95 -19
5225 -19 25 16 -39 -16 45 -25 101 66 66 -8 -61 54 -47 45 67 37 -11 -70 13 -83 -15 -33 -86 -3 -85 86 -29 2 1
5254 1 83 8 23 -55 39 -71 105 84 -25 37 -47 91 32 67 -17 12 -56 -26 -3 -11 -24 -60 -36 60 140 -11 -8 60 -41
5283 -41 4 -100 9 -70 36 -20 -85 -90 41 6 -27 41 15 -56 35 7 -49 28 7 -41 19 0 -108 -91 -1 -30 -123 -31
5311 -31 126 -73 -10 56 -30 -52 -61 14 -109 -41 9 3 -17 170 -29 60 116 79 -40 47 -82 43 32 78 -32 -25 51
5338 51 -36 -44 5 -62 -30 173 49 -63 122 -16 19 -111 -20 20 -24 76 -93 86 203 21 -55 -1 6 -19 -52 -43
5364 -43 -25 0 45 -40 55 74 -67 -98 5 8 -29 40 -43 -28 8 4 -61 8 -12 17 39 15 -4 26 120 -42 -37 20 -111 4
5394 4 36 -53 -40 106 -110 43 -68 -7 0 -47 51 -43 -112 64 -3 108 31 -56 -13 -40 -29 1 -17 54 24 -25 -46 -31
5422 -31 -51 -55 26 -75 -55 -90 47 40 -130 -16 57 55 -48 -37 67 9 -108 70 3 -12 21 -26 29 37 -15 -177 -70
5449 -70 70 14 34 71 24 -16 22 -21 27 -7 28 -42 50 -75 -12 52 35 -16 4 7 -17 -65 63 44 12 -89 38 129
5477 129 64 -81 -9 66 90 -25 30 84 22 56 65 -6 96 48 70 -94 108 -105 74 -21 101 26 -42 -102 77 -7
5503 -7 51 -48 -27 -13 -68 -90 -4 -41 51 -34 25 65 -8 -4 -31 126 -124 -37 27 96 90 -13 -73 26 29 -73 -85 -34 -6 167
5533 167 23 33 -23 3 65 -27 -57 -69 16 56 -29 2 29 -31 9 -47 -18 -10 -18 27 16 42 1 0 -83 40 -72 170 95
5562 95 -63 -46 138 -25 6 -1 38 121 56 -73 -52 -16 -31 -52 4 -37 8 -27 -161 -58 -60 -40 101 -41 -95 -33 -51
5589 -51 11 30 48 -2 -1 15 -6 -3 22 95 35 40 5 78 61 43 134 35 -63 61 92 72 0 40 36 86 30 -47 71 49 46 63
5621 63 33 41 -27 8 -60 -50 -119 -27 30 -44 21 -7 -19 96 108 66 -52 52 18 61 93 -27 26 59 79 58 26 -8 55
5650 55 -35 40 29 68 5 12 -55 30 -23 22 18 35 -18 -32 -1 111 -26 -111 71 27 58 42 -35 -27 38 -97 -31 -117 138
5679 138 -87 13 24 -46 106 26 32 27 1 36 50 -11 -1 -13 113 -127 -44 48 -12 42 -61 -63 14 18 -9 -34 73 70 -5
5708 -5 72 43 -142 12 99 -27 -41 79 5 50 -67 -25 42 -80 43 35 29 37 -17 57 -56 1 13 -34 -18 -16 -85 3 -24
5737 -24 1 -62 82 18 -42 75 73 -34 -19 10 94 -32 17 43 43 -67 15 83 -37 -44 54 -18 -17 78 -3 -85 16 54 39
5766 39 5 81 -92 -8 -1 -38 12 9 32 90 -74 -21 46 56 61 -22 81 127 -9 27 -64 25 -62 -53 79 -112 19 -24 39
5795 39 -12 -18 -13 -13 -65 -9 -60 -126 -164 -45 -93 30 77 -9 19 50 34 -86 -10 -55 -56 -57 -31 53 29 -35 55 -32 18 -23 2
5826 2 -24 -28 -121 113 -57 -38 -21 -32 11 -90 0 -99 135 -7 -14 70 -78 -32 33 -1 97 -47 33 96 -83 -86 -31 -24 -41
5855 -41 32 2 0 -53 36 -9 41 -18 67 26 -38 61 69 69 -80 20 -23 108 107 89 2 101 45 70 31 -65 -160 24 8 53
5885 53 -17 -41 70 -14 27 8 -35 1 -45 -81 -49 -50 -36 44 7 -13 91 12 5 -39 -94 -89 17 78 -22 26 -71 -19 23 29
5915 29 55 82 56 -4 78 -43 19 1 -62 43 -43 -71 -93 -73 32 -11 85 27 -17 51 18 -74 70 106 -92 -50 -62 -16
5943 -16 -106 104 -51 -32 5 -79 94 104 -96 65 -56 59 56 -24 97 -27 6 -86 -41 11 -64 -62 -70 53 71 -112
5969 -112 -83 2 -99 25 -71 95 73 -57 -13 -12 -47 -31 28 -78 -55 -3 -29 -50 14 -30 -20 20 87 -71 25 78 -41
5996 -41 -46 38 30 35 65 3 -54 67 8 24 -117 141 -66 -55 21 -14 121 -63 -170 17 15 -50 90 55 55 -74 -1 -77
6024 -77 83 -17 -19 -3 53 -48 -44 -6 -72 26 -28 66 -59 78 39 -4 6 4 -69 -25 -100 77 -45 -12 4 3 -58 90
6052 90 -74 -5 35 37 -71 -92 -1 31 -5 10 -60 16 102 -33 30 -81 102 77 64 -38 43 44 68 39 -17 -32 -41 22 30
6081 30 10 -34 -12 29 55 -38 -55 -80 67 13 24 -113 21 -6 25 113 -46 -88 54 40 -74 -32 -1 -71 43 30 14
6108 14 -142 39 25 -98 -52 15 46 -98 -10 -15 129 13 60 38 111 118 -22 17 -3 -42 62 -67 -6 -22 31 -75
6134 -75 9 -111 111 79 -27 59 -65 -67 95 24 -7 -11 -179 -14 45 -14 51 -43 4 6 -14 119 -7 8 36 -3 51
6161 51 -92 89 66 82 -65 85 -81 10 -129 14 -6 24 28 46 132 -77 0 34 -4 -52 -50 9 88 31 -40 -37 -32 4
6189 4 -18 -14 -60 -123 52 -13 45 -22 -14 -7 -38 -26 -138 89 -1 -69 11 44 -21 43 -53 47 86 9 -34 -68 -26 10 -50 -86
6219 -86 -136 -54 -56 -14 -89 -57 -91 2 16 76 4 -77 65 -13 -69 -16 -20 71 -24 29 24 50 77 -63 120 -56 111 126 -33
6248 -33 -60 -16 11 -87 -21 -49 -39 94 101 52 1 -4 49 -46 -49 -140 23 -1 26 -38 11 -95 -30 -46 27 -12 -61 -34 41 -26
6278 -26 -11 8 36 6 26 38 73 77 20 14 50 135 -10 11 37 6 -32 -27 36 1 12 18 -64 28 -84 -25 -137 -26 102 -47
6308 -47 59 -97 38 -115 2 11 25 56 20 54 -101 14 -55 -31 26 146 -29 6 -67 91 -125 43 35 -31 -27 -84
6334 -84 87 58 6 6 66 39 28 -99 0 -37 103 -36 50 52 29 -42 -65 -87 -81 24 32 111 8 -132 13 86 -148 10
6362 10 75 -30 -93 8 50 -99 11 29 82 -19 65 60 -31 -10 -63 77 -44 -25 73 -44 -44 34 -15 11 87 -36 42
6389 42 24 22 17 -11 -62 68 58 5 26 92 24 -39 -6 45 47 22 32 57 -31 126 28 8 26 -182 101 21 25 19 41 -29 -87
6420 -87 31 -62 -11 29 5 88 2 41 68 72 50 -59 12 59 -67 67 46 -82 -42 -27 5 32 14 -24 20 1 -26 9
6448 9 63 -23 -42 99 8 29 35 -49 -11 33 -68 4 7 -40 51 -16 -176 -69 -26 -32 23 27 -22 -89 23 -28 45 -8 -72 -31
6478 -31 43 -35 -62 -16 150 29 55 18 -54 -23 12 17 -86 13 -14 8 -139 -81 80 51 -88 3 -32 -113 33 -89 -59
6505 -59 -20 30 -80 31 -34 7 66 -112 -48 -4 -12 -9 37 99 -10 -28 59 12 103 55 -143 56 97 -103 97 95 -75
6532 -75 57 116 16 26 22 24 0 34 6 104 32 38 32 -107 -26 -26 4 -120 -17 4 3 -24 19 9 -82 -63 33 41 30 141 12
6563 12 27 -59 17 -29 -33 16 -108 99 22 -65 23 58 37 141 -51 49 -70 -137 46 -1 7 20 -78 3 -21 -66 -31 93
6591 93 -2 -40 18 57 -201 -108 -26 -111 34 -70 -56 22 -54 -56 -17 -23 55 -2 -82 -88 -12 -12 23 -18 -21 -20 2 -18 145 63 -117
6622 -117 47 56 -15 21 14 -21 -10 94 39 6 47 -74 -40 -65 170 16 -21 -27 20 -99 69 -65 -4 17 2 70 22
6649 22 10 25 -47 -32 -18 19 -34 -16 -4 22 16 66 24 122 51 88 33 -57 -28 -41 72 -3 -36 -49 -18 92 13 -144 18
6678 18 -79 9 20 0 -52 0 -4 25 19 31 24 -71 -9 41 -86 24 -97 2 38 16 -13 91 5 -1 43 16 -25 -17 -1 -59 46
6709 46 49 20 146 27 22 74 -24 106 -12 9 -33 2 -6 -8 -56 41 113 -51 25 -32 72 140 -67 -36 -11 54 19 32 35
6738 35 -13 99 73 -47 -75 -9 -41 20 -79 -85 -58 11 29 -13 -51 43 -24 67 76 24 94 -85 -9 -1 -39 -21 82 45 -13 -63
6768 -63 -35 -1 -48 15 -59 1 -132 -9 -63 -108 55 -58 -3 -7 28 -89 95 -32 -18 -5 74 65 -18 -50 -11 -57 97
6795 97 -28 -15 75 24 -90 -75 -13 54 -95 37 135 -19 -34 -61 -26 10 -56 -42 -10 2 -60 70 -16 -2 14 41 69
6822 69 -10 46 -37 0 -55 -41 -102 -71 -112 39 91 -16 28 -63 -127 -20 -35 -43 -3 60 54 4 -72 28 134 6 44 84
6850 84 33 72 -14 62 5 -2 -34 57 82 -129 -35 114 25 -35 75 -46 49 -97 120 84 -59 -110 52 18 -37 67
6876 67 -24 18 26 4 50 -34 45 56 -62 -8 -8 19 57 20 10 85 4 -10 -126 84 -44 39 17 97 -32 35 5 -30 36
6905 36 9 3 -26 -29 26 21 -85 -7 -34 -13 -1 -32 -74 -1 52 40 27 -43 29 47 6 63 -47 100 -3 -24 17 46 -123
6934 -123 -31 25 45 -15 7 79 -5 4 -124 7 -23 43 1 -167 -29 36 65 -6 -29 -9 49 -81 -29 -85 47 -58 76
6961 76 1 38 -70 36 45 -64 29 0 -3 -29 44 40 79 -12 17 76 -29 -39 -37 105 26 -4 132 87 -98 44 -19 2
6989 2 -33 93 -73 -18 -2 80 2 77 -36 -10 67 109 -57 62 -80 12 26 18 48 -14 -24 -132 58 -96 33 -43
7015 -43 -94 -64 30 15 46 -12 -25 -23 69 -68 37 69 -52 -31 -11 79 -5 66 -178 -61 -37 -27 -81 10 -12 -15 45 85 -37
7044 -37 -36 -65 89 -91 52 -24 56 -12 53 -77 12 134 16 174 126 -71 -71 19 -110 -61 83 26 138 -16 -45
7069 -45 -30 -27 -3 -58 18 40 -17 -76 52 73 -19 81 -81 61 -37 11 9 68 22 -25 107 -110 24 -41 71 8 95
7096 95 44 -15 36 3 128 80 33 -170 -87 -83 11 -42 -22 24 7 -15 -68 -43 -96 -22 -122 62 -47 199 -68 49 -24
7123 -24 68 -26 -31 18 11 -19 -42 44 -9 -20 39 -32 18 -75 -141 22 72 -20 -48 27 11 -73 95 103 -67 59 -19 29 -9 43
7153 43 -17 41 -21 -48 -3 -21 -54 -49 -38 -32 27 -22 -162 -97 177 -36 66 -38 28 -22 -82 -17 21 -44 -41 -46 -53 67 27 -40
7183 -40 83 34 9 -40 -22 43 -70 41 13 27 -101 0 12 93 -23 -5 59 68 38 -5 38 6 -5 -62 -2 62 -27 -107
7211 -107 -76 -40 -65 24 46 4 -63 10 -20 20 87 -34 41 -55 59 -32 12 189 3 -17 92 -30 31 -95 12 63
7237 63 -4 50 95 37 47 -33 3 54 -13 35 -43 -27 8 -21 47 7 26 -25 -3 -25 -96 138 -17 -107 35 95 22 24 17 -124
7267 -124 18 40 -67 22 29 9 -21 -36 96 45 -58 12 20 29 81 61 20 -1 -12 -49 -83 -63 7 -61 9 11 25 27 32 -29 53
7298 53 -42 -93 121 8 34 116 -4 51 71 53 1 33 -66 -54 6 -22 24 -7 23 -11 41 -39 80 -17 -34 9 21 35
7326 35 69 129 37 32 -73 -32 81 36 32 -12 -142 -24 -17 69 43 2 -15 -35 -73 -9 -86 60 -5 22 12 -39 38 32 41 63
7356 63 39 -83 83 -37 -87 -9 -41 50 70 22 -73 62 -13 -31 -21 -71 9 2 -14 25 -63 -14 33 -99 7 40 -35 -11
7384 -11 -43 -65 -16 -47 102 -20 -74 -65 -21 -14 90 59 -83 50 -1 7 73 -62 -31 25 48 -40 140 28 28 -22 -21 73 -54
7413 -54 -63 -147 -10 -54 -6 45 -27 9 -28 -52 35 39 -36 -68 -14 9 29 -56 29 -17 34 52 -52 -22 -82 92 111 -101 51
7442 51 160 22 -52 39 -63 -8 69 -46 -51 12 -93 36 75 7 -11 57 32 -55 37 -4 24 47 -20 -23 1 8 142 23
7470 23 6 39 94 46 20 -4 -23 -30 -33 -76 -56 -14 -13 -10 -44 -13 77 -16 12 36 -63 -5 97 -49 -76 129 12 -74 -33 44
7500 44 -49 43 -17 61 35 -31 3 -40 77 11 -236 -105 -9 32 -32 -27 0 47 -104 43 119 -28 58 15 -11 48 21 53
7528 53 112 95 81 -42 -48 40 57 -78 -32 2 33 -106 81 -28 25 63 116 69 -23 23 53 -3 3 34 104 31 -37 -47 67
7557 67 48 -3 -45 -34 11 -11 44 11 70 86 -49 -28 -68 -43 0 3 17 -13 115 -68 1 46 43 26 23 -7 -30 -69 -32 -85
7587 -85 -21 47 -51 -40 -8 7 -18 -3 84 -162 -7 -78 -95 15 -82 54 23 -19 65 -110 0 -43 20 44 20 -18 -84
7614 -84 -28 -14 58 50 20 78 98 119 -66 -51 -32 -67 109 4 -42 -12 4 28 -75 3 -11 -81 38 -83 -34 -14 28 -55
7642 -55 -46 -1 2 108 35 -135 -5 -48 10 -58 -99 -20 -96 -10 -70 -101 -35 8 51 96 72 -11 -1 -15 28 53 22 22 46 62
7672 62 82 80 -35 32 -12 -6 49 172 -134 -2 -28 -78 19 36 -26 85 -21 -99 -9 35 -144 75 -36 -46 -10 55 86
7699 86 89 -24 -53 45 -91 1 -7 66 24 50 18 39 95 16 -55 -6 48 -65 23 62 8 19 -16 2 4 -40 61 -96 44
7728 44 -25 -39 11 -45 -31 -60 18 47 20 20 14 -69 3 80 20 72 0 41 -62 -117 -14 101 2 -33 22 -49 -9 93 27
7757 27 36 80 -13 -38 -1 43 -53 13 -9 -11 45 -32 22 46 -70 -45 -12 -103 -38 -52 88 42 13 29 138 36 -27 -24 1 21
7787 21 82 31 10 -93 -24 -115 49 -53 -92 59 73 7 -84 134 -44 -83 -114 -24 -7 50 13 15 -49 41 76 170 70
7814 70 -89 8 49 -88 -72 39 117 -74 -5 151 121 -15 107 -58 -51 -99 -27 63 -99 -86 -90 -3 13 -48 40 56 -2
7841 -2 5 -25 5 -19 37 -6 -38 -11 -81 59 120 -10 5 -66 -66 -98 -21 61 -17 -32 43 -47 -32 10 -54 9 -19 -51 -97 -21 14
7872 14 15 -122 -43 -28 21 12 32 -23 -3 -34 -11 5 -30 -10 -51 1 -16 118 1 42 28 -33 191 -19 -67 42 -67 4
7900 4 -31 36 63 -78 -47 -61 82 -73 60 -32 13 139 36 -43 -12 -15 36 30 42 -112 90 7 51 -15 -83 -23 -96 103
7928 103 48 -44 -111 -64 187 25 -58 -111 21 -63 40 -52 -18 4 24 -42 -72 -11 39 -23 43 -47 60 47 -17 -76 -62
7955 -62 -50 57 -99 -116 0 -5 -2 59 -43 -53 1 158 9 -90 60 -64 -120 -27 21 -20 -21 64 96 -77 71 -77
7981 -77 -56 -25 -26 -9 -111 79 35 -14 36 82 47 21 -39 -57 41 50 83 27 79 67 6 22 -42 -118 54 22 153 -74 -75
8010 -75 42 -8 50 51 28 -10 -42 50 50 64 124 121 21 -24 -28 -44 -86 -66 -36 10 44 152 -40 2 40 -58 -80 -50 29 -116
8040 -116 26 33 75 -63 -52 -65 -124 54 105 -6 -36 -2 -51 85 -39 32 -14 -83 38 -1 3 44 -56 88 61 61 88
8067 88 53 19 -125 -52 31 -31 -18 23 6 -1 43 81 95 -24 -49 40 25 -21 -117 -52 -8 -27 24 55 13 -24 26 -129 18
8096 18 15 -22 105 -48 -129 35 -6 -42 -34 -36 72 -10 117 42 35 92 -34 -27 32 -53 41 51 57 22 8 -139 -44 -56 -37 36
8126 36 -28 52 96 -22 -2 -3 -17 -45 17 35 -4 68 -15 -83 -25 -43 -20 135 36 22 30 -33 -85 5 -8 148 -160 40 -79
8155 -79 -43 11 57 19 -71 28 33 1 -27 7 35 -16 26 20 -90 -63 21 -1 -88 21 -89 6 -9 4 -41 -28 -49 -27 103
8184 103 63 3 47 14 -74 -28 70
8191G0
##END NTUPLES=NMR FID
##END=
