##TITLE=1H_Pr NCO-Am
 200.13MHz,CDCl3.
 8 sc
 
 11.12.2025
##JCAMPDX= 6.0         $$ Bruker NMR JCAMP-DX V2.0
##DATA TYPE= NMR FID
##DATA CLASS= NTUPLES
##ORIGIN= UXNMR, Bruker Analytische Messtechnik GmbH
##OWNER= pz
$$ XWIN-NMR		Version 3.5
$$ Thu Dec 11 15:21:16 2025 Russian Standard Time (UT+4h)  she@DPX200
##.OBSERVE FREQUENCY= 200.1313
##.OBSERVE NUCLEUS= ^1H
##.DELAY= (6, 6)
##.ACQUISITION MODE= SIMULTANEOUS
##.ACQUISITION SCHEME= undefined
##.AVERAGES= 8
##.DIGITISER RES= 18
##SPECTROMETER/DATA SYSTEM= spect
##.PULSE SEQUENCE= zg30
##.SOLVENT NAME= CDCl3
##.SHIFT REFERENCE= (INTERNAL, CDCl3, 0, 14.3821)
##AUDIT TRAIL= $$ (NUMBER, WHEN, WHO, WHERE, WHAT)
$$ ##TITLE= Audit trail, XWIN-NMR		Version 3.5
$$ ##JCAMPDX= 5.01
$$ ##ORIGIN= Bruker BioSpin GmbH
$$ ##OWNER= she
$$ F:/spectra/data/she/nmr/H-C/1/audita.txt
$$ ##AUDIT TRAIL=  $$ (NUMBER, WHEN, WHO, WHERE, WHAT)
(   1,<2025-12-11 15:19:51.98 +0400>,<she>,<DPX200>,
      <created by zg, POWCHK disabled, PULCHK disabled
       configuration hash MD5:
       00 E9 B6 7A A2 85 ED C7 34 08 36 98 17 FE 4E 26
       data hash MD5: 16K
       10 50 13 D6 23 A5 3A 18 B5 64 DA F1 23 E2 B4 19>)
$$ ##END=
$$ 
$$ hash MD5
$$ 11 7A DA 8F 7F 00 E0 6C A2 80 00 E8 CC F4 4B 1D
##$RELAX= 
##$RELAX= 
##$RELAX= 
##$RELAX= 
##$RELAX= 
##$RELAX= 
$$ Bruker specific parameters
$$ --------------------------
##$DU= <F:/spectra>
##$EXPNO= 1
##$NAME= <H-C>
##$PROCNO= 1
##$TYPE= <nmr>
##$USER= <she>
##$AMP= (0..31)
100 100 100 100 100 100 100 100 100 100 100 100 100 100 100 100 100 100 
100 100 100 100 100 100 100 100 100 100 100 100 100 100 
##$AQSEQ= 0
##$AQ_mod= 1
##$AUNM= <au_zg>
##$AUTOPOS= <>
##$BF1= 200.13
##$BF2= 200.13
##$BF3= 200.13
##$BF4= 200.13
##$BF5= 200.13
##$BF6= 200.13
##$BF7= 200.13
##$BF8= 200.13
##$BYTORDA= 1
##$CFDGTYP= 0
##$CFRGTYP= 5
##$CHEMSTR= <none>
##$CNST= (0..31)
1 1 145 1 1 1 1 1 1 1 1 1 1 1 1 1 1 1 1 1 1 1 1 1 1 1 1 1 1 1 1 1 
##$CPDPRG= <>
##$CPDPRG1= <>
##$CPDPRG2= <>
##$CPDPRG3= <>
##$CPDPRG4= <mlev>
##$CPDPRG5= <mlev>
##$CPDPRG6= <mlev>
##$CPDPRG7= <mlev>
##$CPDPRG8= <mlev>
##$CPDPRGB= <>
##$CPDPRGT= <>
##$D= (0..31)
0 0.7 0 0 0 0 0 0 0 0 0 0.03 0 0 0 0 0 0 0 0 0 0 0 0 0 0 0 0 0 0 0 0 
##$DATE= 1765451991
##$DBL= (0..7)
120 120 120 120 120 120 120 120 
##$DBP= (0..7)
150 150 150 150 150 150 150 150 
##$DBP07= 0
##$DBPNAM0= <>
##$DBPNAM1= <>
##$DBPNAM2= <>
##$DBPNAM3= <>
##$DBPNAM4= <>
##$DBPNAM5= <>
##$DBPNAM6= <>
##$DBPNAM7= <>
##$DBPOAL= (0..7)
0.5 0.5 0.5 0.5 0.5 0.5 0.5 0.5 
##$DBPOFFS= (0..7)
0 0 0 0 0 0 0 0 
##$DE= 6
##$DECBNUC= <off>
##$DECIM= 32
##$DECNUC= <off>
##$DECSTAT= 4
##$DIGMOD= 1
##$DIGTYP= 9
##$DL= (0..7)
0 120 120 120 120 120 120 120 
##$DP= (0..7)
150 150 150 150 150 150 150 150 
##$DP07= 0
##$DPNAME0= <>
##$DPNAME1= <>
##$DPNAME2= <>
##$DPNAME3= <>
##$DPNAME4= <>
##$DPNAME5= <>
##$DPNAME6= <>
##$DPNAME7= <>
##$DPOAL= (0..7)
0.5 0.5 0.5 0.5 0.5 0.5 0.5 0.5 
##$DPOFFS= (0..7)
0 0 0 0 0 0 0 0 
##$DQDMODE= 0
##$DR= 18
##$DS= 0
##$DSLIST= <SSSSSSSSSSSSSSS>
$$ [...]
##$SUBNAM0= <"">
##$SUBNAM1= <"">
##$SUBNAM2= <"">
##$SUBNAM3= <"">
##$SUBNAM4= <"">
##$SUBNAM5= <"">
##$SUBNAM6= <"">
##$SUBNAM7= <"">
##$SUBNAM8= <"">
##$SUBNAM9= <"">
##$SW= 18.0517328524113
##$SWIBOX= (0..15)
0 0 2 0 0 0 0 0 0 0 0 0 0 0 0 0 
##$SW_h= 3612.71676300578
##$TD= 16384
##$TD0= 1
##$TE= 0
##$TE2= 300
##$TE3= 300
##$TEG= 300
##$TL= (0..7)
0 120 120 120 120 120 120 120 
##$TP= (0..7)
150 150 150 150 150 150 150 150 
##$TP07= 0
##$TPNAME0= <>
##$TPNAME1= <>
##$TPNAME2= <>
##$TPNAME3= <>
##$TPNAME4= <>
##$TPNAME5= <>
##$TPNAME6= <>
##$TPNAME7= <>
##$TPOAL= (0..7)
0.5 0.5 0.5 0.5 0.5 0.5 0.5 0.5 
##$TPOFFS= (0..7)
0 0 0 0 0 0 0 0 
##$TUNHIN= 0
##$TUNHOUT= 0
##$TUNXOUT= 0
##$USERA1= <user>
##$USERA2= <user>
##$USERA3= <user>
##$USERA4= <user>
##$USERA5= <user>
##$V9= 5
##$VALIST= <valist>
##$VCLIST= <CCCCCCCCCCCCCCC>
##$VD= 0
##$VDLIST= <DDDDDDDDDDDDDDD>
##$VPLIST= <PPPPPPPPPPPPPPP>
##$VTLIST= <TTTTTTTTTTTTTTT>
##$WBST= 1024
##$WBSW= 4
##$XGAIN= (0..3)
0 0 0 0 
##$XL= 0
##$YL= 0
##$YMAX_a= 246096
##$YMIN_a= -264969
##$ZGOPTNS= <>
##$ZL1= 120
##$ZL2= 120
##$ZL3= 120
##$ZL4= 120
##$ABSF1= 10
##$ABSF2= 0
##$ABSG= 5
##$ABSL= 3
##$ALPHA= 0
##$AQORDER= 0
##$ASSFAC= 0
##$ASSFACI= 0
##$ASSFACX= 0
##$ASSWID= 0
##$AUNMP= <proc_1d>
##$AZFE= 0.1
##$AZFW= 0.1
##$BCFW= 1
##$BC_mod= 2
##$BYTORDP= 1
##$COROFFS= 0
##$CY= -3
##$DATMOD= 1
##$DC= 2
##$DFILT= <>
##$DTYPP= 0
##$F1P= 0
##$F2P= 0
##$FCOR= 0.5
##$FTSIZE= 0
##$FT_mod= 4
##$GAMMA= 1
##$GB= 0.15
##$INTBC= 1
##$INTSCL= 1
##$ISEN= 128
##$LB= 0.25
##$LEV0= 0
##$LPBIN= 0
##$MAXI= 10000
##$MC2= 0
##$MEAN= 0
##$ME_mod= 0
##$MI= 1.114404
##$NCOEF= 0
##$NC_proc= 0
##$NLEV= 6
##$NOISF1= 3.799351
##$NOISF2= 2.8
##$NSP= 1
##$NTH_PI= 0
##$NZP= 0
##$OFFSET= 14.38212
##$PC= 1
##$PHC0= -3347.744
##$PHC1= 13.99234
##$PH_mod= 1
##$PKNL= yes
##$PPARMOD= 0
##$PSCAL= 0
##$PSIGN= 0
##$REVERSE= no
##$SF= 200.129724274929
##$SI= 16384
##$SIGF1= 3
##$SIGF2= 2
##$SINO= 400
##$SIOLD= 16384
##$SREGLST= <1H.CDCl3>
##$SSB= 0
##$STSI= 0
##$STSR= 0
##$SW_p= 3205.1282051282
##$SYMM= 0
##$S_DEV= 0
##$TDeff= 0
##$TDoff= 0
##$TI= <>
##$TILT= no
##$TM1= 0
##$TM2= 0
##$TOPLEV= 0
##$USERP1= <user>
##$USERP2= <user>
##$USERP3= <user>
##$USERP4= <user>
##$USERP5= <user>
##$WDW= 1
##$XDIM= 8192
##$YMAX_p= 0
##$YMIN_p= 0
$$ End of Bruker specific parameters
$$ ---------------------------------
##NTUPLES= NMR FID
##VAR_NAME=  TIME,          FID/REAL,        FID/IMAG
##SYMBOL=    X,             R,               I
##VAR_TYPE=  INDEPENDENT,   DEPENDENT,       DEPENDENT
##VAR_FORM=  AFFN,          ASDF,            ASDF
##VAR_DIM=   8192,          8192,            8192
##UNITS=     SECONDS,       ARBITRARY UNITS, ARBITRARY UNITS
##FACTOR=    0.0002768,     1,               1
##FIRST=     0,             0,               0
##LAST=      2.2672688,     0,               0
##MIN=       0,             -264969,         0
##MAX=       2.2672688,     246096,          0
$$ Real data points
##PAGE= N=1
##DATA TABLE= (X++(R..R)), XYDATA
$$ [...]
1989B50m7j337J774J78j113P53r2J39P25j884O12J644j950k53P00p26R97j274
2007i04o87K331r31r19J274o2M42j25j241K068J96k112J072M54p16O42j339K94
2025b63J240k186P2J456j120K68J0m29J884j105q73J642k56n14R68o34K98L94
2043H52j371J103P3j382J210q78n14J339r24j42O39r22R36L29j405J232O89j186
2061c22J057n30L9Q35j673P19J254j939O4Q56n82L39j004k79K159j537j088K137
2079E05k54k10J04n57J580k04j842J834L58j648N74l92K94K65j663J000R84k073
2097a345P68N18o16P64n17K28J315j452Q6J560j195m6Q44j013N87l81p09J622
2115A018j634p13J812p11q13R41m79Q58k49j387K265J59j889J406Q3j72J83j358
$$ y = [250, 203, -1134, 640, 818, -295, 458, 366, 505, 1230, -654, -42, 1602, -348, -601, 99, -627, 370, -904, -1591, 740, -191, -1110, 164, 102, 544, 419, -822, 1246, 1442, -670, 402, 856, 140, 782, -557, -263, 977, -1209, -1137, 319, -801, -533, -523, -952, 932, -173, -1046, 596, 340, -174, 794, 160, 458, 852, -519, 584, 657, -725, 485, -393, -907, 432, -492, -634, 5, -917, 19, 348, -1057, 175, 864, -322, 735, 205, 244, 1079, -594, 125, 1379, -560, -496, 360, -222, 117, -887, -1166, 993, -544, -1632, 505, 251, 41, 145, -412, 1168, 964, -878, 956, 1314, -334, 240, -152, 142, 407, -1256, -256, 728, -1345, -577, -59, -675, 89, -428, -200, 1115, -337, -251, 1309, 114, 68, 912, -101, 486, 105, -604, 1018, -616, -1329, 483, -228, -1041, -100, -579, 279, 30, -1357, 908, 1067, -822, 584, 667, 495, 678, -680]
2133f80J229R12k680P31J300j227J8m81K93J283j997J89K239j480k79R61q2O30
2151H79o69p08J836q08j398J342j22n19J51o65P66Nj495J358M76j468Q16M94n63
2170b92P47q41P70J107j921N73J136j516L17K59j95K41j368K99J768j607r91J762
2188B48l31j36k18p3J720j171j147K223J51j209J44k22P60l61j696J568Q97k288
2206a141M20N28j91K37r56P92J354j835M26J395o85j40J48m2R31j189p13J843
2224A182j309q44J258o19m1J32q62J464m46j329J856O4j202J012J11J54J09j133
2242d43J280L52j947R20P44j204Rm87O67O70j649J4J895j277m73R96K74N00j120
2261b79j86J957q94j449J660k22m43np33J143k46j657J569J82j508Q70K2J9L90
$$ y = [-680, 549, 1461, -1219, -488, 812, -415, -397, -878, -585, 698, -1299, -1110, 1129, -351, -630, 331, 249, 879, 210, -498, 1338, 530, -868, 474, 352, -167, -16, -681, 85, 90, -1405, -47, 429, -1039, -223, 271, -292, 455, -386, 384, 1491, -430, 143, 1279, -237, 80, 339, 144, 385, -983, -684, 1084, -523, -1514, 248, -83, -219, -437, -510, 1210, 39, -1108, 1115, 1266, 57, 201, -21, 739, 378, -1318, 250, 1147, -1141, -721, -193, -384, -147, -1103, -311, 1043, -792, -366, 1029, 344, 204, 352, 310, 1241, 52, -661, 1182, -127, -971, 287, -332, -373, -241, -1103, 361, -85, -1414, 442, 506, -696, 316, 427, 581, 690, -443, 837, 1189, -758, 162, 906, -298, -289, -776, -109, 561, -1088, -1074, 821, -456, -929, 67, 341, 841, -279, -465, 1492, 598, -851, 809, 587, 144, 139, -594, 549, 303, -1354, 215, 397, -1111, -241, -219, -200, 190]
2280A90j152J211J003j849P08J078j095K85l87L14O61j693J36J525j520l06R23
2297C2m17N64q12P6J402q81j027J825k83m80L16l33J050m43j586J566L24j813
2315i20O70K57r8J82j154P11J125k009O13J149n79L17l62J80R98j031k93J491
2333A247j439L7O19n94J61l5o82R43n25j119J832m40p38Q37k31N22m1q44J235
2352G45K77j744J008M64p79L57r52Q55P98k374N56J386j115j07K38J93O79j239
2370g54P0J810r46p10R63J2Q2j60p41J223m90j361J204J34j047O25m72M79L47
2389B68j308J054M64r59R30J21o66P31m63L7Q49j223K08N86j256M01N60o64J79
2408a51k09k27J026j044k10J218l75k38O09l97Q99m61j132J540p3j425Q67j94
$$ y = [190, -962, 249, 1252, -597, 111, 1189, 94, 379, -8, 306, 967, -726, -590, 935, -585, -891, 32, -385, 179, -633, -557, 845, -36, -1063, 762, 479, -1, 315, -18, 1032, 589, -997, 569, 893, -920, -250, 7, -91, 91, -1063, -352, 773, -1236, -623, 526, -53, 264, -98, 82, 1080, 49, -244, 1247, -192, -155, 464, -130, 31, -4, -686, 257, -268, -1387, 445, 5, -733, 104, -127, 395, 354, -490, 745, 1022, -722, 286, 750, -29, 328, -624, 231, 1029, -1345, -789, 597, -518, -625, -387, -194, 485, -754, -684, 1126, 180, -530, 433, 445, 527, 367, -374, 849, 359, -1002, 202, 336, -711, -86, -558, -79, 268, -1040, 14, 478, -481, 449, 570, -96, 635, 172, 209, 1058, -165, 43, 629, -627, -226, 334, -330, -151, -360, -587, 439, -605, -815, 403, 28, -210, 399, 2, 901, 440, -692, 848, 775, -650, 217, 23]
2426B3K0K20j244Q60M20j276N89N09l67J97k23J23R59j214J51J291p19j48J77
2445C48n87P02l95p14R20l16o09O99l86J1O43r63N24M37r16Q70m8m02R56k13o86
2466a25Q54o78K11J64j273J062jj173R85n7n14O09o28M94Q10j277K16J112p50
2485D1J55k8k72J058p32o04J029n72m27N17m18K12K63j353J268M4r73R55M9l45
2505a33Q44j025L43Q58r98L82K66r18P79k39q55J028o00j38M13o06J51N48n58
2524d58K07O33r41J041j52m40Q17n37l55Q66q25P2M70p35L86l6q56R34k61n10
2544f80P49n09J91O58p27J46Q24j013P76J13n18P07m60k14M85q26J00O06j013
2563f05J21O26r84P77J47o07R23m09m05Q69l90J15L62p31L57N76r15M96l2o49
$$ y = [23, 43, 263, -981, -121, 299, -977, -388, 121, -246, -49, -272, -149, 810, -404, -253, 1038, 319, 171, 348, -239, 463, 68, -646, 274, -42, -651, 48, -338, -327, 316, -647, -123, 314, -602, 268, 220, -182, 774, 561, -125, 729, 51, 262, 426, -847, 215, 214, -959, 26, -31, -545, 64, -564, -70, 740, -537, -321, 791, 41, 196, 168, -104, 954, 222, -382, 647, 75, -352, 165, -253, -41, 222, -1131, 137, 181, -792, 163, 212, -133, 711, -314, 29, 887, -111, 271, 537, -381, 398, 159, -696, 332, -268, -406, 7, -599, -448, 100, -458, -251, 382, -559, 482, 330, -110, 707, 170, -185, 681, -144, -72, 398, -337, 49, 13, -843, 91, -170, -680, 69, -440, -249, 409, -318, -172, 652, -361, 415, 528, 10, 717, 257, 43, 528, -298, -198, 408, -605, -484, 142, -842, -65, 82, -525, 398, -11, -416, 453, 63, 178, 540, -191, 166, 742, -173, 323, 291, -358]
2583c58O40l90m82P18n08J13P04r78L26L93n78Q72j26n47Q30l06k59M43o59J07
2603d5P07r66J61K54n73M31l65j69Q98n77l20J035l84k51P22n95M64J07r82J029
2623E81k15m82M98m66M8L80q59K82L80q18N52K78o73N00j81R6N39m11j83Q01o78
2644c1N27j10o29O98j69p70P15k80m95O70o03j41Q34n79K77K61m85O61m54p5J054
2665H76n27n93O79l94K13L2q50M42K23p11M54J74m52N35o71J95Q76q02K06M10
2685C15k14J96k5m90Q88k95r34R45j47l22N4o83M20N74j117N75L91l57K65k1p3
2706e5N28m59j67P64o12K38L89r00O02k32m83M65l02k19O05q30K46R80j049K69
2726b22K96o3L99m01j02Q74m24m76P40l10k30R9n86P23q8r59M63L16m19K37j87
$$ y = [-358, 282, -108, -590, 128, -380, -267, 437, -541, -215, 178, -400, 472, 346, -201, 629, 323, 64, 507, -152, -45, 662, -304, -143, 111, -462, -31, -396, -565, 333, -244, -564, 471, 87, -164, 558, -37, 427, 534, -448, 581, 366, -116, 382, -84, -36, 344, -515, -233, 147, -671, -119, 159, -514, -14, -195, -99, 440, 29, -154, 647, -31, 496, 386, -243, 455, 286, -484, 231, -49, -544, 126, -477, -618, 216, -363, -86, 175, -310, 351, -103, -178, 876, 349, -244, 435, 41, 254, 286, -564, -122, 101, -610, -156, 18, -434, 101, -570, -375, 501, -301, -95, 315, 101, 297, 272, -218, 670, 375, -559, 386, 239, -83, -29, -712, -292, 282, -835, -260, 131, -226, 39, 18, -55, 473, 14, -153, 611, -1, 237, 626, -274, 328, 96, -387, 78, -224, -443, 162, -668, -422, 558, -491, -222, 74, 11, 410, 9, -93, 781, 357, -119, 621, 311, 81, 180, -406, 317, 229, -730, -267, 49, -370, -133, -320]
2747c20J44N46q56O13O02o77K59l8j51N78o20m03Q31l49n43O17m46J33n5o14R23
2768A74N5p82M51J58J8L99l59k05P53p88K25M44p44O88l77p46P21l21l7L80n79
2789d72L13N60r87L50O65o83K22j37K01P01p26k82Q75m03k37J91m30O35m12n42
2809e98P08%n66K23MK49K68n74L77O23j044L37M22k45M39q36n6Q58n33n08M84
2830C2k87j00L30n78N33k1o26Q11j10l17N12k98M71L03n24L8K48o01M45j13n50
2851d02N42j47m31K98l69K24L26p41O57N02o25L36%j85N15m64r6Q23p68j03K95
2872A87l94J48k6m18M17M1n43N55l2m0m2k87O17K77n23j9P50p31L12l09M9M54
2894D43o93l29J106q46N3K85m62N34J23o69P09l65J70J55n1N0K74p78K86L55m70
$$ y = [-320, -176, 370, -486, 127, 729, 52, 311, 273, 122, 700, 80, -323, 508, 159, -384, 233, -213, -80, -135, -749, 174, 229, -553, -102, 56, 74, 473, 114, -91, 662, -126, 99, 543, -201, 487, 110, -636, 85, -236, -273, 107, -472, -159, 401, -586, -236, 429, -254, -32, -169, 32, 733, 7, -275, 600, 197, -40, 151, -279, 356, -56, -598, 110, 110, -456, -233, -229, 20, 288, -286, 91, 714, -330, 7, 429, 184, 623, -213, -269, 589, 56, -452, 32, -255, -355, -25, -603, -70, -91, -717, 94, -16, -333, 179, -119, 352, 655, 131, 169, 417, -184, 261, 148, -402, 140, -7, -438, -140, -509, -285, 41, -700, -43, 459, -166, 170, 170, -15, 500, 36, -60, 763, -5, -108, 187, -207, -59, -85, -503, -86, -45, -588, -33, -65, -105, -147, -434, 183, 460, -63, -82, 668, -63, 249, -60, -11, 443, -250, -579, 527, -319, -266, 19, -443, 91, 214, -455, 254, -111, 59, 214, 163, 213, 487, -291, -5, 350, -120]
2915a20M45l33l54P17o59m05P07l22J7L44n18O75J41p75P13L4k18K24l69JN55
2936E00p65k7J009q04r3K07l68N94n40l95P36Q7q72Q29k41J83K49o40O99Om69
2957a15K43J73l40K50m86R4M94o45J0N89n27L05q1l67M98o6l09L94M1R3R4n65
2979b23N91J0m83J42K13k42J38l49l76P90l15j28M20n47M23k0l96N56J44n63L87
3000A72K04k41L06m81R5N03q00J09L56m91K05m56R0O46n52J25P22o29K49L11o26
3021a83O32p7m39L52Q3n32M91m77M1K49o75M25K40l44O7q6L2L78k49JL13o8k27
3044e3L53k71J32N5m29K72J97n30N51n61m6M19m74J93O6m63O01J85m57M88k17
3065A1l06O08L8m60M67l16l3K10l23J01j52j85K13L7j31L94m01K7L48j63J05J92
$$ y = [-120, 325, -8, -362, 355, -304, -709, -2, -324, -307, 37, -481, 194, 335, -440, 273, 307, 89, 313, -56, -55, 500, -265, -292, 717, -87, -180, 27, -341, 253, -287, -682, 54, 141, -731, 98, -143, 40, 289, -351, 348, 354, -115, 128, 301, -39, 211, -275, -181, 313, -332, -322, 267, -260, 45, -36, -403, 95, 29, -280, 114, 155, 248, 342, -223, 368, 378, -105, 37, 250, 8, 146, -203, -579, 211, -104, -232, 188, -359, 64, 44, -352, 204, 348, -215, 172, 376, 135, 441, -40, 55, 558, -242, -133, 223, -268, -63, -519, -429, 217, -335, -210, 512, -117, 132, 443, -183, 449, 372, -67, 285, 368, -164, 327, -150, -109, 140, -535, -110, 130, -214, -147, -233, -201, 177, -72, -71, 242, 174, -53, 300, 29, 161, 216, -213, 59, 256, -274, 277, -284, -330, 89, -385, -192, -126, -589, 12, 197, -260, 228, 11, -295, 313, 351, -109, 358, 42, 9, 219, -104, -3, -155, -340, -127, -90, -221, 173, -228, -201, 147, -16, 89, 281]
3087B81k91K63L82r34P57l0p26N63m60J2M50p44K92K04m58L97J6J3M1o7n2N68
3109D77m83m39P61nj11o0l11M67j83n88P49l37n61N72k15J7K87o18O29J86l24
3130i0M37j15l42K91q6j88J82l0j53M03l85J16rm47O14l73j58M81n58R5M52k96
3152a59J83L49m26M05j20n10P63m93k66N96k06k20K28o22M96j01n55P13j9m10
3172c74L49k9l7L56m13J07N02m91q2K03r7L12m85k11N98k83l09L24l8J66P9l96
3194b49L37R4n16O44J36l82k1r6L8N09n79K12L39p13L25K64o93J66O3j34L60l20
3216b16RM39m24K92L31m50L07Ml65L91k53j28L84n14l7R1k79L73J33m00N60j45
3238A03l97L53K4k14J71k10K71L14o16J59L74l74J92j49k08N34m51l90N08jl53
$$ y = [281, -10, 253, 635, -299, 458, 428, -298, 265, -195, -183, 267, -477, -185, 19, -439, -42, -26, -13, 28, -39, -91, 477, -6, -445, 316, 311, 200, 140, -171, 296, 113, -475, 274, -63, -624, -52, -267, -250, 37, -581, 48, 234, -90, 347, 232, -110, 181, 95, -93, 89, 59, -94, 309, -76, 40, 31, -416, 198, -175, -333, 148, -410, -315, 137, -159, 24, 373, -53, 352, 232, -278, 485, -8, -274, 322, 116, -104, 124, -498, -2, -103, -658, 55, 36, -374, -25, -54, -91, 265, -148, -41, 461, -30, -112, 91, -6, 306, -179, -390, 208, -75, -384, -60, -98, 68, 147, -249, 88, 182, -334, 310, 446, 64, 43, -53, -15, 494, -85, 127, 466, -247, 78, 342, -351, -185, -122, -256, 104, -216, -207, 232, -192, 100, 431, -19, 288, 292, -73, 318, 65, -63, 321, -193, -230, -139, -418, -45, 88, -312, 248, 103, -294, 59, 83, -131, 40, -170, 101, 415, -201, -42, 332, -42, 150, 1, -207, 327, -124, -514, -6, -7, -360]
3259c60K95k54K07l6k18P00k23l16M42J23m01K76l94K81J84n64M18j0m29K98k14
3280a95j24M01j21q3M22p47M75K75l67J28J71k61L77m04k13P43o04m4K79k70o3
3301b25l2kN12k68o32P64q9l44M53J35J10j2o53O19J05n10K50K6l76K11k27p0
3323b55M93p10L80L00l43j07M95m68N49j82l86N05k89j9K79k07K1O0j25J25Mn32
3345d12M17k93j37M40j63q3L92k84M38p9k53P7K02l60J78k33k8M36m11JM16n56
3367b95NK61l55K69j9N8L48k4o76N11J39j99J8k27M64p6o02N45o7k55K40k76K2
3390a91K22m49K79O4r3J41K60l73K24n2J7K37j74N6K78m26J23J44l23J39J03n09
3412c03L02l5j71L73k95j06K38j28K21K17m19M84M0l89L28q5k28Oj24J27K38n54
$$ y = [-360, -65, -319, -112, -148, -366, 334, 111, -205, 237, 360, -41, 235, -159, 122, 306, -258, 160, 150, -279, 19, -195, -319, 82, -39, -122, 300, -447, 28, 303, -64, 64, 235, -26, 351, -53, -266, 477, -127, -171, 108, -162, -225, -257, -259, 253, -15, -647, 117, 28, -316, 137, 272, 382, 370, -283, 336, 441, -69, 181, 207, -169, 42, -185, -255, 238, -472, -92, 208, -135, -242, 253, -215, 334, 152, -234, 271, -18, -37, 242, 35, 56, 116, -9, 116, 120, -412, 5, -288, -425, 15, -148, -231, 161, -123, 315, 236, -17, 60, 262, -98, 80, -153, -181, 255, -156, -155, 261, -295, -290, -29, -384, -115, -134, -76, 272, 248, -428, 83, 222, 23, 41, -186, 278, 202, -400, 145, 78, -177, 63, -213, -191, 31, -418, -139, -75, -168, -27, 233, -140, 84, 32, 49, 286, 112, 168, 446, 20, 143, 287, -36, 103, 206, -303, -1, -36, -207, 166, -129, -235, 3, -125, 96, 313, -106, 378, 418, 29, 357, 272, 44, 50, -74, 53, 291, -263]
3434b63O9L83k09j90J68r7L25k62l3M23j69k87M10r4L8j9m35N74l76j53j24M54
3456A33n33M25l05J14L53o29K77M41l39J17J35j83L31k64j49J74l23L43J02o03
3476c83M01O0m25K74K3k24L2L61j39J78j82R2J27k55M06k39k54K68K48n48N36
3497C57l43j1J59n32J67M76n14K6K04n5m1Qj10M76j69o5M6l2r7J78k92L11M7n40
3521c46O28l71k33M75k86J05J04m18K91J48j73K81k04r4M76l13q4L07l67L7j5
3542e2j63J22N8k03L91k91j95K58k24J55L36l06K51J44k62J78Qj61J36j32k47
3563a99L30l77K71M0k49J32P5k96Q3J00k7L55m06J57K56l37NK51p8j05K24k88
3585h3M14l16k51M35j79j03J15k96J93J20k21J95qj49q1K53j12L26l0l14M76j42
$$ y = [-263, -194, 189, -20, -210, -42, -139, 186, -76, -109, 314, 145, -142, 268, 174, 212, 193, -242, 332, -44, -197, -321, 133, -400, 25, -280, -166, 187, -442, -165, 276, -63, 54, 189, 6, 337, 73, -76, 98, -225, 118, 220, -383, 18, 78, -347, -73, -50, -274, -242, 119, -20, 158, -24, 68, 195, -60, 346, 107, -147, 121, 369, -179, 357, 14, 3, 162, -370, -203, 273, -241, -215, -11, -66, -107, -99, -209, 267, 98, 33, 79, 47, -50, 128, -164, 147, 194, -346, 282, -89, -322, 153, -133, -28, 76, -342, -51, 97, -76, 205, 1, -93, 383, 70, -14, 293, -74, -37, -52, -215, -93, -35, -238, 153, -138, -333, -75, -299, -144, 192, -114, 137, 281, 19, 197, 205, 44, 180, 48, -199, 131, -246, 25, 65, -184, -52, 23, -273, -190, -90, -117, 238, -168, -11, 245, -92, -87, 164, 86, -19, 205, -83, 331, 15, -236, 199, 20, -83, 32, -264, -71, 49, -172, 23, 15, -134, -215, 38, -74, 252, 222, -92, 384, 242]
3607B42n84K38j43K35J92m03L17k00J25J06Q8l14N24n90J61O0r2K09k7j27P5J82
3629B74n67M77j19l09L72m31K24M1J23q6l7k74K93J94j77n5J6K62J2j91n1M0j96
3652a65J70Q2o4j78K20m91K75K9j9J56k52K77j21jL53p4l55L40j53o9M22m81n2
3675a51L30m41j07M65j96J54k83j13P31l48j36R3j18Q1L40n94L98M3l22L81r9
3696A08k46L06k19k23N18l17j22K18n0q7O6R1K11n88K85K99l14M15J3n07J78J76
3718B11k89Q6m3r5J11n5j08K24o9k72L21j97K38J37l69K96J14l10J57Kp5K64k77
3741Bo1L92n08O3K40m77K75N8j92J24m3j0M0K2L65k01n0R7o4j65K01n4j69J46
3765C1J87j59l4k40K13M2j94J54O6j15J29k17J25R8j37J32J49j94J9R7k28P8m
$$ y = [242, -342, -104, -247, -12, 180, -223, 94, -106, 19, 125, 213, -101, 423, -167, -6, 54, -38, 171, 144, 17, 92, 274, -293, 184, 65, -244, 128, -303, -79, -38, 85, -1, -38, -312, -19, 175, -2, -57, -41, 221, 233, 42, -9, 31, -165, 5, 87, 23, -155, 65, -426, -151, -122, -141, 15, -237, 40, -81, -82, 271, 197, -158, 182, 29, -40, 382, -99, -151, 179, -262, -369, 96, -100, 54, -229, -342, 389, 41, -95, -2, -120, -39, 301, -293, 105, 148, -174, 207, 108, -138, 168, -51, -274, 244, -73, -195, 23, -27, -114, -48, 43, 254, -334, -49, 250, -64, 351, 364, -143, 35, 211, -78, 8, -35, -130, -19, -74, -182, 42, -27, -299, 22, -175, 63, 200, -169, 127, 241, -69, 88, 90, 15, 279, 2, -59, 333, -175, -112, 128, -349, -74, -16, -208, -84, -127, -137, -97, -75, 290, 89, 39, 136, 72, -93, 108, 54, -115, 31, 218, 59, 25, -215, -2, 40, -154, 0, 66, -49, 80, -137, -12, 86, -51, 81, 230, 36, 55, 152, -76, 2, -2]
3788bj4K32k33J39r2j30q4K51k42K2K95j65J74R3m18M46J6j13j3l84N32l73o1
3811a24l4J50l15J64J73l56L83j35R7J36k72O4J56oJ70p4J06J65m83M7L3o0m8
3834f3J22l72L1K22q7R0J52j24K40k02j09K19p8l5P4p7j1K83k98R3q2j20K30j53
3858e5o7J39j26N6R6l48L5L04l18K31o3J8M04r0k39K65m8k21L2k58K49K5k91L68
3882I8j89J44j67O5L9o0P0K02O8k74q5K35j12j05m1J03K53l97n3K94k36o3N2j64
3906c23M60o5l16L67j75j19J96r6J36J07j25J64j50k74K90o6k69J68N5j23J61
3927CK4L8J49k17k35M83l31K46r8j33L01j58k58L37k50j01J73k20K57L7K9j21
3949d5J46j64n8P6P8J39k93K71J5m2o0J76k95K25n4j98L44k91l8j36J38n5J63
$$ y = [-2, -16, 216, -17, 122, 30, -100, -184, 67, -175, -153, 142, -23, 151, 244, -174, 272, 288, 175, 162, -222, 310, -63, -124, -158, -8, -323, -159, 14, -342, 41, -94, 3, 139, -133, -69, 87, 81, 251, 177, 283, 448, -35, 12, 45, -15, -63, 59, -313, -282, -60, -147, -57, 95, -29, 211, 9, -100, 119, 41, 6, 80, 3, -8, 275, -23, 70, -12, -132, 98, -55, -122, 17, -109, -53, 43, -305, -270, 34, -284, -53, -116, -98, 306, 216, -23, 242, 194, -27, 5, -253, -4, 21, -270, 98, -91, 53, -114, -49, -10, -70, 0, 202, 270, -4, -89, 146, 34, -71, -112, -9, 244, -153, -206, 88, -148, -211, -159, -323, 137, 72, -244, 123, -52, -171, 25, -71, 65, 172, 47, 211, 61, -213, 77, 11, -258, -90, -35, -158, 3, 27, 65, 214, -3, -238, 245, -86, 160, 62, -71, 230, 72, -186, 151, -99, -200, -27, -247, 10, 47, 76, -45, 101, -63, -121, -45, 33, 172, -121, 150, 165, 123, 63, 239, -56, 169, 115, -83, 261, -30, -68, -204, -66, -121, 42]
3972D2j20j00J36r3J78l70M18K64j81k45K80r3j9K7k85M08j37m20K51Q5r8J05
3994C3k80L15q7L4k12L48j35K81j88o4K43l03k0L71l66r5K81j17j85J33k82K22
4016g3Q8k13K79j67J27o9M1j56M44j70j1J8l1O8k17j7K64k27j57P2m9K01%l14
4040b69K33J6k02M45n31K97Q9j32J16R1p9J05k73J3J80j30k88M84M9j97j13j2
4062a08R5N3j49J37J44j08J54j07j8L0k62J30M03l71j60L97m76J09L4k33L98k9
4084F3p8P1q9n0K49k86K75p3j93K91N7k99J59j10j35J93o3J37l09M0O7K62l56
4107a77M29l07k33L43k25J42K65j96j19K85k95J31K37l77M38j50j86L7m17L14
4127f1r9n5J85m9rk8J98j54L90l85J94Qk03R9L9q8J80n0j77l9L0J97m38J83j23
$$ y = [42, -78, -178, -42, -135, 43, -327, 91, 355, 174, -71, 209, 116, 97, 124, -161, 247, 110, -310, -59, 26, -72, 33, -247, 68, -19, 15, -197, 151, 16, 297, 109, 45, 288, -15, -35, 336, -30, -125, 156, 39, -146, -13, -295, -73, 15, -198, 81, -86, 41, -28, 13, -143, 301, 131, 120, 138, 107, 175, -42, -59, 205, -22, -179, -107, -156, 45, 45, -269, -36, -20, -222, 223, -308, -11, 78, -54, 62, 153, 74, 179, -94, -81, 99, -31, -319, 165, 214, 17, -96, -108, -13, 40, -109, 28, 172, 64, 218, 111, 93, 123, -139, -9, 394, 23, -137, 260, -216, -107, -73, -306, 92, 63, -15, 56, -33, -83, 166, -120, 155, 82, -111, 180, 237, -62, 97, -13, -148, 45, -18, 119, -190, -150, -83, 179, -177, 252, -55, -288, 55, -170, -28, 237, 41, -78, 207, -88, 43, 280, -97, 341, 191, 5, 42, -375, -61, -160, -215, -30, -79, -88, -116, 82, -72, 318, -67, 127, 135, -68, 31, 70, -18, 162, 112, -65, -104, -74, 123, -315, -132, -255]
4152b55J22J71k77K12j62L35J31k46J63j92m7K36j92j07K13m4j0M6l54K51L8m8
4174a6j44J43K6N8j9j64K33j65J3K98k21J40p0l39K51j5k18L05j01o3K28m85K34
4197i1M01o10J79Rj5K23k1k37K39j47K3K26Q8l46J76p2K57m55r1L88j96Q3lj09
4221a01lM08j02m7p1k60L57o4j95J29Qj58O5J16j59K57l64L2K81k86J08K1K9J71
4245A72l99J24J81j96m5L42r9L4J74l88K61j61m8P0pk12L25j6q9J0Q3j50N4j49
4269a29J35J6k19M65j64j56J89j66J8j36Q9q2K21k87K45k54K7N68m83PJ56O1q9
4292C2Nj99K02R7j25J00o8n7J31j84l7K62k19p8K99m25P3K49l25M58j64Qk9q6
4316h0J23l2j37J66J33l45J73J03j28K13j71p1O8J54j20N3k36l7K05j6J37n6j71
$$ y = [-255, -133, 38, -239, -27, -189, 146, 277, 31, 194, 2, -45, 191, -1, -108, 105, 61, 51, 97, -257, -6, 32, -16, -160, -17, 9, 67, 48, -116, 117, -48, -35, 263, 42, 182, 112, -227, 24, 9, -209, 96, -5, -68, 160, -325, -91, 310, -300, -121, -112, -127, 96, 75, -162, 77, -70, -47, 179, 267, -79, 97, 25, 282, -173, -264, 124, -72, 11, 8, -101, -104, 304, 202, 155, 84, -176, 181, 117, -78, 51, 59, -99, -34, 82, -77, 180, -184, -152, 129, -157, -49, -28, 1, 172, -227, -103, 78, -118, -163, 179, 80, 114, 288, -100, 161, 0, -48, 22, 15, -197, 128, 112, 23, 33, 116, -34, 20, -129, 6, 22, -197, 268, 104, -52, 137, -29, -11, -147, -58, -140, 81, -206, 39, -215, -188, 380, -103, -96, 60, 121, 32, 37, -162, 40, 137, 12, 112, 44, -13, 118, -66, -103, 159, -60, -138, 161, -264, -191, 58, -267, 191, 27, 35, 6, -80, 43, 11, -126, 40, 173, -172, 1, 104, -24, 189, 18, -53, 15, 169, 49, 102, -134, -171, 34, 18, 155, 99, -72]
4339g2K91k27n2K9N0J66j18l47L87o5m16M21Q4m34L86p2J4K54m33J06k6pk9P5
4363c5j41K83k3k74J70J60k83J82k85J78N2k76J72J31k2L0l7q5L72l25Q9J18j59
4386hp0J68o8N4j41P1m7j12J52p2P8j53J72j22j4R9kj7J7R4Nk48K14N5j59M5J60
4413A51l15J60j53o9M74l30j44K59l65K48J69o3j83K42r4j30L20l77J78P7k69
4434b14K61L6k42L27m51K86K07m77L92k71j36K44J91j44O7m7N9R9n47O05j10k27
4456i2J46O5n2r0J84l59K74l80J68J41K38k29J7j76J40J85k28K10l49J75R4j07
4478b5O7R6k08J45Q2l70L29j75j60K46J08K0j38J78l84K61j00l7J82R0o6j10j15
4501h4L9j0K5J1k89J45K22j13j58K26j39L58k46j07L91k92R7j16R7l38L70k21
$$ y = [-72, 219, -8, -60, -31, 19, 185, 67, -280, 107, 42, -374, 47, 131, -303, 83, 11, 25, 279, -154, -48, -74, -81, -110, -35, -176, 107, 84, -190, -20, 140, -143, 39, -246, -68, -16, -292, -120, 11, -11, 19, -18, -103, 269, -56, 33, 151, -8, -78, 90, 22, 76, -65, 6, -41, -153, -1, -73, 5, -148, 24, -98, -112, -13, -15, -32, -15, 79, 84, -164, 50, 105, -54, -9, 151, -164, -4, -157, -226, 248, -82, -226, 33, -332, -84, 85, 22, -161, 81, -13, -143, 177, -200, -22, 55, -214, 47, 83, -159, 168, -283, 3, 210, -267, 125, -146, -282, -38, 153, 9, 76, 29, 88, 187, -360, 245, 135, -92, 54, 119, 67, -23, 161, -198, 76, -304, -136, 5, 243, 14, 31, -145, -5, 180, -48, 162, -187, -12, 82, -25, 42, 138, -70, 75, 157, -213, 116, -59, -219, 27, 135, 155, 17, 195, -189, 72, -28, -65, 117, 207, 141, 31, -84, -45, -55, -30, -19, -308, -163, 59, -54, -212, 14, -125, 233, -13, -120, 271, -21, 76, -40, 57, -281, 89, -132]
4523a32K67j91M4L4J21k28J53l05K75K33l62r1J12lJ09M1r9K1j27L23k71qJ20
4546C6j29J73N6j37j05R6O4j88J08L0j78L68q1j6Q3k16L59j21j49j40J7J36k1
4569D5o6k44K57k52K68j7j70K13j98J53K19j23k74L63l20R9J89r3J32m1l72M60
4591B28m2l50K16j4J03p0m7q0L7j28J13J90k16M4n9J27K2L6k22J19J70r4n5k62
4615b34M71l00l1J13J32l83L21k30k2L59l45J15P2j50J31K18l83J72J2l70M43
4636A11k75m0L8M9J24j35J39oL0j43O1J88j78K02q2N1j32rj42L52j25L6R6m04
4660a94J99j35j88M04j38J02N3j02J17M1k01O2M51n01J67k56L07m8j81r7K46k75
4682a67J08o7p0K36J79k97j70J91m6N9l50N34j79P9k7j07J6k4J14k7j22R5N9J35
$$ y = [-132, 135, -56, -12, 22, 143, -85, 68, -237, 38, 271, -91, -182, -70, -73, 36, 77, -22, -1, -128, 195, -76, -84, 36, -93, 80, 136, -1, -106, -10, 54, -134, -26, 4, -174, 194, 113, 97, 180, -36, 323, 202, 53, -87, -70, 66, 45, -21, -265, -8, -260, 8, -9, -179, 34, -164, -11, 208, 85, -189, 174, -146, -47, 142, 49, 181, 140, -232, 228, 186, -164, 52, 38, 141, 71, 24, -56, -19, -147, -34, 156, -60, -16, -75, 52, 74, 110, -112, 7, 177, 83, 28, -234, 237, -63, -94, 19, 151, -232, 89, -141, -163, 196, -149, -34, 38, -112, 19, 237, -146, 26, 38, -332, 111, -164, -204, -166, -117, 7, -128, 11, 5, 35, -108, -47, 141, -37, 165, 83, 134, 2, -7, -149, 203, 78, 114, 210, -194, 5, -130, -318, 86, -52, 50, 103, 1, 118, 159, -42, 20, 471, -30, 137, -119, 188, 140, -41, -138, 108, -167, -59, -126, -196, 40, 219, -78, -248, -57, -103, -44, -394, 140, -39, 40, 13, -94, -78, -102, 12, -15, -137, -42, 17, 152]
4706A52k72O1j4j03K9P2R9P6l2l63M74k94J96P6l05K47k5O4K4l80J93OJ12j04
4730a1j31J21j33L78k63J5J44o1l8p0rM4R4k58J93r7K1K31l63P8J82k66r0K63
4754b6j2J91k72J96O7j98K78l4k86K97l5j69N8O1j95J8J33Q6k70n6J36K13l68
4777a87o8L10k09K31j41j39L72KJ04k11j40n8K28m7j25q8R8J11j57mL4J75q2n1
4801d2q8J65J48k45J42J44l48J09K47o2n7j17l3K60l19K66k23r2J43q5Q5k1J01
4824G8r1J59M1j65P8k57N6K64j70Q0j32l3J24J8%j63L0l4J93o1p4K52k18mL3j61
4850a57J71P3l41M54j93K51q7k08j16J99j26K55L3l67K36q0j64K45k20L24J5l24
4872a27K54j42k2O3J44k25J3J60j71K06l05m4K74j68jL2Qm9K59k54M11l94L3J15
$$ y = [152, -120, -59, -73, -176, -147, -75, 24, 100, 68, -295, 179, -115, 81, 157, -148, 99, 74, 138, 162, -218, -25, -19, 93, -11, -142, -21, -154, 224, -39, -24, 120, 59, 21, -49, -58, -14, 80, -178, 15, -82, -61, 170, -193, -115, 67, -199, -289, -26, -38, 153, -119, 77, 144, -54, 224, 190, -96, 201, 166, -3, 55, 116, -79, -61, 72, 158, -112, -168, -32, 181, -187, -255, 55, -154, 77, -64, -203, 169, 171, 275, 64, -76, -134, 94, 47, -78, -166, -68, 43, -114, -118, -84, 91, 9, -42, -130, 35, 183, -62, 80, 224, -124, -15, 232, 170, 113, -4, -37, 223, -96, 170, -53, -145, -2, -87, -2, -23, 78, -13, 146, 187, 22, 100, -157, -101, 163, -7, 73, -59, -92, 32, 50, 50, -113, -83, -117, 76, 15, -59, 193, -25, -29, 4, -157, 14, 87, -254, 200, 7, 258, 171, -37, -153, 46, -80, 175, 208, -159, 77, -3, -167, 78, -142, 182, 197, -127, 127, -15, -37, 26, 170, -55, -42, 118, -53, 153, -152, -196, 78, -90, -91, -59, -51, -100, 159, -95, 316, -78, -45, 70]
4896G0k04K51n9P0r9R7j14J7M6j80J12n2n7J58k01J93j80O6RK37j73M1J03K4R4
4921B69l51k6K95m78K69J22k4q4p7J2n9K05o2Pr3R6l3L7m3J97o0j35N7j38K48
4946A51k98K80Mk13J24K5j75j21K58l7M1M6l9j69j9J96K48m09J12k8J43k41P3
4969d8o5J80j17J7O6m1O3J0o2J21l76J95J57j49M4J22Pm8N8k96L08k13o9L2J52
4994D8kJ6J7j78L66l30Q5R5j80J03l4j04J06K05j08k2P8k07J07k05J47J2n8L3
5018a0J49k78M8R7j83L04k44R9L9j70QJ61q6J43J22l33J20J51o2m3p2M1Kj11R
5043i9J07j73J12k1J79o3j18o3J25L01l81K23k00L09k73o2j26K39j07K81j85k5
5065b0J35l16J63M4K3m7K40l54K22j68J24Q2k45Q7J28p3j10J44k79K64j6j28K56
$$ y = [70, -134, 117, 58, 128, 29, 126, 12, 29, 75, -105, 7, -45, -102, 56, -145, 48, -132, -66, -57, 180, 7, 48, 151, 175, 269, -82, -108, 187, -291, -22, 100, 76, -8, -85, -73, -132, 73, 11, 18, -75, 21, -12, 25, -18, 179, 119, -16, 41, -97, 151, -147, 133, 137, -76, 48, 73, -102, -223, 35, -2, 39, 85, 46, -123, -142, 54, 302, -107, 5, -23, 120, -121, -48, -113, 67, -50, -33, 33, -8, 55, 65, 3, 124, -252, -57, 100, -49, -5, 117, 124, 76, 134, -162, 146, -67, -136, -104, 48, 46, 62, 79, -99, 267, -63, 22, 117, -63, 40, 6, -98, 8, 213, 105, 83, 161, -46, 61, -144, 3, 15, -43, -10, 139, -139, -91, 6, -177, 127, -117, -18, 21, -149, -141, 20, -66, 77, 199, -134, -14, 137, 75, 32, -40, 1, 3, -108, -99, 8, -165, -53, -74, 105, 42, -76, -139, -14, 287, -94, 129, -71, 238, -35, -97, -223, 16, -91, 190, 5, -20, 115, -201, -38, 6, 29, -18, 222, -132, 90, -78, 46, 128, -117, -30, 98, 25, -85, 59, -220, 44, 28, -100, 156]
5088A56n6j09M1p0P6Q7l18K82K80l36O8n0j97M21m03M1K30l16j10L47o0l3J56
5111A27l74K82J23l20L37j77LM9j96R3K16j47J61o1j77J13j25Q6k8n3P0J83r5
5134I0k09M1l2J58j35R7K17k17k34J74j32L69j75LoJ99k58k89M05j94J45j23J20
5157A4M3J49k57J14l5j00p1j7J07K06j94K3k27M56l14p6J39nO2j50J98k42L71
5180A94l5j86O0J0j59J96j94m1J85NK24j24j49k6J37q6K01k99PJ63l04K78j13
5203e6Q1m3j43R3J93j98LL56m07J63P0l32L45O7l54J06j17oJ54j61L75j37j12
5226f0R4j41rK46k66%L26j54r2K04o9J51j24j21L8j74K7Q0q1L6K06k80K58j50
5250e5J70k05R3P1r4L8j31J16J78j05P5ln3j00n7J0J0j45J01K04k31j8K51q5J69
$$ y = [156, 100, -9, 32, -38, 38, 125, -193, 89, 369, 33, 101, 51, -146, 275, -128, -87, 143, -173, -283, 64, 4, -29, 127, -247, 35, 158, -162, 175, -2, 1, 50, -146, -53, 163, 16, 177, 116, -61, 52, -73, 13, -15, -68, 2, 185, 90, -119, -78, -110, 48, -87, 10, 227, 10, -224, -50, -182, 187, 12, 15, 9, 208, -50, -339, 66, -128, 17, -106, 14, 57, 206, -51, 63, 28, -72, -143, -160, -53, 153, -41, -18, -245, 211, -103, -179, -40, -45, 17, -133, 65, -177, 194, 159, -27, 33, 43, -116, 80, -114, -155, 30, 35, 259, 135, -14, -40, 97, 11, 212, -87, -80, 83, -221, 57, -56, 25, -18, -161, -68, 125, -73, -70, 286, -121, 42, 112, -220, 125, 192, -162, -56, -173, -179, -25, -186, 189, 52, -60, 34, -107, -116, 130, -136, -136, 190, 36, -56, 148, 79, 230, 106, -15, 23, -151, -124, -44, -125, -89, 117, -163, 95, -55, 115, -90, 3, 74, -20, 18, -113, 3, 181, 76, 151, 148, 95, -5, -62, -52, -42, -187, -86, 118, -113, -131, 120, 35, 204]
5275B04k29o3O9j6r6M0m1JK33q9J02k20M4M9NP8J71k04o3j03j40L29o6q4J88J25
5301B24j12p5j71p9K55qj14pN8J80j5k50J59q0k0K58j25q2p6N3O4J09k01J60n
5326A00l13Q5K30l3k46N2K5J87k13K17J91m00J09N4L1k01L65l93L45k95O7K53
5348B17m13K10o6k21K09Q4l55K73J5j85L54j10j18J00o5K0r4K06Oj68J50P0j69
5371e0q6K86k60K52j57m5L33k69k07K21p4o7M27l15j99K38J11q4N9J29j89j10
5393e6J19rj6j25L41l70K08j10k64K37r2J59o3J51k13K57j22P5oK3p6k1J08Oo5
5418G6j69O8J13j71J90j95K02j98l7R5j9Q5o6l3r1J80ko7K03j93oq8l0L6J84j71
5444a04J52j36m5K31j89Q6J62k82q3N09l27q3J54j07J76k93J86m6p2O9R0j10J31
$$ y = [204, -25, -88, -19, -35, -131, -91, -132, -131, 102, 13, 115, -105, -61, -12, -7, 71, 242, 38, -25, -128, -268, 61, -5, -89, 99, 224, 112, 37, -134, -213, 42, 34, -80, -87, -29, 151, 136, -114, 45, -35, -55, 203, 78, -4, -80, -27, 37, 146, -55, 105, 100, -213, -128, 102, 69, -177, -125, -100, 87, -126, 91, 282, -118, -9, 45, 76, -125, 240, -153, 192, -103, -36, 217, -196, 14, -52, -273, -64, 20, -335, -62, -47, -232, 122, 12, -106, -6, -71, -51, -145, 61, 67, -101, 49, 119, -50, -136, 150, -110, 142, -15, -60, 273, 4, -203, 18, -56, -123, 304, -11, -210, 28, 139, 55, 114, 243, 54, -56, 63, 54, 38, -87, 254, -116, 92, -18, -282, -45, -137, 22, -41, 110, -103, 154, 32, 107, 101, 124, 48, 27, 135, 141, 76, -93, -25, 88, -83, 107, -88, 114, -84, -121, -26, -45, 40, -26, -59, -150, 30, 28, -39, 164, -29, -35, -123, -153, -117, 67, -104, 48, -88, -133, 98, -91, -5, 157, -125, -208, 301, -26, -109, 45, -62, 114, -179, 7, -39, -111, -42, 48, -62, 69]
5467F9j12j15L10Q4j4j71j4O8j07O4k50P3jK8R1Q8k1o0l6J51p2k81J18j99L20
5492A1R0j92Q3J99m00M85l85N4O5L0j38K19j38o1J87j89l9K19j38r1K53l14J71
5515a9j03O9l1k8J12P5j00M0r8M1J06k63N7Q8J95j51j5J05n4k10q5K98k7N0l11
5540b59J24j2J80r8j4M9QQ5J31l61L51r7j94J83j34j14L53j24j87J83P5j03m0
5563a5K2J07N9L4l02K33j70J79K27l83q3K4O2N0p7j01L68l08J15j67O8j35L09
5586A16l66K55q9L05J9k77o0O2L7J46l18N5K13j28P3j60Q8m1K95l31J31O6j18
5609b7J38k64n1J99r0k8J25n3J18K6j0k6l20K14j1o6R8K3n1p7K99R6k09j10J13
5634E6j3l5K8Q8j47n1J72k64J41l1k34J98L57m03J61O0R5m2l47L91k05J35P2M0
$$ y = [69, -43, -158, 152, 236, 222, 51, 37, 105, -2, 62, -188, -115, -116, -88, 3, 91, 70, 10, -26, 125, 53, -228, -110, -309, 11, 101, -91, -8, 191, -209, 276, -109, -55, 10, 40, -98, 121, -17, -78, 109, -80, -119, 100, -38, -129, 124, -190, -19, -122, -53, -84, -112, 0, 75, -25, 15, -83, -42, 64, -199, -142, -54, 141, -10, -25, 80, 26, -184, -269, 29, 2, 52, -259, -135, -147, 33, -65, -79, -30, -22, 63, 194, -167, 184, 87, -107, 76, -58, -172, 181, 57, -130, 53, 128, 25, -15, 7, 114, 173, 207, -95, 138, -32, 147, 374, -9, -92, -68, -6, 44, -33, -134, 234, -74, 41, -126, -58, -193, 116, -250, 5, -84, 221, 240, -37, -97, -35, 2, 148, -170, -115, 98, -30, 43, -117, -29, -70, 225, -106, 25, 91, -27, 111, -153, -204, -5, -95, -123, 2, -51, 67, 93, 83, 57, -263, -49, -60, -126, -28, -5, -56, -133, 166, 262, 53, -57, 56, 43, 8, 36, 124, -23, -74, 98, -166, -25, -56, -290, -92, 265, -138, 23, 83, 178, 136, -211, 180, -25, 110, 182, 222]
5658B22k64J74N5j43n3p8K6J84j34Q3l7k50L16q1N1k0J72l48J34J2n6O3j26R7
5682ak3p0l9O6O3R4M5j0k89O3K30m8j3j62K36j33O8J36j30Qo9pJ52k88J47L4l6
5709B4k16K23o3Pj41o5K15k72K94P3Q9k09Q0j60q4K63p0N4j65k96M69J01l53K67
5733F5k0n8j74K21k6J45j97Q0J18j76o8O1N7O4j12L3O9q6P4j02n2K5K87l16J50
5758F2q1RK23j23L5j8M0k71J87J05k28J78j52N8k62M29m4k12R8q5J09p3l9M9N2
5783D6j09oJ06r5K17q1k2K00l01K0J01p6P9k9n5M2n5n9j41J34K43k64J96r1M9
5808D9K9n0Q6j92R0J5J10J68n9n37K69N0Kk13j3K22j64np6K06j96J31J95oj9k08
5834a16J88L5q8J8J25J5j91J00q7q4Q1j26M47k39l28L09r8m1O5kj31j2N8Q0J2
$$ y = [222, -42, 132, 187, 44, -9, -87, -61, 123, -11, 72, 35, -215, 101, 20, 71, 51, 223, -125, 9, 21, -35, 28, -98, -1, -24, -94, -133, -67, -4, 90, 135, 125, -164, -101, 129, 81, 68, -94, 142, 9, 77, 213, 83, 91, 22, 15, 167, -121, 26, 60, 24, -192, 31, -32, -25, -166, -231, -16, -288, 6, 79, 168, -41, 39, -121, -205, 58, -12, 42, -123, -419, 50, 151, -202, 65, 45, -13, -187, 34, 8, 153, -44, 36, 154, -22, -90, -29, 28, 92, -20, 13, 82, -4, 70, -32, -84, -59, 228, -88, 62, -19, -10, 213, 90, 125, 107, 147, -124, 63, 168, -60, 118, -34, 24, -238, 191, 147, -65, 33, -52, 57, -16, -55, -6, 46, -63, -69, 37, -58, 159, 78, 56, 256, -45, -25, 76, 0, 79, 50, -5, 37, -18, -77, -218, -84, 159, -105, 91, 0, 49, 78, 28, 114, -78, 12, 27, 137, 305, 246, -291, -22, 28, 30, -183, -196, 26, -138, -143, -219, -13, -209, -78, 117, 111, 92, -116, 72, 107, 19, 37, 162, 177, -14, 86, -1, -85, -4, -130, 317, 78, -250, 59, -39, -80, -15, -17, -148, -160, -102, -22, -10]
5859a0j5L6N6j51K53j43J99j62l97L58q6K5R2P2n8p1L11m68J57J91j50M1k06J66
5883D0L9L7L1o7M9o6l4Pj87J83k18K74q5j77J47k8R2J29k29K59j11j6J3q0N3j89
5909a34J29l1L8l5rM3o0O3k23n3K23jk48J98K69J6k09K28k20n6J81Ok10N8J32
5934I5r0j61J60j8P1l5j89K21L5j66L99o2l7k87J58j15J06j40J98n0j10J39j48
5957b6R6j67r1M8M9J2P4L2k8o7K6m1J11Rk12J99J72j96j8J66k38J51j78J72k7
5982B8k50L25j71P2J60j36J74K0k17K70m19O1K92k06j47J21J80k88J68l8pq0J8
6005g0J27q3k26K72O7o9O0k8L1k35J96J63k04rK3K4j76Q1K04q4j76J77r5L59m62
6030a33l0J66n8J43Q6k54K80L9j72o4j07J10J34J41l52J31j97K4o3J59j6P6Q7
$$ y = [-10, -25, 11, 67, -84, 169, 26, 225, 63, -334, 24, -62, -37, 55, 127, 69, -2, 309, -159, -2, 189, 39, 80, -126, 40, 79, 116, 147, 80, 129, 63, 29, 36, -151, 32, -186, 88, 3, -174, -27, -55, 37, 166, -63, 196, 85, 69, 82, 2, 55, -134, -5, -36, 2, -33, -42, 1, -59, 4, -219, -272, -49, -50, -298, -100, 169, 185, -24, 204, -16, -72, 109, 115, -95, -37, 95, 5, -156, 4, -14, 57, 22, -167, 54, 89, -77, 322, 260, 223, -64, 94, -21, 85, -55, 143, 93, -17, 122, -26, 70, -97, -188, -140, -91, -79, -5, 27, -1, -68, -42, -83, 28, 37, -175, 24, 196, 0, -18, 148, -90, 61, -117, 55, 28, -222, 103, -68, 4, 164, 28, 202, 222, 5, 275, -144, -83, 209, 3, -144, -23, 157, -131, 37, -1, -8, -88, -70, 57, -26, -252, 20, 87, 18, 78, 50, 81, -154, 42, 205, 1, -8, 15, 39, -137, -56, 148, 64, -112, 65, -30, 329, -133, -163, 3, -55, 88, 174, -80, 200, 239, 67, 3, -104, 6, 140, 281, -71, 60, -137, -113, -176, -17, -33, 43, 130]
6053A30j65O0j09M4L7j41J92J42m8j97J62j9K13l61K27j03l51J04J21Q7Qj79L74
6076B28o9k66K79k70J10J4o1o1K06k32j00K11j45L39j26j67J98k73K4K4J38j71
6098a70K9J19J88j6k49K22l72L12j44pQ4J82k52j6Q3n7J40j12K5n4K73l58J75
6121B5j3k2K7l35L58J06j05o5J10q9J28k75L8l5J49orK5j00q1J62K25Q7n57L26
6146G4k0K2K9k66J72J10l8m2J4l45L78k40J0K34j33j4k3J12l8J15k60J24%j88
6170b13J48L8k20J75L85k90Jm7K7J62l61J28O0j58K19o5N8kj45L36J8k36k2J56
6194A52m33M46j10k64L62k43k9J06m3O1J33j01P6j92L8R7J40l99j4K41K0J6J23
6217A83k91J58m3k66O9K77p1K73l45J03n6k73M50k58K3J31k40K91J08n5j16j16
$$ y = [130, -35, 25, -84, -40, -3, -144, 48, 190, 142, -55, 107, 88, 301, -60, 167, 64, -287, -183, -62, 25, 33, -146, 228, 159, -107, 172, -98, 12, 26, -35, -96, 110, -122, -222, -11, -156, 183, 57, -110, 88, -185, -161, -137, 1, -170, -141, -22, 166, 150, -99, 123, -249, 63, -81, -88, -4, 178, -74, -90, -7, -64, 76, -36, -11, -65, 208, -150, 25, 12, -10, 17, -318, 40, 146, 41, -24, 86, -3, 125, -150, -112, -147, 2, -4, -13, 12, -88, -169, -7, 218, 305, -252, 74, 54, 76, 105, -161, 11, 121, 83, 41, 55, -290, 88, -152, -142, 92, -41, -55, -78, 34, -4, 111, -149, -25, -25, -213, -65, -27, -247, -72, 313, 23, 24, -23, 4, 166, -195, -67, -7, -165, 54, -11, 47, 45, -100, 236, 254, 18, -4, 152, -281, 165, 55, -209, 153, -90, -119, -13, -56, 5, 138, 37, 113, -79, -41, 56, 196, -203, -217, 24, 44, 60, 183, -108, 50, 7, -259, -190, 87, 16, 289, -56, 47, -9, -282, 168, -90, -67, 64, -176, 115, 223, 168, 52, -64]
6239f4J19q2J62j33O1j58Q0J55p7r3p1R8j99k7J93j89J22J36k2l9J65j13P6k10
6263a10J9j16K46m6m4J20j60p4J09J4Q8J11m42L11j01L7J90k42J32K7j99J56J17
6286A43n7r9rK04k09J11j41J04j21J36j06j47K50O5k22J17l1j52J25J33j17k8
6308e1J67k84M2K92k94J36k68K59N2k7o7j30K30J7k37L43q8k35M51j29k48J23
6330E4m4j29j0K81k24K13k63K04J06j96Q5k3j05K61j13j08L6K34k14j43J12j44
6352a30J40k16K50L7k31J36m0M9j01pj9J15r8J53k7Q3j3J09j54j26L65l93J82
6375F4j75K34p3Mj88M05k31M2k25J34pq6L6r6J98K01k18j03J32r2R4j06K66k90
6399h0K32l38M54K18m09L6q8j41L11j46j26J24K00k01k0oJ05L9k59MJ64k13J10
$$ y = [-64, 55, -27, 135, 2, 63, -95, -15, 140, 63, -30, -101, -3, -202, -229, -36, -225, -103, 33, 11, -28, 137, 24, 100, -110, -91, -207, 39, -7, -51, 69, -91, -165, -56, -42, 46, 157, -285, 26, -75, -38, 152, -90, 42, 69, -130, 26, 143, 86, -13, -22, 182, -27, 84, -57, 47, -74, 62, -44, -191, 59, 124, -98, 19, -12, -164, -39, 94, -23, -51, 116, -168, -126, 166, -128, 8, -260, -1, 51, 24, -43, -173, 57, 74, -163, 180, 92, -143, 308, 179, -69, 54, 10, -119, -129, 152, -72, 141, -122, 82, 188, -8, 77, 54, -51, 210, 97, -11, 25, 259, 45, -98, 14, -130, 10, -206, 44, 81, -150, -14, -54, -5, -106, -113, -132, -17, -115, 38, 11, 94, 81, 190, 36, -90, 275, -118, 64, -111, 123, 50, 54, -134, 271, 40, 82, -143, -9, -16, -102, -66, -162, 36, 237, 19, -84, 48, -44, 50, -56, 210, -80, 152, -186, 268, 486, 77, 113, 25, -116, 195, 49, -77, 47, 247, 46, 26, 20, 125, 164, -95, -91, 73, -140, -30]
6422c0p3K52ql91k2L29l89K38M0K46l98N18L13n17m50j4o5J10O34j68J3k15o0
6445a07K54k00p3J80M2j0k02K02m96L81J04j21P5J5M5j50K57k74K55k12j34R1
6467g8LL2Q9L0K0J84j80l1q5j02J11m5j09P7J86Nq1O1j61J73p7r9K30k95J36p5
6493h1J26L1L8j71N6R0k28Q4J37R9Q9k80q1O6lN1j91K00j39m4J38j55o9J09K20
6518I2j34n9R1K4J17n8k02J44O3k12K14j44L5K09o1j65k3K1J00j45K48k63j89
6541b97K24M7k1J6j3J6J90j94o4J39Kk38J01K7Nj24J87J63m8l20M06j53j82J46
6565A5o7j91M61l18J6K25k01J28q0L8O6j84J32j06P4j10M8O4o7J68j77J35L8r6
6589A1J53J28r1N4j49j72R3J5J19k01J16j82m1J68J9j27K78j18k83K40n2MJ09
$$ y = [-30, -103, 149, 141, -250, -272, 57, -332, -94, -54, 192, -206, 312, 625, 108, -342, -356, -421, -311, 323, 155, 168, -47, -107, 147, -53, -126, 54, 96, 86, -116, 86, -410, -29, 75, -46, 29, 44, 89, -61, 196, -78, 177, -35, -169, -78, -75, -43, 46, 76, 96, 280, 100, 69, -16, -118, -7, -52, -161, -84, 102, 107, 26, 87, -74, 99, 22, -77, 153, -142, -6, -81, 45, 76, 114, -57, -1, 89, -139, -55, 82, 181, 270, -10, -91, -25, -28, 23, -168, 32, -107, -151, -13, -168, -237, -128, 92, -42, -101, -10, 14, 131, 73, -129, 15, 78, -134, 80, -64, -29, 180, 119, -46, -69, -48, 52, -93, 155, -108, -297, -73, -26, -47, -31, -44, -28, 162, -32, -96, 43, 45, -193, -92, -65, -60, -184, 3, 166, 118, -202, 204, 51, -131, 15, -52, -243, 218, -100, -84, 141, -60, 68, -12, 26, 92, -92, 40, -66, 8, -102, -54, 10, -57, 111, -66, 69, 107, 11, 164, 292, 201, 255, 106, -66, 27, 42, 161, -40, 76, -106, -147, 21, 40, -87, 191, 73, -210, 30, -22, -18, 91]
6612I1J24ok10J7n0r7K15j76n9qJ11JJ28r0k9n5K6J15m0J92j14O8J06m22K36j45
6638g1J32N0k61R3J62j88o8L15k16p0J9K49j58m2J32q5j15Q9J14k50J75K98l08
6661dN2o0j89K76j39J66J8k28J89M6n6j01R7p0J11j49kR4j3j9k5j20J55K53k17
6686F5n9J10k9j57j88J14L6J21j04K16O4k46M2N1l4J19j68J48j63O8m3J40k4o2
6710A7J73j24q5P1O1l8j62J31J4M5k45J51j66K10r8L4R7k05J05j05N8Jl8J06P4
6735H2l9j16J3Q1KLrr6J27L2nP6r7p8J08j83J7o3J91j63J55J2l1J34k1j29p7j72
6763b46J55J36j28K81k97J26M1J69l81J47nL0k7J48k57m3R7N2m2P3J9p6J85Mk08
6788d7K41k68K26j96j6J37q3J11P1j33r1P2k7N8k9O2j85O9j46K51j5P8k86J51
$$ y = [91, 215, 209, -1, 16, -34, -131, 84, -92, -151, -159, -48, -47, 81, -9, -38, -93, -67, 48, 8, 200, 86, 154, 260, -162, 74, -71, 61, 111, -150, -57, 105, -83, -151, 164, -52, -122, -103, 146, -12, -54, 78, -7, -122, -33, 81, -169, 6, 304, -4, 48, -12, -201, 75, -64, 102, 120, -108, 81, 127, 71, -30, 67, -3, 108, -41, -43, 51, 38, 19, -6, -126, 29, 282, 65, 6, 116, 87, -70, -258, -144, -108, 13, -91, 125, 189, -57, -15, 36, 2, 121, -47, 101, -62, 6, -37, 103, 79, 17, 190, 66, -19, 52, 113, 75, -87, 44, 58, 103, -142, 9, -157, 53, -45, -11, 86, -119, -14, -119, -61, -60, -98, 8, 82, 43, -73, -60, 21, 23, 26, 17, -79, 48, 80, 75, 151, 54, -24, 84, -99, -82, -145, 46, -117, 38, 50, 19, 153, 132, 3, -74, -246, -91, 45, -83, 198, -99, 27, 68, 237, -144, 3, -2, 28, 1, 149, -108, -151, -54, -2, -44, 29, 48, -28, 157, 161, -47, 194, -74, 152, -44, -60, 77, -6, 105, 176, 43, -48, 24, -3, 55, 26, 88, -97, -28, -174, 77, 62, 140, -146, 5]
6812EM3r6p6J10J31m0j15M8pJ68j00j22J0O1o3M3J35k8j90%j46K30Q4J69k82L97
6838C69l53Ko5R9J16m3l55K72K2j52Qk18K48K7l6J2j34K2J31Q4n6n1o6J83K6j7
6864G5j25l3J20r0o6j5J96j52k1K19j03k30J80M3k31L37m5J6m8j11K33k71R6K51
6888B25m51K92L0n9n7k52K80q7k5L0J08J09l04J39n1j51M44k82K43k17J16R9j60
6911A9n4l9M4J15M0J8k19J46r1l5l0O5J8j5O8J74k57Q8j83O6o5Q3L9J39k44K33
6937A23j22p3P8j7K7r4L85m11M4k63K14K07J64l45j08J04N6K65j96J10j39p6Q3
6960A6k11M80m76K08Q3k23J64j12r7J35j04Q5J02k08J27J29Pj18N2l6j6O0j09
6983f2J26k04J43J7K1oL5j0k75K45j26J83J63j78j6o7r0J9Q3Qn6M4K61j96k05
$$ y = [5, 48, -48, -124, -14, 117, 77, -38, 10, 3, 171, 71, -51, -41, 20, -43, 0, 135, 107, -83, -83, -229, 1, 85, 254, -28, 369, 16, 18, -47, 52, 168, 125, -230, 42, 64, -88, -80, -298, -50, -23, -59, -47, -181, -159, -28, 56, 0, -51, -117, 66, 92, 75, -50, -83, 37, -53, -119, -134, 62, -90, -111, 108, 5, -225, -45, -2, -233, 104, 59, 75, 27, -84, 149, -122, -26, 225, -226, 66, 96, 37, -20, -272, 8, -79, -104, -74, 34, 143, -161, -22, -73, -224, 220, -62, 181, -36, 80, 179, 19, -35, -74, -30, 85, 125, 143, -76, 70, -21, -56, -86, -21, -3, -18, 50, 224, -33, 55, -128, -62, -127, -44, -5, 134, -110, 123, 1, -72, 6, -11, 16, -78, 307, -104, -60, -323, -109, 98, 262, -83, -191, -87, -31, 234, 38, 148, 9, -67, 16, -195, 285, -191, 17, 100, -123, 41, -71, -168, -33, -137, -52, 50, -158, -31, 98, 105, -13, 39, 3, -13, 47, -62, 64, -140, 3, 20, 41, 35, 70, 60, -215, 30, -96, 87, 250, 72, 56, -11, -101, -82, 1, 9, -47, -3, 258, 62, -143]
7008a43Q0o0R1N8k07J55j02K03j56m7J82J38j56k6o2J15j61J57j48l3J93q2j02
7031a13J91k08K63k32J81p5k48J72k5Q6L7L3j26o7K14o0J07q1j17J09K3j7o4j7
7055c4j53K30k3k8N8k12OJ78J2p0J02n1m7M5O9J38k20J50j37j23N6K87l13J17
7079C7j83M06n22J53O2K75j36O9m1n9L7k20K12q1p3k3K0R1J6r8n0K71J7l8j63
7104b1J79PJ6j28K4m6n0J78j39K8q2P1L3K10l21P0k07L96j38Oj40O7O2m1k0o9
7130e5R1k23J32L7L05l56J70K3Mk84J27M6L8l9J0m8J97j07p3k7J45j66L53l55
7154e5q2J75j30J78k82J30n4J04mmr6K64j95Q7j5M5N0k39J94J00J5j18j23J73
7178A18l10J22l6L07q4q3j39M9J89j33r5L51l50Q4j77J41M2P8Q5M9k12J47r1j6
$$ y = [-143, -63, -123, -32, 26, -181, -26, -128, 75, -81, -128, 54, 192, 36, 10, -52, 63, -98, 59, -89, -122, 71, -11, -113, 78, -130, 133, -99, 82, 7, -241, -69, -94, -8, 29, 62, -64, -131, 83, 23, 130, 49, -68, 41, 64, 47, -17, -34, -187, 43, 20, -8, 50, -162, -156, 22, 34, -36, 66, 15, -32, 13, 82, 220, 0, 150, 13, -110, -54, 233, -80, 37, -146, 260, -262, -109, -47, 228, 92, 161, 120, 61, 98, -122, 90, 9, -64, -87, -67, 24, 40, -58, -108, 163, 180, 142, -21, 158, 165, 181, 53, 77, 31, -19, 159, 20, 48, -34, 37, 70, 280, -41, 29, -178, 218, 80, 86, -54, 13, 75, 34, 14, -55, 36, -187, -55, -18, 287, -69, 101, 124, 128, -156, -29, 17, 55, 16, 26, -22, 175, 68, -5, -32, 113, -53, 300, -55, -137, 38, -92, 86, -196, -66, -120, -16, -20, -24, -120, 144, -51, 36, 21, 66, 116, -123, 71, 171, 186, 68, -55, 118, -192, -70, -106, 201, 117, 34, -105, -56, 133, 0, -95, 256, -94, -10, -187, -46, -4, 74, 159, 208, -4, 143, 52, 36]
7202C6q0K36j78n5J07j08Jr3K73k31K53k97J38M8o2J42N0k70L94l56N0Q3k41J42
7226a8j32J05J1PK4mj52R9J78j18P8n0j67J68o7j27J26j14N5J64L8r8Pn3J01R4
7252A55j34P9k5P7k28J38n0K3m0J07j52P1K10k64j3O1j8K1J1o3j7K03k40O3J75
7277A50k70J61n7J26j51J69p8r9q9kQ1QK5k35L84n1j63N9J65k99J29l6n5J04K91
7302B67l26J0J22j03j0K33j24r4J52j39J50k49L2K01j05O2j11Q8K15k41m3lr3
7325a09L7K55k87K26j86M6Q1j35M9Q8Q5l82K32J33l6l3j4k3J45j82K11j8j48Q1
7349A16n5r8qj53J83Q2m2P4Nj01j49K92j55J22o1m8j07q9L92l00J65j41k0k2J37
7374A9J77j94jP3k5l1j89M7R2R4N6k73K12j7R2j60o6K32j27N7l22J60Q3m7J52
$$ y = [36, -44, 192, 14, -41, 66, -42, -41, -134, 139, -92, 161, -136, 2, 50, -12, 130, 180, -90, 304, -52, -2, 81, -160, -18, -150, -45, -34, -27, -3, -7, -159, -60, 118, 0, 78, 28, -139, 29, -38, -165, -39, -153, -98, 66, 104, 6, 13, -40, 61, 155, 21, 100, 75, 152, -76, 62, 12, 35, -5, 102, -50, 21, 231, -33, -46, 15, -3, 18, 29, -34, -51, 152, -88, -25, 150, -120, 41, -16, 110, -41, 128, 50, -49, -138, -140, -59, -51, -26, -261, 123, 72, -91, -32, 133, -166, -37, -73, -128, -24, 267, -59, -49, 73, -30, -40, 193, 69, -25, 127, -12, 138, -111, -79, 122, 17, 79, -32, 56, 271, 30, -13, -16, -109, -72, 183, -104, 122, -64, -18, 63, -72, -23, 65, 150, -232, 0, 133, 97, 64, 50, 27, 172, -10, 201, 183, 35, 116, 61, -37, -45, -198, -15, 67, 25, 99, 104, 3, -146, 146, -9, 113, 52, 4, -103, -192, 200, -100, 65, -76, -96, -118, 19, 196, 2, 1, 74, 49, 18, -171, -124, -32, 62, 118, -155, 57, 40, 132, -28, -94, 138, 11, 68, -254, -94, -11, -58, 94]
7399I4N5O3l39J11lJ30o7k72j73M17r7Q8m3Q0L6k35Q1K75l74M0N3oJ10j88p6J11
7425a29K83k06L77k85n9M2m6J23j47j41K10j29K5J48J21n6j66j6J31j61J07M3
7447F9j57m3K73n7m5Q0p5m6K16k90J07q2N9N4o2q2Q7J3NQ0j61J95j63J61k27p
7473i8J18j07j28K52J11j31j5j20K63k84L20j49N1q7M0l0J19j53PO2j29K40p9
7496G3m2K31j71N1o7j64n9J44q4j9J42J47j18j54J20j98K7K13lj30R4N3k6j43
7520h3J52l08J82l5R6K21k79N0K1L1L4j98J07L5M5k93K51l01K17j45K55m7j67
7543a59J73M7k07L16n6j99n4K79r0J45o4j30Q7k05L22j27l0j46L14j55Q1K3l49
7566a84J40Q9k24J30P0k1j40N5N8K3N4j41K28j18K6K2j50n8J89Q6j49J35k63m3
$$ y = [94, 149, 212, -127, -16, -19, 111, 44, -228, -401, 16, -81, 7, -36, 44, 80, -155, -74, 201, -173, -133, -80, -86, 24, -164, -240, -129, 154, -52, 325, 40, -19, 23, -23, 100, -47, -188, 22, -107, -82, 66, 187, 131, -35, -51, 80, -81, 26, 69, -88, -131, 142, 85, 40, 120, 45, -1, 215, -75, 32, -50, 9, 63, 1, -81, 6, 19, 24, 104, -57, 138, -25, 136, -91, -98, 20, -87, -215, 37, 148, 17, 2, -118, 145, -139, 181, 32, 83, -4, 36, 6, 125, -28, -21, 41, -88, 152, 73, 31, 262, 91, 142, 75, -89, -148, -4, -88, -107, 35, 182, 64, -90, 30, -168, -141, 72, 69, -61, 33, 86, 60, -83, 69, -239, -57, -92, 4, 225, -54, -4, 17, 48, 82, -116, -9, 26, 71, -222, 29, -272, -55, -200, 55, 8, -159, 14, 61, -146, 170, 114, -85, -139, 140, 50, 195, 131, 1, 88, -117, 205, 78, 48, -98, 216, 61, 142, 165, -184, -44, 45, -179, -49, 21, 0, -140, -85, -27, -4, 50, -91, 137, 19, 45, 67, -83, -141, 48, 134, -15, 120, -143, -186]
7590a86J72P8j59J07j04KQ2j63J66j6L8j4j3N2J81j88m0o4J37j19J33r6R0P1p6
7615G1J9l29L00q5O2LJ38j03k6p4Q4J35j37N5k58K19n4J0j19k7l7j9R2m3K35l63
7641b51J69L6J66p7j00O8q4J05kMJ8j68L26k44J03o5P5q9N2J1j4P4mj38J82j37
7667A6k0l6QJ89l85J77L8j58J00J93j85J68k33J69l4J21l15J60P4R0j61P4M8j11
7691a3L2j24j8J39O1l6n0mJ78j60J82j63N9j75K69l64K17n4j76J20K13l87J73
7714h1J24mq6J04J08k21M6J66j61M6J04j21m7O6j75K90k23oJ04K12l19J6R0N2
7738H4l26K83J58k67L8q6J15K6j41K22q6j07L87k13l6Q8r5k34K37j57L9K6N3k3
7762a5o4Q1P8l7O0N3j58k11J72j03R0P1K53k90k0l2q5J93k9R3J04p0k33Q6M2R6
$$ y = [-186, -14, 64, -95, 12, -92, -90, -8, -171, -5, -21, 17, 3, -10, 42, 223, 35, -5, -69, 68, -51, 82, -14, 76, 147, 71, 90, -239, 61, -24, 38, 41, 179, 76, 50, -24, 60, 195, 58, 113, -145, 74, 20, 30, -89, -116, -153, -172, -80, -123, 112, -251, -82, -46, 120, 43, -57, 11, -73, 32, 30, 34, 52, -116, 210, -34, 69, 4, 79, -10, 42, 53, 39, 113, 109, -29, 153, 16, -4, -40, -32, 157, -228, -51, -13, -171, -71, 122, -63, 105, -128, 41, 7, 128, -187, -27, 47, 137, -24, 50, 98, -13, 19, -105, -123, 16, 77, 41, -9, -13, 165, 5, 187, 24, 83, -92, 177, -187, 30, -24, -200, -80, 133, -254, -81, 43, 39, -47, 57, 165, -56, -10, 156, -5, 41, 145, 24, -23, 43, -132, 158, -65, -71, 33, 245, -74, -58, 32, 84, -242, 41, 199, -68, -30, -116, -1, 25, -116, 106, 20, -87, 300, 87, 51, 139, 44, -190, 47, -110, -71, -45, 8, -15, -79, 2, 80, 43, 103, 156, -2, -213, -41, -144, -54, 17, 270, -20, -40, -72, -157, 36, 7, 100, 204, 134, -99, -13, 29, 125]
7788A25k20J83k35K36k2J43k30k7J38k20L20k86m0J69o5l6l8J20p1J07j5j42K7
7811g9K30p4j64j15M8J12J71k09P2J89k44k2J32J85k37pJ19l3j16k0K1K02j74
7834a3p7K08j59J63k15J78j82K60L2N7l99L24J36l31o9K9J90k45M9J45j03L6r2
7857g8R3N6K7J30k17J44O9k63j37J57J12q3J6P2j64N6l0p5J68q4K09k12L8n1R2
7882D5q6J58k49J62j78J53K31j08j91j1N2j1k8N3k48K93j13J11O3j03Rp1K2J6
7906b9K9K23r1j18j13J50J71l4l21K33q6n4O5O4n4o7J36r2P5j3j08M5RO3l0l7
7932A6L3J22k46o8R4O2K4J06m4j56J25J75j82Rj47k7kJ66j38J0r0K55j14j76M11
7957B18k05J85m03K50J8k43K03K1K28k21j35p4J56J3j8m2n6K61o3M0o1J33r9n6
$$ y = [125, -95, 88, -147, 89, 67, 210, -20, -47, 91, -129, 191, -95, -135, 34, -31, -67, -105, 15, -56, 51, 36, -106, -79, 151, 77, -87, -202, -154, -42, 129, -80, -8, 181, -63, -85, 47, 232, -5, -12, 107, 74, -42, -62, -41, 161, -13, -90, 118, -41, 122, -93, 85, -97, 163, 195, 252, -147, 177, 313, -18, -87, -58, 132, -113, -64, 81, -22, 14, -78, 15, 71, 98, 228, 11, 155, 224, -39, -176, -19, 93, 10, 26, 98, -66, -10, -40, -115, 53, -31, 178, -34, 4, -47, 45, -41, 117, -132, 30, -148, 5, 236, 128, -63, -74, -22, -33, -61, -8, -256, 37, -76, 35, 98, -5, 4, -67, -45, -29, 0, 223, 132, 14, -99, 51, 222, 188, -133, 100, 14, -40, 25, 89, 35, -32, 104, 12, 87, 74, -34, 11, 20, 83, 53, 16, 49, 171, -75, -143, -49, 13, 37, 143, 99, -57, 68, 243, 61, 70, -77, -104, -106, 60, -78, -68, -158, 97, -17, -193, 218, 13, 198, -205, 45, 63, -180, 23, 44, 272, 51, -84, -158, -2, 11, -7, -49, -105, 156, 93, 133, 72, 205, 106, 50]
7981E0k01J08j47K05k7J69j68m7o4OJ07J4J33o8l2Q3k8j61p2K37k0j25j2M3L0
8006A3m6K43k77J83o0j14J36j03mJ33M2o6j93K18n6j39k0J78Oj37q5J63q6J44
8030G3L3l1k45J79J29k71J30O1j10j19L24l1k57J34l2J03k49J50J54l6lj14J34
8053A06j88K69k70K25j05r4j0J5L0qo9J9K04Q6M4k45J0J12k72J78L2j45L02j85
8077D1j4M5J07j90l7J47n1jJ9o9J49j77o0N9p8R2rK15j52k8p3J16k99K40m0K57
8103B09j40j81L5J69j91J03p1q1J57j00K14j19q5N4j65K16q5J79j01l9J28l5L3
8126A04nj4q8M9L8J11k73k5J3J09Q2j35O6K8k61K00J27J14l02J69j53J84l13L34
8150A59p9k01N3j46J13K6Q3J06p5K15j56j8n1L0J60k28j57J23J56l01K49J02k06
$$ y = [50, -151, -43, -190, 15, -12, 157, -11, -58, -122, -116, -9, 5, 138, 70, 38, 121, 93, -68, -140, 97, 77, -48, -60, -17, 13, -33, 210, -67, 116, 56, -58, 78, -25, -29, 104, 146, 80, -113, 105, 49, -90, -110, 68, 74, -63, -148, 15, -71, 73, 106, 75, -170, 9, 138, -133, -3, 58, -52, -171, 153, 122, -135, -1, -33, 70, -179, -29, 125, 89, 86, -28, 106, -82, 187, -83, 142, 37, -57, -67, -52, -22, -30, -99, -80, 124, 210, 254, 9, 19, 131, -141, 37, 69, -76, 226, 41, 27, 72, 179, -11, -48, 99, 48, 47, 66, -3, 146, -31, -91, -32, -110, -18, -27, 188, 36, 8, -65, 51, -248, -8, -48, 209, 69, -112, -77, 92, -99, 4, -67, -148, 9, -91, 123, 4, -81, -27, -192, 24, -61, 118, 17, -22, 106, 71, 104, 99, 85, -3, 46, 84, 195, -78, -103, -90, 19, 101, -34, 32, 60, -201, -1, 126, 240, -62, 107, -46, 138, -175, 159, 80, -121, -68, -214, -101, -75, 8, 114, 39, 254, 98, 80, 29, 59, 219, -9, -166, -43, 113, -188, 61, 163, -43]
8173d3M7j2j9Q0m1j28K13j55kj94L42j24L3J93k80P8n5K23
$$ y = [-43, 4, -8, -27, 53, 12, -116, 97, -58, -60, -254, 88, -36, -3, 190, -90, -12, -67, 156]
8191A56
$$ Imaginary data points
##PAGE= N=2
##DATA TABLE= (X++(I..I)), XYDATA
0@%%%%%%%%%%%qJ6j6J6j6K4l2M0m8N6p0P8q9J08j30J51j75K02k30K66l04L44l90
34b07M42m99N60o29P03p85Q77r75J081j197J326j466J618j785J967k167K388k629
52a377K897l197L530l905M330m816N378o033O813p763Q946j0468J2506j5387J9814
67A1268k7552M4895j55300N9756L13029j56179k18033J7053J94951j0669j28943
78e5724p558R5981K092k813k383n5980o8221N8704J37404P723j68786m9990J20911
91A1360N0272p3128l0484N0411L4155m5347k0244K2693k8032n149R2750K7957
103H7214j04672q0660O7310J05751l1891q5123K8999M5171l4113k6574J4481J3761
115c46J272J6769K4746n3925p4968O6056J01338m4735q6693L1005P6937m3890
$$ y = [0, 0, 0, 0, 0, 0, 0, 0, 0, 0, 0, 0, -8, 8, -8, 8, -8, 16, -16, 24, -24, 32, -38, 40, -49, 59, -71, 80, -95, 107, -123, 143, -161, 183, -207, 235, -264, 296, -333, 370, -415, 462, -513, 568, -629, 697, -769, 849, -936, 1031, -1136, 1252, -1377, 1520, -1677, 1853, -2052, 2278, -2538, 2840, -3193, 3620, -4143, 4803, -5665, 6841, -8546, 11268, -16284, 28611, -126689, -66933, 246096, 89917, -128116, -111063, 83888, 73219, -55724, -63282, 32699, 34791, 31978, 29595, -26385, -94606, -35902, 101502, 109225, -59561, -109551, 11360, 61632, -11496, -41980, 8431, 42586, -2761, -23005, -312, -28344, -33493, 59257, 87214, -17458, -98118, -30808, 74943, 43052, -42071, -13072, 32099, -2014, -28588, -14107, -346, 926, 17695, 42441, -11484, -86452, -20396, 80942, 36207, -50486, -19481, 57456, 13566]
127A3566r9116O4764J26208o5934j26174M7468J08910l9391j17450M0147J42514
138I5512k9383j40662rR8221K4333m9095j6124L4478j0256l2941L1242J5566m1183
151b0301R497N4606p876p8632k6417Q9119M7756p7437l6409N6417J5303m7592
163b1966j5612N2237K8558m9011j7269L8470j1321l0797K5195L5304j1044m1544
175a8800k372L3951j3829k1820L6285J3938l6570j6330K0802J5631k1886l677
187a4677M9473o875o9128R027O6200p13n9469n991P3864R759r5423k0286Q7912
200B3673L4130n5127m5603K6523M0494k0978k2535J9058K603M2J6708j3573l2859
213b7444K44M8326L4591n4444n3871M6078M5508l1677l6067J7822L8325j3571
$$ y = [13566, -85550, -20786, 105422, 39488, -86686, -39218, 69692, 30301, -87149, -47002, 95512, 66129, -74533, -74542, 23679, 48012, -1083, -17207, 17271, 7015, -25926, 5316, 20882, -20301, -10804, 43802, 35926, -42706, -69123, 19996, 67752, -9685, -46094, 10323, 25626, -21966, -37578, 14659, 43217, -5794, -23063, 15407, 4086, -26711, -1516, 33788, 22744, -18800, -21172, 12779, -1050, -22870, 13415, 27353, -9217, -25547, -4745, 10886, -11000, -14677, 34796, 27921, -41207, -32180, 34020, 33307, -26162, -32153, 41711, 51470, -43953, -64239, 23673, 57803, 2676, -42927, -16404, 24090, 3112, -19423, -365, 2238, 2280, 18988, 5415, -27444, -27200, 21126, 55717, 1273, -52598, -6520, 38988, 7311, -28756, -10934, 27391, 13820]
225A3820m1113J4139K1862j7578N379K4380q541l1668j0237M0109K4517l7778
237b709j6335K8207M189j5586p816N875J2036m872J626N531l0964j0575M3970
250A2577J8669l1916k8712J9004L8822k0597l8639K7640L2690j7232k3567j168
262a2429J7315K479j3788J3713O708k6389k314J7551J268o890m881J1955O881
275A1179k3587n02K2655n665p162R985L638r944j7845J1654L1557j6838k9071
288a9946J6273J6924j0194j9320J456K8382J213k6585K043R051k085O786J421
301E419k787k376n248J1031K647k0308Q485K0070q687j6353o741J3673J3587j7385
315d973m580J7551p597j0854O033O553M307p815k200J4589q570j4542J3239Q584
$$ y = [13820, -27293, -13154, 8708, -8870, -3491, 20889, 12348, -19320, -29557, 10552, 35069, -2709, -19044, 9163, 13352, -2234, -10050, -4175, 7861, 2989, 4615, 10146, -20818, -31393, 12577, 31246, -670, -29382, -10378, 28444, 7847, -30792, -3152, 29538, 12306, -11261, -12429, 4886, 7365, -6423, 7290, 13998, -12391, -14705, 2846, 4114, -2776, -7657, 4298, 11179, -12408, -12910, 9745, 4080, -3082, 6903, 10541, 597, -17248, -5594, 25963, 9125, -19946, -3673, 13251, 3057, -16263, -14807, 13575, 14788, -11797, -9754, -703, -2788, 3998, 5419, 2632, 256, -4992, 6039, 8686, -11622, -3137, 16933, 8246, -8107, -14848, -1175, 12412, -4973, -9553, 7998, 401, -10453, -4420, 2133, 6440, -1375, -3575, 11014, 2444, -12098, 1141, 9725]
329I725l450n098p312O755J109r983R789L982j1209K912K648k771m09k994J2178
344E872O942j9326j419J3798j355l051k410L421P382j2503o409J2472k642k736
358a964M240m784L0j402k689J0831k069p804R403m23n686J875j486P523L082j1505
374b828L116K112q212O853L571n158j172m878N081P070j2754o90J1992J89n58
389C734p342o055J3467N136m195k340r658M676J3830p781r563k30N878J2339r954
404A942j9206R120J3595K054m795j3241L991J2846k520o71k717o221J0647M654
418I478q870l536l934P612J2290j1801j1594L627M597R183m673j2337P363N172
432B577k663K286m624N31P104l928K428J316j0726K745P332P64O43j2360m822
$$ y = [9725, 6275, 1177, -6135, 620, 1729, -8254, 1535, 5517, -5692, -2780, -132, -2903, -3312, -6306, 5872, 12814, -6512, -7931, 5867, 4512, 1461, -949, 2472, 9854, -2649, -9058, 3414, 772, -1964, 2276, -2508, -2478, -3880, -6569, 4262, 2193, -5611, 3792, 3369, -2317, -442, -1928, 5595, 8677, -2828, 288, 2400, -5812, 1041, 4612, -546, -1718, -6596, -1515, 5555, -7199, -7889, 4103, 4292, 3734, -3608, -9663, 3804, 8940, 4745, 2405, -7253, -2577, 11253, 3472, -6091, -6321, -443, 11896, 1942, -17264, -8144, 5451, 7505, 2710, -10531, -6540, 6306, 3786, 3115, 398, -5823, 4824, 9478, 608, -2928, -6862, 750, 13040, 1239, -10355, -6728, -2131, 7052, 2379, -9958, -2595, 2577, -86, 2200, -2424, -1893, 5211, 1283, 3711, 5027, -5699, -2954, 4378, 5142, 5785, -6575, -11397]
447a1397J5245J622p388k221l463Q249N103p519J188k500k960J5233M054j4077
461h31j0342J459K3424R810l1114j6383K0880K2117m582l1590q702L3615J3464
474B1225k0436j6421M06K0524J2342j4135r960j819M323J9019K34k2181q299J1361
488c817K1958k76l5575q021L1594J5973j5382k6968J24L2021O006k2068o346O224
502d553J1597L595j2312j576L936l196R327L346j4038o183M566J3522M665k3095
516a0399o500K1722N272j2226q933O801J7563r939j7615J6323J3279j4279j2991
529a1922P147K3844m408l5571L085L3636L085k4712j7061J6420K5388j3319j9797
542a4185P614P206L359K874n994m521m352O803K2354r259l1216L292K7832J2545
$$ y = [-11397, 3848, 5470, -1918, -4139, -7602, 647, 5750, -1769, -581, -3081, -6041, 9192, 13246, -831, -11173, -9714, 13710, 23520, -7594, -23977, -3097, 19020, 14438, -17152, -25854, 7761, 21225, 789, -15632, -15226, 5298, 17640, 3505, -6455, -8274, -3951, 15068, 15302, -6879, -15178, -3817, 18141, 17865, -17710, -25731, 5863, 21836, 6454, -20514, -20390, 11631, 17637, -4431, -10777, -4553, 7044, 10639, -1673, -3249, 687, -2509, 6818, 10164, -3874, -10057, -5491, 8031, 12696, -10399, -16899, 4823, 10095, -2131, -11064, -4263, 13300, 3361, -14254, 2069, 15348, 1069, -11922, -4775, 19069, 14661, -20910, -17825, 15811, 18896, -5816, -22877, -6457, 18931, 5612, -14185, -6571, 635, 3994, 6868, 874, -3647, -7999, -1196, 21158, 11899, -19317, -16025, 11807, 24352]
556B4352k3021l0354J8102L4056r602k6388p667J6927K1948r821k0487K918Q180
569h57Q491M131j3239o370M521O841J1396j0015k1963Q037K0139L588j7393k0948
583b3641J5806K7965j2205k3591K501J9155R936j9502j1425K2039O374j7076k942
596f606J0467P188j1111j3734J6351J2509j8291q885Q472Q822K6j1752N98R505
610C559o391J061R500p003p599L732J1210O434j9147j2366K1643J1820j2594j4389
624a0530k442J7487Q639j5788p452L463N939J0412o476j2861L376P725Q434q55
638I071j6993j540J4214O038k237j4670q213J7937J0583j1139j4194l633J9415
651D639J2907k1216j3843J2403J4536J533j6278o365J6481L501p503p4k535J477
$$ y = [24352, 1331, -29023, -10921, 23135, 13533, -12855, -20522, -3595, 18353, 8532, -11955, -9037, -857, 7634, 11765, -1474, -7844, -3323, 3518, 14914, 4899, -17064, -9027, 11112, 14700, -2693, -23641, -7835, 20130, 7925, -15666, -13165, 5990, 15926, -3576, -15001, 7038, 13412, -3664, -6606, 3861, 11049, -62, -13796, 2555, 15064, -3227, -12112, -3640, 5182, 5208, -6544, -5946, 3559, -2832, -1771, 7729, 726, -6873, -3141, 8069, 14503, -4644, -17010, 4633, 16453, 3859, -10530, -12972, 4515, 13154, -2634, -10086, -6623, -684, 9728, 3252, -9609, -6233, 1492, 9926, 9071, -7922, -9462, 4752, 10790, 8553, -6117, -14330, 3607, 14190, 3051, -11143, -14776, 4639, 17546, -3670, -17513, -5110, 9426, 10959, -5319, -11684, 4797, 8298, 795, 721, -1814, -337]
665c37M436k752P50m317n680J0853K843j0064j037K289M540J880q308K927O107
680D130n560J790L986m258L83p43K467M603r458k951R336j879l461p77j328N143
696A423j003n382N298N6k807M887k316r85L826l049K044J222m860M222j14n896
712c434M711J88l223N81k678L820K887q944K669P205l526j114j307J773O676n544
728G40l856O466j350p19Q73n105L260K322m238J631k995j806Q171k966n276L107
744a741J168L589q86p333O005N178n799P74n42l2L640m753m14M191n348K67L236
761A200l764J684j53k635N123j493k570M347k620O59M757m578k69J988j754M344
777D266k992n871O194J16l424J371k844J855L020n236K543K230m698M371J369
$$ y = [-337, 4099, 1347, 2097, -2220, -7900, 2953, 5796, -4268, -5305, -3016, 1524, 3404, -4904, -1977, 4130, -1430, 360, 4346, 88, 471, -272, 2195, 6798, -2660, -5611, 3725, 1846, -1615, -2392, -3720, 1423, 420, -4962, 336, 392, -2415, 2472, 156, -829, 2997, -52, 1992, 3214, -1646, 2576, 2462, -3434, 1277, 1465, -1758, -1177, -3855, -35, 2852, -6092, -3423, 3782, 256, -858, -2165, -392, 6284, 740, -3116, 3350, 2000, 1281, 2154, -2951, 309, 2631, -1607, 24, -2971, -4777, 3394, 428, -4848, -1741, -573, 3016, 2130, -5203, 802, 5980, 181, 955, 413, 381, 4021, -732, -1146, 3045, -2303, -2036, 1200, -2564, -880, -1033, -3668, 1455, -38, -2608, 1739, -881, -222, 4535, -43, -312, 1676, -78, 4266, 1274, -4597, 1597, 1713, -1711, -340, -3184, -1329, 1691, -3545, -1002, 1228, -3470, 901, 2270]
792B270l131K556j762N44M716n566j133M254l271J680j48m669L728n27j850L810
808A501m512j564P160j944j596K73j434O646m74p713M071K750j622J184m952N78
824a648M808m082l60J015m287N078J540n292J538J47J805M380o816q83P198k006
840B135q75k72k631M811j168m549M293k551k518N392k258k170R48k166N212O09
856B242o850M243K546j929K604k855o51L867l006J249K065p007K600L707l869
871a044M14k001j14N369m451j530N125l447j00M345j574K73k100r36P743k707
887C265o992L902J418P2k45n378K584K802m453L530K1o077M459L190o08q99n491
904d900M891P523o991k673L095k33L013k263m058L068j712O27M311o709k816O540
$$ y = [2270, -861, 1695, -67, 477, 5193, -373, -1506, 2748, -523, 1157, 1009, -3660, 68, -459, -2309, 1501, -3011, -4575, 2585, 641, -955, -682, -2116, 4530, 4056, -3657, 414, 3164, 1542, 2726, -2226, -1648, 3160, -922, -1282, -267, -4554, 524, 2064, -3228, -1690, -1543, 262, 4642, -2174, -3057, 4141, 2135, 1260, 988, -1643, 3168, 2000, -2549, 1744, -807, -3325, 2067, -191, -2361, -1413, -3579, 1633, 2242, -4608, -365, 2181, 252, 2856, 1, -650, 3217, 211, 1460, 3525, -3482, -882, 2825, -1044, -630, -2631, -2745, 2624, -1827, -3357, 1768, -1679, -1779, 2566, 992, 1265, -835, -1771, 5972, 3265, -3727, 175, 1593, 1665, 1420, -3958, -1374, 1428, -3025, 505, 526, -5551, -1092, 2098, 1490, 591, -4900, -9, 7514, 523, -2150, 945, 712, 3725, 1462, -2596, 472, -1240, -613, 3698, -3011, -5827, 713]
920G13O42o82l100j383P440j766m903O002j66m302J891J420K670l758p597Q549
936A670N336r650k383L888K551jn959K912N356p536P03Q677l067n321p83O565
952B958P119j0551q454J0991N161n339m858k729O656K763n943R32r04k932P822
967B692J242n924j325M06O750L372r540r47M381Q75L964m417q451M653O352R70
983E053o113j0236Q810J2423r286q895M390P022K416q794p19J0151n065n873Q965
998D249J755o930m802M961J0865q291j4717J0834J1351q599q557K791J0370j555
1012C725j2292O673J0789r348n842P183O528k778j1739K976J4053n801j0191L482
1026b582L638J310k788l638M437j465k653O838j652n766L042K236K700m78o451
$$ y = [713, 1355, 673, -2427, -3810, 3630, 1864, -3039, 2963, 2797, -1505, 386, 1806, 4476, 718, -6879, 1670, 7006, -2644, -5027, -1139, 1412, 1411, -4548, -1636, 3720, -3816, -3113, 5564, 2497, -2824, -3607, 2958, 10077, -474, -8928, 2063, 7224, 1885, -2973, -5702, 954, 3717, -2226, -1294, -2198, -5130, 2692, 3934, -1990, -3315, -2909, 3841, 7213, -2327, -3274, 1107, 1982, 5946, 1529, -6922, -2269, 4083, 5053, -1060, -11296, -2486, 9937, 651, -8244, -3854, 3168, 5584, -3210, -3929, 6222, 1157, -4716, 4249, 6004, -926, -5728, -767, 10098, 1807, -12910, -2076, 9275, 676, -7881, -5090, 5280, 3725, -8567, -1894, 8895, -453, -6295, 888, 7416, 4638, -7101, -4125, 9928, 4127, -6064, -2582, 1056, 2366, -422, -4060, 377, -1088, -3741, 3097, 1445, -4321, -1279, 957, 3657, 3179, -3272]
1041c272K139M161r65K353n935o170R944N230p217p830R1J3586K243j7066K04
1056h504J3240M8o193l138N944M480q977R66J0833p422q743P678P822l450j3574
1071h990R95J7866l724j7136M754J1315m81q727l105J1677J364j2256M544R043
1085G139n406n227K411N900j63j0335K766R914p247n075M939J516j020l748R65
1100b671O662m953l725P205o92k954K474k60M22j095q81N329m601o307Q872K342
1116E167p953k248L353O625m002r599P714P275q265j628M997J429k528l909O423
1131B851M445j1497m89J1156k130q337j032O826M700j0688m019J2247m63q838
1145e268K054N017J365n679j628R931j435j0266N905O050m473m547Q93O603j129
$$ y = [-3272, -1133, 3028, 2063, 4416, -1519, -7689, 2255, 7485, 268, -7562, -7471, 6115, 8358, -8708, -8504, 4736, 4784, -1409, -4547, 1397, 5877, -3100, -2134, 8699, 1277, -7466, 212, 8034, 4584, -8990, -7995, 9871, 6147, -10989, -6235, 5080, 4599, -4128, -7233, 4444, 5808, -6448, -1904, 7139, 1733, -3494, -1083, 4817, 4654, -5681, -2915, 6999, -248, -5323, -384, 1132, 112, -3636, -2671, 3991, -962, -4687, 2518, 1826, -1128, 1346, 1086, 1508, 413, -468, 4861, 260, -6047, 2825, 5167, -2786, -5034, -1681, 4944, 942, -8657, -943, 6332, -1933, -3561, 1436, 2865, 337, -3572, 2851, 7296, -4201, -4690, 6466, 4336, -4001, -5033, 1793, 6493, -4195, -8214, 4033, 3570, -5268, -3214, 1803, 3168, -2511, -4139, 5792, 4357, -5909, -4, 6046, 1573, -2974, -2081, 4522, 3393]
1160C393r949M464P336o854k830L630K460j007n018L704O096p330j594Q087j584
1175C004m534L04L401L137p473k932R685j523p850K590L672k59l721k016P413
1190B898q07p600N629M458n138j401K290M071j710p149M925N787p857k032N435
1205A799j0k422l879M266M589p850k223R293r69n409L47M036L530o181k936Q814
1221D795j139p146L358L070j664l422j403O746j194q228M727N021m982j821K044
1236a238L399j40o018M059N771o812j333N239j11k135l293K116N222o280l256
1251d810O962j124m021J008J535K276l501k050P415j339o196M376K707j684j907
1266c53j121M809n37o942M059L843n446j365K195K162j031n167L387N914o065
$$ y = [3393, -6556, -2092, 5244, -1610, -4440, -810, 1650, 643, -4375, -671, 5425, -1905, -3499, 4588, 3004, -1530, -1226, 2175, 5312, -2161, -5093, 4592, 3069, -4781, -2191, 1481, 1222, -2499, -4515, 2898, 2091, -5509, 120, 4578, -560, -1961, 329, 4400, 2690, -4459, 466, 6253, -1604, -3636, 1799, 1789, -633, -4512, -246, 4343, -3507, -5730, 3563, 2594, -2815, -2468, 1568, 5098, -1083, -4019, 4795, 3656, -3490, -132, 2938, 1274, -2148, -3551, 3195, 2001, -6227, -1500, 3521, -1461, -3282, -1238, 2161, 2021, -3997, 62, 5833, -979, -2312, 2927, 2816, 681, -2612, -496, 4726, -1554, -4810, 2152, 1028, -2993, -1985, -450, 1826, -1675, -3725, 3690, 2351, -3845, 531, 3238, 1554, -353, -1474, 3335, 2798, -4144, -85, 3758, -1688, -3053, -858, 1304, 273, -4894, -1507, 4407, -1658]
1281a658j772N181Qj115j550R36M384m761k100O208k253l979J726J249J009l475
1297a962k597O984m37o542L448L060j868p78r87M169O06o184L603M036m755j006
1313a210J612J205j63m552J294N421n316j887M343p55m23j286M30M097k854k592
1329b636N473q11l076J853J89Q57j528k584L994q0m943K913J343k536P87j196
1345a981K252J179m505K888L189m254O78K286m68J65k404J072L862n218j234M578
1361B085j669j647j47J51L260l345k906N858J7l898J744Q34J217k69l248L482
1377A519J417m173J583J412k157N13j260Q79J680m054P91L138k459J8Q11n98K319
1394A379j180q61K614k037k25L133k620q02J402j021J772k022k118L592p02k559
$$ y = [-1658, -3430, 1751, 1759, 644, -906, 30, 4414, -347, -2447, 3761, 1508, -2471, -745, 504, 1513, -1962, -4559, 2425, 1988, -4554, -1106, 1954, 86, -692, -1679, 2490, 3096, -3088, 515, 4551, -204, -1210, 402, 1607, 1444, -3108, -1814, 3607, -1709, -3596, 747, -8, -431, -1717, -1287, 2810, -44, -2636, 2837, 2026, -1050, 803, 992, 1849, 321, -2263, 1731, 1651, -3292, -379, 964, -1572, -785, -1981, 271, 1450, -3055, -167, 3022, -1232, -554, 1732, 1264, 1429, -975, 97, 3959, -1259, -2493, 2085, 416, -1231, -1378, -1227, 2033, -1312, -4218, 1640, 1657, -2241, -497, 337, 1554, 1285, -1963, 1519, 2936, -1237, 346, 1758, -399, 114, -1146, -267, 1413, -2641, -1850, 1288, -1171, -1153, -342, -940, 1379, 199, -662, 1952, -85, -310, 2823, 203, -599, 803, -218, 1554, -468, -2586, 1006, 304, -2255]
1410b255K098m56m11J091j447K386L73l597K783K133k639L23p15J257J678l760
1426a158j93L121k221p33P94q31J805j698j358L873j083k259K600n42J145N90
1442A852l487K348J768k385O64q59m70K446k602r88K337j743J29J164k004J951
1458A21J58k383L453p3k168J474k13J158Q38m269J579L093k692n85m77j8K719
1475A715k551k033L408p48j138J369j025K184o74k620L800Q82l095N77L81J230
1491A662M12m293J158L674k704j802J109J34J687k414j586M571q54k747K068M75
1507E50J143j064k698L795J472m201N84J394k68M22l175Q82K971l137p88K117
1523ao23O86r81o31L803j368k892K924N52k53k20k430K565J582l882L12J135m92
$$ y = [-2255, -157, -613, -1024, 67, -1380, 1006, 1379, -2218, 565, 2698, 59, 382, -333, 924, 2602, -1158, -1351, 1770, -451, -1184, -390, -1221, 584, -1114, -2472, 1401, 318, -1941, 659, 117, 1262, 1852, -1635, 713, 2481, 96, 760, -99, -569, 1877, -725, -1713, 624, -1119, -990, 174, -1830, 121, 279, -2104, 1349, 1276, -892, 582, 369, 1527, 2365, -1904, -325, 2768, 76, -509, -986, -1004, 1715, -836, -2869, 539, -209, -1347, 22, -1003, 1181, 507, -2113, 1687, 2569, -526, 51, 432, 1662, 2074, -2219, -1061, 2613, -91, -1893, -784, -650, 1037, -1377, -2963, 1608, 754, -1993, 75, 550, 1693, 629, -2069, 1726, 3198, -1003, -419, 975, 707, 1129, -2046, -1164, 1807, -1330, -2118, -1, -624, 62, -919, -1550, 2253, 885, -2007, 917, 1469, 1216, 996, -1434, 1131, 2713, -1169, -857, 278, -214]
1541b14O68k214l26L363k204j035K514q17M66j95r03L155o25l325K477J136j130
1558G91j98k134K188J759m257P5K376r63j84q12j81L241k340j398L564n89j182
1575b44N61n28K480p13l163K543R23k458K83l99O83J071l221P23K506k210J92
1592i71Q42l98K060j611j259L408j074j219J391j043Q72K05k552J636N44k344
1608a513J533o75n90J843k151K91K241j619P9J073p57J698r10j290K283l16j430
1625b10R00j116P51N02k761J382J683k580O18M71o93J835j728r1K671j520o80
1642e66J679p06Q92m95j588K366o28k305J930n96m65L99j752J477J241k733J235
1659f15J209j314J213o81l03K074j495J8J660k126N61J032j712Q28k49j294J473
$$ y = [-214, 454, -1760, -2086, 1277, -927, -1962, 552, -265, 201, 6, -897, 2258, 1633, -1692, 785, 1921, 791, 593, -1541, 647, 2406, -1851, -1776, 600, -363, -547, -1359, -1540, 1701, -639, -2037, 1527, 938, -244, 317, -211, 2269, 1556, -1607, 936, 1859, -599, -316, -715, -32, 1039, -2182, -1459, 1047, -1163, -971, -129, -527, 1533, -78, -1337, 2071, 997, -222, 1169, 126, 998, 1203, -1349, 287, 831, -1513, 20, -655, -1245, 598, -1553, -1262, 979, -640, -561, 512, -245, 1453, 543, -747, 1536, 1220, -210, 690, -426, 325, 827, -1934, -552, 1131, -1449, -831, -360, -1053, 782, -946, -1037, 1634, 114, -566, 1113, 407, 1299, 804, -784, 1582, 954, -1351, 579, -17, -482, -83, -1835, -358, 883, -1850, -615, 594, -720, 493, -188, -491, 1583, 88, 106, 1766, -360, 201, 1233, -479, 349, 100, -1194, 279]
1676B79p50p47J640j509k4J780j275M15P86j159K010n55j652K362n21j295R19
1693G04q67M46J95k118J654P58k557J156M75n12Q23j359O91K193k224n0J917j070
1711B55O23l29r53K004j082j669J941p78q60R06j221R02M87k085J732O29j600
1728a098J410j0o84J866j529nJ612j787O28J006k258J278o7j499J230p65n61J719
1746D86j646J86J696j459N33Q93r50J246p31q89K504r73j552J536q35j29M84j824
1764a424J468K67k246J756K10r59R74o54M17J634k079L33J976j625O05l9p38J467
1782A343r01j322J960j419o01J202j290M23O65j383J126L44j113J486j43r26K023
1799A474j154k37J323j644O91M27k010J402J12j445J257r80n8J575j930KJ822
$$ y = [279, -471, -1218, 422, -1087, -1111, 669, -606, -191, 595, -564, 1446, 891, -761, 1601, 1080, -215, 704, -163, 283, 478, -1640, 14, 772, -1785, -629, -154, -666, 157, -1202, -511, 1682, -542, -592, 1325, 255, 878, 549, -404, 1600, 518, -1151, 790, 12, -848, 58, -1163, -261, 226, -1859, -127, 502, -1098, 312, 302, -382, 1484, -45, -50, 1562, -225, 403, 1409, -849, 429, 362, -1137, 93, -672, -1233, 486, -1160, -974, 722, -737, -204, 689, -261, 985, 254, -635, 1869, 896, -656, 880, 45, -84, 400, -1424, 44, 311, -1935, -179, 31, -928, 46, -608, -191, 1443, -636, -303, 1673, 48, 653, 614, -124, 1343, 442, -880, 1080, -339, -940, 262, -1028, -605, 60, -1323, -197, 147, -966, 520, 377, -549, 1474, 320, 83, 1406, -238, 453, 880, -1130, 272, 384, -1061, 196, -784, -842, 733, -1197, -1195, 627]
1816F27j199L57Q19p52J497r00j001J999o26j343J293p47M11J66j992J149Q03
1833E61j819O70M47o58J304j434L58J968j481j78J361q02O02k38j093J458k52
1850G74j535J158n86p3P26j873N94J222j517O86N46o56J303p74n95J912p35m67
1868A10O78r48Q63J32k026J467M41j787O40j50n9R34j559L06J999j453k91R41
1886B38j04Q89r09p83K382q52j321J043l45M73m75j605J592L62k206R95O95o91
1904f22Q00r82L26K042j802j57J656j167P33l12j303J872p34j235J225n47l60
1921e67P08j543O74J212j681O48L33l77J350j139k91K262j127o77R49o68P29k47
1939E48j724J782L19k015O81J33j22L87j355P78J847k044M7J439l16M38q85k46
$$ y = [627, -572, -215, 604, -148, 1349, 449, -552, 1447, 821, -522, 771, 24, 435, 601, -1391, -242, 561, -1258, -588, -141, -799, 505, -929, -571, 1397, -84, -262, 1099, 297, 899, 661, -432, 1026, 774, -761, 397, -189, -262, 464, -1409, -815, 407, -1110, -424, 122, -534, 769, -5, -600, 1312, 577, 110, 788, -160, 703, 835, -1191, 276, 717, -1070, -430, -580, -639, 295, -1264, -958, 1041, -412, -703, 238, 134, 1023, 114, -669, 1713, 861, -460, 583, 238, 711, 236, -1369, 223, 585, -1621, -626, 69, -622, 178, -804, -478, 1564, -238, -395, 1261, 94, 827, 515, -788, 1084, 350, -885, 340, -207, -567, 141, -1402, -728, 484, -1197, -549, -216, -593, 757, -382, -673, 1589, 462, -215, 734, 66, 795, 548, -1176, 606, 925, -1090, -409, -276, -398, -11, -1366, -588, 1259, -785, -738, 701, 385, 823, -62, -308]
1957c08K202j604j183J553k66m23J4j188J680Q9k417J408O69r93P46p14M66J548
1975A279j687J25J587j026N19j95j068J587p35j317J192m29k85O34j580Q36J023
1992D60j731R26M54n15J049p89l63K101j164q15J503p51K11k97j182J827m74j991
2010a541J306M71q01M34r53R01J296k444Q62J312q49L03n5j04J788j659q49J905
2028A323j110p67O88j084J304l45j590J761j57j155J004k06j24J239j451Q61J024
2045A215j482Q03L36j282J103l32j050J326r84n9P06j492Q15R52j618N86P91o91
2063c57R66r18k0K208j840l80J390p41Q8j38p26J533r79j837K187j1j477P61l20
2082f11P10L87k031J533J208j804P11P03m42O67j196LJ364j737k55J503j163P4
$$ y = [-308, 1894, 290, -893, 660, 394, -29, -15, -1203, 477, 566, -1851, -443, 226, -767, -21, -735, -269, 1279, -408, -283, 1304, 278, 797, 602, -466, 1121, 386, -931, 261, -168, -453, 181, -1399, -563, 460, -1271, -345, 109, -406, 643, -146, -509, 1592, 428, -387, 1116, 365, 576, 279, -903, 924, 450, -1541, -235, 236, -565, -131, -1084, -183, 1113, -1331, -469, 843, -6, 297, 242, 138, 1926, 267, -582, 1323, 213, -554, 134, -950, 354, 9, -1581, 180, 23, -1132, -128, -334, -458, 781, -670, 191, 1215, -267, 536, 872, -410, 693, 361, -689, 637, -347, -406, 300, -1192, -377, 575, -1043, -457, 334, -357, 609, -309, -329, 1879, 39, -341, 1049, 308, 396, 258, -468, 1065, 86, -1751, 436, 425, -1052, -291, -611, 99, 486, -1545, -12, 1196, -608, 103, 806, 364, 1031, -165, -162, 1202, -535, -790, 713, -450, -376]
2100c76P3n39J342r44o54J538p40m42J497o93M5O00q71J033j25j730J826L0j426
2119e56O10l86K4L54j364J196P91k001P84J307q98K27m59Q17J155j902j90K049
2137A558j058n11K84j1M17j155p69J974n66j628J171J98J0m7r75J897N9j971J567
2156D44P37j164M87l41L56K48j284M48Q01j762O92P53j016M36m10r7J248j272
2174f96K36J557j106k52Q92n9J54n59o36J739p83j796J793p9j012J32j54J109
2192D80p27j609J915J009j894L48Q18K74k4j503J175J539k223L0J627r25k65l86
2210c41j53J225j561m14K033r17r40J045k41P94k51j195J912j19j373J304k3r33
2228a48N78p85P66J24j759J018P56j782O72O51m71L13o35N84J256j815N73J539
$$ y = [-376, -303, -842, 500, -444, -1098, 440, -300, -742, 755, 62, 107, 707, -164, 869, 744, -986, 840, 870, -556, 54, -332, -308, 46, -1318, -122, 669, -1332, -548, 759, -139, 88, -371, 446, 1601, -301, -491, 1558, 500, -11, 273, 262, 679, -476, -1245, 729, 163, -1465, -294, -96, -86, -133, -1108, 789, 848, -1123, 444, 1181, 17, 504, 163, 519, 767, -517, -69, 732, -1030, -338, 415, -601, -165, -575, -672, 576, -696, -460, 1097, -9, -261, 631, 572, 726, 167, -469, 1270, 487, -1309, 484, 405, -607, -475, -629, 480, -247, -1856, 59, 1068, -826, -478, 340, 614, 590, -913, 262, 1801, -422, -392, 1235, 310, 45, -341, -494, 731, -830, -1244, 789, -128, -1068, -23, -264, 530, 279, -916, 996, 877, -496, 808, 785, -148, 430, -355, 411, 535, -1224, -206, 550, -1232, -560, 91, -380, -67, -702, -118, 1138, -677, -104, 1435]
2246A435j119l04L00J0P14j366p66K285j103j365J385j97O2n02o49J966m29j771
2264a414J596P17j068M91j50O59M00j888R07J086j814J4P36q47N02p16J18J371
2282G00j494n7J555r65k1M75k49J071j065k45J657j083j049J426m78j86l0n66
2300f04J100o85j237J584M21j653O82J45O57j15j316J299J283j852NR86l89J17
2318D28p59Q1J292j701m91J605o97m97M78l28R08k65q23J562m57r39J370n84o3
2337A20N15p85Q25o6j324J204j65j340N10K50m0L00r51P79R67j799Q87J111r91
2356GN2n4K85P16j416k6J628j090p89R17l54L27p40o83J814n69j145J152J93q9
2376A36k4m99J069K56j616J080O59j172L35j26q7O01j186J0J259j349lR32r71
$$ y = [1435, 316, 12, 312, 322, 1036, -330, -1096, 1189, 86, -1279, 106, -91, -29, -531, -1180, 786, 357, -1414, 182, 899, -169, 322, 172, 831, 1231, -657, 250, 1336, -478, -464, 272, -575, -73, -789, -671, 700, -794, -851, 704, -261, -282, 193, -56, 1015, -50, -295, 1362, 279, -770, 656, 178, -8, -38, -604, 496, -189, -1426, 158, 579, -1074, -392, -247, 410, 295, -1021, 278, 1561, -291, -286, 700, 311, 428, -331, -250, 1042, -659, -1150, 455, -242, -739, -261, -589, 319, 54, -769, 793, 336, -603, 767, 183, 120, 635, -150, 675, 609, -715, 489, 324, -1016, -506, -256, -296, 4, -947, -168, 799, -1000, -113, 998, 7, 59, 5, 290, 1006, -410, -436, 1192, 102, -687, 230, -124, 203, -537, -1220, 594, 25, -1120, 32, 225, 136, 112, -387, 682, 938, -678, 402, 1061, -111, 224, 98, 11, 612, -574, -564, 695, -654, -657, 275, -696]
2395f96O83j1l56R36o17l87J579j130j80R18n86J19q4m55Q15q04o61J203j97j160
2415a071R41j13K71J41j148J429L83j487Q22L38n3N8p79N20R48j713L7R68n85
2434i3j62ol59P65p20n57J776n18p75Q24l8K38M53j165J235j42j157P57j18n98
2454c60Q65q77r5P01p97L54N01j145O02M22n69N47L2NL91q30M28P80j170K18N51
2475E54r43L43k24m46J331r51p70J354n73j24M87m52Q85r0j014J346lr86R77k50
2495D51l50N94j277O17N50j270M00J72n24P18l17l26R32m73k31Q34n55J25N96
2514F66q44O18K5n52O16l59n31Q30o30l22P95r40K38M64o88P49N2p17Q75q4o05
2535c44J022o65K76M70r63O21L12j373O92J38p24O01l15j63N88q61J73J002n55
$$ y = [-696, -13, -24, -380, 556, -61, -448, 1131, 1, -179, 739, 153, 272, 188, -267, 548, -256, -917, 286, 89, -1071, -130, -243, 28, 169, -979, 450, 833, -654, 168, 506, 453, 511, -268, 252, 1200, -513, -476, 492, -93, -255, -261, -620, 145, -575, -1132, 644, 126, -649, 175, 137, 375, 828, -337, 898, 756, -401, 356, 238, -360, 505, -372, -467, 234, -563, -209, 292, -853, -251, 171, -398, 149, 181, 186, 577, -253, 175, 955, -215, 3, 554, -389, -46, -270, -716, 615, -336, -1106, 248, -325, -449, 38, -414, 471, 381, -633, 713, 710, -276, 701, 451, 101, 695, -582, 35, 585, -685, -285, -113, -637, 81, -236, -562, 370, -103, -334, 500, -55, 70, 666, -178, 440, 465, -87, 529, 170, -361, 469, -161, -483, 312, -628, -390, 74, -614, 135, 187, -530, 345, 261, -344, 678, 13, 289, 759, -204, 417, 729, -644, 48, 186, -538, 63, -252, -415, 173, -688, -515, 487, -68]
2554f8J79K33o40O49j01m93R57n97l19P81o77O6L86q54N83M4q34O10L1p41J076
2575B71n43J10Q25r67L36O35p03M75r3n84R16n49l20M47m46n1K39l93J21L08p90
2596g56P70J7l21N73r6l42P37n15m00R38p41J46K41o00N66j15o14Q49m30l14K24
2617a83p2KL41p49Q99N58j144P03J05k37K58j19m45O92o53j52M81o76L48K33o96
2638e06O88k07n16P99l25q1O35o00M31M66r02K29N15q30O34m25m00R34o76m63
2658f00Q78p08L31k44l47P93K44q09R20k60o5K87m29J74N07q71PP58n43K78l31
2679c0m58P45o33m78R50j64l15K50l36P33J84q77R66r1m60M45k91j90Q11j123
2699c62J78O69q95M69r3m15O94m97j87N64k3n09O33l03O38l29n07O41J12n47L24
$$ y = [-68, 111, 344, -296, 353, 252, -241, 716, 119, -200, 581, -96, -30, 356, -498, 85, 129, -705, -95, -64, -805, 271, -272, -162, 663, -304, 32, 667, -36, 439, 346, -238, 678, 129, -191, 256, -190, -241, -2, -395, -274, 34, -756, 14, 31, -290, 283, 187, -155, 582, 67, -333, 605, -136, 10, 251, -349, 217, 102, -512, 337, -93, -407, -183, -255, -253, 88, -661, 238, 796, -348, 355, 460, 223, 481, 362, -83, 609, -44, -196, 285, -391, -43, 190, -506, 182, -25, -541, 258, -67, -148, 487, -113, 318, 784, -118, 111, 626, -204, 430, 5, -395, 539, -137, -600, 278, -430, -99, -343, -690, 103, 347, -462, 458, 198, 133, 420, -9, 165, 672, -199, -192, 566, 23, 301, -30, -488, 257, -376, -854, 96, -68, -383, -133, -469, 264, 448, -429, 537, 446, -14, 431, 140, -50, 761, -362, -184, 485, -410, 59, -34, -449, 245, -252, -439, 125, 102, -407, 226, -77, 561, 232, -275, 366, 478, -69, 255]
2720B55l12k93Q38r23p5N67k34p6P2l11P43lr22Q38K01l62L07k87K49L71j318
2741f75Q56J79m33K51j91j85M66o59k94R46m95j43L97j98N70r1p63Q02K42o28
2761d6M69j92r3K98o97L84K11q00J85M33m33K76l46j54P70l87j18O43n36K27N08
2782F02q28L10M13p09L80Q9l39J49k74j00M72n49j00N45m27O21m76k13J027k21
2802C72o72N00j73L82P8q96O47J40n76N5K5k8K35n16l7Q47p73j84P60m3k0j4m90
2825c81R64k99n79Q61l37L4N6o63K73K04p40N84O9n56L88l4m11J047o62k22P00
2846B96l80L36J04n62N27J15p03L87L1k11L90n90j46P33r27J39M61j65K40k13
2866a38k82J027k65n18M79L1n4j02m33M78K67r63N10N90j129K88j46J59K42o57
$$ y = [255, -57, -350, 488, -435, -510, 57, -177, -253, -181, -492, 251, 248, -674, 164, 365, 3, 310, 23, 272, 643, -675, 181, 360, -73, 178, -13, -198, 268, -391, -685, 261, -234, -377, 20, -178, 392, 301, -462, 340, 582, -46, 423, 231, 138, 436, -261, 123, 334, -466, -281, 152, -281, -5, -351, -505, 265, -122, -240, 403, -133, 94, 602, -226, 84, 497, -212, 168, 257, -82, 67, -207, -307, 165, -384, -484, 61, -366, 255, -221, -434, 593, 372, -300, 200, 27, 409, 487, -409, 238, 378, -198, -143, -118, -146, 89, -427, -464, 383, -390, -574, 186, 143, 123, 109, -381, 583, 284, -295, 566, 229, 263, 319, -344, -71, 133, -607, -23, 46, -510, -122, -156, -567, 480, -182, -404, 296, -84, 252, 356, -206, 321, 436, -267, 120, 151, -60, 330, -260, -406, 327, -600, -461, 0, -165, 75, -138, -420, 607, 342, -176, 303, 334, 280, 178, -255, 223, 490, -473, 37, 627, -502, -214, -360, -201, 41, -616]
2886f16L02P46m74n2K76k20N44l39m99O65l2n00L47j46j74L63o05M33Q8n25L27
2907i1j56j01M30l88J42P11n90J47L81l96M63k16o61O80l3l34J3m48M89R2o54
2928e20K91N02n88M55k16k44Q27m70l34R71m67j48J62j56K78j25p74Q27K5p63
2948d67M04o0o6K61n14M65N39j005K89N45m38K56Rm96R21m55l17O67m16o4J83
2969B41n77K33K09q05N91R3j05M5j07Q5M90m45mO24o98L07N9n46Q52m71l83L04
2991hk46L43K7n94L56M26p58M81K00k74K24l81K41P28n90j34L89m02J67L6l38
3012a07J67k4p38J084m03k16L10l60K94J39l15L41J45k65J35j8RK44n25j02O77
3033D72m12k75M31o00M88q4l95N71m70k29M84N5M7K76n54K89L66n41L46R0n27
$$ y = [-616, -314, 432, -42, -94, 182, -38, 506, 167, -332, 333, 301, -199, 148, 2, -172, 191, -414, 19, 107, -418, -91, -247, -348, 82, -306, -164, 547, -43, 104, 485, 89, 552, 336, -325, 355, 322, -12, 1, -447, 42, 134, -520, -229, 273, -315, 140, -76, -320, 507, 37, -297, 674, 207, 59, 221, 65, 343, 218, -556, 271, 296, -467, -63, -123, -189, 72, -442, 23, 562, -443, -154, 391, -47, 209, 218, -278, 643, 188, -129, 538, 122, 58, 241, -336, -103, 106, -699, -108, -15, -120, -75, -182, -97, 393, -52, -56, 568, -130, 177, 236, -310, 542, 71, -312, -8, -254, 89, 116, -478, -122, 304, -454, 27, 227, -47, 177, -204, 37, 765, 175, 41, 430, 28, 195, 231, -107, 60, 36, -702, 382, -21, -237, 73, -287, 7, 146, -169, 172, 317, 52, 187, 169, 178, 422, -103, -205, 472, 60, -215, 216, -384, 104, 20, -375, 196, -274, -503, -19, 36, 83, 359, -195, 94, 460, -81, 265, 355, -172]
3054a72K91k79j67M97k39j55L42l29R4K58m80M31J48m32N80l01j45M01n61L25
3074A07L10p96M27K31m29J88J26n43M45k50J1K62n73J61N25m17J61K91n95O41
3094B83J28m60L97k80k56R56j057J32L6j12J08p9l0K53J4n18R76m71n0R3n6K96
3116C03j34j32K75O8m46J05k08j57L92l44K50L03p00l7L13M3K07J29n03N93k49
3137G1l5N15m58n2L00l96K0M47n63K92Q5q04M82J34k97J63j05J4K41l15M67K21
3159D27o79M81J75n26M73k75j38N72q68J61L37n52K52P3j78N04n95Q5N62m46j00
3180b55N05mj50J67l10L73j4n37N93k66k73K0m4k97N42l90J79K06j52j7L49k49
3202b4L02l01J64L95o00o1O57l56K4j71l58M90l2m32M17q5l60N65n41L24K98m34
$$ y = [-172, 119, -160, -327, 170, -69, -224, 118, -211, -117, 141, -339, 92, 240, -192, 388, 87, -58, 343, -218, 107, 417, -379, 48, 279, -150, 38, 164, -379, 66, -184, -173, 89, -484, -323, 202, -215, -54, 237, -358, 283, 411, -49, 348, 68, -188, 768, -289, -157, -121, -233, -125, -204, -234, 19, 33, -485, 491, 20, -30, 63, 7, 303, 169, 37, 312, 380, -66, 39, -169, -326, 66, -278, -28, 275, -425, -462, -149, -106, 101, 230, -273, 320, 71, 36, 551, 93, 41, 341, -55, -35, 412, -151, 141, 226, -578, -96, 38, -259, -96, -201, -187, 54, -261, 206, 427, -252, 229, 404, -122, 351, 76, -62, 510, -358, -197, 140, -412, -160, -87, -265, 239, -356, -271, 291, -155, -255, 250, 246, 96, 263, -47, 326, 312, -225, 368, 102, -171, -151, -195, -492, 50, -340, -161, 45, -107, -124, 225, -24, 278, -23, 141, 536, -64, -125, 532, 176, 200, 29, -329, 161, 129, -303, 114, 29, -331, 234, -307, 17, 315, -119]
3224a19K18K50o46P34m9m15N26l19j27J28k87L8K26p08L71j2k29J49N3k3N06n75
3246c10J91N46k48k66J70j6J86j42m61Q16n26j05L56k31k37K28k76L62O9m58L41
3267a1L03o23M60j01m4J15j78P5M23o31L58J18n15L94l0l99L57k78m5N71o33n
3289c19J73K15M9N6l15N94k77n45N95q3j88K69k82J02m1l47M62K32p65L76m6j41
3311b26J43J3R3N44o44o0O07l94O6N2j11L12p01P8M10k96j31K48j18j1l8n8J61
3334f1J72l21N13L6m01M58k35K7m6j90j7L84m04K1L67l52K42n29K27K91l72l0
3356b20M83o32M13O2oK84m38j43N66j74l49N51l26j43m2k69L40K00n59L68K05
3377A71m35K02J43rK99n77J58N36o03K39J31k56L33l01m29O61n39j07N79l88L43
$$ y = [-119, 99, 349, -297, 437, 388, -27, 499, 180, 53, 181, -106, -68, 158, -550, -179, -191, -420, -271, -218, -241, 265, -310, -119, 427, 179, -87, 83, 67, 253, 111, -350, 466, -60, -165, 191, -40, -277, -49, -325, 37, 106, -352, -11, 292, -331, 129, 28, -16, 99, -79, -4, 419, -212, 146, 264, -251, 143, 113, -286, 71, -207, -252, 319, -314, -319, -146, 69, 118, 174, -141, 453, 176, -369, 226, 143, -45, 224, -58, 44, 3, -344, 118, 350, -415, -39, -85, -226, -83, -70, 23, 567, -77, -137, 470, 76, 142, 194, 83, 395, -306, -228, 182, -114, -245, 3, -115, -126, -164, -222, -61, 111, -210, 303, 339, -62, 396, 161, 188, 142, -48, -65, 319, -85, -64, 303, -49, 193, -336, -109, 182, -190, -220, 263, -369, 44, 106, 100, 384, -54, -197, 369, 195, -154, 397, 71, -72, -114, -383, -43, 157, -402, -34, 171, -264, -62, 81, 72, 371, -206, -48, 488, -115, 124, 255, -1, 332, 31, -398, 263, -276, -383, 196, -192, 151]
3398A51k39k16M87k25j76M41k09kL17j32o8J43n10M0K02m38O72k1n52L60j58K7
3420a06Pj99K85J79m04K06M27m15KL5KM40n75j4N33m31p1R6k22J45Jk99N11r8
3444C5l46P5K22p4K01l56L20j1k61J49L2j08L67k57l02O46p08J68L02k35N3o6
3466a54k36N12j18j98K25K19k40K35j13r4K70l23m3J52Ok4j41k90N77k56m21N76
3488A21l57L03J5m00O85j38k94J42K08j70pl43J69N11k54m99M52k58K12j29p0
3509a01N5q7K57qj25M4L17n51L44J86m69M97J1m84L7q3J35K03k78j42M8k4N8K75
3533A15l39K03K9k11M23k44PJ51k58K41L28k34K9j77j36L2N4n19O01j45Q1K79
3555C10j88j40J5p3J96N1j54K39L0m28M44n55K94J28j79j63K95l28J53J14r2Q
$$ y = [151, -88, -304, 183, -42, -218, 223, 14, 12, 329, 197, 129, 272, -238, -198, 4, -434, 238, 217, -335, 25, -133, -106, -99, -298, -13, 166, -238, -32, 395, -20, -18, 17, 19, 459, -116, -130, 403, -28, -99, -3, -225, -80, -79, -378, 133, 35, -311, -236, -14, -88, 113, -243, 77, 66, -195, -46, -14, -122, 245, -12, -314, 332, -376, -208, 94, -141, -88, -154, -390, 122, 4, -194, 31, 250, 10, 245, 132, 38, 308, -15, -58, 94, 100, 76, -65, -355, 222, -34, -455, 121, -236, 67, 82, -318, 367, 229, -65, 77, 285, 115, 108, -235, -66, 445, 191, -308, 144, -114, 98, -31, -101, -46, -133, 124, 116, -9, 35, 352, -199, 145, 331, -138, 359, 370, -114, -77, -160, -25, 178, -100, -242, -194, -218, -160, 115, -224, -21, 8, -203, 220, -24, -17, 134, -124, 117, 445, 211, 240, 63, -73, -41, 13, -506, 95, -50, 31, 310, 122, -18, -3, -76, 120, 171, 17, 256, 286, -142, 302, -253, 41, 169, -10, -173, 122, -206, -53, 61, -31, -23]
3577b3l6k68M46k54J21K97l06oR0l24M89n0m18M13q4l27J94m5j20M15l00N2J18
3600G4l37L08J23j60K18j38M8J70j34l29L53l04K62j59j90L0K31l92K55J05mj06
3622g6j28J9J43K90j64J39j64K09j31l70L96k47l1Q7P5j92L54k98J98j78P6J47
3644A54k43J07P5K8k53Q1K08N1j13j35K53K2l30K71P6k80J56j82j72L75n10L44
3666a7J68n49L03m4J79P6jp9K23m6j43K53k07P4j66j33K48m8k79M01j53l13J64
3689h9J5K7K85k90n4K68n2Q4J01l16J77m9l43M10j85R7K4j56k9J81l17K22j3k48
3713b50K85q5J08K22k31jJ77k55J34N4m23L49n0k90K48j30o0J86k28J20M14l03
3735ij22K71l97K09rOL77k55j83N00p41L10J38l30M46l87Q5L21m04N3Mk8J46O6
$$ y = [-23, -59, -327, 119, -135, -14, 283, -23, -29, 61, -263, 226, 176, -242, 171, 87, -240, -46, -91, -211, 204, -96, -44, 74, -263, 45, 168, 8, 226, 88, 136, 306, 172, -157, 196, -108, 154, -5, -195, -165, 66, -326, -71, 34, 30, -76, -204, -185, -42, 248, 84, 223, 59, 268, 137, -233, 163, -84, -115, -28, 47, -145, 209, -89, 109, -69, 7, 154, -89, 18, 93, 121, -132, -51, 157, 208, 95, -40, 213, 235, -95, 176, 252, -28, 128, -54, -226, 149, -361, -17, 151, -398, -95, -139, 40, 116, 115, 36, 259, 213, 70, 323, 116, 190, 24, -109, 139, 91, -188, 213, 60, -253, -89, -74, -47, 238, -52, -106, 162, 110, 194, 295, -21, 156, 107, -236, 174, -11, 86, 110, -46, -75, 106, -211, 11, -2, -250, 35, -50, 58, 280, 49, 48, 225, -30, 104, 158, -265, 84, 34, -256, -8, -138, -198, -12, -240, -120, 294, -9, -131, 140, -257, -48, -57, -51, 326, 71, -112, 388, -353, -43, 95, -235, 211, -176, -91, 230, -174, -121, -117, -145, 1, 67]
3759F7k62K36K4k79L09j26M7P5J4l7L00m60p0L23l67K69R9m84K07m6j56K34K0
3782f3K39J62n82N18k22J5l6K19k97O0K21k79M0j55K4L9q4J77k9j47L95n9k93
3805a37M4Q8K5j8m3N0K78m24J99Q4k94Q7j93R0J06j24J6K30q6j52K71l55K43M3
3829B8k04M36k3l31L61j13j99J65k68K61j92M4O7J11m16L96j7l06K78j91RJ80
3851G6Pk05L31k47N9L0L5n2o0j53L27k62j56K88j53M4k04O8L06j09k02L23Q9k48
3875f8J49k77M08M0k32n5K33j71K03k13k04L48k12j37L34k97J85J99l17J78m1
3896E3l25M69j68j12M64l34p0K68k60J01N7m28K45Q5j87J40k1j25K07k0k4P1j84
3919i8K29q6J9o7K01j43J41j05k94L66l37qK85k66N6j43Q6M30j35j40K63j23k55
$$ y = [67, -195, 41, 65, -214, 95, -31, 16, 91, 105, 68, 368, -92, -162, 161, -206, 63, 162, -322, -115, -161, -317, -83, -63, 176, 338, -244, 274, 52, 67, 31, 250, -47, 13, 234, -45, -5, -160, -136, -97, -181, -4, -33, -180, 215, 156, -137, -93, -5, 20, 2, -41, 9, 287, -137, 62, 146, -148, -61, -254, -164, -58, -182, -166, 64, -22, -174, 97, -258, -15, 28, -176, 260, 237, -94, 267, 154, -45, 120, -148, 113, -79, -35, 32, 143, -273, 123, 106, -200, 78, -113, -104, 76, 83, -122, 209, -38, 21, 51, 86, 34, -26, -179, 148, -114, -270, 18, -135, -91, -295, -227, 79, -30, -232, 91, 180, -68, 81, -196, 212, 252, 20, -35, 198, 27, 230, 17, -187, 161, -51, -188, 146, -151, 34, 233, -84, 94, 53, -272, 197, 29, -83, 381, 47, -23, 245, -15, 86, 143, -285, -40, 45, -142, -2, -23, -148, 59, 39, 15, 86, -98, 131, 45, 64, -3, 198, 55, 196, 91, -203, 163, -174, -182, 103, -163, -107, -250, -164, 266, 131, -9, 254, 131, -124]
3942a24J51j12K32J47l60L19n6m03M72rm11j68K76j33J63k46J72OJ6L36l26J51
3964I3P7q8j03O4j04N2J13k38j4K19l11K38k08N6L43j36j66L07n7l98M53r4J60
3987B58j9k18M2pl9J03k2j63K5k09R5M11m11J20L2k17J19P0M5J48l3j86O4P9r1
4012dR8j54M01J05n81K03k5j71n3K23q1J00r8N1M6p0N7k6J97q0j55m7J19j30K19
4037A44j02m48K85J80k92J89nj91K44j55O8K15j04k64M64k96P9j29J2K68j83J11
4059I0J77l90L7K09m12Q3K07k6o6K26k16qK56oJ77l53r2M14j94k09M56l19j1J48
4083A78k51J00q5j71J80k5k45L38j78Q2P5K4J07p5j47K82J89l09J47r7j90K90
4105B19l90K55m7j80J04O5l39Q8K64k47J84q0n5K76m0J42k0l01L20k65R7r7L8
$$ y = [-124, 27, -85, 147, 294, -66, 253, 197, -206, 266, 257, -154, -322, -46, -179, -16, -262, -90, -84, -68, 268, -58, 93, 170, 82, -21, 43, -61, -9, 104, -134, -148, 71, -240, -2, -210, -154, 189, 53, -113, 194, 137, -261, 192, 98, 258, 239, 21, 63, 56, 17, 120, 98, -65, -40, -249, -154, 257, -154, -34, -2, -219, -100, -30, 15, 163, 130, -56, 8, 87, -4, 94, -60, 341, 446, -135, 68, 43, -128, -181, 42, -39, 61, -37, 14, 60, -10, 47, 21, 218, 138, -17, -64, 55, -75, 144, 42, -406, -121, 59, -233, -44, -49, -240, 4, -151, -83, 132, 28, -236, 228, -68, 11, -118, -106, 162, -21, 90, 267, -123, -86, 123, -289, -206, 1, -25, -91, 135, -81, -89, 167, 161, 338, -15, -107, 307, 113, -96, 360, 41, 30, 178, -73, 27, -58, -229, -49, -74, -319, 19, -159, -77, -2, 22, 129, 54, -93, 189, 378, 69, 216, 119, -71, 219, -171, 84, 37, -143, -39, 26, -313, -225, 39, -208, -24, -104, -159, 117, 77, 219, 199, -102, 218, -47, 50, -47, -9]
4128iJ19m1j79n3J09j23L39j57k35J77J47j84J94r6P2J80l91J22J28o8j47R6k23
4151b23O7J44qOJ17r5j2j25m4L13k16K43k8l8K5k95j5L09n1o7k8p1P0n6j20M48
4177B50k29m3K9R5k61J52J60j91J74r2k17K67q4J12Pj42J38j87J84R7l25K8%R6
4201A8p8L2j44K98j42l7K02O2kqk70J66J45l31N0O1j79P6J59l63M13l20l9L02
4225G1q2J4K03l89J16ORJ71j24J0N7k81K23J97k20j34K25p2J99j22j64j0N3j49
4249a93L64j79N1R4L6o8J01m60M49j04p2o4J71j27l6j09l12M97l80L48m4q9K32
4272A06k14j4L44k20q1K25J7k69K55q0k16L69k59J80k75M4J39k44L38j38k00N6
4294a37M10l99J47NJ34k42J34k17L38j27j83M38l69k7J97k78K96j09j48P5M8R3
$$ y = [-9, 110, 69, -110, -163, -54, -177, 162, 5, -230, -53, 94, -90, 104, 8, 80, 260, -131, -9, 119, 51, -96, 0, -223, -156, -12, -20, -14, 103, 8, -4, -129, -173, 140, -76, 167, 139, 101, 126, -169, -184, 125, 74, 7, -21, -92, -22, -78, -198, 250, 21, -22, 7, 102, -159, -7, 153, -38, 136, 44, -173, 94, 10, 122, 129, -13, 125, -62, 122, 219, -106, -78, -78, 18, -60, -28, -172, 126, -16, -53, 149, 211, 209, 201, -69, 97, 242, -89, -39, 22, -157, -81, 78, -285, 128, -192, -231, 71, -11, 3, 206, -183, -67, -61, -52, 119, -5, 5, 62, -219, 4, 201, -19, -153, 72, 0, 199, 77, -87, -97, -44, -193, 171, -8, 43, 137, 173, 105, 206, -254, 195, 91, 19, -45, 126, -1, -37, -146, -458, 39, -341, 7, -37, -126, 106, -108, -122, 222, 2, -79, 146, 163, -106, 149, 69, -147, 222, -37, 143, -132, -88, 51, -193, 145, 7, -193, -137, 273, -126, 21, 26, 160, -82, 52, -165, 173, 46, -137, 301, -68, -95, 102, -176, 120, 11, -137, -62, -14, 79]
4316G9R5k59k22L71k46pK36k5l0P0k07K14Q2l03J35J82j86M2r9l0J27k50J47P0
4340a4o6K30p5j62K38j99J09J8k48K16n6r4Q2N2j21J15k7o7J43J8j34J40k81K04
4364B1J30l49L80Rk82J24j16Q0K44j94J45p7k96J63j66J16j58m6M2O1M0J97L6
4387A04j52j49L38j01J10P4l05J10k5j05K31k03j47K98l18J45J23j52PJ08j15
4408a24J80J29k58J01k02J72j0RO3K1j89p2J48j1Q1l0j67K68j37Q9J05k39m2K08
4432I3j77K10n2LJ4j30L02k15j50J32J17l46J92Pl80L08K13l07K03r9k73K90k7
4455g2O8J06j71K98k98Q6K19r2j89J11j05m0J78j53q2J75l96M21K67m42J53j07
4477f5l6L73k48m5J47j25L72k08l58R4M8q3J22o0j69K75k88K57R3j10L3L49l68
$$ y = [79, 174, -85, -307, 64, -182, -189, 47, 22, -8, 62, -145, 69, 151, -152, -17, 165, -21, 21, -78, -108, 19, -231, -84, -14, -80, 150, 75, -87, 151, -48, 61, 79, -169, 47, -9, -103, -21, 31, -90, 25, -2, -69, 74, 92, -42, 98, -183, 21, 151, -198, 182, 191, -91, 33, -83, -3, 241, 47, 192, 115, -181, -18, -184, -68, -226, -272, -230, -169, -129, 68, 104, -48, -197, 141, 40, 150, 224, -81, 29, 4, -101, 130, -73, -220, 78, -240, -95, 28, -124, -117, -9, -124, 56, 185, -73, 28, -174, -2, -12, -3, 60, 81, -108, -180, -32, -43, 38, 8, -159, 109, -28, 61, 166, -73, -115, 93, -84, 126, 74, 77, 91, -39, 263, 48, -102, 30, 147, -199, -7, 0, -380, -72, 141, -166, 37, -62, -335, -45, -72, -4, 102, -69, 229, -69, 17, 236, 144, -45, 66, -39, -79, 99, -54, -136, 39, -357, 64, 331, -111, 42, -65, -101, 272, 24, -21, 126, 1, 373, 165, -193, -99, -51, -134, -12, -72, -241, 34, -254, 3, 96, -14, 19, 368, 0]
4500@K5P8k0K83l48j34K11j72K6j5j91N15j65k77L0K19k41J90J32k17J23j66k4
4523a38K67k7j63J06j42J18K8j55K73j13j12J07k62N9K73j13J30j71r6K00MM8
4545A21q4n7rj9J38m1m1j52K2J27j38J61k28R5K53k84n6R3R4K33k49R1KJ59J7
4570B48k99K28k89J99l7m39M83O3k77J51j10J73n1o3J65k01J92J58k18O6jj98
4592e7R8J36j60J23m2k69L79l69j44K60P4j29K17k29K70Kl40L47lj05J09o8p4
4615B6J38j64K0J29k17J96M3k28K06l42j09K90j31n4L49j65r8J88k63L25j05j81
4637a47M53j55p7o7j84K88q1K6l3J02l10J02J15j69K22q6J01n1Q9j49r1K00j17
4660a9J74m06K65j2Pq7m6K9L16l32M75j11q1j88K50l62J70L6l32L87j46R2K6j15
$$ y = [0, 25, 103, 83, 366, 18, -116, 95, -77, -51, -66, -257, 258, 93, -184, -154, 65, -176, 14, 146, -71, 52, -114, -138, 129, 102, -61, 45, -97, 21, 49, -106, 167, 54, -58, 49, -213, -154, 119, 6, 136, -35, -131, 69, 73, 121, 37, -20, -29, -48, 90, 49, 8, -144, -122, 5, -133, 28, -200, -105, 148, -136, -192, -99, -5, 228, -21, 70, 72, 231, 248, -51, 177, -112, 87, 50, -389, 94, 157, -120, 31, -79, 94, 43, -20, 145, -56, 136, 294, 76, 142, 141, -57, 41, 177, 17, 140, 98, -171, 208, -161, -305, -45, 29, -100, 117, -112, 158, 160, -180, 167, 164, 59, 168, 100, 26, 164, 0, 20, 149, -68, 128, 171, -57, 149, -193, -302, -12, -143, -197, 152, -13, -111, 77, -186, 139, 34, -147, 306, 151, 74, 7, -177, 111, 30, 56, 23, 125, -185, -83, 32, -137, 85, -1, 100, 49, 138, -11, -102, 98, -19, 155, -251, 14, 2, 9, -78, -124, -95, 221, -111, 364, 253, 172, -16, 234, -128, 42, 78, -254, 133, -13, 79, 105, -10]
4684a0J08o5j50K65k35j43K58j27r1J96j31J2K20j40m1J26o2J17p7J48j42oj10
4707h0J21J7l09L53l30K23J61j55q7J78o5J51l6l21L09o6j31J30r4J3O4rL7j57
4731h3j99K6L76q0J9J2l2P6j97J07n8j28J81n5k02L63k03J04L15l77Q6Jj41K8
4755f1n2n9M13m62K07q5K20k33K31j84m9J62j41J45K39k73K8J14Q7j90j96Q8J24
4778G3k40J24J71k77J52L05l99K54k2l2j70jK02j56Oj26K90p4M4n8n0o5n2P8O2
4803C9j56J40j00j30K14p5j87L07K09k79K29j46kl4k61L59k74j8K41q4k46K67
4825A3n9j0P6L0O6l12J56J0k9j75L67j29r4J24m7K43k8l05J4O8J72L6m05K05O3
4850E0n9r4M6K1r2J87k67M11j62j44rJ81j01N6l4j3M2Mn6j40K35%qk8O8l5j9m4
$$ y = [-10, 98, 33, -117, 148, -87, -230, 28, -99, -190, 6, -125, -113, 107, -33, -74, 52, -10, 107, 30, 178, 36, 30, -80, 41, 58, -251, 102, -228, -5, 156, 1, -86, 92, 27, 178, 142, -179, 130, 64, -67, 63, -31, -18, 46, 37, 74, -83, -282, -256, 120, 40, 59, 71, 39, 115, -82, 25, -33, -161, 20, -35, -237, 126, -77, 27, 342, -35, 51, 52, -89, -61, -113, -172, 241, -221, -14, -99, 121, -112, 119, -65, -114, 48, -93, 52, 291, 18, 46, 160, 247, 57, -139, -51, 73, -167, -43, 128, -149, 3, 308, -91, 163, 141, 109, -61, -62, 140, -16, -10, -136, 154, 80, 124, 66, 16, -49, -101, -23, 39, -117, 23, -77, -207, 7, -68, -255, 52, 261, -18, 211, 65, 63, 29, -232, 127, -147, -165, 76, -8, -254, 13, -46, -56, 20, 50, 116, -196, -40, -30, -59, -234, 133, 4, -90, 34, -13, 230, 202, -103, -89, -21, 151, 187, -218, -13, 50, -9, -103, -57, -36, -128, 59, -208, 203, 41, -103, -112, 69, -32, 24, -10, -23, 19, 23, -33, -173, 62, 62, 54, 26, 94, 59, 40, -4]
4878dj03N8K10j07k93L60j52q1L24j38j78J17m0J46M5j54j37p4K94j19k4J13N8
4901A21r2Q2j45l05L46j32J19K8j49J90l0n9j08J62j84J18P3j56K53r5q6Q6M4
4924H1j37J53m8q6J01Qo0j4j12L1L1j59K21o4L4L4j69K49q7L3j9J7k1O0m4N1J31
4951B15j22q3j32K15j0O3j2j68R7l7j23K0J24O3j13M2J24k0k16j27K5K90q1P4
4975A08k10J14n1L9k35L16P1k21l0Q4p9J05k45J97J16l00K97k27l2L71m3k06Q9
4998B8j17J4J60j85K6om4L45o4j99k8N4j3kJ35k39K77k16j38M08k10j40K83j60
5022c1K7P9j10J68j82j18K43m2K0Qj59J99j27p9R3J71k55J37r5O3N5OJ21n6l17
5047a81K24o0l1R9k10K91j01K45m26L66j70K34k05P9l2p8j68J88o5q5J7j10J35
$$ y = [-4, -107, -49, 161, 54, -239, 121, -31, -112, 212, 74, -104, 13, -27, 119, 164, 10, -127, -201, 93, -26, -50, 63, 121, 29, 111, -34, -339, 7, -125, -6, 22, -127, 63, 33, -26, -134, 28, -156, -38, 35, -121, 132, 37, -49, 37, 81, -56, 97, 49, -37, 64, 72, 12, -2, -114, -83, -52, -211, 10, -54, -20, 14, -155, 94, 7, 40, 21, 38, 17, 77, 33, 84, 215, 93, 10, -122, 93, 83, 146, 134, -34, 63, 26, -97, -77, 47, 110, -3, 39, 163, 143, -73, -200, -175, 115, 34, 108, -102, 12, -39, 0, -235, 81, 152, -69, -99, -15, -94, 11, -234, -37, 79, -221, 76, -151, -183, 188, 145, -61, 28, -89, -75, 85, -100, -74, -80, -124, 221, 157, -42, -70, -16, -29, -31, 104, -135, 142, -74, -212, 196, -14, -154, 129, -31, -4, 75, -35, 133, -49, -167, 76, 34, 54, 62, -97, 102, -25, -104, -11, 160, -95, 42, -53, 10, 65, 71, 192, 136, -181, 43, -17, -48, 51, -159, 132, 31, 276, -150, 216, 46, 280, 75, 154, 122, 44, -124, 64, -1, -86, -69, -179, -44]
5070d4Q1k77O3K09o0M4r9O9J79L3l96J53M2j8Q1J6j91O7O7k61J79j5j33L82o0
5095A11j8n2j30M2n4o0K83j05J07j4j97M4J02j76L7J68l30M33j76J29j3l17L96
5118B10l00J73j08J7L4K89k38M4k62K49N7j27j16J76J26k46o3PK29j30j06Q5n4
5141e4k52M73j90NJ91j93j18K22j25J80J61k55j00J4j09K97j52j00O6J50j12l9
5163d0j46K08J71k29j14K79r4K4J25k30J32j97M9K73k56P6K5m49R4K19j9P4K6
5186AM3r1o0J8M2J02j5Q0l48J70J73Jm9k24K69k95k0j5L46n0L7m9m5j65K81k01
5212f4K80k00j21L55n03M47j22L4J23k58l3J21n1J38o0k23pK53j52q6L06k99K70
5235A48k08J90J23l37J77j83J94J7J00l79J51R3r3J7j24J46O9k85L4K40p6j46
$$ y = [-44, 37, -240, -177, 32, -28, 16, -83, -14, 165, 198, -198, -45, -3, -21, 60, 76, -115, -48, 19, -242, -63, -78, -211, 171, 111, 93, 41, -89, -47, -101, -161, 122, 17, 124, 110, -87, -43, 59, -117, -80, 88, -242, 191, 15, 144, 131, -186, 210, -90, 83, -25, -8, 26, 315, 77, 121, -141, 108, 165, 38, -78, 98, 224, -22, -85, -78, 151, 21, -85, 0, -54, -306, 167, -23, -18, 173, -20, -138, 84, -41, 139, 300, 45, -55, -41, -150, 147, -5, -105, -39, 111, -1, -40, -186, 22, 193, -36, -150, 129, 35, 59, 184, -46, 86, -111, -62, 211, -45, 31, 56, -393, -299, -80, -99, -25, 1, 44, -47, -107, -89, -47, 55, 40, 120, -228, -58, 115, 116, 67, -157, 112, -183, -203, -218, 128, 78, 115, 66, 21, -144, 137, -64, 216, 16, -105, 250, -253, 194, 72, 106, 229, -29, -62, 59, 8, 146, 86, -137, -144, 109, -43, -129, 177, -122, 148, -60, 130, 253, -84, 93, -90, 104, 121, 221, -158, -7, 86, -7, 10, -114, 32, 101, -184, -150, 90, 14, -132]
5257a32K40j55j4O4k07N5K00mj1j43J9K14j30O5P6k83K18p6q7L31l87L79k45j3
5281b6j14K33j7q0m6o2K28R2k05K2M9k28K93j74M5j10o1J74N8j95L14j96K9K16
5305B39j0l84L5P7r6K24nl3p0j52K5J4P3O5k78J58K17l04K4L88l32J61o9j07L70
5330B30o9j46O4J7j76J69o8j01o6J7N8R7j74J76j72lQ2J47n9P1j98L06q4q2l7
5355aJ66l05J57j10j5K54j88oJ74k28J89m8n5o8nj52M74k83K2P4N0k5O0k12o6
5380a47J64k03K91j35r7M9l0R4P5q0M0J20o3j27J95r9L4o9J50n8p4J4M7k24J93
5405F0O8j12M3J2l6P6l3p9MJ80m52M11lk72K36r4J41j56j35K26j57Q0N8j20nJ03
5431D4l9j88L88k25k23J69K4J33M3k06J68k1j45R2j3J04j45P0P9j57J2Qn5Q3J45
$$ y = [-132, 108, -47, -61, 3, -204, -149, 51, 47, 36, -107, -88, 126, -4, 61, 137, -146, 72, -4, -91, 240, -147, 232, -13, -26, -140, 93, 76, -4, -50, -112, 116, 208, 3, 25, 74, -154, 139, -35, 10, -100, -161, 13, 71, -124, 190, -6, 23, 239, 229, -155, -120, -43, -139, 85, 80, 47, -23, -175, -150, -136, -63, 2, -276, -118, 99, -205, -181, 207, -125, 36, -33, -140, 230, 161, 15, 79, 96, -80, 89, 21, -80, -146, -129, -71, 26, -148, 28, -144, -147, -65, 82, 23, 94, -104, 202, 118, 36, -1, 165, -140, 17, -93, -108, 146, -42, -48, 126, -102, 87, 39, -16, -84, -89, -241, 233, -50, -28, 46, 96, 71, 131, -81, -147, 17, -186, 105, -30, -127, -78, -108, -14, 61, -19, 21, 141, 78, -49, 146, 47, 81, 12, 162, 104, 30, 44, 91, -133, 60, 128, 16, 59, 71, 35, 111, 78, -1, 3, 183, -269, 142, 139, -133, 103, 9, 150, -6, -141, 85, -72, 8, 66, -54, -59, 44, 5, -183, 205, -20, -243, -74, -50, 83, 126, -80, 88, 67, -78, 14, 1, 105, -40, 30, 109, -48, -36, -28, -83, 0, 145]
5456A45m82N03k8j78l5K30r1q2l1p4K38r8q3K18kk47j19L35k30K80m22K94Q0m6
5480G5K0k29K31Q8k00O3K5k39L0K50l57K32%k47L88k11K86k35q8J91j2k42J56
5503b5j79M58k05j14R5l0L24m31Q9j00J07M4n0J80m15K11K33l10L05o8p5J14R0
5526B48j39n1k8k4j20J67j92J79J02l30K07J65j67Lj56J2J93j93L07j09j51J41
5548F4l5J44N5j19l99K59N2J1O4k67K75j38r9J64j52L6N2j25J31pJ25j03P6j34
5572g0J79j09M4K59l25J09oj07q7K21j64P8O9L5k00j77K60K01p1J5r1k03L00k91
5596a31O5J22j52K04j61L6o5K7J0K0J7kJ30k7n3J99k44j14J76p5n5K52k0M4j03
5621A00J9l49L06pk34J89M3j28K05k44K5Q5Q7j98m3J18J23p3MP4k2J14j14r7p
$$ y = [145, -337, 166, 138, -40, -75, 155, 64, -18, -49, -123, 115, 17, -66, 152, 150, -97, -216, 119, -111, 169, -253, 41, 121, 75, 95, -134, 97, 185, -15, 48, 73, -166, -136, 114, -243, -11, -11, -258, 130, -81, 205, -30, -118, 73, 61, -181, -25, -204, 254, 49, -65, 30, 0, 324, -107, -18, -118, -11, 33, -17, 163, -252, -41, 192, -118, 187, 119, 44, 158, 248, 109, 58, 30, 6, -114, 53, -139, 40, 142, -188, 19, 184, 17, 20, -136, -124, 69, -124, 183, 74, -77, 64, 29, 173, 228, 109, -290, -31, 21, 32, 96, -171, 104, -34, -133, 31, -121, -85, -33, -158, -27, -34, 91, -12, 64, -70, 109, 0, 44, 303, -22, 87, 81, -26, -113, 108, -56, 22, 91, 126, -74, -251, 9, 210, 139, 154, 63, -140, 160, -131, -66, 56, -96, 108, -53, -17, -82, -55, -45, -25, -8, -10, 120, 93, 40, 239, -5, -119, 57, -18, -73, 179, 159, 203, 100, 119, -230, 76, 69, -165, 24, 67, -61, 144, -100, -75, 10, 97, -101, -144, -26, 97, 24, 28, 102, 80, 194, 80, -17, -24]
5646b4K4NJ9m2m0L9k28N74l43P6O9O2j96j8j82J09J09l0m5Q5K3m1j27J54K69j90
$$ y = [-24, 0, 5, 24, -18, -58, -19, -247, 327, -16, 60, 129, 191, -5, -23, -205, -96, 13, -17, -62, 23, 46, 5, -122, 32, 301, 111]
$$ [...]
8191B8
##END NTUPLES=NMR FID
##END=
