##TITLE=1H_Pr EClH
 200.13MHz,CDCl3 ,
 8 sc
 
 31.10.2025
##JCAMPDX= 6.0         $$ Bruker NMR JCAMP-DX V2.0
##DATA TYPE= NMR FID
##DATA CLASS= NTUPLES
##ORIGIN= UXNMR, Bruker Analytische Messtechnik GmbH
##OWNER= pz
$$ XWIN-NMR		Version 3.5
$$ Fri Oct 31 13:40:33 2025 Russian Standard Time (UT+4h)  she@DPX200
##.OBSERVE FREQUENCY= 200.1313
##.OBSERVE NUCLEUS= ^1H
##.DELAY= (6, 6)
##.ACQUISITION MODE= SIMULTANEOUS
##.ACQUISITION SCHEME= undefined
##.AVERAGES= 8
##.DIGITISER RES= 18
##SPECTROMETER/DATA SYSTEM= spect
##.PULSE SEQUENCE= zg30
##.SOLVENT NAME= CDCl3
##.SHIFT REFERENCE= (INTERNAL, CDCl3, 0, 14.3821)
##AUDIT TRAIL= $$ (NUMBER, WHEN, WHO, WHERE, WHAT)
$$ ##TITLE= Audit trail, XWIN-NMR		Version 3.5
$$ ##JCAMPDX= 5.01
$$ ##ORIGIN= Bruker BioSpin GmbH
$$ ##OWNER= she
$$ F:/spectra/data/she/nmr/H-C/1/audita.txt
$$ ##AUDIT TRAIL=  $$ (NUMBER, WHEN, WHO, WHERE, WHAT)
(   1,<2025-10-31 13:38:59.00 +0400>,<she>,<DPX200>,
      <created by zg, POWCHK disabled, PULCHK disabled
       configuration hash MD5:
       00 E9 B6 7A A2 85 ED C7 34 08 36 98 17 FE 4E 26
       data hash MD5: 16K
       4A 27 5F B4 14 DC 20 77 A2 DA 4D 7E 1E DB A9 11>)
$$ ##END=
$$ 
$$ hash MD5
$$ 39 31 EC 08 A4 F3 D8 93 69 1D 89 68 F4 DC 06 94
##$RELAX= 
##$RELAX= 
##$RELAX= 
##$RELAX= 
##$RELAX= 
##$RELAX= 
$$ Bruker specific parameters
$$ --------------------------
##$DU= <F:/spectra>
##$EXPNO= 1
##$NAME= <H-C>
##$PROCNO= 1
##$TYPE= <nmr>
##$USER= <she>
##$AMP= (0..31)
100 100 100 100 100 100 100 100 100 100 100 100 100 100 100 100 100 100 
100 100 100 100 100 100 100 100 100 100 100 100 100 100 
##$AQSEQ= 0
##$AQ_mod= 1
##$AUNM= <au_zg>
##$AUTOPOS= <>
##$BF1= 200.13
##$BF2= 200.13
##$BF3= 200.13
##$BF4= 200.13
##$BF5= 200.13
##$BF6= 200.13
##$BF7= 200.13
##$BF8= 200.13
##$BYTORDA= 1
##$CFDGTYP= 0
##$CFRGTYP= 5
##$CHEMSTR= <none>
##$CNST= (0..31)
1 1 145 1 1 1 1 1 1 1 1 1 1 1 1 1 1 1 1 1 1 1 1 1 1 1 1 1 1 1 1 1 
##$CPDPRG= <>
##$CPDPRG1= <>
##$CPDPRG2= <>
##$CPDPRG3= <>
##$CPDPRG4= <mlev>
##$CPDPRG5= <mlev>
##$CPDPRG6= <mlev>
##$CPDPRG7= <mlev>
##$CPDPRG8= <mlev>
##$CPDPRGB= <>
##$CPDPRGT= <>
##$D= (0..31)
0 0.7 0 0 0 0 0 0 0 0 0 0.03 0 0 0 0 0 0 0 0 0 0 0 0 0 0 0 0 0 0 0 0 
##$DATE= 1761903538
##$DBL= (0..7)
120 120 120 120 120 120 120 120 
##$DBP= (0..7)
150 150 150 150 150 150 150 150 
##$DBP07= 0
##$DBPNAM0= <>
##$DBPNAM1= <>
##$DBPNAM2= <>
##$DBPNAM3= <>
##$DBPNAM4= <>
##$DBPNAM5= <>
##$DBPNAM6= <>
##$DBPNAM7= <>
##$DBPOAL= (0..7)
0.5 0.5 0.5 0.5 0.5 0.5 0.5 0.5 
##$DBPOFFS= (0..7)
0 0 0 0 0 0 0 0 
##$DE= 6
##$DECBNUC= <off>
##$DECIM= 32
##$DECNUC= <off>
##$DECSTAT= 4
##$DIGMOD= 1
##$DIGTYP= 9
##$DL= (0..7)
0 120 120 120 120 120 120 120 
##$DP= (0..7)
150 150 150 150 150 150 150 150 
##$DP07= 0
##$DPNAME0= <>
##$DPNAME1= <>
##$DPNAME2= <>
##$DPNAME3= <>
##$DPNAME4= <>
##$DPNAME5= <>
##$DPNAME6= <>
##$DPNAME7= <>
##$DPOAL= (0..7)
0.5 0.5 0.5 0.5 0.5 0.5 0.5 0.5 
##$DPOFFS= (0..7)
0 0 0 0 0 0 0 0 
##$DQDMODE= 0
##$DR= 18
##$DS= 0
##$DSLIST= <SSSSSSSSSSSSSSS>
$$ [...]
##$SUBNAM0= <"">
##$SUBNAM1= <"">
##$SUBNAM2= <"">
##$SUBNAM3= <"">
##$SUBNAM4= <"">
##$SUBNAM5= <"">
##$SUBNAM6= <"">
##$SUBNAM7= <"">
##$SUBNAM8= <"">
##$SUBNAM9= <"">
##$SW= 18.0517328524113
##$SWIBOX= (0..15)
0 0 2 0 0 0 0 0 0 0 0 0 0 0 0 0 
##$SW_h= 3612.71676300578
##$TD= 16384
##$TD0= 1
##$TE= 0
##$TE2= 300
##$TE3= 300
##$TEG= 300
##$TL= (0..7)
0 120 120 120 120 120 120 120 
##$TP= (0..7)
150 150 150 150 150 150 150 150 
##$TP07= 0
##$TPNAME0= <>
##$TPNAME1= <>
##$TPNAME2= <>
##$TPNAME3= <>
##$TPNAME4= <>
##$TPNAME5= <>
##$TPNAME6= <>
##$TPNAME7= <>
##$TPOAL= (0..7)
0.5 0.5 0.5 0.5 0.5 0.5 0.5 0.5 
##$TPOFFS= (0..7)
0 0 0 0 0 0 0 0 
##$TUNHIN= 0
##$TUNHOUT= 0
##$TUNXOUT= 0
##$USERA1= <user>
##$USERA2= <user>
##$USERA3= <user>
##$USERA4= <user>
##$USERA5= <user>
##$V9= 5
##$VALIST= <valist>
##$VCLIST= <CCCCCCCCCCCCCCC>
##$VD= 0
##$VDLIST= <DDDDDDDDDDDDDDD>
##$VPLIST= <PPPPPPPPPPPPPPP>
##$VTLIST= <TTTTTTTTTTTTTTT>
##$WBST= 1024
##$WBSW= 4
##$XGAIN= (0..3)
0 0 0 0 
##$XL= 0
##$YL= 0
##$YMAX_a= 581407
##$YMIN_a= -641424
##$ZGOPTNS= <>
##$ZL1= 120
##$ZL2= 120
##$ZL3= 120
##$ZL4= 120
##$ABSF1= 10
##$ABSF2= 0
##$ABSG= 5
##$ABSL= 3
##$ALPHA= 0
##$AQORDER= 0
##$ASSFAC= 0
##$ASSFACI= 0
##$ASSFACX= 0
##$ASSWID= 0
##$AUNMP= <proc_1d>
##$AZFE= 0.1
##$AZFW= 0.1
##$BCFW= 1
##$BC_mod= 2
##$BYTORDP= 1
##$COROFFS= 0
##$CY= -3
##$DATMOD= 1
##$DC= 2
##$DFILT= <>
##$DTYPP= 0
##$F1P= 0
##$F2P= 0
##$FCOR= 0.5
##$FTSIZE= 0
##$FT_mod= 4
##$GAMMA= 1
##$GB= 0.15
##$INTBC= 1
##$INTSCL= 1
##$ISEN= 128
##$LB= 0.25
##$LEV0= 0
##$LPBIN= 0
##$MAXI= 10000
##$MC2= 0
##$MEAN= 0
##$ME_mod= 0
##$MI= 1.114404
##$NCOEF= 0
##$NC_proc= 0
##$NLEV= 6
##$NOISF1= 3.799351
##$NOISF2= 2.8
##$NSP= 1
##$NTH_PI= 0
##$NZP= 0
##$OFFSET= 14.38212
##$PC= 1
##$PHC0= -2622.789
##$PHC1= 0.59235
##$PH_mod= 1
##$PKNL= yes
##$PPARMOD= 0
##$PSCAL= 0
##$PSIGN= 0
##$REVERSE= no
##$SF= 200.129724274929
##$SI= 16384
##$SIGF1= 3
##$SIGF2= 2
##$SINO= 400
##$SIOLD= 16384
##$SREGLST= <1H.CDCl3>
##$SSB= 0
##$STSI= 0
##$STSR= 0
##$SW_p= 3205.1282051282
##$SYMM= 0
##$S_DEV= 0
##$TDeff= 0
##$TDoff= 0
##$TI= <>
##$TILT= no
##$TM1= 0
##$TM2= 0
##$TOPLEV= 0
##$USERP1= <user>
##$USERP2= <user>
##$USERP3= <user>
##$USERP4= <user>
##$USERP5= <user>
##$WDW= 1
##$XDIM= 8192
##$YMAX_p= 0
##$YMIN_p= 0
$$ End of Bruker specific parameters
$$ ---------------------------------
##NTUPLES= NMR FID
##VAR_NAME=  TIME,          FID/REAL,        FID/IMAG
##SYMBOL=    X,             R,               I
##VAR_TYPE=  INDEPENDENT,   DEPENDENT,       DEPENDENT
##VAR_FORM=  AFFN,          ASDF,            ASDF
##VAR_DIM=   8192,          8192,            8192
##UNITS=     SECONDS,       ARBITRARY UNITS, ARBITRARY UNITS
##FACTOR=    0.0002768,     1,               1
##FIRST=     0,             0,               0
##LAST=      2.2672688,     0,               0
##MIN=       0,             -641424,         0
##MAX=       2.2672688,     581407,          0
$$ Real data points
##PAGE= N=1
##DATA TABLE= (X++(R..R)), XYDATA
0 0 0 0 0 0 0 0 0 0 0 0 0 0 4 0 1 -8 8 -8 8 -9 16 -16 16 -24 24 -29 36 -40 45 -53 60 -68 77 -86 96 -109 121
37 121 -136 151 -167 187 -207 228 -254 280 -308 340 -375 412 -455 502 -551 609 -673 743 -828
56 -828 925 -1033 1167 -1326 1520 -1768 2093 -2534 3174 -4182 5951 -9713 21019 -127627
70 -127627 -641424 -415122 262647 581407 222559 -302879 -408123 -72220 236705 221957
80 221957 20686 -83407 -67278 -69911 -93279 5948 187298 198439 -60233 -300066 -202824
91 -202824 139136 315612 132821 -171602 -251323 -63502 142932 160684 40135 -49296 -58438
102 -58438 -62629 -70572 5239 148531 170856 -24390 -243293 -211299 59997 275593 205512
113 205512 -73423 -281911 -217533 58375 286523 246418 -33857 -293733 -277684 25134
123 25134 334590 318775 -46400 -388873 -312296 118933 410821 227245 -196436 -358482
133 -358482 -115285 198162 231407 23949 -132814 -95295 4341 14054 -13367 48168 134100
144 134100 56015 -159414 -223775 10272 272141 209965 -116259 -297477 -118988 172258
154 172258 220344 10994 -156945 -96807 45788 50494 -40676 -20616 113995 120317 -95961
165 -95961 -256946 -83909 257058 317477 -22949 -361351 -275677 137463 384878 182687
175 182687 -214745 -342628 -86571 219871 238258 16130 -157531 -139096 -24645 62060
185 62060 98711 85788 4685 -104746 -129188 -16019 130937 150820 10789 -142175 -142851
196 -142851 4019 128839 104537 -12940 -89175 -76950 -24079 32627 78498 72891 -11552
207 -11552 -104550 -93270 24614 119995 90154 -24365 -99431 -70187 14120 64942 54697 21769
219 21769 -15888 -67881 -97579 -24825 122783 166240 -231 -209375 -188713 70418 264851
230 264851 151809 -138859 -260505 -74348 186401 212290 -1586 -174686 -116326 49721
240 49721 99809 20104 -30715 2543 12382 -52725 -82510 13017 130550 99052 -71673 -176995
252 -176995 -69872 132802 182631 14417 -158510 -125686 47946 131563 48117 -56474 -55115
263 -55115 2448 9335 -23109 -10917 49989 63343 -20606 -110407 -77321 64009 145947 56136
275 56136 -103919 -138934 -12996 116334 108791 -1319 -86659 -80028 -9933 59059 75559 27214
287 27214 -47439 -83266 -44591 36887 86322 50550 -42034 -93429 -43647 50180 81329 28766
299 28766 -33725 -46905 -24467 3620 32442 49843 25398 -36683 -75421 -37164 48430 88112
311 88112 28913 -71345 -95718 -10672 82466 71540 -19359 -68163 -27281 27656 27629 1390
323 1390 2535 18184 2692 -36761 -40399 15525 70703 44940 -48315 -96603 -28015 78495
335 78495 86395 -13036 -90089 -53630 36256 66263 19101 -30610 -29213 855 14030 3508
347 3508 814 16950 19310 -14604 -46122 -19777 41753 55147 -5194 -62775 -43640 22921 53180
360 53180 20668 -27896 -38224 -7740 24429 24481 2025 -10316 -3893 -133 -5542 -1041 15313
373 15313 16941 -7378 -26391 -13319 13326 19498 2434 -14885 -16193 -3698 10066 11508 1156
386 1156 -6071 -3591 1216 298 3040 10061 7021 -7800 -12841 1290 13571 5205 -9456 -10796
400 -10796 -876 5443 2832 -4002 -7662 -1952 7089 6027 -4919 -6985 4099 10221 1974 -5555
414 -5555 443 7245 2024 -6440 -4374 4694 6816 -575 -9981 -11432 -936 12427 10428 -8352
428 -8352 -18589 -4883 14025 14589 226 -7602 -5271 -403 4947 8442 5720 -2188 -7147 -6885 -2689
443 -2689 4308 11069 5880 -11460 -20669 -6251 15766 18408 684 -15463 -14583 -458 14111 17122
457 17122 4247 -11297 -12777 -920 8177 9357 6601 -23 -12684 -18012 -3355 17570 18889
470 18889 -2131 -22112 -20627 1509 22879 21382 -2592 -23634 -16250 9111 21326 11410 -3473
483 -3473 -9176 -9179 -5762 4302 14605 11705 -6318 -20975 -17315 3507 23195 19437 -7686 -29350
497 -29350 -18204 14107 28518 12065 -10968 -16746 -7535 4002 11727 13849 4897 -10371 -19126
510 -19126 -11482 7797 23143 15177 -13153 -32534 -17307 18314 31752 9760 -19046 -23449 -5519
523 -5519 13159 19036 11884 -3056 -16065 -15774 -1709 16252 22148 6572 -20575 -31441 -8567
536 -8567 25697 30548 87 -28782 -24258 2404 20765 18468 3957 -10237 -15708 -9021 5513
549 5513 18943 19495 2222 -22947 -29397 -3240 31377 31868 -6359 -37826 -27682 9148 31005
562 31005 19320 -7331 -22977 -16634 2002 16538 17561 7853 -6989 -19691 -17359 5543 30307
575 30307 24290 -11261 -36305 -22176 14344 31950 16141 -13919 -28575 -17084 8275 23493
587 23493 16993 -1081 -16749 -19383 -6299 16621 29484 13681 -19570 -33850 -11315 22282
599 22282 30932 8114 -20113 -28231 -11780 12424 23914 14001 -7069 -22567 -20442 366 25342
612 25342 30403 3690 -31374 -33236 3820 37556 29577 -9139 -33726 -21560 8673 24415 14126
625 14126 -6176 -15639 -11113 -3690 2600 11897 17577 4067 -21785 -27634 871 33530 30013 -7194
639 -7194 -35906 -24019 12863 33641 17365 -14904 -26791 -11149 9227 12963 6610 1694 -4132
652 -4132 -13724 -14628 2594 23580 21682 -5133 -28953 -21991 10513 34046 21647 -14440 -33916
665 -33916 -15733 17302 27970 8780 -15804 -21824 -8803 8599 16286 9116 -5319 -13345 -8656
678 -8656 2264 9472 10305 4587 -5314 -12137 -7025 5422 13855 10019 -3002 -15291 -14963 1438
692 1438 18394 15618 -6339 -22022 -13133 8916 19083 8082 -8680 -12656 -3204 7098 6962
705 6962 1580 -361 1765 -1970 -9403 -6696 9247 18050 2774 -20511 -21112 3638 24904 16079
719 16079 -12483 -26051 -8429 18970 22264 -1225 -19987 -10437 10235 14165 -910 -10534 -2484
732 -2484 8337 4747 -7247 -10002 2088 13143 6660 -11593 -16765 -348 17672 12834 -7894
745 -7894 -17405 -4223 13106 13099 -1730 -11406 -5405 6596 8733 -943 -8321 -2304 7270 4999 -6942
760 -6942 -10744 329 11822 6981 -7797 -13625 -2616 12497 12836 -2301 -14888 -8255 9654
773 9654 15220 1391 -13067 -9035 6314 11604 870 -10379 -7335 4851 9771 23 -11016
786 -11016 -7407 7693 12994 -131 -13910 -8375 9083 15437 2100 -12635 -10597 5574 14180
799 14180 4750 -10168 -11664 2684 12169 4010 -10180 -9353 4241 11212 1744 -10227 -7689 5276
813 5276 11958 2964 -9974 -9960 4263 14019 5781 -10556 -12400 2068 12977 6139 -8515 -11477
827 -11477 -5 10127 6016 -6479 -10397 663 10929 6056 -7983 -10652 3247 13361 5764
840 5764 -10148 -12311 3083 15146 8216 -10049 -15585 -1279 14937 10788 -7787 -16557 -2856
853 -2856 13556 10911 -5981 -13522 -2183 11584 9016 -5564 -11354 -877 11780 8394 -6908
866 -6908 -13054 -744 12697 8337 -8077 -13677 -1873 11538 8411 -5462 -11354 -2484 9049
879 9049 7922 -3452 -9114 -1448 8498 5595 -5165 -8034 1083 8940 4055 -6623 -9417 -211
893 -211 9492 7235 -5135 -11789 -4054 8757 10215 -1168 -10380 -5783 5440 9647 1910 -6726
907 -6726 -6122 2310 7910 2935 -6174 -6525 2609 8237 1293 -8343 -7207 3611 9986 2715 -8323
922 -8323 -9191 2252 11369 6159 -7046 -10197 496 10471 5928 -6389 -8538 1564 8168 2627
936 2627 -7206 -6254 3921 9072 602 -10578 -8188 6420 13335 2079 -12743 -11182 5791 14966
950 14966 4833 -10378 -11476 2364 11319 5266 -6884 -9143 927 8283 2368 -6942 -5669 4135
964 4135 7654 -512 -8453 -4922 5799 9220 600 -7945 -6865 3022 9147 3934 -5246 -6885 -524
979 -524 5231 3624 -1585 -3631 -1396 954 734 -615 -233 1071 1698 -188 -3010 -2238 2805 5266
995 5266 2222 -4171 -5960 -550 6186 6168 -995 -7699 -5812 3273 8377 3119 -6403 -7213 195 6074
1011 6074 3450 -2886 -3957 739 3959 786 -3223 -1909 3589 4970 -1374 -7525 -3446 6210 8118
1026 8118 -974 -9671 -6069 4813 9150 1621 -7479 -6570 2389 7420 2208 -4695 -3790 2457 4650
1041 4650 -678 -4332 -542 5018 3336 -3780 -6206 -631 6480 5170 -3054 -7665 -2494 5472 6474
1056 6474 -819 -5923 -3119 2876 4460 1000 -2377 -1453 757 1008 -306 -643 367 1035 -267 -2264
1072 -2264 -2174 1057 3113 1117 -2496 -2823 -381 2589 2952 477 -2389 -2795 -14 2978 3286 -440
1088 -440 -3116 -2093 1134 2539 1111 -1449 -2585 -867 1221 1059 -569 -1076 645 800 -1071 -1665
1104 -1665 366 2906 1611 -2274 -3556 285 3739 3505 -1260 -4597 -2437 3041 4452 176 -3872
1119 -3872 -2687 1340 2372 332 -1562 -796 748 560 -934 -858 1274 2318 355 -2886 -2832 1289
1135 1289 3995 1431 -2958 -3806 -90 3071 1994 -978 -2529 -1450 714 1726 684 68 40 -327
1151 -327 -782 -924 768 2423 1094 -2068 -3042 -234 2592 2870 -376 -3292 -2746 708 3123 2301 -630
1168 -630 -2655 -1703 534 2314 1906 276 -1738 -1944 -427 1861 2326 656 -1827 -2620 -1271 1219
1184 1219 2169 828 -1489 -2438 -707 1170 1865 1003 -515 -1514 -984 396 1722 1523 637 -1012 -1711
1201 -1711 -1078 902 2525 1446 -1361 -3078 -1996 1441 3064 1736 -1152 -3545 -2095 1245 3577
1216 3577 2582 -1087 -3730 -2486 846 3588 3154 -712 -3825 -3497 743 3916 3219 -792 -3748 -2814
1232 -2814 533 3468 3157 -119 -2857 -2693 51 2827 2825 949 -1746 -2899 -1046 2053 3305 893
1248 893 -1968 -2819 -1429 845 1705 1522 -55 -1847 -2217 -1371 1263 3474 2543 -1381 -4539 -3004 2686
1265 2686 6173 2846 -3501 -6134 -2117 3926 5518 1487 -3689 -5033 -1715 2207 3751 2229 -1023
1280 -1023 -3292 -3362 57 4590 5112 106 -5747 -5654 821 6405 5456 -1757 -6401 -4024 2208 5047
1296 5047 2386 -1765 -3158 -1455 267 970 1784 2187 -97 -2917 -3522 -13 4162 4707 -382 -5201
1312 -5201 -4616 748 4889 3898 -576 -4193 -3505 -466 2881 4087 2034 -2699 -5487 -2876 2919 6570
1328 6570 3402 -3381 -6565 -2930 4053 6839 2643 -3810 -5627 -2189 2778 5055 2478 -1292 -4401
1343 -4401 -4020 428 4785 4761 -97 -5405 -5081 707 5933 4509 -1213 -5245 -3099 1539 3060 1925
1359 1925 98 -772 -1938 -2833 -874 2969 4496 816 -4959 -6234 -357 6369 6123 -1132 -6720 -5045
1375 -5045 2079 5828 3052 -1432 -3407 -2372 -521 1812 3396 2616 -1126 -5332 -4305 1855 6696
1390 6696 4143 -3199 -7533 -3220 4612 6568 1848 -4205 -4775 -991 2284 2899 1495 -444 -2117
1405 -2117 -2909 -1353 1980 4443 2046 -3461 -5528 -1701 4269 5125 576 -3965 -3819 112 2627 2799
1421 2799 1042 -435 -2022 -2692 -858 2840 4389 1079 -4292 -5657 -12 5324 5254 -827 -6086 -3544
1437 -3544 1621 4237 2352 -923 -1956 -1723 -767 798 2344 2807 136 -4112 -4338 820 5254 4104
1453 4104 -2542 -6019 -2595 3174 4997 1229 -2358 -2789 -561 980 1273 1558 1420 -381 -3558 -3188
1469 -3188 1307 5126 2907 -3034 -6050 -2042 3995 5011 764 -3768 -3702 276 2045 2003 873 -219
1485 -219 -1046 -2051 -1163 2101 4415 1610 -3781 -4817 -404 4534 4313 -916 -4541 -2703 1427 3209
1501 3209 1219 -875 -675 -509 -1313 -1082 1571 4065 1467 -3645 -4753 -148 5352 4528 -1435 -5820
1517 -5820 -2991 2323 4597 1450 -2112 -2621 -906 224 701 1318 1773 -123 -3085 -3273 734 5024
1533 5024 3446 -2487 -5576 -2179 3495 5026 843 -3456 -3675 103 2135 1439 191 -126 -559 -1933
1549 -1933 -1293 999 3359 2024 -2113 -3769 -1393 2988 3876 335 -2628 -2558 -347 1438 1462 740 -104
1566 -104 -1505 -2285 -1266 2177 3777 1112 -3341 -4360 86 4610 3832 -967 -4341 -2104 1789 2873
1582 2873 895 -920 -942 -785 -907 -696 1346 2677 427 -3460 -3673 419 4381 3435 -2173 -4685 -1611
1599 -1611 3240 3511 31 -2792 -1515 1095 1130 -795 -207 1223 1124 -1371 -2852 -574 2982 3494 -505
1616 -505 -4297 -2508 2396 4265 1186 -2711 -2849 99 2082 1442 9 -487 -351 -703 -977 -167 1872
1633 1872 1519 -954 -2950 -1365 1728 3338 400 -2349 -2067 215 2072 1434 -18 -746 -1055 -1021 25
1650 25 1229 1580 25 -1668 -2120 240 2324 1567 -888 -1988 -573 1129 958 -347 -76 378 552
1667 552 -667 -1106 712 2238 888 -1932 -2828 17 2835 2053 -1413 -3212 -764 2086 2346 -622
1683 -622 -2218 -390 1537 991 -890 -856 978 1862 -520 -2399 -1077 1742 2539 -219 -2871 -1772
1699 -1772 1586 2692 480 -2182 -1498 1068 1527 160 -1111 -587 963 773 -512 -1199 135 1552
1715 1552 431 -1322 -1461 170 1609 616 -1079 -1492 81 975 754 -325 -596 20 421 278 -255
1732 -255 326 214 26 -274 -186 452 299 -302 -423 176 418 -109 -639 -190 482 371 -456 -1075 102 814
1752 814 862 -572 -1023 167 1469 1034 -996 -1050 228 1306 511 -1209 -1204 554 1622 173 -1346 -1047
1770 -1047 762 1735 97 -1454 -1204 564 1688 -125 -1250 -883 1091 1247 -608 -1882 -537 1586
1786 1586 1043 -717 -1621 -307 1634 1539 -252 -1681 -824 1264 975 -91 -1037 -529 671 541 -390
1803 -390 -357 132 361 -385 -757 -527 927 851 131 -892 -1025 440 1061 835 -427 -952 -393 308 553
1822 553 323 -107 -491 -569 95 709 696 440 -748 -608 -25 453 331 -206 -284 -52 -509 -108 536 1079 419
1843 419 -508 -935 -456 947 1320 251 -1206 -1252 272 1035 776 -618 -879 -405 107 266 101 528 276
1862 276 -642 -1027 -366 734 1704 694 -1487 -1891 36 1692 1764 -419 -2028 -1329 732 1634 676 -391
1880 -391 -856 -793 471 718 717 83 -45 -1043 -566 199 1126 892 -331 -1200 -1019 638 1005 790 -180 -807
1900 -807 -584 71 623 698 292 -327 -922 -590 303 1171 1037 -20 -1458 -930 586 1582 1042 -300 -1713
1919 -1713 -1128 347 1645 1344 -642 -1501 -1378 137 1546 1311 -105 -1379 -939 224 1235 1300 -111
1936 -111 -992 -1095 54 1055 1396 16 -1089 -1067 -462 616 864 400 -517 -1006 -629 319 959 548 49
1955 49 -588 -821 -331 696 1136 718 -421 -1188 -888 487 1192 754 -459 -1289 -1092 290 1479 1242
1973 1242 -371 -1466 -926 197 1596 1293 -216 -1651 -1147 75 1511 1193 -179 -1093 -1329 -60
1989 -60 952 957 -68 -1092 -1046 -87 1005 1060 358 -755 -781 -30 742 761 54 -209 -682 72 89 45 644
2010 644 230 -6 -737 -677 35 1209 1167 -343 -1326 -1053 479 1517 830 -551 -1684 -529 799 1040
2028 1040 595 -533 -1086 -717 -205 761 786 101 -1023 -1272 -230 1077 1700 273 -1384 -1507 -200 1420
2046 1420 864 2 -1113 -698 280 805 667 -228 -371 -103 -247 -174 49 143 282 -329 -891 -227 442 1010
2066 1010 660 -343 -733 -410 366 916 752 -536 -1222 -841 716 1121 569 -357 -1271 -639 449 974
2084 974 737 -419 -824 -988 39 682 592 393 -703 -846 -666 1119 959 339 -1274 -1299 -175 1073
2102 1073 1203 -189 -1191 -748 -61 783 567 -92 -389 -71 -170 -270 221 627 238 -285 -1036 -1020 523
2121 523 1250 585 -739 -1571 -304 982 1238 0 -760 -819 -23 597 818 273 97 -537 -540 26 300 807
2141 807 536 -563 -1066 -288 933 1272 311 -954 -1195 -102 1020 917 71 -540 -639 67 389 747 -78
2160 -78 -653 -353 -307 -63 601 345 117 -228 -509 -397 191 672 299 -579 -771 -187 743 1098 531 -977
2180 -977 -1184 -176 729 873 254 -463 -777 -396 236 396 293 115 -434 -784 -521 316 822 620 -400
2199 -400 -1046 -426 390 997 639 -669 -776 -67 432 785 77 -497 -867 -117 429 301 241 39 -59 -522
2219 -522 -494 256 758 472 -367 -803 -649 419 819 603 -86 -884 -546 570 793 585 -257 -505 -158 210
2239 210 341 280 40 -14 -380 -348 280 227 233 154 -489 -525 273 818 366 -143 -701 -634 217 411 611 -52 -275
2262 -275 -519 169 47 238 117 -194 -403 -371 -119 418 150 -131 -281 -760 -6 644 539 91 -116 -344
2282 -344 370 624 274 -175 -490 -359 197 591 215 170 35 -229 -252 -102 393 293 75 -483 -402 -285 417
2303 417 601 -22 -530 -475 251 240 466 -196 -576 -440 55 620 395 173 -360 -367 -215 -109 2 260 129
2324 129 -220 -324 -145 335 501 228 -385 -520 105 645 559 -85 -491 -321 -138 391 201 -269 -388 -348 141
2345 141 8 64 229 -8 -53 -474 -7 375 395 108 -292 -213 -20 291 284 -156 -471 -381 11 86 256 232 -426
2368 -426 -161 -267 -83 281 202 -217 -256 -203 148 312 240 -130 -147 -79 218 235 293 161 -106 -465 -375 39 514
2391 514 194 -459 -156 -190 60 442 251 -332 -223 -163 231 102 14 -54 243 -176 -93 375 357 79 -62 -448
2413 -448 -62 324 470 322 -466 -569 -34 407 91 110 -77 -178 -290 127 93 82 124 -371 -312 84 269 342
2435 342 -152 -570 -417 155 127 315 59 -197 -359 43 -44 212 11 -21 -581 -280 165 370 159 -345 -545
2456 -545 -350 99 428 308 -207 -104 109 175 70 31 79 413 -32 -246 211 382 417 -31 -563 -364 615
2477 615 730 124 -505 -470 -40 137 64 -107 -86 -99 -96 -96 -56 322 241 269 -506 -223 138 881 313 -498 -782 108
2501 108 747 565 -267 -327 -167 206 264 92 -450 118 -10 -48 -145 40 217 -34 31 -427 -77 134 37 -131
2523 -131 -79 -311 -44 120 308 -14 154 -49 -197 432 499 337 -108 -427 -417 170 161 27 -298 -302 -117 207
2545 207 -33 -318 -67 -30 -176 -101 153 303 589 -323 -709 -271 601 454 276 -807 -371 203 799 172
2565 172 -667 -723 -20 318 320 132 -215 -191 -117 -339 138 421 714 186 -473 -440 386 706 208 -440 -689 59
2587 59 159 342 -36 -332 -413 305 488 -43 24 321 74 -106 -163 36 379 383 -188 -670 183 296 501 119
2609 119 -433 -524 -427 -64 357 214 -141 -743 -311 120 507 474 -172 -566 -465 131 587 431 -521 -832 -533
2630 -533 445 579 230 -352 -564 -365 499 416 158 -82 -386 -517 410 594 300 -363 -382 36 315 496 92
2651 92 -49 -150 -222 -372 -237 -89 226 107 30 -743 -380 302 782 351 -295 -732 -79 638 584 134 -414
2672 -414 -801 -81 418 472 166 -453 -740 -545 344 871 493 -350 -892 -259 641 918 222 -742 -817 -82 684
2693 684 601 240 -444 -272 28 499 99 -325 -361 -30 62 147 -186 112 202 103 29 -242 -252 58 122 306 -28
2716 -28 -281 -246 143 403 272 7 -533 -362 468 653 233 -405 -926 -318 435 1093 477 -895 -1142 -302
2736 -302 1122 1220 -73 -1244 -888 103 1162 685 -114 -864 -953 339 663 495 -356 -619 -144 86 680
2755 680 167 76 -186 -124 273 53 292 -175 -200 64 -179 -74 -112 -64 253 221 -453 -576 -182 436 729 284
2777 284 -546 -751 -217 745 1004 407 -721 -1101 -127 889 1124 380 -980 -1699 -279 1083 1323 80
2795 80 -1561 -1183 623 1369 678 -468 -1126 -469 490 1084 176 -706 -291 -90 95 -72 207 472 -286
2814 -286 -273 -392 108 415 198 -205 -361 -189 50 -4 -100 15 99 -118 -434 -97 331 1228 404 -1072 -1109
2835 -1109 -284 1053 1420 170 -1212 -999 367 1364 984 -373 -1123 -455 497 883 455 -485 -707 -519
2853 -519 112 721 780 1 -919 -831 182 934 549 -118 -731 -324 146 427 456 34 -210 -284 32 -212 278
2874 278 666 -33 5 -526 38 456 385 1 7 -303 -441 197 255 479 420 -499 -716 -240 552 1075 71 -1225
2896 -1225 -1108 125 1451 897 -595 -1030 -499 985 950 -91 -669 -544 173 143 141 84 315 -67 -340 -373
2916 -373 249 643 632 -378 -906 -304 531 753 -25 -635 -410 432 409 -72 -120 -184 266 -72 -556 -68 423
2937 423 464 -232 -801 -598 83 696 362 -315 -692 0 102 357 -62 -58 -624 -344 -6 507 538 -32 -429
2958 -429 -478 107 453 131 -376 -532 -210 441 180 146 -150 -122 -159 -164 27 411 618 80 -640 -546 313 845
2980 845 553 -294 -475 68 485 264 -296 -358 249 139 -127 -562 -166 261 428 -432 -412 106 774 476 -453
3001 -453 -831 9 469 534 -234 -859 -173 547 543 -215 -157 -121 47 -11 -207 -118 286 244 89 -584 -89 345 961
3024 961 -28 -491 -298 164 562 183 -400 -53 -182 3 -80 109 -16 75 -322 -35 109 189 396 -341 -129
3045 -129 43 250 385 131 -221 163 -29 -15 -185 121 257 -7 -136 -520 317 356 -11 -258 -247 200 451
3066 451 53 -454 25 142 238 -483 -92 50 451 193 -129 -294 175 693 104 -300 -523 71 544 328
3086 328 -485 -584 91 579 28 -406 -139 -112 -39 88 -277 -116 240 258 31 -603 -6 619 274 -218 -336
3107 -336 -287 212 98 -23 -444 -172 317 -28 -254 -320 182 21 114 -146 -103 337 -34 -69 -326 -3 188 155
3129 155 -225 -157 -19 124 78 -197 -160 -165 106 -59 -22 -16 286 150 -47 -152 239 69 -45 -210 -290 -76 36
3152 36 -25 -391 -70 49 291 -27 -109 161 216 362 -193 -99 48 235 30 -137 -210 83 241 68 -470 -200
3174 -200 217 125 -51 -359 -263 22 195 185 -116 212 355 287 -287 -294 271 622 370 -159 -223 28 -33 56 -448
3197 -448 -249 -221 217 -24 -238 -241 -125 135 -80 172 -185 138 -110 -155 -230 8 315 -405 -113 15 -25 53
3219 53 174 121 -308 28 227 -99 154 298 9 22 -306 252 51 308 44 -268 -45 46 269 -103 -145 56
3241 56 -208 -99 226 122 -11 83 159 -256 52 161 240 -105 -434 -39 -66 139 285 -155 -32 -185 81 168
3263 168 -104 228 -27 -14 -173 -162 228 195 -177 -384 -272 131 251 193 -441 -6 -46 118 -6 -55 -66 44
3285 44 -84 -36 -56 71 94 140 -83 -159 150 185 125 -119 -343 -56 -54 209 50 -293 -169 -213 -29 23 58 -39 -21
3310 -21 -45 -253 326 66 11 133 -121 31 154 177 -50 -31 36 -10 77 -132 -79 -140 -50 -183 -20 149 18 -47
3334 -47 -141 -55 171 291 314 -49 -316 -313 -211 -8 77 96 -111 11 32 46 189 -36 -158 -107 -269 -39 266 81
3358 81 -81 -23 -180 190 102 -26 -49 -91 -98 -5 -35 84 141 -416 -29 76 36 182 74 -383 -344 -57 19 49 296
3383 296 25 -82 -7 160 -44 195 -23 -169 -153 -34 57 135 -35 -313 -284 -41 -55 253 108 -256 -33 10
3405 10 138 153 -33 -190 -23 -122 -57 255 108 54 -218 -526 -26 346 95 -125 -288 -237 -84 37 171 301
3427 301 -321 -123 -46 210 58 257 -39 -405 -105 131 327 237 -13 -259 -4 100 328 -35 30 -176 -45
3448 -45 -166 414 84 -3 -148 -132 -18 282 203 -162 203 -388 -184 37 139 36 -109 -274 113 -77 348
3469 348 76 -142 -116 -151 -231 71 118 47 55 -123 -44 297 289 -21 -407 -474 -320 54 -10 3 -209 -172 -202 -18 -52
3494 -52 -97 -7 -213 -161 -148 390 190 -26 41 -113 -32 148 248 44 -35 -152 43 82 94 232 -128 -47 -205 -35
3518 -35 219 212 -235 -211 -324 -321 190 524 -246 -477 -336 -153 109 402 302 -339 -301 -173 101 -157 49 75 -180
3541 -180 -149 70 395 66 -29 -39 -233 226 134 6 -206 -170 -206 -90 -12 108 -259 -30 -100 -40 28 236 91
3564 91 -187 -26 -222 61 172 -25 -19 -254 0 -161 217 234 -157 73 -50 -79 553 88 210 82 -389 -136
3586 -136 59 267 220 30 -475 -88 340 329 -97 -149 -157 -208 107 48 90 -162 175 -70 -107 180 90 60 -186 -370
3610 -370 -37 193 143 281 -79 -463 -75 22 372 167 136 2 -104 16 182 140 -2 -22 -163 -12 197 164
3632 164 -137 -75 30 -160 256 430 164 136 -310 -235 80 130 219 -29 -347 -106 298 135 74 57 205 -105
3654 -105 155 -142 212 -57 -434 -105 146 7 376 56 -100 -214 -202 96 61 164 -39 -313 -151 168 416
3675 416 93 -39 -169 106 123 37 4 -86 -183 -144 34 61 500 -34 104 -64 -328 -155 139 74 -145 -311 38
3698 38 -10 256 323 -62 -17 -295 267 28 -129 15 -75 -97 -155 47 202 17 -44 32 -32 280 526 209 -48
3721 -48 -206 204 43 41 63 121 -311 103 63 -18 45 -311 9 -274 -29 -36 221 222 53 -57 -169 67 -63 -189
3745 -189 -83 -146 84 182 -294 51 -255 -310 275 146 270 164 -217 -89 256 -5 -190 101 23 21 29 -82 55
3768 55 304 68 95 -69 -271 256 116 107 -445 -384 -387 326 2 -188 -354 -127 10 175 198 3 200 178 231
3791 231 -223 194 13 -140 160 -169 -1 151 71 -106 -163 -41 -59 337 -61 62 -255 -173 -228 -30 -232 14
3813 14 -5 -128 -30 -261 -21 106 118 -400 -138 115 62 237 -127 13 -255 71 214 197 2 253 116 -38
3835 -38 227 -141 213 85 111 38 184 3 84 -2 294 -74 62 -45 17 -37 -104 -85 309 166 183 -67 -171
3858 -171 -183 72 194 150 -130 -149 -309 -309 29 -6 -91 -241 -74 197 64 -215 203 58 100 -243 -353 117 277
3881 277 92 99 91 207 -83 -193 -144 -71 121 66 81 133 91 281 255 -98 -105 105 46 -210 189 -177 23 8 54
3906 54 154 -117 84 230 38 -59 142 -9 12 -101 -287 55 56 -87 92 -110 -128 -58 158 -49 103 96 113
3929 113 -53 73 -128 -84 121 77 216 -349 -128 -138 -16 183 135 57 -255 -135 -56 360 169 -167 -214 -17
3951 -17 158 121 -240 -208 22 118 51 186 -1 32 98 203 102 378 -187 -53 -93 144 238 -15 133 -60 -21
3974 -21 -51 195 97 -152 -71 -145 -181 19 168 -146 345 -157 -178 83 75 12 57 90 -158 187 59 148 45 -249
3998 -249 -196 50 40 188 -186 133 -65 -328 -125 -53 305 298 -53 118 174 291 279 218 -257 -56 -17 93 98 -4
4022 -4 61 -295 156 -125 151 -88 -129 63 -8 72 194 287 25 -68 17 154 -77 -176 109 136 29 254 -139 80
4046 80 159 396 -60 -61 -231 286 -115 213 -77 -77 -198 -40 46 -162 108 -155 -225 -221 36 -8 40 -28 -54 -269 221
4071 221 87 -115 -215 -253 175 122 20 -181 -231 69 135 -30 33 224 -92 165 -19 -49 277 74 -211 279
4093 279 12 115 -63 -174 -180 127 -168 -7 -85 40 220 262 -286 32 217 100 137 64 -405 37 222 110
4115 110 103 -367 -249 130 214 40 -196 -162 33 272 346 -169 -328 -57 -277 -67 -125 75 220 84 -314 -367
4137 -367 -146 86 155 -92 -174 -312 53 -26 165 -29 111 -310 -471 -75 -195 -14 140 -99 67 -40 134
4158 134 -58 -70 -129 -19 -97 53 95 167 -104 -159 155 206 268 83 -286 -55 -43 38 11 -173 -73 -220 42 359
4182 359 246 -209 -144 105 -115 80 8 210 -39 -419 -53 86 163 55 234 -152 234 -177 -95 237 -145
4203 -145 11 -165 -46 135 288 137 -128 -208 69 145 -216 -94 -7 -279 -125 -12 -6 -31 133 -81 -150 -185 -24
4226 -24 -18 -14 -114 59 95 -22 -35 -151 74 99 289 27 32 -3 -6 -188 1 -104 77 -265 -31 307 -107 48
4250 48 270 40 65 49 -11 -122 118 -30 32 -164 -70 23 -155 168 -55 -207 -154 -114 136 -92 -8 -57 -15 -104
4274 -104 -89 173 113 -17 -72 -232 -72 2 -138 -26 -261 -78 -125 -62 5 -46 -54 314 -18 -2 201 83 7 -1 40
4299 40 -300 127 167 -89 181 110 160 -90 61 11 -42 -61 60 114 -39 -141 58 -95 -171 -198 274 -55 185
4322 185 233 -448 14 133 -6 227 161 -33 162 -66 269 -95 304 -323 157 188 -63 273 -191 67 -105
4343 -105 259 33 -93 183 95 -14 -27 -62 208 185 -167 -130 -232 -131 -321 138 -239 85 -257 22 -35 -6
4365 -6 -121 -207 -76 -215 12 237 -48 -82 -94 -72 -98 -71 -48 -93 145 84 -247 -172 244 122 336 9 -159 47
4389 47 -5 -104 -31 47 38 34 101 6 122 128 -161 -208 9 -204 57 1 -244 -72 308 55 -8 -117 -127 -166 -6 -144
4415 -144 72 244 -25 -111 7 -311 25 -170 -148 -126 -18 -179 -5 301 -232 168 37 1 42 92 159 41
4437 41 -46 -149 12 98 25 229 5 -100 46 95 30 88 -9 -178 46 189 -6 -155 275 74 145 166 3
4460 3 -172 -47 -160 49 -67 -188 201 120 -4 -160 153 -157 -28 -79 94 87 234 -109 126 -36 247 -405
4482 -405 45 123 411 227 -176 -405 -17 140 220 -189 -196 -190 122 -18 334 120 40 -120 -187 97 -69 125 -167
4505 -167 112 300 116 -79 29 107 14 81 -150 -180 -52 -169 204 -28 -103 -182 405 15 4 67 90 131 -101
4528 -101 -80 -36 -17 3 134 120 -71 82 -222 -188 135 -205 46 -43 -234 130 -164 240 214 211 117 -317 72 225
4552 225 221 -168 -277 60 -82 -116 -65 165 -14 189 -200 -130 114 36 187 -149 170 -80 -100 -36 44 126 -99
4575 -99 -161 254 76 55 -344 339 198 -253 -276 -249 171 29 249 17 126 173 29 -1 -139 -47 -23 213 -270
4598 -270 108 165 -8 146 66 141 274 -16 42 -110 -27 -23 -68 13 -83 3 189 125 58 -166 14 160 -54 -44 -39
4623 -39 -380 0 -12 -62 -138 82 109 252 229 165 20 -40 95 217 -6 -299 -27 -167 28 -96 -1 113 -102
4646 -102 -27 -70 137 -74 46 9 -112 70 24 326 43 -134 -44 -23 63 109 104 -240 -56 63 268 -235 -7
4669 -7 26 -82 52 150 -286 -20 23 74 170 -111 199 119 -196 225 -309 213 -75 -11 -34 335 -125 89 -154
4692 -154 23 175 -19 97 -245 195 5 6 140 -177 -167 212 165 -82 150 -178 -262 -244 162 401 -10 254
4714 254 -324 58 86 -211 -186 47 -73 160 198 -124 -113 164 158 137 52 -120 168 61 -96 145 -507 -92 374
4737 374 133 -184 -275 -447 -65 43 -44 145 -295 25 -104 147 390 -1 -186 -80 31 -14 507 130 -196
4758 -196 -66 -52 190 217 -136 -138 30 11 -83 503 -144 -40 -226 -49 146 -73 -61 -73 -71 127 62 -166 -150 158
4782 158 -136 11 -234 -117 23 -171 -104 136 -99 -333 153 -125 212 -446 -68 -80 174 201 -52 -71 -106 35
4804 35 344 -9 54 -113 -188 -171 -34 169 51 -207 -191 69 194 174 -119 -128 -110 157 -146 93 -124 -18 112
4827 112 -14 192 111 -47 173 97 46 -136 79 -82 278 -260 -187 253 12 58 -60 75 -25 86 76 91
4849 91 -5 34 25 100 -36 91 -12 -23 216 151 169 130 220 -71 -277 78 -91 47 -54 -6 -278 28 98 97 418
4874 418 -300 42 -112 127 26 314 197 131 -125 249 117 -170 178 -268 104 -257 -170 -44 85 106 -95
4895 -95 66 225 250 150 263 169 -201 55 99 99 -35 -83 6 187 -110 -29 -230 -101 -152 -176 98 147 5 173
4919 173 -190 -219 -182 211 -147 -87 -138 200 115 328 302 -105 -29 -66 64 -25 -102 234 -61 -58 65 205 10 413
4943 413 -65 -100 74 11 309 -87 -167 -194 -68 -290 222 -60 137 -46 -149 -183 88 -5 221 -207 114 -90
4965 -90 -257 118 128 -21 -162 207 200 193 289 -133 -160 126 66 -244 -180 -186 215 55 -342 -132 72 61 -52 -184
4989 -184 33 250 251 175 -169 -176 41 -150 -143 12 -71 28 -275 -159 20 104 -52 31 66 239 93 -307 472 64
5013 64 -81 -226 349 102 -25 183 48 87 -243 200 -17 -339 -89 96 -190 44 66 -10 -63 272 -237 -9
5035 -9 -45 -135 108 -34 -255 -59 188 86 -227 -110 -132 44 211 -138 93 -159 -8 82 -80 311 -392 -274
5057 -274 66 3 -110 43 61 207 -36 -135 130 66 29 168 166 -215 182 80 -48 -143 -283 174 -54 66 71
5080 71 -249 158 2 -15 -58 235 -80 149 -252 144 -156 94 -55 -54 -96 -248 -68 145 63 -202 119 77 47
5103 47 181 146 -268 276 -20 183 -132 -97 86 -112 -38 121 -31 76 -42 38 65 40 157 -7 -155 23
5125 23 -66 -253 -17 56 -104 104 28 1 71 -47 -89 -5 -1 -83 82 106 -381 -158 -93 -53 97 -50 -31 52 -138
5150 -138 119 -40 -249 277 -313 -306 -9 111 31 -19 -54 -79 -204 -94 -265 -157 334 -119 70 239 81 -18
5172 -18 155 0 -120 -107 262 -233 -67 -4 -179 105 -89 137 -61 -54 30 -42 108 223 54 87 -52 -53 -180
5195 -180 186 -17 14 -134 -147 -215 -162 -218 126 -127 -92 67 73 -2 29 -85 -121 129 183 77 185 134 -185 151
5219 151 -149 150 80 -156 -1 145 106 11 -34 -109 71 2 79 -189 297 318 -74 -114 -99 28 100 49 0 -5 -160
5244 -160 92 77 -73 99 -34 3 89 20 40 -37 67 -245 -228 -281 -111 -87 165 2 185 -137 -277 -39 -53
5267 -53 26 11 -116 -51 -8 53 -7 -165 9 3 -42 10 186 -39 278 -1 -295 171 -89 -4 40 147 -191 -199 27
5292 27 -197 -134 82 41 42 15 -129 -120 97 -52 -67 199 148 -18 248 150 -9 -160 26 -17 28 -287 -63 -121 19
5317 19 16 -115 226 26 -76 132 -1 -68 -12 -10 166 -84 -10 -43 22 -32 48 69 39 -79 22 199 130 144 -103
5342 -103 148 -109 -38 44 150 -56 49 -151 203 -80 156 -113 -337 89 93 -19 -184 -218 18 -106 141 -68
5364 -68 66 64 -20 -12 -24 232 -124 -49 329 288 24 133 -104 95 -90 0 -90 63 -73 -93 203 -31 28 -51 -49
5389 -49 144 60 -50 19 -94 322 175 -340 -186 -156 -44 157 -74 -82 -386 -61 162 266 -143 -143 -201 197 57
5412 57 -129 21 -64 98 -94 -185 74 -4 -364 96 -25 -31 105 -232 -248 43 -83 82 -6 -95 -10 -96 34 -20
5436 -20 -93 -18 -51 302 -8 -246 -248 162 -188 84 -322 76 -174 182 -23 63 -142 -305 209 96 69 -11 -221
5459 -221 115 184 74 204 31 -129 89 100 86 279 -206 -155 173 294 326 244 75 -74 -203 -280 169 328
5481 328 -154 203 248 173 92 -126 -77 -257 257 -11 275 35 20 -21 -194 -225 8 -113 198 -257 -9 116
5503 116 -12 62 -285 117 129 75 -29 100 -164 -82 -164 108 126 67 185 -20 -233 -226 -14 -21 -45 76 -259 154
5527 154 -176 199 -175 65 39 255 15 -15 8 43 121 23 185 -62 27 -128 -56 -309 320 -124 65 -154 -135
5550 -135 77 81 66 -313 -78 -27 103 -37 -99 38 -68 349 21 -18 -140 -110 216 -80 272 -129 -72 -142 200
5573 200 -254 -156 129 98 -96 70 127 -97 110 -105 5 -31 -11 -18 -82 -295 -339 -112 247 -77 36 62 242
5596 242 -135 46 -68 259 -123 -321 139 -135 62 230 35 83 -175 -4 -152 -132 160 -232 178 -70 237
5617 237 -307 205 -96 52 90 -11 -121 -183 -146 30 67 -191 80 4 -16 350 53 -72 -202 -295 60 1 203
5640 203 -137 -146 138 93 -76 -111 -196 194 -125 -220 -276 -255 -82 -1 -20 -292 -55 -13 -185 31 37 -32 -25 -23 -417 7
5666 7 -37 -127 19 -200 92 -132 78 -24 -16 -195 22 240 29 222 -254 181 93 -204 17 75 423 -44 163
5689 163 -23 168 203 -36 -261 -89 54 186 23 134 45 -105 16 -191 127 251 193 -306 160 66 -142
5710 -142 135 57 100 -39 22 297 169 49 -309 33 37 -41 -12 -253 79 -29 -108 93 -168 -80 -115 -27 -40 -281
5734 -281 -5 -23 131 81 42 -64 3 280 13 104 174 -74 -83 105 97 -109 61 43 -99 66 352 -28 16 179
5758 179 -140 -142 63 122 -31 394 60 -110 127 11 -41 -288 109 335 52 95 -98 250 -79 148 -96 -38
5780 -38 40 174 63 -190 81 -204 -193 127 59 -59 52 -4 3 39 -10 220 86 -34 188 8 62 86 22 -171
5804 -171 196 116 25 -261 -289 25 186 93 236 127 142 -84 -9 -26 10 287 135 -203 13 123 -20 46 -33
5827 -33 39 -35 103 -67 -78 95 136 -328 -56 -17 -329 173 -32 -96 -47 -77 -138 -104 224 -14 -30 161 44 166
5851 166 -5 -127 285 -90 149 181 -32 -111 -146 -173 8 77 6 -87 -134 37 75 -85 134 76 127 132 -40 -188
5875 -188 49 73 -293 -135 60 82 125 -48 -95 -95 35 80 -36 143 -270 177 -168 -16 285 -22 -134 -270
5897 -270 69 -170 -47 -31 152 19 -54 -137 11 154 -188 -81 -67 283 -143 -274 183 149 22 116 -181 -10
5919 -10 8 260 -27 -73 -211 -325 -122 155 109 -60 -94 -113 336 4 134 -103 77 260 -72 14 75 -17 -109
5942 -109 -41 246 -168 -106 104 -159 -98 32 290 -38 73 -39 -14 -52 10 57 -330 -187 5 60 -29 -16 5 -79
5966 -79 175 126 71 -27 100 -91 -268 86 -36 -67 95 187 -112 22 -234 -26 -63 101 -202 -211 -165 95 -116
5989 -116 -43 -49 -309 242 -201 -33 -81 9 1 115 67 -138 -182 -160 212 100 10 60 -68 241 -458 -113 -26 -72 -30
6014 -30 -20 -113 -10 -1 -271 -30 63 165 -65 179 174 -225 194 96 -110 128 193 -173 -101 -163 -66 -130 -158 113 128
6039 128 -79 -271 124 186 -73 -118 -96 -313 6 10 -116 120 243 0 109 100 -280 32 -141 76 -120 183
6061 183 65 79 -25 33 -96 -227 10 10 99 173 -140 -26 191 -147 -193 25 44 280 -138 -191 79 -56 -55 20
6085 20 208 281 -98 133 60 -104 -42 -9 96 152 -288 -46 -113 -131 252 -92 12 -52 42 173 11 -63 81 150
6109 150 402 -60 140 -62 -345 -34 -29 -41 34 96 233 -190 -105 198 66 -163 303 92 27 -175 -493 160
6131 160 -155 128 97 87 -126 -154 -36 -12 -51 -172 83 113 37 -67 -69 -74 -103 -1 141 -386 -83 -22 -27 -134 -232
6156 -232 -93 98 -87 -266 211 -63 0 35 183 -6 -24 -60 63 115 -60 199 -142 -215 224 -180 89 81 17
6179 17 -176 -16 -32 -52 22 -131 32 3 -30 150 29 75 -164 -154 64 -104 157 177 -70 425 -162 119 -70
6202 -70 -55 -502 -146 -256 -93 136 -239 -356 9 88 295 307 -188 23 179 77 143 -104 -93 288 23 -2
6224 -2 66 128 -42 -43 -44 -47 68 -61 138 172 129 -10 -88 12 93 -125 26 -26 150 -42 -13 5 99 239 -131 23
6250 23 107 -64 -62 -70 -76 155 -103 68 -203 76 -28 -166 -101 125 91 55 -132 110 104 355 116 56 -160 -62 184
6275 184 -136 -54 -136 -4 20 54 -274 70 -40 -190 -79 91 -107 0 -85 129 -3 -52 28 -14 -209 59 154
6298 154 -234 -162 184 -54 -136 -36 -24 75 -16 62 22 22 155 -19 153 82 -58 -59 216 -38 41 216 -113 91
6322 91 -4 6 -110 -196 9 -113 -90 -68 -22 78 -257 -87 -165 -32 364 100 114 210 -22 271 116 -6 42 76
6346 76 66 32 240 40 13 -109 199 23 -33 -57 78 216 92 156 -144 355 78 211 -420 -88 -83 -88 -136 -21
6370 -21 -229 -31 -61 203 -167 -266 -181 -27 -36 -88 34 -9 -42 30 201 65 -56 -51 -85 -100 86 -67 125 75 -39
6395 -39 -160 55 -63 -122 -155 312 100 12 -175 -125 68 -328 -305 144 -143 -212 96 169 5 220 26 -19 -106
6418 -106 -87 54 -121 -110 261 -211 145 -17 8 -15 -120 -130 348 -147 113 95 -40 -7 -115 439 -144 5
6440 5 67 -223 -27 302 -89 100 -87 235 -1 -137 -50 -90 37 272 -4 -55 -155 -45 76 -148 13 347
6462 347 155 -186 -89 46 -184 122 -123 237 -227 150 -246 78 -546 -58 204 50 -283 34 -271 50
6482 50 10 49 28 332 277 68 -114 -52 -61 81 -34 148 -336 -185 246 -88 -51 -94 338 17 5 0 294 347 -34
6507 -34 158 54 57 -68 -16 -7 -376 202 342 148 14 -52 68 14 -126 -230 -192 -45 -20 22 -50 -99 -233 112
6531 112 -21 66 309 -47 50 37 -88 -85 -229 -58 11 -50 -240 6 20 -26 -161 71 12 -34 -19 -225 68 332
6555 332 323 9 -268 -23 43 -128 22 104 272 244 119 155 36 46 280 121 -141 -6 69 26 8 -333 -43
6578 -43 -8 96 86 269 183 -111 -22 -54 0 237 102 53 101 399 -337 -152 -222 190 -177 137 35 56 165 -103
6602 -103 133 -27 -95 -8 30 162 129 63 206 -23 170 113 67 -34 71 -135 -64 81 52 20 -120 -68 -181 206
6626 206 -155 -211 -237 -66 -22 -47 -109 109 245 -75 90 -79 278 90 -82 71 142 -3 -43 -12 33 148 -58
6649 -58 66 -30 13 157 -134 55 -275 106 -215 128 114 199 26 -96 25 -117 46 -69 62 -152 16 -56
6671 -56 -136 61 29 76 19 124 -307 -323 8 56 397 -24 261 -133 150 11 4 187 42 -76 -138 300 -318
6694 -318 88 93 69 20 -195 120 -47 -48 -157 -3 115 50 55 -201 -75 110 31 -75 -71 82 -19 19 -131 -19
6718 -19 236 -36 -39 12 -53 64 200 -189 1 63 67 -61 175 -3 217 61 -262 -249 120 81 -3 61 40 -263
6742 -263 -92 -1 218 -62 -65 -76 129 71 184 -103 -39 -43 -196 -122 61 235 -106 -24 35 170 61 -199 104 78
6766 78 -97 -13 -100 -162 -23 -203 11 -179 -42 135 -5 8 -59 -250 150 -96 -124 -110 76 68 72 -211 -20 -73
6790 -73 -185 -274 -139 16 89 9 -236 285 3 285 100 -2 -70 -76 52 128 -51 -149 -108 191 -44 -20 -109 84
6814 84 -89 -112 -24 -145 159 149 64 -120 -34 4 24 -126 107 -91 78 239 -22 -7 -102 -20 -164 -208 225 -121
6838 -121 157 -58 197 -208 1 46 -295 -159 -306 161 24 96 -173 290 -59 -42 78 -202 -14 25 244
6859 244 8 -32 291 12 -63 161 -249 -65 -41 53 248 -106 164 30 -104 -98 261 -114 47 -26 24 -127 211
6882 211 36 92 -19 -136 -94 15 -29 7 -38 -53 145 -94 -107 -25 228 68 160 46 56 346 76 117 91 -67
6906 -67 -92 97 94 -30 113 -560 192 -49 -228 -182 64 -195 -25 -89 291 252 143 48 -275 124 -171 -165 141
6929 141 -66 -118 88 237 -33 -41 -133 -148 115 89 119 -181 -19 -25 -34 61 23 134 -152 44 46 -70 273 140 -32
6954 -32 -32 15 3 -65 -24 99 -204 104 -247 -20 -163 157 -114 97 -232 219 -206 38 -270 -231 -269 -59 363
6977 363 -378 -106 -15 161 5 94 -4 252 89 -196 4 -47 -4 -98 -119 50 -106 196 -77 -34 243 164 -121
7000 -121 146 262 -132 171 -59 30 -56 215 -7 -46 -67 22 -308 -63 -273 -77 -100 123 77 -132 -204 -24 -117
7023 -117 -144 6 -32 242 -87 -189 -99 142 153 -135 -197 -131 -50 133 -212 -224 -146 1 62 -120 89 202 -96
7046 -96 -47 -198 110 122 162 132 -335 -111 185 -25 -99 14 121 163 59 124 -215 -32 157 127 134 284 -288 -313
7070 -313 -120 -32 -188 209 -47 -233 200 117 -107 83 -85 -33 150 130 -134 46 86 -28 -208 -228 -3 110
7092 110 30 81 -45 2 -82 -68 244 238 -10 4 -108 -41 58 -51 29 121 -26 -322 170 102 47 92 111 -308 17
7117 17 -45 -227 -77 -99 39 114 34 143 -124 0 -89 117 -167 -2 16 6 -138 30 64 -258 71 145 68 -29
7141 -29 27 -361 -245 -59 2 -109 -86 -62 -374 -9 -39 -66 -97 11 -141 34 119 187 13 9 -105 -20 -22 21 85 167
7167 167 -46 -173 126 -266 18 -143 59 12 -59 84 57 -102 -102 91 -207 40 -77 61 76 -130 -165 -164 -21
7190 -21 -4 -230 -129 -138 -58 129 -18 -91 124 79 -43 -212 -63 293 -59 -69 80 -114 133 -6 -180 113 -136
7213 -136 146 256 150 173 -33 283 -155 174 -24 -148 47 -11 -212 136 93 21 -118 4 506 -30 111
7234 111 37 188 -17 -114 -123 158 78 160 -54 141 137 -89 117 -77 11 19 -33 -25 -42 -12 -36 -55 -64 -104 -54 -147 294 339
7262 339 18 109 118 -129 -1 -151 -94 165 -22 -271 23 266 27 199 2 -106 -221 -52 48 121 -33 124
7284 124 260 227 -307 -273 59 16 -31 58 -189 118 29 103 183 -127 225 -21 189 197 -243 -57 102 202 -100
7307 -100 103 -121 14 1 25 43 2 -42 148 -143 -119 246 117 288 -126 -46 -116 182 16 -177 111 139 -131
7330 -131 52 341 214 -127 79 -78 -130 82 8 74 -253 -3 113 122 -158 -13 -242 39 40 36 -232 66 -35
7353 -35 -45 -214 -25 -127 -115 30 82 142 142 65 95 -37 -101 -54 -102 51 116 101 -20 33 40 3 -49 365 -43 -103 26
7380 26 36 -134 42 -294 -27 -167 -143 -17 -177 81 69 -91 256 -175 44 65 -241 -23 -92 53 333 48
7402 48 103 -36 -40 91 -39 165 72 110 -176 -155 3 -2 165 117 25 -152 -66 367 100 -422 -133 -156 270 84
7426 84 -49 -58 -113 130 45 24 -253 51 -121 -134 -35 -66 187 92 99 20 303 97 12 67 25 -149 -63 -23 -85 -128 14
7453 14 120 -127 223 -23 -98 -3 -102 -47 115 -51 -168 -135 -183 65 98 102 -73 -91 -81 -108 -73 109 -11 91 128
7478 128 69 -118 371 -16 75 -18 502 22 -96 65 -207 148 -183 -280 -328 34 93 215 172 -113 -253 -80
7500 -80 98 -203 -141 165 -64 43 -170 -145 -107 293 179 -65 -114 -215 -12 121 122 -163 544 8 71 31 -65
7523 -65 159 -23 129 -190 -128 36 71 82 -30 83 48 120 -134 87 207 93 -105 38 81 -15 242 -107 60
7546 60 20 -237 314 127 323 -61 57 -66 -40 6 18 -246 218 -77 -194 -106 -215 -156 -49 -134 -87 6 -160
7569 -160 105 77 19 33 131 155 250 -63 37 -71 121 83 -96 -63 -262 265 178 -14 52 -75 107 49 16 -127
7593 -127 -178 46 186 -244 -69 -172 37 44 -118 -169 -55 -148 35 49 173 -139 -130 13 -36 92 17 226 192 199
7617 199 158 109 5 315 -138 118 -217 16 160 -227 -67 103 -195 -110 57 -78 70 -28 -10 -121 -30 103
7639 103 -60 -160 113 -148 -250 -30 118 89 -339 -268 261 -304 -219 -134 194 -12 -132 -65 -260 -22 -34 95
7661 95 -185 -43 335 24 86 85 39 90 3 165 -34 -115 -77 -41 -179 -74 212 -51 -191 201 -411 -46 92
7684 92 91 28 60 -98 -219 -206 1 69 12 -156 156 -67 -159 67 -241 68 -50 -278 -16 -47 82 60 83 -24
7708 -24 -4 33 -142 -199 151 -6 -60 100 -102 83 -29 -5 -20 -63 -35 20 -49 71 109 17 -125 188 -9 118
7732 118 -6 -8 -81 11 67 -84 251 94 63 -148 10 -11 -37 -63 -101 -68 149 -31 68 12 36 -108 38 79 229
7757 229 35 154 3 109 -70 229 223 158 246 -238 -13 -245 5 89 222 -148 -163 -103 -34 -101 -20 -71 -107 -119
7781 -119 142 166 129 166 21 -93 339 -130 -69 239 -27 -180 -172 -91 -85 -42 -7 -98 -147 -36 180 -81 44 -268
7805 -268 -207 123 29 -121 -82 -69 -171 -132 104 -4 -110 -118 -124 163 144 -115 274 -171 134 -116 105 -27 -56 -7
7829 -7 -109 -74 103 -116 71 -148 -201 -26 -1 38 -273 -8 -138 -138 197 90 -213 66 -25 166 -235 -56 -49 -105
7853 -105 86 118 -37 -156 -140 56 185 222 -153 151 -112 -306 -81 -201 87 -51 62 116 -213 -89 148
7874 148 -132 129 -26 83 201 -175 -87 104 37 32 -30 -164 -148 196 -204 -63 -158 133 -10 74 97 -53 -69
7897 -69 -170 63 -211 -273 35 210 115 119 106 -64 177 -225 12 -15 -132 -95 131 99 79 -41 -194 -276 -124 -132
7921 -132 -97 -222 -28 -51 -13 404 -122 272 52 -396 -226 -168 115 63 91 -121 132 376 -91 79 65 338
7943 338 136 26 -77 189 162 86 125 -26 -254 -192 -210 -248 -57 -24 31 -158 -174 -256 88 48 -221 26 123 28
7967 28 -9 134 -65 -38 21 222 -91 129 91 -30 -106 -5 155 -104 -92 61 191 90 -38 -25 -1 -215 286
7990 286 -42 78 35 -214 15 -105 -350 -133 -99 40 -202 237 -194 227 61 154 239 -107 -113 -63 -130 47 -65
8013 -65 -99 -66 84 -206 69 296 -55 205 -135 25 4 332 109 47 -38 -307 -168 -3 219 80 -51 217
8035 217 0 -209 -80 -94 -71 -118 7 -108 -97 -9 -51 3 25 -50 -1 101 24 -91 -203 146 -136 119 134 -177
8059 -177 12 125 125 -90 150 -80 -78 -136 -168 -175 -17 -116 244 -128 -57 171 68 118 -265 11 18 318 -178 33
8083 33 172 -65 -69 181 -164 37 83 167 13 -240 96 -220 235 53 -18 251 -18 150 -29 94 119 35 -13
8106 -13 136 -120 -163 216 1 -60 -26 26 187 199 -261 -61 -23 95 176 19 -65 149 103 296 89 104 173 -77
8130 -77 -151 154 -165 87 -117 -125 104 -267 46 151 303 179 241 242 114 -212 -19 -187 -98 80 61 177 199
8153 199 205 -60 -104 -53 -300 -154 -147 -352 50 26 -196 -79 -106 104 74 279 135 356 200 54 99 70 -91 34
8177 34 -169 -103 -276 -50 -278 -199 -283 20 191 10 240 77 -1 211
8191B11
$$ Imaginary data points
##PAGE= N=2
##DATA TABLE= (X++(I..I)), XYDATA
0 0 0 0 0 0 0 0 0 0 0 -8 8 -8 10 -16 17 -24 32 -36 44 -57 65 -79 92 -108 130 -149 174 -203 233 -265 306
31 306 -347 395 -447 504 -569 641 -716 800 -893 993 -1106 1227 -1357 1500 -1660 1829 -2018
48 -2018 2223 -2449 2699 -2972 3275 -3616 3996 -4424 4912 -5472 6121 -6893 7814 -8943
62 -8943 10373 -12240 14789 -18515 24471 -35562 63275 -287632 -251363 527841 530166 12250
74 12250 -498878 -355109 93745 366632 183973 -84773 -177152 -68579 -11681 6641 66691
85 66691 169400 89839 -150699 -283302 -72564 243369 289208 -5543 -273440 -227808 47560
96 47560 217402 140661 -43744 -119380 -73488 -16703 5600 63676 134189 85109 -109976 -233149
108 -233149 -96152 179319 275939 77934 -207096 -285590 -86394 196536 290592 103792
118 103792 -192711 -315652 -137188 191484 354663 165424 -218576 -397529 -143931 289400
128 289400 409295 68647 -332698 -332083 30283 302498 203300 -81275 -204632 -89175 54062
139 54062 61473 9755 31269 71088 -14650 -166602 -140733 108373 277047 108430 -212301
150 -212301 -276980 -3458 257587 194147 -76962 -206506 -75651 92058 79263 -30724
160 -30724 -26790 73299 52268 -127100 -195755 24368 286866 211594 -160906 -370173 -131277
171 -131277 281331 369347 30592 -328474 -295598 61883 310262 190296 -103343 -226865
181 -226865 -106549 60795 117859 81794 15059 -63886 -117386 -74808 57941 153916 97269
192 97269 -66651 -164619 -85818 84144 157747 64356 -75981 -115480 -46832 33377 67190
203 67190 62162 17542 -61563 -107040 -46739 74582 122170 38763 -80461 -108785 -28550 67076
215 67076 86083 34101 -22170 -48091 -57028 -40107 36926 127652 96540 -81505 -212417 -100469
227 -100469 157073 247611 40098 -225846 -230049 32530 246270 164755 -93575 -210218 -70166
238 -70166 116742 126221 808 -62219 -17292 9655 -33835 -43079 44008 113505 36031 -119404
250 -119404 -153393 2643 170185 137441 -64898 -187095 -80152 110296 146024 12129
260 12129 -94552 -59454 24084 34535 -4279 -790 40164 31744 -47518 -97037 -27691 96939
272 96939 118822 -10103 -141884 -110391 48724 143018 72601 -61726 -110352 -46957 44621
283 44621 85799 56019 -15913 -72554 -64863 2547 70559 75104 5004 -77235 -85303 -4565 78494
296 78494 70742 -10609 -66278 -47975 1809 32164 40166 30412 -5453 -50640 -54273 5714 73938
309 73938 71333 -12334 -90229 -70710 31331 96858 45405 -56153 -80576 -11836 47256 31827
321 31827 -8459 -11625 5534 -4219 -28509 -16314 35485 63056 14642 -65716 -75261 13961 96246
334 96246 62202 -50783 -98989 -26893 64582 64857 -7566 -53711 -31443 11875 23046 5847
346 5847 -2129 8423 8018 -17559 -31731 2607 51195 41175 -25880 -64305 -21703 45471 52628
359 52628 -1634 -46550 -36645 6390 32121 18188 -11066 -19889 -5922 4501 1911 3683 14217
372 14217 10908 -11387 -21910 -1441 23416 19397 -5474 -19881 -12535 4077 12631 7012 -6380
385 -6380 -12089 -5162 2240 1731 1938 5764 2625 -8771 -8548 7346 16723 4084 -10652 -7560 4941
400 4941 8623 1767 -5781 -6984 -691 5750 2303 -7816 -8464 2544 8087 -1095 -7931 -205 7652
415 7652 2342 -5161 -783 8240 7277 -1724 -8505 -4934 5640 12546 4244 -13491 -17514 -197 15885
430 15885 9184 -8489 -13690 -5041 3863 7102 6914 2275 -4818 -6257 -849 5258 8452 8950 521
445 521 -13070 -14735 2501 18911 12117 -10281 -20948 -11116 6848 15549 9759 -6022 -16175
458 -16175 -9226 6629 14140 8740 1127 -4725 -10294 -8393 7334 20422 11744 -12421 -24222 -11468
472 -11468 12141 22819 9631 -16011 -26869 -8806 17538 21712 2675 -12915 -11817 -2975 4183
485 4183 11062 13883 4603 -12176 -18416 -5708 14526 22648 7122 -19569 -29343 -7370 22679
498 22679 25242 -1214 -22894 -17813 922 13062 13829 7732 -3329 -13824 -12428 1365 17819
511 17819 20332 3395 -21499 -27784 -2642 27589 26337 -6165 -30168 -21051 5483 20500 15407
524 15407 106 -13144 -16503 -6530 11054 21260 14827 -5401 -23887 -20055 8059 32849 21512
537 21512 -15485 -34820 -15861 15396 24704 9332 -10118 -18804 -13238 819 13797 17844 8115
550 8115 -9689 -23527 -15816 13705 35860 19988 -21088 -39234 -12732 25585 32770 5653 -22914
563 -22914 -26779 -8269 12906 19190 9664 -5466 -15426 -16207 -4017 16873 28332 10852 -22694
576 -22694 -33250 -5065 29312 31634 1707 -26669 -27030 -3772 20201 22777 4584 -15750 -22005
589 -22005 -11680 6746 21891 20636 -1911 -27724 -25694 6157 33469 25851 -6839 -28673 -21593
602 -21593 4507 23723 21250 479 -20129 -23838 -8963 13340 26087 15803 -14299 -35615
614 -35615 -19840 20557 40825 16107 -24803 -35109 -7180 24249 27858 5464 -16854 -18188
626 -18188 -4880 5899 9013 9774 6300 -7874 -23673 -17537 13480 34313 16178 -23280 -36853
639 -36853 -9002 28001 33729 4424 -25703 -25059 1221 20496 15395 210 -7406 -9194 -10679
652 -10679 -5498 10069 21074 8719 -17672 -28993 -8905 22916 31955 6622 -26583 -30450 -298
665 -298 29579 25837 -3181 -24033 -18354 2850 17165 15059 406 -13373 -14528 -3590 8223
678 8223 10563 4800 -3634 -10083 -9370 27 10999 13336 3419 -9287 -14174 -5739 10789 19462 7780
693 7780 -14434 -21856 -4781 16431 17633 -758 -16172 -12938 1861 10423 6419 -1611 -3565 -794
707 -794 -1258 -4878 -454 11934 13638 -4120 -20934 -12521 13601 24829 5640 -21280 -23870 1258
721 1258 23500 16345 -10956 -22946 -5841 15798 13861 -4581 -12147 -695 10095 4385 -7303
734 -7303 -6395 5839 12322 1672 -13766 -12510 6086 18118 6112 -14367 -16677 1037 16138
747 16138 9386 -7619 -12595 -2274 9407 8286 -2879 -7931 -179 8767 4092 -7301 -7978 4006
761 4006 11879 2713 -11346 -11760 2383 13650 7833 -8403 -15225 -3189 13324 12829 -3939 -14524
775 -14524 -4988 10803 11423 -1919 -10854 -4101 8409 8795 -2712 -11265 -4154 9213 10097 -4883
789 -4883 -14846 -4718 11957 12446 -3756 -15027 -6215 10254 13784 339 -12570 -8290 7054
802 7054 13101 1373 -11617 -7417 6915 10372 -1607 -11365 -5730 7509 9774 -1745 -11919
815 -11919 -6949 8078 12962 1256 -12862 -9009 7170 14336 2819 -11363 -9452 4351 11541
828 11541 3069 -8959 -9116 2979 10496 2454 -10123 -8809 5845 12283 1160 -12590 -9138 7553
842 7553 14810 3039 -12984 -12181 4822 16685 6789 -12070 -14904 1899 15540 7332 -10408
855 -10408 -13278 1596 12862 5346 -8637 -10434 2784 12254 5027 -9370 -10767 3859 13935
868 13935 5291 -10431 -11415 3363 13116 5407 -9005 -11144 840 10204 5176 -6559 -9113 1139
882 1139 8682 3518 -6744 -6682 4074 9453 1913 -8061 -7044 3980 10458 3852 -8062 -10089 399
897 399 10698 7277 -5816 -11423 -3137 7997 8156 -1889 -8572 -4457 5067 7919 689 -6789 -4477
912 -4477 4606 7576 -384 -8281 -4469 6351 8770 -1036 -10223 -6814 5460 10488 1903 -9947
926 -9947 -9015 4046 11343 3304 -8306 -7222 3983 8995 880 -7407 -4193 5847 7704 -1922
940 -1922 -10474 -4250 8682 10809 -3040 -14197 -7312 9837 13704 -473 -13180 -8605 6772
953 6772 12843 2644 -9331 -7427 4342 8958 1126 -7255 -4062 5647 6546 -2692 -8647 -2571 7124
968 7124 6934 -2815 -9629 -3980 6276 8717 857 -7450 -5656 2666 7426 2925 -3275 -3712 -105
983 -105 2159 925 -797 -750 692 419 -1180 -2588 -900 3008 3793 -765 -5609 -3947 2643 6905
999 6905 3771 -4027 -7476 -1976 6247 7639 26 -7925 -5844 2982 6980 1606 -5139 -4417 1639
1014 1639 3546 -55 -3371 -1159 3997 3791 -2807 -6306 -395 7865 6352 -3673 -9441 -2495 7855
1029 7855 8208 -1744 -8920 -4518 4674 7105 -203 -6436 -3570 3431 4264 -1064 -4348 549 5157
1044 5157 2079 -4613 -4868 2037 7096 2829 -5169 -7002 168 7030 4864 -3363 -6944 -2007 4371
1059 4371 4276 -675 -3679 -1318 1674 1661 122 -419 966 1076 -413 -1982 -441 1907 2338 -219 -3211
1076 -3211 -2624 815 2799 1563 -1275 -3027 -1871 1599 3347 1909 -1730 -3112 -858 2860 3128
1091 3128 142 -1957 -1626 781 1910 950 -960 -1317 53 461 -854 -1280 715 2133 163 -2868
1107 -2868 -2431 1204 4084 1943 -2694 -3951 -323 4458 3705 -1293 -4459 -1583 2581 2762 -535 -2347
1123 -2347 -1110 997 569 -1045 -594 1238 1754 -488 -2906 -1351 2431 3842 118 -3695 -2661 1732
1139 1732 3517 1724 -2148 -3043 -560 1491 1647 -7 -1064 -696 -411 -401 -220 1289 1917 -182 -2506
1156 -2506 -1781 1125 3343 1797 -1832 -3288 -1639 1911 3120 1049 -2539 -2964 -540 1542 2004 717
1172 717 -1021 -2107 -1450 870 2529 1885 -225 -1908 -1634 316 1993 2117 -169 -2262 -2170 -122 1496
1189 1496 1216 -397 -1712 -1621 -633 1294 1543 1029 -317 -1476 -1399 132 2133 2155 559 -2169 -2797 160
1207 160 2720 2828 -99 -2741 -3260 -554 2403 3275 622 -2740 -3230 -870 2796 3680 1633 -2252
1223 -2252 -4101 -1613 2586 4381 1449 -2665 -4009 -1563 2142 3628 1278 -2523 -3954 -1698 1676
1238 1676 3207 1815 -942 -2996 -2119 753 3237 2914 -398 -2826 -2174 376 2229 1888 395 -1466
1254 -1466 -2201 -1436 318 2224 2239 257 -2777 -3953 -943 4412 5271 145 -5199 -4747 1190 5732
1270 5732 4439 -1237 -5351 -3760 771 4060 3177 -84 -3257 -3677 -1737 1944 4663 2707 -2760
1285 -2760 -6127 -3167 3948 6927 2678 -4513 -6459 -1607 4998 5382 517 -4275 -3457 -396 1913
1300 1913 1792 1231 435 -1482 -3164 -1816 1948 4541 2749 -2859 -5388 -2126 3528 5501 1829 -3030
1316 -3030 -4818 -1996 2309 4053 2685 -840 -4337 -4441 -106 5026 5462 -119 -5707 -5985 178 6289
1332 6289 5750 -778 -6115 -4929 1043 5117 4168 112 -3377 -4835 -1720 2760 5259 2442 -3346
1347 -3346 -6326 -3117 3681 6219 2272 -3992 -5684 -1292 3778 4265 1013 -1271 -1723 -1378 -941 1360
1363 1360 3549 2707 -1749 -5798 -3760 2944 7083 3360 -4311 -7204 -1866 4774 5957 851 -3810
1378 -3810 -3750 -1106 1821 2946 2500 350 -2878 -4273 -1251 4039 6107 1391 -5757 -6782 -61 6635
1394 6635 5721 -1269 -6058 -3749 1756 4100 2306 -418 -1686 -2055 -1187 747 2951 3201 12 -4608
1410 -4608 -4423 718 5499 4128 -1979 -5197 -2696 1762 3682 1869 -743 -1983 -2162 -843 1066
1425 1066 3531 3109 -1282 -5029 -3617 2287 6393 3118 -3653 -6224 -1537 3947 4452 519 -2838
1440 -2838 -2867 -502 726 1572 1736 1250 -1716 -3742 -2031 2765 5592 1945 -4463 -5308 -359 4854
1456 4854 4433 -548 -4278 -2493 955 2166 1347 227 -135 -1653 -2732 -1044 2823 4483 983 -4620
1472 -4620 -4996 518 5614 4120 -1768 -5368 -2560 1795 3433 1217 -670 -1754 -1412 -1211 386 2821
1488 2821 3184 -477 -4242 -3530 1703 5562 2625 -2974 -4582 -1130 3083 3289 70 -2014 -1566 -400
1504 -400 -442 80 1930 2572 -346 -4177 -3288 1981 5631 2862 -3523 -6025 -1192 4277 4122 -302 -3503
1521 -3503 -2549 239 1633 1007 663 373 -928 -2947 -1778 2380 4744 1157 -4103 -4792 -81 5259
1537 5259 4122 -1210 -4550 -2664 1638 3062 970 -836 -1183 -677 -1051 -388 1829 2551 407 -2993
1553 -2993 -3030 357 4015 2917 -1241 -3424 -1978 1253 2744 1175 -483 -882 -1507 -1363 348 2623
1569 2623 2640 -758 -4202 -2911 2105 5013 1946 -2938 -4504 -903 3354 3278 -137 -2080 -1489 -99
1585 -99 -56 301 1508 1574 -1083 -3637 -2398 2378 4492 1364 -3918 -4417 -12 4205 3061 -1821 -3621
1602 -3621 -902 2016 1530 -545 -400 590 519 -1853 -2141 468 3368 2154 -2441 -4356 -815 3650
1618 3650 3789 -315 -4061 -2405 1379 2698 940 -1093 -987 -187 -564 -293 634 1701 471 -1855
1634 -1855 -2529 -214 2757 2049 -891 -3007 -1754 1197 2167 788 -927 -1036 -395 146 708 1087 1161
1651 1161 -527 -1762 -980 1091 2376 642 -1516 -2304 -60 1525 888 -732 -706 159 -19 -539 -600
1668 -600 746 1659 245 -1999 -1709 1355 3152 1182 -2336 -2773 31 2853 1671 -1560 -1995 239
1684 239 1652 601 -1176 -836 1093 1344 -900 -2033 -93 2400 1905 -1220 -2786 -764 2515 2381
1700 2381 -969 -2868 -955 1579 1677 -425 -1598 -483 1035 724 -962 -1052 638 1484 72 -1578
1716 -1578 -1313 943 1565 162 -1190 -1278 268 1099 483 -696 -786 47 351 158 -219 -30 27 222 -76
1735 -76 -84 460 611 -345 -299 358 176 -331 -270 -12 556 86 -1061 -597 156 1007 309 -956 -1010 236 1285
1756 1285 493 -1268 -1124 526 1176 -113 -1231 -745 699 1318 -68 -1325 -439 1284 1052 -362 -1472
1773 -1472 -1118 1090 1664 -473 -1481 -775 1074 1209 -884 -1073 219 1603 808 -1277 -1690 75 1946
1790 1946 961 -1107 -1543 -261 1440 978 -390 -938 -145 1048 86 -291 -586 343 430 56 -655 -229
1808 -229 895 827 -476 -1048 -396 658 1156 199 -961 -869 -77 694 608 138 -441 -613 -248 556 776 448
1828 448 -378 -664 -438 253 745 75 -277 -417 -107 -111 204 430 219 -265 -669 -1001 -100 1152 832 -447
1848 -447 -1429 -919 807 1426 664 -676 -983 -55 546 368 199 11 -90 -613 -698 115 893 829 -516 -1706
1868 -1706 -938 855 2170 1116 -1500 -1746 -685 1431 1564 91 -1176 -1050 -28 592 829 131 -331
1885 -331 -548 -780 -288 1041 1190 291 -1096 -1057 -402 788 1174 322 -987 -1222 -204 784 884 245 -601
1904 -601 -449 -798 -321 597 1060 611 -855 -1223 -125 757 1603 660 -1197 -1451 -544 925 1631 390
1922 390 -1003 -1744 -682 966 1544 460 -1119 -1678 -890 889 1527 578 -801 -1291 -694 671 1187
1939 1187 939 -264 -1497 -875 343 955 256 -42 -882 -715 -160 657 918 358 -92 -604 -364 380 759
1958 759 705 -16 -1310 -984 40 862 1268 147 -1311 -1304 -524 830 1573 359 -1100 -1428 -377 920
1976 920 1454 556 -1307 -1844 -413 1165 1197 359 -1014 -1074 -381 937 1334 633 -750 -1471 -476 506 1132
1995 1132 690 -365 -1055 -825 178 737 512 -417 -584 -278 26 58 293 219 142 -471 -679 -303 591 902
2015 902 529 -867 -1588 -478 804 1251 -230 -1226 -1254 6 1532 1115 -66 -1139 -1038 91 792
2032 792 996 436 -705 -1376 -709 257 1242 729 -393 -1483 -949 543 1539 686 -977 -1111 -334 1259
2050 1259 1270 141 -527 -568 103 343 132 -47 8 -46 -574 -322 -267 664 911 73 -678 -916 -39 921 915 389
2072 389 -1147 -1184 -175 986 1342 117 -1047 -1238 -281 618 1117 -15 -954 -1261 -380 704 1034 296
2090 296 -508 -1107 -602 351 1154 667 -276 -1093 -765 521 1478 612 -410 -1102 -507 566 831 263 -337
2109 -337 -332 -112 -53 -49 407 78 709 -337 -1082 -236 872 1324 291 -1003 -1314 259 1365 1048 -365
2128 -365 -1196 -514 368 814 477 -63 -643 -376 0 453 778 673 100 -1134 -764 50 1008 833 -267
2147 -267 -1217 -919 362 1307 768 -643 -1214 -509 196 833 624 -527 -373 -267 150 330 396 238 -504
2166 -504 -463 -430 -38 616 388 -112 -713 -805 -326 905 657 -185 -920 -633 47 754 819 -77 -762 -736 -18
2187 -18 469 456 -124 -229 -420 -318 -145 763 422 68 -873 -875 152 999 885 -85 -1228 -880 328 999
2207 999 137 -263 -819 -295 277 47 121 16 -339 -30 -389 -348 485 563 252 -408 -460 -126 624 811 -84
2228 -84 -658 -465 130 585 793 -109 -190 -325 139 116 361 -146 -377 -299 -264 -65 304 723 172 -100 -554 -248
2250 -248 439 419 278 -390 -764 -228 446 566 -86 -552 -371 97 45 36 -75 -143 -78 -254 -93 383 400 427 -369
2273 -369 -426 -204 367 540 174 -233 -707 -86 724 892 278 -503 -169 -277 454 35 371 -87 -191 -392
2293 -392 -244 106 433 206 -248 -221 -184 21 385 277 -377 -386 -230 198 517 300 -46 -643 -401 167 91 357
2315 357 -236 -190 -61 213 309 407 -166 -68 -123 -468 146 357 468 -122 -477 -363 160 681 177 -295 -338 -363
2337 -363 393 448 260 -133 -475 -16 165 175 83 101 -182 -386 -69 222 225 460 -356 -543 -561 411 516 123
2359 123 -246 -415 -221 43 248 241 -42 -428 -354 -245 335 578 87 -331 -643 221 330 426 -28 -324 -337 -3
2381 -3 199 510 39 -186 -220 -290 -90 295 410 17 -311 -314 -11 439 615 -64 -536 -276 307 460 -66 -89
2403 -89 5 -15 166 401 278 136 49 -532 -445 61 562 650 32 -410 -429 252 439 213 -159 -355 -100 44
2425 44 243 -7 131 -71 -359 -255 -282 -29 283 -460 -352 -433 69 619 82 -629 -275 -40 93 81 345
2446 345 57 64 -49 -158 234 308 252 -508 -271 247 314 219 64 -350 -378 18 119 -23 -19 -83 -251 -341 -320 140
2470 140 541 592 -463 -793 -286 313 455 -115 -698 -221 408 506 -14 -447 -476 -174 11 -127 -113 226 148
2491 148 -188 -210 -403 705 352 -307 -704 -482 145 726 560 -182 -100 43 364 70 -112 -37 -284 16 67
2512 67 -106 490 264 -260 -363 -107 345 436 126 -501 -202 -187 434 126 227 -40 -76 27 225 490 270
2533 270 104 -485 -528 -57 143 262 -88 -367 -168 364 141 -201 -135 56 1 4 23 -2 171 27 -476 -174
2555 -174 -21 550 668 -449 -685 -134 725 422 -246 -689 -92 357 304 205 -138 -329 198 15 -338 -127
2575 -127 279 296 -249 -468 5 466 481 -95 -731 -334 414 502 90 -383 -249 34 -19 238 -99 -103 11 -262
2597 -262 -351 -252 -16 345 -15 -206 -56 -14 415 433 -2 -495 -362 -64 647 398 -56 -400 -338 212 795 336
2619 336 -203 -671 -444 196 574 704 -34 -638 -380 307 698 493 -103 -575 -355 74 218 401 20 -406
2639 -406 -462 -144 544 459 40 -638 -287 323 456 586 -117 -240 46 182 -121 -246 -176 125 467 -388 -561
2660 -561 -136 399 562 -182 -346 -903 -147 810 532 84 -986 -389 57 571 604 82 -960 -654 84 572
2680 572 509 -311 -803 -691 10 709 669 -85 -952 -793 440 747 420 -577 -822 -276 637 351 163 -511
2700 -511 -408 -270 311 98 -271 -110 -18 177 -400 -303 32 197 183 194 -318 -331 126 492 540 224 -134 -490
2722 -490 -101 254 660 -3 -708 -573 -3 960 1012 -64 -1088 -997 218 1138 916 -409 -924 -540 453
2741 453 968 421 -558 -889 -474 431 963 135 -493 -803 -293 302 492 -131 -426 -406 -104 65 492 104
2761 104 -68 21 52 243 34 -15 59 558 202 -253 -662 -43 348 825 -273 -927 -562 463 768 680 -311
2782 -311 -1285 -767 239 1099 850 -300 -1071 -711 563 1017 906 -545 -1294 -624 917 1503 325 -792
2800 -792 -1110 -169 742 672 -151 -225 -616 108 353 218 130 58 -90 -508 -139 740 614 -37 -265 -487 98
2821 98 -13 446 122 115 -71 -118 -189 65 513 807 203 -686 -1065 532 1492 961 -833 -1295 -851 769 1456
2842 1456 270 -1086 -1086 -436 959 980 -142 -585 -983 -98 516 642 531 -136 -639 -528 754 756 293 -424
2862 -424 -426 -250 323 603 -46 38 -262 -18 -23 35 329 153 165 -474 -595 333 528 450 -54 -122 -347 -160 520
2885 520 440 267 -291 -547 -518 339 1078 1013 -296 -1332 -651 465 1510 313 -1169 -1067 264 1072 788
2904 788 -68 -832 -471 284 480 -48 169 51 44 -283 -256 409 537 222 -772 -546 274 796 476 -531 -646
2925 -646 -149 500 374 14 -162 238 184 0 -265 -47 528 164 -189 -718 -78 538 724 125 -587 -440
2945 -440 115 851 303 -300 -545 -192 -157 82 417 226 -455 -319 -278 347 576 360 -528 -511 -94 447 258
2966 258 -231 -201 -23 -51 11 134 328 301 -344 -180 -133 432 613 11 -680 -248 179 487 176 -593 -470 422
2988 422 318 -136 -216 54 252 86 -539 -383 364 739 164 -596 -686 93 543 198 -603 -577 21 480 321
3009 321 -141 -383 80 97 -126 -324 59 451 87 -455 -583 -201 587 392 -275 -636 -169 251 235 73 -454
3030 -454 -174 29 -98 -61 -82 46 51 -230 -280 325 390 -193 83 -247 208 254 -67 -237 -274 21 -17 103 100 -23
3054 -23 247 247 -226 -112 462 388 -122 -587 -313 136 554 33 -388 -182 184 110 -60 -192 -90 146 243 -116
3076 -116 -272 272 606 172 -348 -441 463 752 345 -431 -753 441 562 63 -219 -323 38 239 114 -39
3096 -39 -265 217 18 -232 -390 244 239 210 -229 -215 -72 499 196 -196 -159 -14 134 51 -192 -222 421 330 91
3119 91 -50 382 109 142 -53 -307 107 417 184 -302 -87 -34 55 88 -339 2 52 -88 -166 101 29 162 126
3142 126 -37 6 -104 207 82 -593 -192 595 235 -130 -249 -259 169 176 297 -9 -109 264 198 -282 -183 153
3164 153 -135 -117 -120 -261 303 189 200 -464 -99 168 342 120 -269 -145 184 124 -170 -49 -160 -71 102 -337
3186 -337 -189 226 80 -137 -433 -262 383 185 -245 -218 -275 266 -17 360 -188 7 -195 116 -223 9 -46
3207 -46 -95 -130 -457 -251 67 -49 117 -295 -162 50 77 -4 -353 -33 89 14 -41 188 129 -123 381 -89 252
3230 252 159 268 -169 -89 -185 242 196 19 -323 25 98 100 8 83 -264 196 41 -83 26 -70 264 -127 -192 -136
3254 -136 86 362 -82 -427 -136 13 6 -227 -82 -113 179 -154 -92 -11 7 230 -33 -134 -102 120 281 198 15
3277 15 -365 -224 287 418 78 -107 -62 -132 -102 135 29 -96 -157 -390 -28 -82 -121 275 234 94 -146 168 101
3300 101 -36 -236 9 -124 295 332 90 -134 -180 -87 19 299 0 -97 -200 -214 236 395 240 -34 5 -74
3322 -74 -50 177 136 -171 -195 -275 16 -13 202 -324 2 -261 -27 133 284 217 6 -333 22 198 -5 75 -352
3345 -352 -141 64 84 -89 169 75 49 11 -31 297 282 -99 -202 -127 151 123 142 -61 -11 -155 270 56 203
3368 203 -119 90 -247 -318 3 223 80 87 -61 -336 -54 165 -8 -116 -121 -206 -71 68 -118 -16 -302 -156
3390 -156 -192 362 152 -93 101 31 -116 -77 -207 139 -83 -217 -40 34 272 -140 0 -106 -126 104 100 246
3412 246 -34 77 -50 -251 -32 435 21 -3 -428 -12 217 243 80 109 -297 -35 437 51 350 -170 -223
3433 -223 -275 121 337 184 -24 -285 -484 -206 271 102 -37 -126 -370 -107 97 -33 208 -431 -148 -141 88
3454 88 356 71 118 -108 -239 111 101 168 -148 -288 -140 36 33 150 -160 -189 -183 -353 388 247 104 -47 -355
3477 -355 -159 72 296 300 316 -339 -330 81 72 429 -138 -309 -310 -22 -122 249 200 -332 145 -30 80 32 81 -243
3501 -243 -63 -209 -126 155 54 -334 -398 -190 -177 211 -149 -122 -184 -35 -268 16 -15 196 51 -161 -176 332
3523 332 413 -62 -304 -259 -290 -12 340 6 -41 80 49 30 134 265 78 113 -474 -326 222 -88 201 -162
3545 -162 -33 86 20 430 268 -146 28 -179 -222 204 144 -16 -149 -222 46 229 247 132 -259 -27 -61 90
3567 90 80 151 -248 -176 -46 400 361 -229 -39 -41 -32 78 80 168 165 -248 -261 41 -82 207 195 -202 -186 213 391 42
3593 42 -150 -549 -181 67 52 360 -50 -235 -72 -8 88 242 39 72 -220 -283 179 363 -201 96 -21 -190
3615 -190 202 373 181 28 -45 -152 -34 52 -16 22 -329 -194 178 214 128 -176 -61 -90 266 126 347 88
3637 88 15 -72 -258 26 232 160 283 77 -200 40 11 275 -185 -230 -113 -28 118 229 -172 -421 -145 -175 27
3660 27 438 40 7 -150 -12 255 214 366 -190 -99 -153 -1 -132 336 60 -75 -99 39 94 152 95 -161 73
3683 73 98 -14 128 277 -138 -83 -183 249 66 4 140 -196 -61 -132 342 -7 -32 -379 -96 55 189 148
3705 148 -58 -308 123 57 158 308 93 232 -39 86 47 -6 356 -398 -320 -140 130 82 33 157 -96 -253
3727 -253 149 324 72 104 -125 -98 -49 123 16 51 -212 -37 -184 -118 -165 332 7 -303 60 -167 371 142
3749 142 -9 -183 -481 23 125 97 -29 -242 -52 -196 178 -134 34 -202 143 297 65 -18 -73 81 -7
3770 -7 51 -72 103 165 52 -67 -19 -51 222 172 -298 -218 -144 357 163 28 -27 129 -50 83 -121 -96 291 -100
3794 -100 -45 -117 -193 261 360 70 -165 -89 53 200 238 -94 -184 -128 463 215 156 -138 120 -64 -152 -248 107 90
3818 90 -57 -271 -72 45 -3 181 -190 -281 -250 283 114 139 -86 165 -48 112 -61 120 53 149 44 -117
3840 -117 216 -74 7 -125 -105 -7 95 212 -172 -41 -31 -251 56 199 -65 -3 -175 -49 -139 231 -90 -163
3862 -163 -300 -68 324 50 -157 77 215 83 93 -140 -153 229 73 -143 -193 166 38 42 -78 -37 -205 -12
3884 -12 39 -88 -210 -10 67 200 -27 -92 -162 -18 301 25 -308 -164 41 -62 -1 -304 -38 174 22 -153
3906 -153 93 -49 -125 -66 25 -153 -167 71 35 -155 89 162 -39 -157 -307 -45 -58 -35 75 227 178 -69 -158
3929 -158 -25 -136 -170 309 -53 -110 -168 -36 -46 218 5 196 169 -50 33 9 370 -100 -154 -358 233 167 142
3952 142 -107 -213 117 209 -90 -50 -66 -67 -123 332 -89 -402 76 146 -65 173 89 54 316 -299 -16 77 177
3975 177 -85 -279 53 -26 -61 89 -86 -94 -35 145 -51 -410 5 -91 314 176 17 201 54 64 206 -120
3997 -120 -137 153 38 17 -54 34 -227 -171 345 284 96 -222 -36 -34 7 154 97 -58 -54 5 175 206 -166 -192 79
4022 79 116 166 -3 -18 206 -299 26 -167 378 -43 264 -223 -185 42 139 164 84 119 -22 112 -88 -385 107
4045 107 409 -82 -347 -109 -15 322 -132 105 -133 -173 184 69 48 -61 -238 217 108 161 129 142 -291 -59
4067 -59 -107 -39 195 -93 -319 -187 11 -46 444 -80 -192 -81 -55 82 -104 62 -86 159 -123 47 184 120
4089 120 -90 -128 -132 27 96 129 32 -132 121 -180 21 305 126 -267 -183 -380 -177 440 61 -115 126 -173
4111 -173 87 -45 180 -224 -166 -25 65 70 129 205 -130 180 -90 344 71 125 -72 190 -138 9 -206 99
4133 99 -103 144 103 204 -28 -108 -31 107 83 -73 -111 169 168 -342 -22 -99 68 -96 194 92 -118 -64 175
4156 175 -174 93 -84 177 -194 113 130 38 88 -111 81 -6 134 -4 -62 -84 -81 -166 97 192 -114 -187 -76 67
4180 67 -87 106 29 136 -7 9 149 -156 -10 -217 -187 -210 85 85 -260 -127 -337 -144 -7 20 165 9 -256
4203 -256 -382 -110 71 -107 60 57 -169 -90 31 -86 120 27 -100 -84 -152 -28 227 57 152 -20 118 22 -83
4226 -83 -106 -266 18 -62 -25 73 166 -115 -115 19 114 -26 303 -61 -226 -33 -6 -72 -163 -78 -255 172 -170 -85 -151
4251 -151 -91 -252 -33 -124 24 -96 1 151 -239 -42 40 387 -128 87 -294 211 -141 71 -83 -103 -3 42
4273 42 -238 80 -121 148 3 235 -92 181 44 -182 183 167 2 43 186 141 -143 -63 -193 14 2 71
4295 71 206 -14 15 0 17 125 -82 72 8 -169 49 65 -86 -130 85 119 30 -239 -349 -229 -134 110 -154
4318 -154 28 -205 -82 120 19 -1 220 151 182 101 -174 -34 -249 -33 85 -200 -86 108 250 5 33 -55
4340 -55 -134 311 -331 50 -171 -244 125 -120 202 83 244 -84 23 -114 67 61 115 -71 -81 -13 -404 -238 163
4363 163 -60 -207 197 -246 167 33 1 -41 8 10 -186 -228 -94 -77 -21 -23 -165 13 15 461 44 -89 -54 -150 345
4388 345 298 74 -72 -148 111 204 58 109 -164 75 267 64 -121 4 64 118 -95 1 -93 32 163 -4 58
4411 58 180 101 33 -133 -179 -75 24 -126 39 -206 3 -19 -107 -96 393 10 -93 255 -128 -37 -163 208 104
4434 104 2 -50 74 -50 -25 6 -40 70 -234 -215 -1 233 -36 -409 -62 -13 -240 64 -92 -27 -1 328 35
4457 35 -218 135 -116 36 -57 -108 -48 231 197 110 175 -71 -62 -243 -120 135 -244 -23 -91 -4 147 -18 83 -134
4481 -134 277 349 50 -54 -127 -333 36 96 133 49 71 204 -129 -19 44 -283 -204 15 95 -3 16 156 153 -209
4505 -209 -9 123 132 -284 -312 -181 -61 -147 179 -155 -119 233 -101 -22 -12 10 -212 162 69 -56 -81 55 308
4528 308 77 -134 -271 165 -5 -77 -37 34 -103 -166 -83 -149 -60 91 -162 -214 30 210 -12 94 137 73 90 97
4552 97 -343 220 88 -106 27 -18 92 -181 70 69 301 124 65 75 -193 229 -53 110 -191 -12 -10 -313 -19
4575 -19 159 48 -84 31 160 -31 -29 -105 -29 -158 -21 183 101 119 45 49 -192 36 174 -74 -18 339 219 255
4599 255 288 182 38 -61 -87 33 -23 73 48 93 208 73 44 148 122 -101 -85 -111 -60 -73 -19 8 30 -39 116 78
4625 78 185 -159 128 83 -46 370 155 -49 140 267 228 -113 -65 -77 -99 75 -88 91 -68 227 72 -100
4647 -100 122 89 236 85 -357 -118 -205 -51 -39 232 -185 -55 -189 265 -307 -49 325 33 -65 102 30 -34
4669 -34 22 88 41 -265 -28 130 167 28 -311 36 67 -20 248 -88 28 47 262 643 116 -187 35 -91 -187
4692 -187 27 -139 60 42 -60 51 -87 12 -66 -130 168 125 361 -371 -104 -64 113 260 -171 -122 -145 92 98
4715 98 -30 -145 -39 84 74 175 -201 -266 -237 21 144 187 -68 -151 83 282 318 -279 -448 -500 123 105 -114
4738 -114 21 -116 110 384 29 -266 -44 -115 277 289 73 153 -19 87 -165 495 419 -113 -151 -263 211 288
4760 288 110 -56 -176 -258 140 -52 69 -245 -22 146 -51 -60 -227 -133 -228 -92 74 -155 -225 -177 157 132 -97
4783 -97 -140 -99 29 158 37 158 170 6 110 75 -55 -28 -127 -112 -12 -158 14 -159 68 -196 260 233 54
4806 54 -166 -167 352 162 142 -57 -308 65 159 207 -174 109 -98 -14 -31 182 150 109 -28 -105 147 44 -90 116
4830 116 -43 209 127 -7 187 352 71 359 147 -93 95 278 -50 73 3 -158 233 47 142 -245 -162
4851 -162 2 11 76 16 -4 -145 -10 153 -78 -192 19 34 11 492 35 116 -171 -322 -203 26 326 -44 1
4874 1 -295 -39 -45 145 330 79 -37 -109 -11 136 120 107 105 -202 36 -65 80 13 -187 -107 -95 103 107 29 -163
4899 -163 -84 -123 73 -78 68 141 -130 -46 -15 93 1 97 -227 -43 20 -35 299 36 -127 -242 -295 -142 118
4922 118 313 -72 -140 -268 -207 -84 22 70 -238 -175 -83 272 132 -200 -277 -99 -29 58 -83 26 -99 161 204
4945 204 -36 32 -126 -157 -99 -97 141 -194 51 39 -49 -114 -84 -256 2 255 32 -142 263 72 153 207 -2 -132
4969 -132 6 2 176 64 -184 -183 142 25 433 165 154 -201 -9 -212 -65 -78 -28 -82 -187 106 -274 184 -11
4992 -11 -45 -42 135 59 101 -208 75 -138 26 39 155 -109 -75 -131 -1 -26 -197 -91 -6 -17 -94 -228 -34 -122 -36
5017 -36 67 50 -19 234 133 -128 49 -106 147 17 -41 360 47 -150 117 103 -54 40 -18 -183 -80 47
5039 47 -59 36 -234 191 -75 -15 188 239 -180 35 207 -37 186 179 -105 -35 -208 -347 -123 -141 259 51 -126
5062 -126 -76 -11 176 174 -226 -115 -181 48 -76 -98 48 -284 -32 -75 -239 95 -214 -299 0 -313 36 -80 169
5085 169 142 32 -194 -66 -58 -59 95 229 163 -22 -234 -76 -30 -342 76 -180 199 160 154 197 5 -156 31 -120
5109 -120 -55 155 -110 -487 44 -46 140 -127 -64 246 69 -33 -39 -93 -149 14 209 121 256 -362 80 178 -25
5132 -25 17 -82 80 115 147 -119 -93 130 -151 39 274 42 -74 88 293 131 -128 389 128 52 67 -101 176
5155 176 -144 -183 -132 -296 211 59 -39 -131 -243 -273 75 -12 71 -135 33 21 -291 -35 60 186 10 -127 -100
5178 -100 78 124 -70 -48 38 -273 71 70 -91 -107 -12 226 42 -24 -90 282 254 15 121 297 -36 9 59 103
5202 103 85 -171 176 -177 61 -111 -25 -365 98 -138 102 -91 -67 -2 -154 1 18 146 163 -28 -169 -114
5224 -114 -9 78 84 -69 -21 116 -123 226 141 129 -249 -218 0 267 -175 -438 67 -56 208 38 68 220 135
5247 135 -40 155 138 106 -76 -51 -367 -1 319 -9 231 36 -57 -220 129 -37 110 -135 -389 -16 30 287
5269 287 -45 -223 80 227 332 130 288 -131 -247 220 15 75 10 -160 -93 131 24 204 -13 144 -98
5290 -98 -167 128 62 52 -59 129 -180 127 76 159 114 -146 110 30 -78 190 -115 -55 -95 176 -42 -76 15 -122
5314 -122 -41 127 153 -25 81 114 -137 -32 -24 -121 -61 309 -231 121 -181 -285 -27 -148 32 -112 -46 103 221
5337 221 -69 72 161 -112 -72 -179 -25 13 224 -84 -180 -59 -106 -265 -167 255 -45 59 106 -73 -207 -137 -264
5360 -264 248 -34 274 -118 -55 160 -168 217 -139 112 35 -182 72 -29 53 -98 -88 26 83 142 57 190
5382 190 -557 -237 7 -53 222 13 -151 158 -408 49 145 71 -40 44 -47 -44 3 75 0 -133 -171 -165 219 74
5406 74 54 40 -25 -144 119 -67 -133 27 -138 281 147 86 -206 -395 81 -162 -119 77 21 -139 145 -47 127
5429 127 -175 -22 119 -157 29 69 -304 179 9 62 1 59 67 146 -232 -167 53 -46 -219 -187 228 194 147 -264
5453 -264 125 51 -180 -176 -9 -70 -4 403 23 99 127 89 454 -91 -126 5 99 205 -58 0 -77 -32 -127 36 -179
5478 -179 24 242 -48 65 105 145 25 127 -20 84 77 61 235 -45 -36 -295 -260 39 89 -239 -145 60 10 190
5502 190 52 65 -268 177 4 129 -152 308 9 -71 -15 -43 -91 37 289 110 -220 141 -120 -340 -139 8
5524 8 55 -142 -61 -442 112 39 112 -245 -95 -47 233 -241 -82 142 61 95 -164 -133 -33 -47 55 -128 134 -170
5548 -170 76 -12 191 -52 -89 40 154 244 41 -176 -149 134 87 111 -407 -94 -41 186 -22 -253 65 -25 -22
5571 -22 -48 8 -340 -105 8 68 -14 -139 -265 -121 48 223 38 28 -166 191 -11 219 115 76 -82 -61 -94
5594 -94 -12 101 -41 207 -56 -85 -118 -4 -18 -175 223 15 -96 268 -5 29 58 -75 -51 121 76 15 485
5617 485 -14 38 58 160 321 177 -18 3 237 -26 139 -158 -222 -5 -46 -187 -68 -236 -1 54 -125 -44
5639 -44 -232 25 -14 116 1 385 7 21 176 250 -195 -8 -213 96 -10 69 -17 235 106 135 118 94 -14
5662 -14 21 14 -112 -89 -60 134 52 200 -59 139 189 -175 -60 21 -260 128 -220 152 257 -47 -151 -81 -124 -46
5686 -46 75 -225 -164 121 -17 5 22 25 -156 108 303 -78 32 2 -56 -99 241 -68 -219 -43 -23 4 189 269
5710 269 -166 516 -70 -4 66 24 -133 -40 137 -206 -148 -145 112 244 269 -125 -70 32 -146 -24 10 65 -14 163
5734 163 116 17 23 111 -70 67 53 -94 326 -62 84 135 -7 167 103 -161 5 -190 43 -2 -262 -82 70
5757 70 148 232 42 177 -8 -59 -174 217 -6 173 -153 47 156 -108 -126 -35 -154 -92 -87 146 -91 -77 292
5780 292 -48 -79 -54 -32 92 201 7 -62 -187 -300 76 -229 -77 78 -198 125 54 -22 1 5 -151 84 -65
5803 -65 236 94 -70 -131 25 43 -46 -98 -178 94 -83 206 6 87 126 -315 1 -59 -134 -128 5 -136 -285 -118
5827 -118 -66 -50 108 -38 125 -190 95 113 158 151 116 25 -93 46 228 307 -141 -175 77 1 -286 73 47 -42
5851 -42 -220 -30 33 191 -203 52 -23 72 94 -82 -332 -108 -94 57 -72 -201 2 -216 198 -61 44 8
5873 8 66 83 186 -1 -90 25 74 64 -30 -205 -59 -175 -2 15 226 234 -165 -157 15 156 -262 -118 -91 -54 -7
5898 -7 76 47 8 -65 -273 -174 60 22 -300 116 171 279 -30 53 -57 -196 134 75 -31 58 239 -268 28 -17
5922 -17 -208 86 188 163 78 -48 -20 250 -56 -78 37 -112 2 -37 162 135 30 67 94 -67 137 -2 -298
5945 -298 65 42 -79 -271 23 142 -168 59 15 -71 -45 33 159 49 177 -1 -3 244 39 151 -118 -86 -159
5968 -159 78 -134 267 58 -7 58 -81 140 233 -177 -57 129 300 184 -49 -163 141 10 -137 48 29
5989 29 142 -180 -30 61 90 -220 183 70 2 -165 68 100 -203 -285 -308 197 -120 -92 35 -251 -39 -184 54
6012 54 61 -187 -328 129 39 350 130 -200 -148 172 55 -45 -268 -78 -145 -144 -28 -11 -37 -122 -135 -4 -137 -202
6036 -202 -11 -228 111 184 -124 -22 -71 65 81 87 -41 157 6 -5 187 -49 111 -133 270 16 -94 -214
6058 -214 107 -206 -266 119 4 -32 310 34 -56 -120 66 225 33 -4 -113 0 -87 -1 -54 -65 -75 167 6
6081 6 278 51 -169 135 -126 -79 129 -3 -118 107 64 197 59 367 204 18 -13 -91 29 146 -205 152
6103 152 144 10 -59 -81 70 -128 27 31 36 -275 180 -81 71 -168 88 57 32 -216 -230 -116 -202 -177 66 -46
6127 -46 73 298 -88 275 28 -290 -45 -105 -183 10 -380 -151 -75 -179 23 -259 228 237 -299 319 -79 255
6149 255 -56 221 39 -116 120 193 75 -47 -69 -57 -166 -203 -341 -51 -28 10 72 -177 94 -229 87 -183
6171 -183 3 -206 150 59 182 14 64 -359 171 47 93 121 -7 -65 -53 186 154 -163 75 148 -85 108 -96
6194 -96 0 -195 -93 -62 -163 247 264 21 156 -178 22 122 125 -48 -14 -37 -34 92 -200 -145 282 -25 -73 -79 72
6219 72 -274 -151 169 -77 -127 -5 36 -51 -16 -109 89 -72 225 -11 -115 37 -16 299 -271 117 -72 111
6241 111 33 -69 -48 -141 153 -51 -48 186 -62 -129 45 196 27 -58 -207 -25 111 -242 -318 -56 73 -26 -174
6264 -174 68 171 105 -55 19 285 -201 59 -129 96 -132 115 212 125 -17 -48 -138 44 -99 -6 -213 100
6286 100 344 1 -40 -1 -106 -461 -214 -133 -157 76 145 83 140 -59 189 245 -159 -44 -26 11 -47 71 -258 -25
6310 -25 74 28 -199 91 -127 32 239 -72 44 -16 77 36 59 -149 -165 188 10 102 -60 -90 -60 102 -38 -169
6334 -169 -114 -11 -12 -111 61 27 145 -187 -26 -63 -49 -224 -190 193 -185 171 38 -297 25 -121 128 -33 16
6357 16 181 -82 -77 -11 -74 91 -47 -76 47 -76 170 39 96 -16 -103 -19 143 -154 45 117 92 132 7 68
6381 68 251 -81 -194 -205 -193 155 0 -303 99 326 321 281 -75 -150 0 10 -24 126 66 -121 156 14 -78 -171
6405 -171 -408 -91 22 115 11 102 260 57 -37 95 52 -76 13 454 99 -51 -29 -121 -27 -25 -131 9 -2 -88
6429 -88 -108 -39 23 120 275 73 -44 -47 213 314 134 -95 -139 151 -219 -39 164 88 141 -55 -106 122 -106 148
6453 148 -43 115 207 -66 -128 -153 -140 178 -66 285 0 -104 -43 -205 -248 72 -47 122 90 -152 -46 25 -49
6476 -49 155 -161 -55 342 30 28 -81 -48 -113 159 -39 230 22 14 -159 13 180 -132 12 53 -67 -11 193
6499 193 210 -356 64 -92 -18 -323 18 45 -89 -20 87 -27 -32 9 100 -126 84 99 78 73 238 34 -103 149
6523 149 32 148 -157 25 -132 188 153 310 -171 137 34 -341 -85 -60 -77 -21 221 -38 8 235 266 -95
6545 -95 160 -240 99 -331 -296 -218 77 16 -237 7 112 11 28 108 320 109 -145 -41 -272 -49 -28 -189
6567 -189 232 -115 99 109 55 45 -222 -35 -220 -105 137 91 217 -49 -105 407 -269 165 5 126 -291 -34
6589 -34 -29 -18 43 48 -96 -125 90 -47 -101 22 -230 26 17 59 114 86 83 290 54 169 -13 -158 -213 -86 197 -8
6615 -8 -85 128 -98 -74 44 -5 -73 -74 -101 157 66 59 256 -3 -5 -113 -195 63 -54 -51 -18 127 47 -142 -96 -193 0
6642 0 151 74 72 -245 40 -242 84 -3 3 87 -75 154 47 -58 86 36 62 8 -9 135 100 138 138 -28 -173 -73
6668 -73 22 -73 -209 -132 0 8 -30 -163 22 17 -168 31 238 105 -111 73 -58 72 45 13 56 -117 76 195
6692 195 308 365 -72 78 71 -51 -149 -86 266 -145 -33 50 153 104 -183 -196 91 -167 7 83 -93 -253 -219
6715 -219 117 -2 188 166 21 326 -34 274 -104 -23 -45 104 -79 -163 -103 -76 -80 -37 122 -60 -82 -151 -27 -87
6739 -87 -128 143 -59 231 -71 171 38 -74 50 152 59 259 -159 167 376 -17 314 202 -354 -197 -38
6760 -38 -220 26 4 -149 -36 132 -70 221 -164 -190 -73 -91 -341 -100 114 -162 31 -109 -195 169 48 111
6782 111 -301 -40 -122 -27 -376 -156 128 38 12 3 -58 -108 339 -146 107 -42 -136 -27 141 20 -124 70 31
6805 31 -128 113 -219 186 -27 139 139 30 -53 -4 -35 196 -64 -116 -292 217 141 -3 60 -107 -10 63 -66 -9
6829 -9 -46 -108 -44 -166 103 -140 120 -105 2 -44 65 10 -38 -169 -215 574 -165 -104 -155 -142 230 -116 -12 -94
6853 -94 16 86 0 87 -209 -88 -87 144 -27 -24 -130 -118 110 -88 -180 325 5 -157 -33 -9 -67 -151 -29 318
6877 318 -132 -187 183 -11 -26 -85 -80 -214 -2 103 -78 42 10 -120 -126 -230 59 -184 393 -122 -102 -51 -36 -86
6901 -86 -260 -45 193 -57 -75 43 -390 -183 -187 -58 -42 -33 -54 17 -82 -224 -88 -126 -25 188 -46 -46 7 -23 260
6926 260 -73 -278 -44 -130 -97 122 145 -56 59 123 230 150 159 84 -65 85 243 -18 71 350 -12 106 -229
6949 -229 -132 -166 65 -153 -40 90 58 233 -12 113 54 174 -143 53 268 -304 -335 33 112 20 119 -60 136
6972 136 146 44 -214 13 113 10 -274 -10 82 28 191 17 -48 172 108 -174 17 163 -41 110 57 63 -128
6995 -128 -38 -27 -14 -41 272 -41 -207 187 -163 -119 43 204 -389 500 78 147 -192 71 -69 -192 -101 -121 -311
7018 -311 -93 -12 119 32 -115 -185 125 70 -167 -190 70 162 117 74 -30 -150 20 103 63 -268 0 -35 55 -23
7042 -23 128 43 70 145 25 -216 96 -214 -22 265 83 158 -136 82 -145 158 -94 169 -107 38 20 30
7064 30 83 -100 -84 157 176 94 -151 172 -145 -205 -102 66 237 -32 40 229 77 -249 -42 -323 75 28 20
7087 20 -41 167 211 -55 10 -141 -135 127 -7 -118 -264 8 -37 -50 11 14 38 37 -52 -132 57 120 78 107 64 -120 -187
7114 -187 -87 330 5 3 289 -51 -142 -17 103 -319 50 138 18 236 179 -17 -156 69 -65 -144 -76 -17 -115
7137 -115 -448 108 -351 19 146 -103 -128 -85 260 -180 -83 97 50 -182 -338 -407 329 86 -95 -209 -113 -24
7159 -24 106 -158 70 52 90 -84 -62 -139 -169 252 152 -501 -15 -146 -208 -323 48 -8 -135 53 -80 -198 -283
7182 -283 -274 87 -157 97 155 -16 45 -65 -23 13 311 46 -210 80 -4 -84 182 152 -83 62 -76 -58 -27 65
7206 65 -115 -77 32 -134 119 -308 -310 23 -361 35 73 -154 136 11 -153 -80 -107 15 33 -87 -9 -10 -196 74
7230 74 -38 -141 -37 222 -6 77 102 95 40 12 -118 2 -222 -16 -154 42 -114 85 -13 -45 -117 135 253
7253 253 309 33 -191 212 -219 90 -200 -88 68 11 -12 -142 69 -44 44 -337 47 18 -36 -39 48 -179 -333
7276 -333 -245 14 83 -26 -119 91 36 -328 104 71 350 98 78 194 -119 247 97 -173 -15 -161 116 -110
7298 -110 -156 185 47 -216 107 184 -116 -11 193 126 -154 114 -189 8 23 318 -299 127 309 -260 -55
7319 -55 -88 71 -357 -142 32 292 314 25 34 95 173 -142 -159 -107 50 -31 56 -5 69 -162 31 -82 26 205
7343 205 -229 -160 -30 46 267 2 227 66 -51 104 4 -73 -38 -293 -63 10 77 -87 -180 8 -119 -259
7365 -259 -167 -128 102 -47 14 48 39 9 180 5 24 195 36 -196 -210 73 -1 132 15 -14 133 -283 175 9
7389 9 26 131 37 166 139 -30 31 7 -133 10 87 14 -169 -36 -5 -231 47 -78 -174 -202 -246 -48 -105 24 111
7414 111 3 -46 9 239 189 61 104 143 31 -140 5 96 -48 -79 -17 65 -290 -147 -87 -115 -93 23 309 104
7438 104 -82 -157 51 -68 -99 -12 -194 17 24 -158 115 -2 81 105 14 2 117 36 255 107 -105 251 132
7461 132 -42 -135 -189 -135 -30 279 -118 -40 -109 168 -127 -121 -23 -124 -29 -116 64 -15 -496 -90 -139 61 0 11 164
7486 164 197 -53 -56 259 66 108 -44 95 -76 93 216 110 69 90 21 180 95 35 -120 -123 192 -245 156 74
7510 74 28 102 -114 -287 15 -323 232 124 31 -59 -106 52 3 202 -16 -36 193 -147 -138 -87 97 156 49 -201
7534 -201 191 -57 232 123 -158 -207 181 75 -75 -167 -3 -45 -175 139 -76 -184 -1 73 4 -127 105 45
7556 45 -168 132 50 -237 38 -65 -1 107 60 -99 -87 124 144 44 -67 205 -48 23 -106 273 29 -190
7578 -190 -138 -101 7 -40 -36 -148 104 -78 146 178 4 -48 -34 -248 -91 235 338 -213 93 150 -45 -127 160
7601 160 150 -168 -85 43 4 -200 45 -140 -188 33 -68 5 331 26 62 -148 215 41 -41 117 64 115 -15
7624 -15 -208 206 -105 -11 63 -64 230 -13 -291 95 106 87 -149 -17 12 9 210 18 -97 83 130 10 37
7647 37 -175 3 30 -138 117 333 -77 13 -115 262 -51 -259 194 102 1 -105 219 298 67 199 -1 -30
7669 -30 -45 -12 65 -153 -64 -191 -60 -48 -360 93 80 -32 -55 -134 -292 -111 -62 60 -158 36 -14 205 312 -20
7693 -20 -134 74 -85 -144 -20 -195 -66 114 -87 -91 -83 91 -13 290 74 -141 -128 78 -26 -127 27 -292
7715 -292 -22 10 -197 24 187 -69 7 11 -104 110 -218 -166 23 -312 364 -72 -191 89 -169 -47 228 -45
7737 -45 316 -40 10 89 -361 200 63 91 -42 -20 415 135 -158 50 82 129 -49 55 -153 -222 29 -131 99
7760 99 200 243 174 -23 26 21 227 -97 166 -118 -38 109 -301 17 295 -147 -113 -169 196 -86 172 162 -34
7783 -34 -23 13 -113 70 247 -138 56 42 378 -87 -51 282 -100 76 60 60 61 -102 73 -303 32 -69 74
7806 74 8 180 237 302 -24 -115 -38 204 -41 -71 -68 -29 -160 176 116 -13 181 -151 -102 93 -156 -121 -249 34
7830 34 -63 -171 24 -319 335 37 -146 -67 326 142 83 -241 -179 128 -59 -78 229 -218 98 -77 -133 290
7852 290 -102 -22 -138 -113 70 2 176 -54 -2 236 -108 -80 -44 153 -46 -31 -212 -141 144 371 52 -54 -186
7875 -186 -186 -53 -28 -51 -24 94 55 35 -138 392 -41 134 41 34 -279 -39 151 -189 44 85 220 239 0 90
7899 90 -119 -326 -215 189 211 -243 -38 2 -76 -245 107 -62 -155 130 -168 -23 69 108 128 68 -166 -6 -21
7922 -21 73 155 79 -183 -359 99 100 125 -25 -239 -93 -120 227 -39 -51 -62 53 -83 -140 344 -76 212 -88 -75
7946 -75 -134 -117 24 113 -32 231 -330 -50 101 39 27 -110 148 -200 3 22 151 156 -87 44 40 -164 52 -187
7970 -187 -44 -31 39 -192 46 -196 11 -141 -65 -140 -168 -59 178 13 264 -125 -31 21 -171 238 49 105 43
7993 43 -4 -62 -230 155 33 178 -147 149 21 -74 231 48 -9 -102 -209 15 -251 -260 81 -127 -116 -88 171
8016 171 299 356 150 9 169 331 192 -63 -99 -29 23 102 -21 -28 -97 155 243 -175 168 -12 -175 -192 9
8039 9 -14 0 46 86 103 -24 93 -50 90 -130 -128 69 59 -20 -84 83 102 210 -1 212 68 -62 -45 -8 301
8064 301 -128 2 -47 -326 162 169 63 108 -21 -174 -302 -56 -69 -135 -10 171 -228 208 295 -95 46 -150
8086 -150 -103 -138 106 96 -66 54 -9 -45 26 -72 423 8 182 159 111 -7 35 -22 285 -114 -427 -41 93 72
8110 72 146 26 17 -210 163 56 212 131 261 153 239 -168 -3 269 21 -30 -191 12 -106 71 -162 64
8132 64 -66 16 191 -152 -221 303 2 219 257 58 -144 18 -290 -208 -105 -43 71 -3 -150 -8 214 15
8154 15 -199 -8 129 -33 170 -227 -64 -173 -50 -21 73 -256 -79 -18 -32 66 -115 85 357 -69 -50 -398
8176 -398 -157 366 -193 -38 -47 -51 168 382 -97 2 -179 -27 28 7 -157
8191a57
##END NTUPLES=NMR FID
##END=
