##TITLE=1H_Pr DBA-E
 200.13MHz,CDCl3,
 8 sc
 
 11.11.2025
##JCAMPDX= 6.0         $$ Bruker NMR JCAMP-DX V2.0
##DATA TYPE= NMR FID
##DATA CLASS= NTUPLES
##ORIGIN= UXNMR, Bruker Analytische Messtechnik GmbH
##OWNER= pz
$$ XWIN-NMR		Version 3.5
$$ Tue Nov 11 15:54:18 2025 Russian Standard Time (UT+4h)  she@DPX200
##.OBSERVE FREQUENCY= 200.1313
##.OBSERVE NUCLEUS= ^1H
##.DELAY= (6, 6)
##.ACQUISITION MODE= SIMULTANEOUS
##.ACQUISITION SCHEME= undefined
##.AVERAGES= 8
##.DIGITISER RES= 18
##SPECTROMETER/DATA SYSTEM= spect
##.PULSE SEQUENCE= zg30
##.SOLVENT NAME= CDCl3
##.SHIFT REFERENCE= (INTERNAL, CDCl3, 0, 14.3821)
##AUDIT TRAIL= $$ (NUMBER, WHEN, WHO, WHERE, WHAT)
$$ ##TITLE= Audit trail, XWIN-NMR		Version 3.5
$$ ##JCAMPDX= 5.01
$$ ##ORIGIN= Bruker BioSpin GmbH
$$ ##OWNER= she
$$ F:/spectra/data/she/nmr/H-C/1/audita.txt
$$ ##AUDIT TRAIL=  $$ (NUMBER, WHEN, WHO, WHERE, WHAT)
(   1,<2025-11-11 15:52:55.51 +0400>,<she>,<DPX200>,
      <created by zg, POWCHK disabled, PULCHK disabled
       configuration hash MD5:
       00 E9 B6 7A A2 85 ED C7 34 08 36 98 17 FE 4E 26
       data hash MD5: 16K
       5B 6B D9 7E F6 4F 84 CB FB 6B D6 45 DF D1 4B E8>)
$$ ##END=
$$ 
$$ hash MD5
$$ 61 A5 F4 91 E8 CB BF 55 D2 99 4C E2 EC EB 57 59
##$RELAX= 
##$RELAX= 
##$RELAX= 
##$RELAX= 
##$RELAX= 
##$RELAX= 
$$ Bruker specific parameters
$$ --------------------------
##$DU= <F:/spectra>
##$EXPNO= 1
##$NAME= <H-C>
##$PROCNO= 1
##$TYPE= <nmr>
##$USER= <she>
##$AMP= (0..31)
100 100 100 100 100 100 100 100 100 100 100 100 100 100 100 100 100 100 
100 100 100 100 100 100 100 100 100 100 100 100 100 100 
##$AQSEQ= 0
##$AQ_mod= 1
##$AUNM= <au_zg>
##$AUTOPOS= <>
##$BF1= 200.13
##$BF2= 200.13
##$BF3= 200.13
##$BF4= 200.13
##$BF5= 200.13
##$BF6= 200.13
##$BF7= 200.13
##$BF8= 200.13
##$BYTORDA= 1
##$CFDGTYP= 0
##$CFRGTYP= 5
##$CHEMSTR= <none>
##$CNST= (0..31)
1 1 145 1 1 1 1 1 1 1 1 1 1 1 1 1 1 1 1 1 1 1 1 1 1 1 1 1 1 1 1 1 
##$CPDPRG= <>
##$CPDPRG1= <>
##$CPDPRG2= <>
##$CPDPRG3= <>
##$CPDPRG4= <mlev>
##$CPDPRG5= <mlev>
##$CPDPRG6= <mlev>
##$CPDPRG7= <mlev>
##$CPDPRG8= <mlev>
##$CPDPRGB= <>
##$CPDPRGT= <>
##$D= (0..31)
0 0.7 0 0 0 0 0 0 0 0 0 0.03 0 0 0 0 0 0 0 0 0 0 0 0 0 0 0 0 0 0 0 0 
##$DATE= 1762861974
##$DBL= (0..7)
120 120 120 120 120 120 120 120 
##$DBP= (0..7)
150 150 150 150 150 150 150 150 
##$DBP07= 0
##$DBPNAM0= <>
##$DBPNAM1= <>
##$DBPNAM2= <>
##$DBPNAM3= <>
##$DBPNAM4= <>
##$DBPNAM5= <>
##$DBPNAM6= <>
##$DBPNAM7= <>
##$DBPOAL= (0..7)
0.5 0.5 0.5 0.5 0.5 0.5 0.5 0.5 
##$DBPOFFS= (0..7)
0 0 0 0 0 0 0 0 
##$DE= 6
##$DECBNUC= <off>
##$DECIM= 32
##$DECNUC= <off>
##$DECSTAT= 4
##$DIGMOD= 1
##$DIGTYP= 9
##$DL= (0..7)
0 120 120 120 120 120 120 120 
##$DP= (0..7)
150 150 150 150 150 150 150 150 
##$DP07= 0
##$DPNAME0= <>
##$DPNAME1= <>
##$DPNAME2= <>
##$DPNAME3= <>
##$DPNAME4= <>
##$DPNAME5= <>
##$DPNAME6= <>
##$DPNAME7= <>
##$DPOAL= (0..7)
0.5 0.5 0.5 0.5 0.5 0.5 0.5 0.5 
##$DPOFFS= (0..7)
0 0 0 0 0 0 0 0 
##$DQDMODE= 0
##$DR= 18
##$DS= 0
##$DSLIST= <SSSSSSSSSSSSSSS>
$$ [...]
##$SUBNAM0= <"">
##$SUBNAM1= <"">
##$SUBNAM2= <"">
##$SUBNAM3= <"">
##$SUBNAM4= <"">
##$SUBNAM5= <"">
##$SUBNAM6= <"">
##$SUBNAM7= <"">
##$SUBNAM8= <"">
##$SUBNAM9= <"">
##$SW= 18.0517328524113
##$SWIBOX= (0..15)
0 0 2 0 0 0 0 0 0 0 0 0 0 0 0 0 
##$SW_h= 3612.71676300578
##$TD= 16384
##$TD0= 1
##$TE= 0
##$TE2= 300
##$TE3= 300
##$TEG= 300
##$TL= (0..7)
0 120 120 120 120 120 120 120 
##$TP= (0..7)
150 150 150 150 150 150 150 150 
##$TP07= 0
##$TPNAME0= <>
##$TPNAME1= <>
##$TPNAME2= <>
##$TPNAME3= <>
##$TPNAME4= <>
##$TPNAME5= <>
##$TPNAME6= <>
##$TPNAME7= <>
##$TPOAL= (0..7)
0.5 0.5 0.5 0.5 0.5 0.5 0.5 0.5 
##$TPOFFS= (0..7)
0 0 0 0 0 0 0 0 
##$TUNHIN= 0
##$TUNHOUT= 0
##$TUNXOUT= 0
##$USERA1= <user>
##$USERA2= <user>
##$USERA3= <user>
##$USERA4= <user>
##$USERA5= <user>
##$V9= 5
##$VALIST= <valist>
##$VCLIST= <CCCCCCCCCCCCCCC>
##$VD= 0
##$VDLIST= <DDDDDDDDDDDDDDD>
##$VPLIST= <PPPPPPPPPPPPPPP>
##$VTLIST= <TTTTTTTTTTTTTTT>
##$WBST= 1024
##$WBSW= 4
##$XGAIN= (0..3)
0 0 0 0 
##$XL= 0
##$YL= 0
##$YMAX_a= 564656
##$YMIN_a= -556487
##$ZGOPTNS= <>
##$ZL1= 120
##$ZL2= 120
##$ZL3= 120
##$ZL4= 120
##$ABSF1= 10
##$ABSF2= 0
##$ABSG= 5
##$ABSL= 3
##$ALPHA= 0
##$AQORDER= 0
##$ASSFAC= 0
##$ASSFACI= 0
##$ASSFACX= 0
##$ASSWID= 0
##$AUNMP= <proc_1d>
##$AZFE= 0.1
##$AZFW= 0.1
##$BCFW= 1
##$BC_mod= 2
##$BYTORDP= 1
##$COROFFS= 0
##$CY= -3
##$DATMOD= 1
##$DC= 2
##$DFILT= <>
##$DTYPP= 0
##$F1P= 0
##$F2P= 0
##$FCOR= 0.5
##$FTSIZE= 0
##$FT_mod= 4
##$GAMMA= 1
##$GB= 0.15
##$INTBC= 1
##$INTSCL= 1
##$ISEN= 128
##$LB= 0.25
##$LEV0= 0
##$LPBIN= 0
##$MAXI= 10000
##$MC2= 0
##$MEAN= 0
##$ME_mod= 0
##$MI= 1.114404
##$NCOEF= 0
##$NC_proc= 0
##$NLEV= 6
##$NOISF1= 3.799351
##$NOISF2= 2.8
##$NSP= 1
##$NTH_PI= 0
##$NZP= 0
##$OFFSET= 14.38212
##$PC= 1
##$PHC0= -2622.636
##$PHC1= 7.392366
##$PH_mod= 1
##$PKNL= yes
##$PPARMOD= 0
##$PSCAL= 0
##$PSIGN= 0
##$REVERSE= no
##$SF= 200.129724274929
##$SI= 16384
##$SIGF1= 3
##$SIGF2= 2
##$SINO= 400
##$SIOLD= 16384
##$SREGLST= <1H.CDCl3>
##$SSB= 0
##$STSI= 0
##$STSR= 0
##$SW_p= 3205.1282051282
##$SYMM= 0
##$S_DEV= 0
##$TDeff= 0
##$TDoff= 0
##$TI= <>
##$TILT= no
##$TM1= 0
##$TM2= 0
##$TOPLEV= 0
##$USERP1= <user>
##$USERP2= <user>
##$USERP3= <user>
##$USERP4= <user>
##$USERP5= <user>
##$WDW= 1
##$XDIM= 8192
##$YMAX_p= 0
##$YMIN_p= 0
$$ End of Bruker specific parameters
$$ ---------------------------------
##NTUPLES= NMR FID
##VAR_NAME=  TIME,          FID/REAL,        FID/IMAG
##SYMBOL=    X,             R,               I
##VAR_TYPE=  INDEPENDENT,   DEPENDENT,       DEPENDENT
##VAR_FORM=  AFFN,          ASDF,            ASDF
##VAR_DIM=   8192,          8192,            8192
##UNITS=     SECONDS,       ARBITRARY UNITS, ARBITRARY UNITS
##FACTOR=    0.0002768,     1,               1
##FIRST=     0,             0,               0
##LAST=      2.2672688,     0,               0
##MIN=       0,             -556487,         0
##MAX=       2.2672688,     564656,          0
$$ Real data points
##PAGE= N=1
##DATA TABLE= (X++(R..R)), XYDATA
0 0 0 0 0 0 0 0 0 0 0 0 0 0 0 0 0 0 0 -4 8 -8 8 -8 8 -9 16 -16 17 -20 24 -28 29 -36 39 -44 52 -58 64 -70 79
39 79 -88 101 -109 122 -135 149 -163 181 -199 221 -242 266 -295 323 -360 395 -441 490 -546 615
59 615 -694 793 -913 1071 -1280 1578 -2029 2796 -4346 8724 -47021 -178341 -49129 246092
73 246092 512923 564656 416330 216856 92296 56798 81907 74565 -29316 -227620 -430657
84 -430657 -495013 -370827 -194503 -104490 -119049 -133365 -40284 125660 250509 303591 315623
95 315623 322930 313464 239252 119678 21616 -47890 -105300 -166347 -231155 -276628 -309776 -332479
107 -332479 -285501 -145134 31114 140091 119812 58255 97852 245249 384425 390019 241546
118 241546 54838 -61443 -90301 -61501 -46117 -98879 -212747 -335460 -362242 -232987 -37019
129 -37019 85673 75492 283 1140 116441 247716 300822 252724 152814 69983 11172 -30089
141 -30089 -47474 -69361 -117205 -179935 -225736 -206046 -132216 -71762 -41703 -14211 38932 112371
153 112371 148056 132705 122512 141394 163989 143248 56374 -40938 -90548 -98539 -87873 -83424
165 -83424 -98552 -120615 -143554 -140184 -70091 37565 112285 109915 47702 14134 59503 130562
177 130562 158089 114982 30473 -33806 -63226 -71263 -57264 -44511 -53646 -81448 -112244 -100714
189 -100714 -35194 30571 58235 51063 35953 45275 60412 56729 51990 55111 54777 34238 -20685
202 -20685 -73996 -79864 -51420 -20147 -12040 -32700 -51536 -52841 -36423 8793 59841 79488 55295
215 55295 -1220 -31817 5269 67903 92175 49076 -34452 -84831 -71453 -24806 20612 30068
227 30068 -2004 -44087 -70769 -55245 5459 60085 66129 27592 -20269 -27317 5868 35488
239 35488 42782 28255 3439 -14651 -30906 -38022 -15990 15755 29543 13737 -26573 -51757
251 -51757 -41105 -11431 23289 42206 30163 -1068 -35862 -43572 1528 61595 80709 38623
263 38623 -37088 -74161 -37198 30364 71526 50262 -19407 -76250 -83122 -38686 31333 66492
275 66492 35290 -32164 -81058 -58918 22831 87587 86898 29386 -34820 -45732 -6677 37865
287 37865 57792 34447 -16362 -55346 -64986 -40161 154 16272 2786 -22352 -37212 -22979
299 -22979 6133 26330 40251 44975 38405 25671 4361 -8547 2836 20117 23874 2340 -39767
312 -39767 -66693 -60227 -30972 5673 19685 374 -28141 -41568 -17167 41269 86739 83539
324 83539 34877 -22681 -35095 3972 47361 54648 10316 -55244 -88715 -75059 -30682 13333
336 13333 20839 -6574 -37703 -43683 -6159 51391 79647 64824 23653 -7541 -1457 22557 32277
349 32277 20343 -9229 -36528 -47662 -49821 -41200 -25684 -16460 -11653 -8236 -3321 11468 25176
362 25176 29225 34452 40226 43185 36605 11735 -11288 -13545 -4906 -283 -14507 -44208 -59739 -51630
376 -51630 -28942 -360 15898 14008 4071 -5167 4368 37050 64499 63690 31613 -10793 -26103
389 -26103 -11293 6150 8204 -11829 -39531 -53070 -50594 -32541 -3815 14958 15931 5349 -4054
402 -4054 8465 34739 48773 44935 26986 8905 1061 -7125 -16600 -18438 -17169 -17590 -24153 -36715
416 -36715 -37589 -22529 -4199 11315 19166 19483 19079 14946 13723 25442 38507 38942 18529 -16715
430 -16715 -37002 -29500 -11331 10 -8177 -28861 -40901 -36857 -17699 13057 34052 33475 15478
443 15478 -5123 -3222 24098 47570 46754 18281 -18547 -35068 -29022 -13343 755 -681 -15781
456 -15781 -33542 -42385 -28394 3746 28816 33130 18613 1293 1641 15489 28198 32731 22742
469 22742 3165 -14715 -27084 -24891 -9466 913 -3371 -19599 -35381 -30973 -9501 12104 25071
482 25071 23748 12998 5016 2604 10729 26388 32254 19782 -4914 -27607 -28587 -12341 994
495 994 2436 -10290 -25433 -28940 -21008 -3721 16689 25672 19589 5772 -4680 2081 20069 29871
509 29871 24606 6254 -12840 -19821 -17620 -9917 -555 238 -8444 -20231 -27229 -17960 2909 17924
523 17924 19830 10298 -750 -49 9181 19294 24639 18547 2666 -12455 -20239 -13690 548 4901
537 4901 -3486 -18885 -28043 -19734 -2658 10088 14108 8038 -33 -947 4976 15400 24317 20408
551 20408 7613 -5903 -12061 -6934 -358 -1124 -6608 -13457 -16718 -13712 -10723 -6533 720 5588 8522
566 8522 8889 6848 7816 10253 11350 13038 11103 4754 -3191 -11384 -13428 -7046 -1789 -2949 -11251 -20512
582 -20512 -19293 -7172 6876 16260 14125 4830 -408 1499 10112 19746 19013 7084 -6538 -14752
596 -14752 -10377 -817 2209 -3481 -14442 -21424 -17331 -5968 5215 11474 8617 3408 2763 5764
610 5764 11243 14565 12033 7413 1971 -3444 -6627 -9155 -10415 -8112 -6661 -6671 -7257 -9683 -9222 -2374
626 -2374 6922 16015 17248 8943 327 -1592 4857 14632 15194 3992 -10567 -20314 -18003 -6404 2684
641 2684 3539 -5372 -16610 -16917 -4398 12702 22743 17243 3447 -4532 -1904 8414 16264 12648
655 12648 1488 -11266 -18080 -14911 -5683 781 348 -6611 -12658 -9875 -1089 8700 13707 12315 8660
670 8660 5954 3051 2302 3557 4784 4652 -432 -8828 -13751 -13947 -9799 -3549 -48 417 -1965 -4995
686 -4995 -3607 4771 14531 19046 13256 1592 -5236 -3529 3350 7906 3871 -5800 -14380 -17180 -11909
701 -11909 -2254 3790 3313 -2802 -8227 -4368 6236 15731 17309 10081 885 -2757 -1398 2327 4331
716 4331 1849 -3958 -9849 -13509 -10879 -4525 69 1242 -1034 -2727 -143 3577 7665 10158 9859
731 9859 7668 3672 -1520 -2964 -1066 596 18 -4451 -9244 -10308 -8175 -3829 345 2503 2647 1078
747 1078 -119 2115 7153 10742 9466 3939 -1572 -2688 -1374 181 -41 -2716 -5934 -8037 -8167 -5313
763 -5313 -749 2782 3036 720 -441 1494 4952 6827 6774 4852 2212 -538 -2678 -3005 -1422 -341
779 -341 -1066 -4153 -6895 -6199 -3019 201 2769 2972 2087 1105 699 2379 4755 6001 4733 370 -3550
796 -3550 -3797 -1587 -101 3 -2203 -4076 -4287 -3595 -1504 1231 2705 2659 877 -397 764 3176 4215
813 4215 3388 1114 -749 -1472 -2282 -2415 -1200 -303 -241 -1917 -3785 -3490 -648 1902 3109 2412 1020
830 1020 -37 -333 525 2569 3665 2540 -873 -3964 -4103 -1483 1416 1917 -42 -2989 -3658 -2187
846 -2187 533 2815 3469 1862 -649 -2130 -859 2128 3523 2188 -540 -2991 -2475 -959 394 1154
862 1154 178 -1002 -1972 -1879 -860 1376 2446 1606 6 -1012 -469 747 1029 1019 736 -19 -934 -2083
880 -2083 -1901 -76 1156 1209 -186 -1720 -1789 -119 1325 2103 2020 723 -552 -1783 -803 713 2357
897 2357 1442 -676 -2685 -2388 -555 1373 1760 569 -998 -1596 -957 543 2037 2200 784 -810 -1918
914 -1918 -851 1128 1510 542 -748 -1710 -1511 -608 289 741 699 -52 -687 -574 259 1199 1485 851 29
933 29 -494 -291 -213 -145 -65 -32 -199 -847 -1376 -1106 59 697 996 648 -59 -298 72 581 1139 1354 470 -344
955 -344 -1189 -1060 -218 708 433 -465 -1194 -1270 -645 405 1074 980 493 -316 -346 117 1127 1318 447 -384 -934
976 -934 -940 -18 -275 5 -288 -585 -865 -335 -86 628 836 638 124 -21 170 552 416 415 215 -215 -676 -950
998 -950 -921 -510 71 27 -150 -411 -635 -157 372 889 1001 807 98 -32 -177 281 656 421 -110 -915 -1144
1019 -1144 -687 -334 262 206 -95 -589 -577 -210 705 1060 910 139 -164 -567 119 469 383 141 -518 -1135 -1012
1040 -1012 -689 89 533 432 -352 -507 -583 195 1066 1069 901 202 -464 -490 -157 145 806 116 -600 -1097 -960
1061 -960 -175 251 687 305 41 -425 -265 192 746 1176 759 20 -486 -703 -181 235 253 -66 -579 -1029
1081 -1029 -742 -61 326 582 421 -15 -715 -293 231 909 703 382 -135 -951 -547 162 506 808 150 -586
1101 -586 -979 -817 165 1006 774 -72 -474 -927 -330 708 864 932 202 -857 -874 -330 546 1193 201 -455
1121 -455 -1015 -910 150 773 618 229 -359 -324 -418 -119 626 448 298 -382 -466 -461 -1 379 421 308 -28 -337
1143 -337 -447 -185 109 739 379 -300 -569 -857 2 452 656 455 -105 -491 -640 7 700 1370 557 -285
1163 -285 -741 -711 483 888 629 -7 -639 -1033 -606 591 647 735 -13 -620 -294 44 777 941 465 -94
1183 -94 -446 -374 -14 378 -78 -162 -185 -533 -387 -323 16 451 302 373 169 28 -14 349 444 638 359 -449 -729
1206 -729 -804 -418 361 354 37 -640 -914 -354 381 813 940 392 -493 -451 5 571 1129 671 -256 -1033 -940 -521
1228 -521 271 295 -42 -507 -759 -346 -149 584 456 519 164 -33 35 402 431 297 136 -274 -545 -567 -658 -148
1250 -148 120 116 -136 -247 -438 38 889 891 773 146 -59 -225 110 315 452 -130 -428 -920 -1269 -575 44
1271 44 320 -77 -573 -513 -77 491 1138 1147 809 164 -518 -372 184 676 288 -448 -931 -1150 -653 -21 208
1292 208 275 37 -127 -159 7 785 1118 1001 185 -364 -768 -264 472 356 -79 -928 -819 -949 -393 131 1028
1313 1028 461 -176 -424 -175 843 1202 893 518 -111 -667 -464 -226 -30 22 -268 -699 -874 -553 205 642
1333 642 545 487 161 144 162 421 248 986 281 -264 -630 -732 -525 229 121 -620 -646 -862 -545 471 870
1354 870 1081 882 -31 -304 -321 402 1034 621 -368 -1305 -1318 -533 220 177 132 -486 -448 -560 278 1086 1132 715
1376 715 79 -392 29 634 488 -92 -403 -567 -701 -422 -490 -408 213 17 112 75 144 471 629 528 689 532
1398 532 124 -507 -572 -251 374 263 -375 -1170 -1048 -427 -94 248 462 197 55 -167 332 1028 1298 824
1418 824 28 -728 -613 19 134 -18 -680 -979 -981 -361 -287 262 592 501 12 -140 245 774 835 607 234 100
1440 100 -272 -268 -461 -810 -218 -152 -496 -932 -529 -36 360 665 407 406 123 185 425 662 610 639 -272 -686 -890
1463 -890 -315 75 94 -531 -544 -519 -80 285 495 1085 592 223 20 81 492 989 484 -329 -628 -631 -521 -168
1485 -168 -232 -295 -399 -469 -597 -285 490 815 792 13 66 -25 349 395 154 58 -177 -361 -685 -390 61 77 -162
1508 -162 -576 -322 118 467 652 377 87 -159 282 117 328 439 241 -187 -833 -629 -409 137 33 -30
1528 -30 -129 -340 -243 -150 349 437 590 152 24 -341 42 383 357 -180 -255 -364 -541 -152 -26 248 305 -119 -334
1551 -334 -232 99 484 545 254 132 -61 -120 128 347 116 -92 -237 -501 -267 -108 391 282 -287 -204 9
1572 9 31 439 485 388 -148 154 -129 -13 184 132 65 -447 -519 -299 -252 52 -2 58 81 1 92 81 46 193 349
1597 349 189 -180 -201 56 109 74 64 -357 -188 -467 -91 16 121 210 -16 -199 11 218 233 301 290 -182 -214
1620 -214 -31 188 39 48 -156 -301 -390 -177 84 136 423 -66 -186 -213 131 3 340 -14 166 -255 -56 53
1642 53 94 117 164 153 -191 -154 -245 136 87 -6 -69 -19 -308 135 181 38 234 -125 -178 -271 -170 54 229 279 -237
1667 -237 -204 -334 -27 290 257 57 -90 -253 -187 -101 63 144 64 25 -100 -153 284 249 247 75 -302 -140 77 88
1691 88 -22 -25 -170 -302 -268 -115 222 187 33 -67 -97 -106 267 312 250 110 -200 -195 -51 134 69 70 30 -311 -239 -312
1717 -312 -90 135 131 -51 -150 -42 116 6 164 143 -91 -51 -175 67 -49 145 136 -213 -173 -476 -91 168 367
1740 367 -53 -222 -297 -202 156 264 258 320 -45 -148 27 222 222 206 -297 -303 -389 -157 -170 39 36 -183 -29 -54 -65
1765 -65 173 112 280 -24 -81 -45 77 -45 124 213 -106 -246 -181 -6 -53 -90 261 -18 -122 -104 287 199 184 136
1789 136 -32 -34 -10 -35 -24 298 62 -275 -119 -179 47 77 60 -147 -49 -50 81 88 266 86 35 -315 -238 -1 49
1814 49 234 -70 -2 -298 -183 -164 120 270 222 291 22 -122 -138 313 211 276 -46 -12 -46 -57 99 -224 -22
1837 -22 210 126 -373 24 254 335 408 101 -222 -190 58 47 165 -43 -84 -382 -170 -176 -64 -80 70 -258 -221 -116
1861 -116 91 340 162 264 38 -145 -120 118 0 50 121 -299 -627 -357 -212 256 -89 -149 -118 -189 14 194
1883 194 402 427 402 -103 -198 -56 110 72 -94 -244 -396 -355 -364 -156 64 -81 -257 -218 -15 276 439 465 144
1906 144 65 -56 -39 92 269 14 -183 -235 -380 -556 -84 -188 -37 129 -252 -90 -34 92 241 438 350 52
1928 52 -118 -198 194 215 49 -244 -178 -534 -327 -90 336 85 46 -72 -83 69 389 597 372 20 -317 -244
1950 -244 0 245 253 -120 -571 -191 -112 -233 119 171 -106 -145 79 212 185 317 53 88 -18 55 -16 54 244
1973 244 -17 -43 -77 -195 -250 -35 89 366 148 226 -97 -174 84 189 335 44 -58 -382 -284 -2 123 35
1995 35 -70 -253 -153 -119 238 255 312 51 155 113 252 331 144 169 -160 -314 3 1 23 164 -275 -127 -42 -128
2019 -128 93 204 223 290 -34 -94 -64 -59 103 129 108 -105 -79 -204 -359 -100 86 93 -191 -145 -241 -10 41 358 62
2044 62 -142 -155 -124 -4 181 61 192 -96 -73 -27 -1 138 55 31 -242 12 127 31 60 254 -28 -28 -103 40
2068 40 124 168 86 -19 -3 -154 34 -5 62 109 28 -15 -230 -383 -1 190 61 130 -85 -230 195 -19 47 188
2092 188 30 -114 -209 41 205 301 -74 22 -312 -310 -22 201 151 142 -377 -129 60 91 153 148 131 56 -95 88 55
2117 55 26 -14 -13 -175 -54 -131 -145 38 134 239 14 -293 -210 189 64 245 114 277 -63 -226 54 69 72 134
2141 134 -131 -179 -138 -71 201 2 -18 -249 -44 17 234 278 -74 -83 11 -206 -13 95 -118 -200 -237 -295 240 8
2165 8 -182 -12 -156 140 249 13 67 127 224 161 23 -9 -115 -263 -322 -183 -65 -80 -136 80 -219 -36 239
2188 239 260 -67 82 -67 148 398 288 182 36 -249 -280 -130 116 141 131 -398 -277 -242 16 342 249 139
2210 139 23 13 183 92 133 -54 -309 -121 -40 -38 -24 -156 -93 -93 87 -6 -68 157 147 146 259 343 -80 -89 -236 128
2236 128 105 -61 -109 -292 -218 -272 -9 -199 -7 11 -231 29 173 132 157 112 -193 -197 5 75 26 -98 -93 -20 -209
2261 -209 1 11 68 105 64 -40 57 163 132 313 201 23 -188 -264 -122 -2 59 57 -121 -160 -65 65 -301 -34
2285 -34 -194 -125 -45 6 92 12 389 95 -31 99 -168 -217 20 -36 178 -266 -189 -225 -223 16 257 69 -147 6
2309 6 -207 -54 319 229 73 29 143 -6 2 -137 -106 75 -222 -39 9 8 16 -2 17 4 -93 238 137 145 200 133 127
2336 127 -247 28 196 -21 -120 -13 -100 -150 -206 57 -35 193 69 -119 25 -85 -16 171 -13 33 -176 11
2358 11 -176 31 32 -113 -114 -329 -20 -153 103 78 -26 -59 -66 175 -98 145 115 64 30 317 68 20 125 -82
2382 -82 -73 -111 -63 -56 -111 -81 -172 108 71 25 -106 -52 78 139 27 23 142 -113 -156 117 -45 197 -227 -291 -7 85
2408 85 -37 -1 105 -181 43 -57 216 -101 -11 14 -59 -112 120 156 27 116 -286 -54 -268 -95 -176 -9 128
2431 128 41 -155 -60 0 117 -93 -28 -202 -27 128 69 102 26 -53 -217 -117 -64 -191 -9 -220 46 141 50 -100
2455 -100 41 79 101 101 -41 -37 -252 -133 39 -60 10 -227 -62 -258 -58 39 96 16 -175 -75 93 123 202 165 67
2480 67 -246 120 247 -94 110 -217 46 -118 -192 171 4 67 107 -21 -35 146 21 8 -32 61 142 70 -131
2503 -131 -143 -247 -173 -23 17 53 -129 12 99 144 250 123 147 -33 -125 1 200 -98 -77 128 -117 -63 -100 141
2527 141 97 -6 31 176 -18 202 84 202 188 -30 -131 -27 66 -50 -19 78 -126 -226 -76 -56 95 38 14
2550 14 -128 163 118 -27 -101 238 -250 -98 108 -51 111 184 -153 -12 74 6 -69 136 17 180 -246 -71
2572 -71 68 -19 106 221 1 -26 95 -14 32 211 13 -41 -160 -173 -15 64 -100 94 -116 -52 -260 53 189
2595 189 85 4 -107 127 58 -53 200 101 -200 -234 -97 -172 23 65 -61 -9 88 71 72 47 -151 221 -56 75
2619 75 32 -38 15 99 -25 -100 -30 -91 -233 -73 146 -114 243 127 -93 -63 -118 20 -64 122 97 -107 -135 69
2643 69 47 45 -61 3 54 -9 0 10 43 -194 -71 -121 40 38 -199 191 -102 -203 -117 117 -31 61 -49 -119 -7 10
2669 10 -18 122 -113 70 67 -72 -52 125 -23 155 57 -57 -295 -46 5 -145 -113 -129 -132 -79 91 -198 128 114
2693 114 -6 69 -25 198 -31 101 62 131 93 -34 -6 -115 -14 -95 -6 209 -34 -216 -86 15 -3 224 119
2716 119 -2 -132 48 182 119 125 -72 -40 64 -141 -42 -188 -278 -13 51 -119 -118 -21 -43 38 37 119 -8 65 1 217
2742 217 140 116 76 -231 -205 51 -43 -125 -143 -217 61 -22 74 48 123 -84 -249 -130 -34 223 30 12 -10 32 -167
2767 -167 -102 -17 -13 -58 -38 135 60 23 58 -8 51 114 -32 -103 16 102 87 64 -70 -93 -69 48 -145 5 -50 106
2793 106 -127 97 45 131 -38 173 189 -28 -142 61 -218 115 -12 175 -91 52 -9 -147 15 2 12 -225
2815 -225 -110 63 -18 -26 -11 166 -23 -50 -42 -8 -157 131 -45 -102 28 177 -7 84 -285 -27 -119 41 54 94
2839 94 138 -98 -92 -36 -1 164 -18 -163 26 -231 -40 -153 122 -33 -9 198 74 146 -2 -110 72 64 -153
2862 -153 0 -138 -184 1 42 20 -152 2 -22 -58 -47 -19 -11 -9 74 122 -130 98 -83 119 26 91 -184 14 -45
2887 -45 -20 -72 -101 -94 -88 179 54 -89 113 -84 -136 28 192 224 -89 -91 -3 76 41 -161 -361 382 -142 91 -120
2912 -120 124 318 -184 48 174 28 -141 -20 84 -41 -20 69 -250 -70 -144 25 134 28 92 -28 -33 152
2934 152 42 97 -123 -48 -65 201 -52 -11 -61 113 85 -35 52 76 143 30 165 -128 59 -7 38 159 42 -14
2958 -14 39 -292 25 42 -133 -25 -331 -88 -94 49 -249 46 -6 5 -140 -291 -7 -123 -82 45 73 195 -79
2981 -79 -208 -71 32 13 -197 -76 -4 -112 9 106 157 -174 -178 18 135 23 184 -32 -92 70 -72 32 -42
3004 -42 -23 -83 -57 -127 63 -111 243 18 16 67 -118 -64 -59 -102 -101 -106 51 -169 279 8 -143 161 103 -49 44 63
3030 63 -158 -2 197 -124 -240 -155 -106 -9 -32 -41 -71 -5 -50 -57 -64 208 -5 -91 -151 -60 10 212 -201 -79 -107 -149 -48
3057 -48 -163 -15 -41 -177 118 -24 94 26 -125 215 49 73 233 156 -112 -208 15 56 -95 -164 -136 -119 67
3080 67 -23 115 135 -91 98 172 193 8 14 -36 88 121 -13 154 -59 8 69 119 -43 0 -12 84 -227 -20 51
3105 51 -16 -33 -161 186 -33 84 -133 -5 31 -78 16 -138 3 50 -195 -62 54 -154 -48 -97 -218 -117
3127 -117 -195 91 282 58 58 92 53 130 -50 -83 -59 -143 -131 19 -72 18 -1 -225 113 -27 11 78 89 79 -83 -51
3153 -51 -32 257 -39 -52 -133 50 -84 -31 -133 6 -193 108 97 113 -75 -141 46 48 18 27 148 -15 139 -197
3177 -197 -18 53 -23 118 51 78 -15 11 -15 43 -167 12 -25 -69 123 -129 -1 -11 -86 106 48 -41 85 -94 60
3202 60 31 72 153 -187 -1 4 128 97 171 -151 -91 72 -142 57 -75 -137 48 41 32 9 101 -105 153 11 -145
3227 -145 206 -14 -187 29 -33 -125 158 -84 -204 -1 49 25 -37 -95 34 -92 71 58 183 164 152 -25 -39
3250 -39 3 99 -22 -20 -63 -38 -51 7 58 142 20 6 34 -49 81 84 21 30 25 1 -86 17 46 -85 -40 92 62 -54 -318
3279 -318 -250 184 121 80 34 -14 34 93 94 192 -25 -101 67 93 -81 58 120 45 -22 19 -8 157 -29 -77 -231 -189
3305 -189 -76 13 -52 96 106 201 -49 -82 82 -174 -30 26 24 -109 -185 -66 -88 -181 27 23 -112 -39 -117 3 118
3330 118 26 -15 60 -52 178 27 -243 -302 -49 -44 85 -44 -225 -157 0 -138 -80 -224 -200 23 -37 245 82
3353 82 -1 133 -30 179 -218 -135 -124 -87 77 83 -149 25 -9 -91 89 48 68 -99 123 360 -149 213 -70 218
3377 218 -90 94 22 35 11 45 97 -118 -60 -54 74 -94 205 -160 -13 -189 -43 -41 77 54 -100 -232 -126 8
3401 8 102 -145 -36 -14 -104 -21 -79 24 208 66 -22 146 -52 132 -53 -473 88 -52 84 -60 -53 41 -112 -157
3425 -157 20 -395 145 174 120 -26 46 59 87 -9 -220 -92 -81 -149 -57 -90 41 -43 59 -128 314 -230 -117 17
3449 17 259 144 41 -100 44 139 187 55 45 -163 53 -142 -95 -100 -142 93 154 258 9 73 -66 -71 -60 21 -78
3474 -78 9 -102 -181 -3 -27 -17 -143 111 -120 4 -58 -88 132 88 -6 -21 154 50 54 -43 18 -179 -34 -50 -144
3499 -144 -79 -147 -62 175 -205 -152 4 -218 92 125 -134 211 128 46 163 84 0 -93 -53 -34 60 159 138 53 91 106
3525 106 -17 -155 -155 172 67 45 78 190 189 -162 91 -149 156 -134 -80 64 50 -116 36 54 -71 171 86
3548 86 241 9 274 174 -20 -20 -233 174 -27 56 44 121 52 -78 -28 -87 21 -11 117 -91 101 -116 1
3571 1 -60 -103 -72 -143 -73 161 -274 -66 -37 -103 77 131 -161 -90 -139 28 125 99 63 62 -102 -246 176 76 -43 -25
3597 -25 27 120 122 133 -45 125 -33 -184 32 79 68 -85 -35 -15 90 -70 253 -80 -14 24 -21 -56 -67 119 78
3622 78 -142 -78 147 69 79 165 116 200 413 -101 149 -56 -96 -33 -93 -190 146 209 30 -143 -108 -69 -73 42 -97
3647 -97 95 -159 -135 19 180 30 -32 -333 84 44 96 112 -58 111 -30 5 204 -4 134 97 230 -104 68
3670 68 -87 152 -76 265 201 -176 41 2 5 168 -68 -83 -6 58 9 138 110 -177 -58 -116 178 195 286 -98
3694 -98 -73 85 44 -5 72 11 -28 88 -118 75 46 -116 -149 -225 -14 -41 -136 -24 111 -26 39 34 43 -13 16 -43 124
3721 124 -189 18 43 -117 -65 92 80 32 33 96 108 -10 149 -146 200 -183 -222 -186 -63 142 -7 -156 -87 35
3745 35 -48 9 43 55 2 -105 -5 39 81 85 28 56 64 -250 28 260 76 137 -36 -69 -168 59 238 -26 31 -113
3771 -113 36 -16 81 -120 -168 85 17 92 92 -162 -148 -59 36 45 -72 300 21 -28 0 129 -121 289 -239 54 -167
3796 -167 22 132 18 -14 28 223 47 179 -288 51 -199 98 43 -78 -33 37 27 -70 98 -108 298 27
3818 27 104 -151 -97 112 -188 -48 -13 -126 -62 -119 41 -119 -75 44 -2 110 -67 -99 110 12 -50 -178 64 -209
3842 -209 19 -84 107 229 -116 112 -19 -10 160 173 -51 95 65 -47 -234 -104 200 -60 -51 91 -232 -32
3864 -32 15 53 -50 5 -156 -26 -191 -227 -76 -17 -47 142 -24 -19 68 19 192 13 70 38 52 61 139 44 -56 -62 172
3891 172 -7 -73 180 -18 -39 112 -108 13 173 -117 -119 185 -96 110 -97 -136 73 39 6 117 -88 80
3913 80 -53 -37 -101 133 54 -35 24 250 60 -130 -146 15 -57 104 58 139 102 -234 -62 183 73 -254 83 10
3937 10 125 190 -67 80 89 -42 124 -117 35 -181 112 -147 -197 -3 65 264 82 -42 -148 130 -47 234
3959 234 -17 -6 51 108 -29 92 -37 -5 -56 -141 -87 -83 -44 89 -88 88 49 -156 204 -108 70 -146 -235 -134
3983 -134 61 123 271 28 214 -39 -16 114 -43 -63 136 -40 -176 56 14 50 146 68 -182 -99 -80 143 0
4006 0 -93 7 -115 -57 49 60 -41 124 111 18 63 120 -41 -8 41 -6 -83 -198 78 21 43 -60 -122 -55 -72 -50
4032 -50 125 148 25 -64 44 58 199 137 82 11 -153 275 -87 77 -72 -23 -52 37 -43 -316 81 -159 188 38
4056 38 47 -3 -108 12 99 55 -27 12 -39 -77 -20 111 53 -95 -116 -43 -144 -39 74 -125 -116 29 38 85 -51 -29 15
4083 15 -70 131 -18 -4 74 70 -15 76 -61 96 -160 46 -16 221 99 -107 8 55 45 -54 -11 -29 242 -17 122
4108 122 64 -93 125 -96 10 35 65 135 -65 -112 -29 243 -39 -39 39 -159 -294 -63 90 19 73 -172 46 37
4132 37 -117 69 -96 126 -54 193 48 94 118 -55 -53 -41 54 -75 -70 -23 4 72 164 30 -134 170 145 -110 -60
4157 -60 -54 34 -26 133 -205 -158 -29 -2 162 18 -52 -38 110 -110 18 8 73 4 80 65 -14 -121 17 169 -141
4182 -141 4 42 18 92 -73 26 -116 58 -286 -10 245 174 -15 -88 -67 -74 69 -50 91 80 135 48 45 13 14 -3
4208 -3 -142 -29 4 -102 -5 -69 88 -37 -75 96 -67 68 -156 -86 25 -71 -36 -274 20 -104 -56 141 47 37
4232 37 -22 -11 -55 182 200 32 -66 132 -127 157 -293 -279 -95 29 115 -113 41 103 -109 35 -160 -11 44
4255 44 27 9 36 147 -108 29 -16 -152 213 -56 -2 1 83 5 144 32 -126 82 -55 26 28 -53 -158 -143 -34
4280 -34 123 -189 -74 236 -13 -288 37 37 16 -157 -19 66 -134 30 117 40 38 6 37 -158 3 -144 -20 67
4304 67 111 61 99 35 -55 4 -21 36 -79 62 123 -113 33 5 -145 -39 227 -83 -57 -154 -50 112 -166 -106 193
4329 193 -236 -47 -43 -4 114 -148 -83 126 1 -111 -1 -161 -65 -82 -170 19 9 -246 189 208 31 -41 -150
4352 -150 -51 -76 -39 124 173 -103 0 43 -159 -139 21 -257 -118 139 -27 85 44 26 -196 -202 -45 -176 141
4375 141 -56 93 -8 21 -28 -26 73 -223 65 122 239 -113 46 -19 -4 -13 121 -157 -18 -75 40 -50 -10 9 -29
4400 -29 155 -166 -23 -60 -3 -71 17 -39 90 229 22 9 176 -44 143 154 108 -136 5 -73 58 -174 -6
4423 -6 -235 112 42 132 13 85 -251 -48 -21 -167 113 151 69 74 11 40 46 153 50 -55 23 -147 -94 -101 36 -149
4449 -149 61 -125 151 -5 -23 257 125 -102 190 111 -134 -142 47 17 13 42 -119 -33 -41 -126 -3 155 -74 2
4473 2 -138 133 -22 181 -12 -178 45 53 -59 19 -24 34 64 139 77 70 64 226 -125 -13 54 -45 -37 71 -279 -242
4499 -242 99 -109 -106 -163 22 -88 82 -39 -11 -213 -59 54 -64 -76 123 -62 134 112 33 -5 -27 -37 41 37
4523 37 -56 166 112 -68 213 282 263 -153 68 14 110 137 -29 -193 -58 130 -54 150 129 -55 38 99 191 66
4547 66 125 79 154 3 29 89 -96 17 57 218 -143 -77 -68 -11 -158 58 -79 188 24 72 127 8 -91 153 -23
4572 -23 3 -1 -118 -17 -135 -40 -88 98 -150 -125 33 -1 157 -35 179 -45 162 121 -72 136 -33 177 -30
4595 -30 -5 26 116 -22 170 -1 -152 -289 -173 118 -9 152 192 8 50 3 -87 63 -20 41 15 57 79 -101
4619 -101 211 -66 -134 -16 121 -29 -56 135 160 99 -224 -43 -68 8 -68 222 -59 55 -195 94 29 -162 -68
4642 -68 31 -121 71 79 -161 -36 -12 94 63 171 -18 91 48 89 67 -243 70 -10 -158 196 212 84 110 -51
4666 -51 70 51 -104 -57 179 112 37 13 -116 -1 -88 38 -123 -124 -29 -242 -140 -23 -43 40 -65 -45 191 5
4690 5 34 -76 -78 160 -96 -70 -212 49 -31 84 -198 4 85 0 79 -287 62 -1 -88 -46 41 60 -8 -177 -40
4715 -40 21 36 33 -142 -136 -119 0 116 -80 81 -31 43 -105 172 -27 -26 175 -296 96 -61 -41 194 49 -79
4739 -79 -117 -52 -2 135 -119 56 86 -79 170 -11 24 -86 -86 -117 -163 -254 29 -8 -20 -117 143 -5 -144 -59 -293
4764 -293 96 171 -26 228 147 -26 126 -12 -74 -25 149 5 -46 -10 -74 -52 202 -60 69 82 6 150 -22
4787 -22 52 42 51 28 214 -232 255 -119 3 -27 -47 193 38 -224 -221 49 -37 -132 1 204 -38 -191 67 1
4811 1 -164 -40 -117 -10 256 23 -31 15 -88 -146 130 -77 166 -93 -158 18 13 -108 -284 -67 -6 333 19
4834 19 24 52 -115 25 -93 -46 113 -297 -95 -30 -22 -108 166 82 -147 93 114 78 117 32 -118 36 -237 -98 -50
4859 -50 -258 62 -56 216 -34 72 91 -258 -66 80 116 130 221 -34 -19 37 80 -144 101 -15 50 -2 41 -253
4883 -253 -71 23 35 -91 -146 -43 268 220 -214 216 109 -100 148 152 255 -109 -163 -150 49 -48 -39 2 -112 105
4907 105 -105 -51 55 10 178 16 59 -53 -49 -31 41 -5 19 -6 110 155 52 112 64 6 65 -15 -119 -43 91 102
4933 102 -38 38 155 63 41 162 48 -64 104 -311 70 -22 192 83 170 45 105 -21 182 0 -127 22
4955 22 28 -77 -223 124 -147 156 -174 -95 11 -106 -4 22 -141 385 -43 82 183 87 -104 203 160 18
4977 18 -298 -75 0 -124 -195 -80 69 -15 121 159 152 34 80 -122 61 89 78 130 131 -52 73 122 53 12 -116
5002 -116 46 173 -28 -320 21 -53 -72 -92 -235 -169 114 -205 -2 -33 105 -48 -185 10 -28 -91 48 1 21
5025 21 -305 -138 -64 -47 -15 58 55 22 71 -223 -64 49 53 15 26 -181 -5 -40 44 -99 -102 91 10 33 -61 61 217
5052 217 -45 87 -2 -115 -111 122 86 120 45 58 346 -77 -65 -149 -85 32 -39 -20 9 125 -106 382 73 111 -253
5077 -253 -56 246 -5 -69 62 116 59 -130 149 -28 -153 -327 -74 133 -111 -96 -201 297 -86 126 -72
5098 -72 -30 -32 -73 38 -211 171 55 3 60 40 -129 -218 104 78 -124 135 99 98 -109 50 135 -141 -78 -111 -64 156
5124 156 7 44 -14 -278 -1 96 110 -96 121 -2 -121 -17 11 61 3 75 -43 -18 -254 130 242 -110 96
5147 96 -50 -56 115 8 -104 -87 -170 4 -1 -71 108 169 -48 -61 5 88 -10 -58 95 -116 127 82 -102 74 -80
5172 -80 -21 104 208 -88 49 64 16 25 -204 28 154 0 -68 9 46 -8 -44 -22 -152 15 -62 -166 -120 -56 -8
5197 -8 -142 -215 51 38 112 -31 -46 -132 9 134 -61 170 31 -140 -34 -68 -24 -39 -13 46 1 -49 22 142 -30
5222 -30 -9 -32 123 -6 -8 -3 131 -78 -19 -41 -57 -57 53 -47 -146 16 104 -33 151 131 46 141 -155 -137 140 49
5248 49 83 78 83 10 -36 56 -28 86 -111 130 -1 2 255 243 -96 75 63 -221 -162 192 -107 -109 30 127 -48 20
5274 20 78 -50 31 8 -67 38 92 52 -229 152 -121 -158 101 -245 127 130 -94 -243 198 80 -213 65 24 175
5298 175 -35 90 94 -84 274 -182 79 -36 68 -177 117 -66 80 106 -198 -66 -36 -148 -56 16 -136 -17
5320 -17 -68 34 -178 -106 73 66 3 84 -107 -36 157 171 -152 -11 75 -279 243 -26 -24 161 -14 -228 60 97
5344 97 -91 -7 -248 117 56 128 83 123 -41 -17 -2 130 65 199 -109 0 151 128 90 100 -210 -64 -88 222
5368 222 26 -99 86 -99 5 94 -43 20 5 16 119 -22 15 -72 -40 168 49 84 -10 -189 -119 -18 132
5391 132 42 173 -154 218 49 25 -37 -81 -70 117 133 -14 -129 185 163 -48 -78 129 60 -135 203 89 -259
5414 -259 -48 -73 -15 -159 186 -70 -39 -108 85 179 64 -27 -247 -81 -57 -105 41 -101 -46 74 88 -129 6
5437 6 -64 200 20 -35 72 70 48 -109 -72 -121 -65 -26 223 -74 28 115 -64 29 -108 -34 176 61 -95 87 -131
5462 -131 -116 95 -155 0 146 151 81 -10 -73 -58 11 92 -124 3 -243 -1 -18 87 -8 -13 45 -7 203 53 -185
5487 -185 -57 73 -69 11 -126 -25 45 6 -121 -143 -37 150 27 -106 85 64 -47 -294 22 -120 27 -64
5509 -64 155 264 23 -120 -45 68 -156 32 -117 -36 -2 148 -68 -81 -116 98 -31 -74 -108 -110 194 23 -137
5532 -137 0 -49 -57 43 -155 -55 -8 -23 -172 56 19 -20 93 49 152 -136 -38 -122 60 -195 -38 -143 200
5555 200 126 150 24 89 14 -141 187 -28 -185 126 -113 94 43 -161 -16 -63 -28 -5 -12 -102 79 -128 -23 9
5579 9 -54 -51 -161 -228 -43 296 101 -90 53 48 117 105 93 -18 163 96 54 -61 -67 250 -20 77 162 23 -111 -127
5605 -127 -86 -188 -44 19 -307 46 116 247 20 89 9 103 -42 6 134 41 44 2 55 -124 160 -238 -133 31
5629 31 -85 -143 -28 69 -73 7 115 34 -56 104 -34 28 70 -119 83 -243 0 -115 -21 151 36 160 29
5652 29 -138 -15 24 0 206 196 -116 -3 -102 -123 63 -2 24 70 -147 77 -78 4 -55 -66 -26 77 69 -16 146
5677 146 -92 138 76 182 -68 124 42 -206 1 5 -153 -22 9 -81 161 -37 1 30 131 -35 -268 200 3
5700 3 67 -95 -131 -96 8 119 2 -1 -28 71 -31 -67 66 135 -102 -283 -195 59 164 44 -10 -210 -66 140
5724 140 -29 -87 -10 104 100 159 37 -109 129 -236 -30 -42 42 -84 231 -65 194 -207 13 -42 13 41 -1 11
5748 11 -66 -69 98 -96 15 171 -12 18 -42 132 -15 7 -261 -13 80 -62 -64 90 129 80 102 77 58 62 140 -17
5774 -17 -111 -73 -61 -30 188 -24 10 11 -16 -13 -21 -166 59 -193 -149 -4 -135 -207 8 261 53 -19 -170 -156 -236 264
5800 264 -13 142 -7 195 -127 58 -83 -33 52 -75 -8 45 55 -115 -211 -191 -112 -146 -84 171 25 43 -32 57
5824 57 -3 -13 20 288 -23 3 15 -66 -160 -58 -148 -103 99 83 25 -38 14 -170 42 -37 -216 -57 106 -33 113
5849 113 262 7 126 195 -1 -59 40 93 34 -79 -71 -107 7 224 -57 -79 -61 -34 -11 -116 -87 -8 74 92 6 160
5875 160 47 69 -107 30 50 130 -126 99 58 -51 194 159 -14 -152 203 41 -8 -16 126 98 -48 62 139
5898 139 41 130 49 58 -51 -19 72 -62 3 19 -7 -85 -32 9 11 -193 -64 144 -128 -323 108 71 -126 -130 -44 111
5924 111 -61 -162 199 111 -65 117 120 -150 20 -75 91 95 -19 220 114 -22 30 125 114 145 309 -104 -154 152
5948 152 -62 61 51 13 158 -75 -51 -24 -10 -29 204 -68 -30 99 82 108 -173 196 83 100 -63 -74 196 -157
5972 -157 -60 58 -95 33 197 -114 10 60 9 181 92 241 17 63 96 -35 66 31 -44 -5 144 -181 -67
5995 -67 -143 67 -24 -42 55 10 -107 -129 -62 -168 -24 -84 -67 168 183 68 -149 -88 -78 22 -81 -48 81 -150 -49
6020 -49 -169 -25 -31 -75 -69 47 39 45 50 -64 63 -66 -4 -135 -136 -41 38 224 96 -195 39 87 70 -159 8 -114
6046 -114 -77 39 189 18 -60 61 -229 223 -92 -133 148 -51 185 99 -21 -42 -146 49 70 12 83 52 -155
6069 -155 62 -26 70 -162 133 113 29 32 -199 -182 45 189 -77 -131 -213 -198 -43 10 -155 2 76 -125 -57 49
6093 49 -58 188 135 -103 12 169 80 -69 135 91 -27 -10 -48 55 247 -62 -119 -75 -106 140 -16 61 134 45
6117 45 -15 -51 169 150 -127 28 42 -82 -21 -49 69 -53 224 -85 59 -141 -65 125 -102 41 -18 61 -54
6140 -54 -32 -150 70 225 -283 -32 -8 -8 -147 151 21 57 8 -7 137 -103 12 -26 -20 -39 -112 -75 24 -101 57
6165 57 -180 41 -213 171 111 -227 -95 -181 4 145 -142 -30 -17 -144 81 -4 -16 -22 -219 58 -14 -71 -31 91
6189 91 6 -6 58 -137 -345 187 -53 76 179 80 -119 -105 102 154 73 -71 7 -158 7 52 -190 -2 4 -94
6213 -94 236 174 -127 162 246 -118 -13 -80 4 -185 38 -206 11 -186 -160 31 -79 -33 -40 62 76 -111 95
6236 95 -38 91 335 134 -57 -234 -127 216 -9 -44 -91 229 114 -238 -28 268 -37 32 153 -14 130
6257 130 -16 25 -114 105 -174 -131 141 30 -3 -152 -132 -136 64 79 -160 17 12 -189 151 119 -3 229 97
6280 97 -64 -63 -203 87 111 68 -100 74 -52 23 61 89 -23 267 -132 -146 101 -358 62 139 -129 209 62
6303 62 -121 151 130 -39 -151 73 -110 -231 15 -14 155 98 190 293 -74 -59 -77 -26 51 31 48 -104 -24 -173
6327 -173 56 -129 -16 11 -178 -38 104 59 -182 -35 -12 -185 -123 -38 -38 -52 33 3 98 -81 -239 162 -38 -144
6351 -144 220 -72 11 102 31 199 -175 -138 -11 192 25 75 -59 102 52 -251 60 151 -139 -149 94 -42 -56
6374 -56 -35 39 161 -20 28 33 -110 -67 -309 -60 69 -78 -45 -80 -94 -34 102 48 -135 -259 224 47 68 -170
6398 -170 -5 -14 15 -19 18 204 140 -60 -58 19 273 -87 88 -69 123 8 -109 -5 -143 -192 141 13 -22 -80
6422 -80 3 -69 -80 -48 15 -7 -132 -34 -105 -106 45 -169 205 106 31 153 36 106 -81 -7 21 -144 -159 -21 132 -162
6448 -162 -5 280 -168 36 -123 -18 -145 -62 104 -154 141 179 30 48 -106 -363 151 -15 7 2 -1 40 101
6471 101 117 25 35 72 -113 117 -56 46 -4 -136 -177 5 -144 19 6 -6 53 131 43 194 271 -47 99 6
6495 6 64 -16 126 62 -133 69 95 -70 -96 48 41 48 -100 -89 -94 56 -173 52 -6 -23 -147 90 19 -129 80 -71
6521 -71 -100 -26 -200 -135 292 8 0 -4 55 -28 136 28 1 66 -128 -54 86 -115 108 -129 -169 28 -31 30 20 -146
6547 -146 20 -63 122 103 168 -67 -68 -145 -174 17 -3 259 -111 -309 27 126 303 20 82 10 12 -160 -72 -111 -78
6572 -78 58 99 -67 233 42 95 87 147 -82 193 87 -64 212 -195 -338 167 -219 -8 74 82 119 119 -38 67
6596 67 40 -3 49 150 10 -67 49 212 -14 -238 17 -353 -67 -164 186 183 6 -125 24 -103 -10 157 21
6619 21 223 -123 -26 12 3 81 -205 22 221 38 255 -148 66 147 92 60 -73 340 -54 -18 -49 175 -49 -70
6643 -70 130 65 120 42 -86 -82 -83 7 139 43 -107 -96 106 -162 42 145 65 53 89 -58 169 -12 -27 -60 -31 131
6669 131 111 52 54 -14 -179 100 -143 -23 53 -125 182 58 -73 -8 81 -91 -42 -244 35 207 -113 129 63
6692 63 -59 67 144 -331 -78 -156 -109 268 73 91 -44 13 -195 -76 122 64 16 -52 -94 -71 -180 -262 -10 -62
6716 -62 -13 -170 -49 -16 143 -78 -182 180 -82 -204 99 -33 -25 -89 -82 80 -27 15 251 -64 -51 86 -136
6739 -136 -97 147 187 148 -155 -145 64 -97 -107 53 -120 78 -62 67 99 -117 136 172 -46 -103 69 11 11 15
6763 15 143 -44 106 144 -42 -53 -67 -110 6 -19 156 -12 -107 -47 125 -69 -4 44 7 26 -11 79 178 -87 177
6788 177 96 187 10 -46 212 -142 158 -72 113 179 137 -41 -110 19 163 24 75 138 -98 40 34 286 53
6811 53 161 185 -54 -126 62 39 -124 -309 59 -159 205 -153 -21 -50 -55 143 76 -53 111 51 21 -24 -69 -44
6835 -44 125 46 -100 47 4 -149 -2 -12 -74 152 113 22 -142 55 -76 41 -65 2 -117 -120 -127 90 113 -107
6859 -107 64 11 -19 62 -73 81 293 49 -109 69 -29 -153 8 -148 118 -27 14 54 30 4 98 197 98 -66
6883 -66 -129 -154 12 106 52 110 -106 23 53 157 -112 -57 83 152 95 -42 0 31 -60 -124 -110 -114 0 -66 -33 -82 -26
6910 -26 -5 -15 -1 -99 138 -120 -183 32 157 40 177 221 -46 -154 55 -131 -223 27 39 78 248 -246 168
6933 168 11 -278 -187 -51 -26 -90 -50 -106 204 102 -62 -26 229 77 133 52 -30 120 -60 212 -49 112 -144
6956 -144 29 282 45 -30 154 10 -80 87 101 -16 77 242 56 -4 97 179 123 97 25 122 160 -61 -23 112
6980 112 -49 93 -174 94 -325 -55 -24 -37 -136 19 92 -18 -169 -67 30 -151 144 77 124 -34 -50 67 -64
7003 -64 -40 154 67 -21 169 -177 -133 48 -158 -49 16 -71 -141 -29 40 12 22 -102 -58 -63 66 -34 9 44 160
7028 160 -21 43 181 -46 -47 13 128 164 -8 126 140 125 50 159 158 219 -31 -88 88 -124 72 25 130 -65
7052 -65 -94 75 -71 48 52 120 113 -25 -105 -259 -41 -71 -27 8 -186 -157 -186 87 -65 -124 -218 -130 -143 135 -66 4
7078 4 157 96 1 146 -108 49 -111 -39 -70 17 -86 -137 42 138 65 85 -73 -50 19 -7 283 109 -60 -79 27
7103 27 100 18 128 95 102 241 74 201 -116 -146 -36 22 25 95 139 175 -121 -99 111 -6 -89 113 -151 -62 -38 159
7129 159 -78 -103 59 -46 -5 128 108 164 88 -14 202 142 42 -165 165 -91 -80 61 -56 61 71 138 -33
7152 -33 64 108 -193 55 60 101 -24 59 -72 21 -29 296 61 215 20 -28 -162 -126 20 45 -55 60 202 -77
7176 -77 -109 156 101 -169 155 50 -21 28 -128 -53 -60 -2 59 10 66 -70 -150 -182 7 218 79 -151 28 90 9
7201 9 16 -194 -38 -80 296 16 82 -187 -124 -81 -26 -34 -11 -146 192 175 94 102 -94 47 213 105 138 34 -262 -220
7227 -220 131 79 4 39 28 85 26 20 -175 161 -109 -51 259 -83 6 11 -61 178 106 12 146 123 -19 -23 -1 9 -140
7254 -140 15 78 109 -164 75 -54 -27 28 -27 186 -145 -41 2 -68 -114 5 208 97 -95 205 85 -160 -22
7277 -22 96 123 132 -182 13 34 -109 -16 -248 -292 11 128 -59 75 -144 128 136 241 -186 -9 76 -243 -46
7300 -46 -191 218 -58 69 -189 -49 43 -230 -30 217 -152 207 48 -204 -197 -24 -15 285 5 -91 -43 -74 -163
7323 -163 10 148 -65 7 93 118 322 -112 -60 -108 196 2 -140 73 -11 52 -148 -143 -34 110 -1 -16 125
7346 125 -40 -14 113 28 54 116 138 -48 -261 92 -36 -77 -110 -76 23 -192 -52 98 90 -136 -54 83 -2 97 1
7371 1 -97 113 96 108 11 -49 50 -38 36 -4 112 87 -38 -26 26 -43 9 -196 77 -249 -114 100 -100 -35 -105 -63
7397 -63 0 111 -74 141 186 66 125 55 -176 -75 -104 -8 -7 -167 -112 -81 17 5 -28 -43 90 -145 -96 -14 61 42
7423 42 164 54 -41 43 5 -162 121 83 -131 -121 -65 -182 25 -13 212 17 -30 192 -38 -10 1 -189 13 59
7447 59 84 33 -14 15 -54 -23 -52 39 -100 5 -151 -143 53 190 -91 -10 -33 198 105 -194 46 23 54 6 -143 18
7473 18 -216 0 -107 -157 38 38 -143 10 -38 -115 55 156 184 -172 13 -117 -152 99 -79 -177 269 -63 -89
7496 -89 124 82 147 -97 -38 -343 85 52 -51 48 -29 -126 -12 -113 -78 11 8 91 229 -13 161 -83 15 -58 -87
7521 -87 -224 51 -135 -28 -20 -52 95 29 100 -180 -306 111 -48 -55 -223 -116 104 75 54 190 177 -16 -98 24
7545 24 159 -3 0 140 71 118 -26 101 111 17 -141 -237 134 14 -128 69 61 -301 -38 72 -92 -8 -41 5
7569 5 -38 -19 221 -76 -207 39 6 -87 92 45 -165 -72 47 132 13 -10 88 -38 94 136 -2 -35 130 15
7593 15 4 60 -45 50 86 130 39 -89 159 58 -109 -86 63 165 -109 86 119 -64 -22 128 -59 144 234 -19
7617 -19 141 57 -51 -4 94 -138 178 -19 24 -22 144 83 154 -22 -53 116 111 -192 -45 -22 -139 84 -21 267
7641 267 -97 0 -23 83 -28 61 -88 16 116 35 39 22 42 -289 -188 52 -42 -134 171 124 103 19 -76 113 -2
7666 -2 -32 -62 135 9 3 -131 102 -40 -98 90 -122 141 30 -77 -112 1 33 109 17 0 -85 -56 24 143 22
7691 22 137 99 112 134 -121 -224 84 -52 113 266 3 74 31 -56 213 33 -117 110 -28 64 5 12 73 -131
7715 -131 53 136 -70 174 83 -93 102 205 116 -4 116 -173 -119 49 147 -86 130 107 -97 161 12 62
7737 62 60 -19 14 -53 -111 -39 -68 20 128 6 199 -1 -84 81 16 97 -73 180 -152 14 55 141 22 164 50
7762 50 -40 76 -90 -158 153 1 82 -38 -94 22 76 76 -182 85 -18 -76 -66 308 71 100 117 15 1 -161
7786 -161 -13 69 11 -21 -98 -104 -228 23 -174 11 26 172 5 -169 107 -71 -45 -10 -22 -171 -85 63 27 0
7810 0 166 60 16 32 58 -108 16 -143 -96 -112 -234 -93 -50 -164 141 146 -36 -3 128 -56 235 71 72 39 -142
7835 -142 71 -1 -160 109 132 -57 -75 47 24 -33 110 -191 -20 -49 73 155 -100 -37 102 -64 50 -89 57
7858 57 -116 -28 -86 178 92 201 -96 297 -278 25 55 -111 -67 -35 16 25 200 -143 -103 75 83 -126 -117 -37 216
7883 216 38 9 -74 -28 -49 45 -16 -169 148 247 -155 198 -32 -64 -96 39 44 -71 137 -75 -49 118 173 2
7907 2 92 -225 -74 -28 1 181 -122 250 -53 -2 -32 -24 -76 318 -52 83 41 118 -111 50 -88 17 77 -17 15
7932 15 37 -94 -1 6 -2 63 -164 -90 -99 -86 -65 -33 -92 -35 18 -20 5 -141 10 80 -141 56 11 -271 -38 -117 1
7959 1 -38 -154 51 191 -68 5 -161 131 47 -76 40 -24 -36 -19 -151 74 140 34 58 -254 29 -113 -178 -96
7983 -96 -13 -16 -56 122 166 145 88 -45 2 -109 49 -41 64 -29 65 103 61 117 -110 55 -52 248 11 38 56 83
8009 83 6 -21 -20 215 -129 -152 -88 -99 147 93 -100 -4 104 -33 278 -113 -15 34 132 14 176 22 94 127 -9
8034 -9 12 -51 -50 115 33 309 -46 -37 -110 30 -99 -50 9 -37 -139 -106 -69 -55 108 142 -81 4 -28 -73 -153 -217 21
8061 21 -58 -17 18 250 -232 35 -52 45 -20 -50 143 188 124 -158 -7 133 -244 20 -151 -206 80 157 -34 141
8085 141 -90 -216 -101 -20 -11 151 -71 -146 129 -69 -60 63 148 -41 -64 -6 78 -82 2 -60 -260 53 -27 -164
8109 -164 69 -127 139 -90 -43 13 59 -213 99 105 71 46 91 74 -33 79 99 -59 -135 -64 -102 17 51 144 -183
8134 -183 -63 243 -222 325 -34 -46 150 228 -139 -111 1 136 160 138 10 74 -116 34 -75 -158 126 -21
8156 -21 -10 -56 69 -125 -23 -136 -17 215 38 -13 165 -242 -72 -86 70 35 -123 -155 -54 31 55 -49 -339
8179 -339 90 6 -231 34 3 95 -129 -270 123 9 -25 73
8191G3
$$ Imaginary data points
##PAGE= N=2
##DATA TABLE= (X++(I..I)), XYDATA
0 0 0 0 0 0 0 0 0 0 0 -8 8 -8 8 -16 16 -24 24 -32 40 -48 57 -72 81 -97 117 -135 158 -181 209 -240 273 -312
32 -312 355 -401 453 -511 572 -643 718 -801 892 -990 1099 -1216 1347 -1487 1642 -1808 1993
49 1993 -2194 2419 -2666 2938 -3244 3584 -3969 4406 -4913 5496 -6190 7021 -8044 9336
63 9336 -11030 13357 -16769 22291 -32731 59684 -289763 -556487 -163594 -27396 6069 -121883
75 -121883 -104813 23866 260351 427551 502197 403212 244572 86993 55749 102599 107429
86 107429 -49702 -266301 -419324 -403789 -303950 -229226 -205314 -154658 -65104 49649 124605
97 124605 174134 240748 315155 342038 314211 233013 134506 29341 -76700 -141317 -145183 -153131
109 -153131 -220620 -340027 -400642 -294738 -79794 86122 118831 58016 33815 118704 253320
120 253320 350572 350831 238587 73238 -65296 -109881 -53162 -4302 -72134 -229036 -353248
131 -353248 -328534 -170493 -20483 34201 21041 11996 58631 137183 199362 235982 229357 166995
143 166995 81080 9033 -21917 -27745 -67711 -139680 -187834 -186758 -150322 -123840 -117372 -76159
155 -76159 11153 92027 123678 102364 82800 110085 150056 158327 124474 53604 -22687 -81455
167 -81455 -109907 -88280 -50855 -59364 -115832 -170437 -152048 -45421 63794 101295 75195 36015
179 36015 36069 72671 102993 114878 99181 47322 -17189 -66434 -75111 -43182 -26625 -52129 -87617
192 -87617 -99379 -70375 -24730 2049 23910 53291 69999 64235 35576 14450 33736 64519
204 64519 65191 30250 -24558 -62694 -66066 -51096 -23630 -222 -10633 -44918 -73115 -57457 15739
217 15739 84892 87825 32876 -28209 -35344 17152 68065 78141 42362 -20163 -64903 -69644 -38261
230 -38261 14071 38427 8438 -41107 -67460 -43287 13409 45402 39216 16910 -4455 -10128
242 -10128 -4736 3445 26202 45213 34254 476 -37094 -46800 -18472 13678 28383 20381 -11319
255 -11319 -43346 -53739 -33690 18629 60138 44571 -13730 -64965 -56448 15662 81345 85654
267 85654 31540 -39087 -66015 -31974 26275 68644 56191 -12324 -79244 -92506 -39580 38914
279 38914 66550 21513 -46183 -78210 -42838 28910 73246 70444 32115 -12958 -27204 -7614
291 -7614 24801 48205 33919 -9590 -46003 -57102 -39398 -13095 -4869 -7281 -9599 -14656 -14604 -9613
305 -9613 4086 34340 58448 54863 29595 -2996 -14664 4730 26438 30235 6169 -40755 -74108
318 -74108 -72186 -37438 11612 31812 5095 -37476 -54960 -18843 51809 94555 80513 27620
330 27620 -22390 -26537 9105 42362 46115 8808 -48903 -81817 -73085 -31294 12309 15967 -15058
343 -15058 -41889 -37399 4958 52147 66717 52745 29018 12306 11834 14624 13151 9233 -5395
356 -5395 -25611 -39011 -45371 -39983 -30291 -27163 -18736 -3380 8930 15912 13909 16099 36189 54788
370 54788 53152 30763 -1592 -16498 -9045 -2 141 -13470 -38734 -56589 -56810 -36070 1448
383 1448 24847 18851 -2365 -14790 4432 44371 65576 55758 25541 -5059 -14923 -10187 -3859
396 -3859 721 -8647 -31964 -50828 -54212 -32705 -636 14021 10705 4270 4919 17459 28824 31475
410 31475 33923 33407 23663 7289 -12497 -22017 -16628 -13887 -18308 -25672 -33443 -33230 -25375 -12754 9297
425 9297 28836 30158 17587 1847 4363 28310 45674 39952 14191 -17520 -32115 -27071 -15056
438 -15056 -3105 -4223 -22224 -41088 -44658 -21875 17711 40225 32617 8786 -8232 411 25747
451 25747 42183 41196 21486 -8347 -29000 -33800 -21453 -712 3896 -12494 -33098 -41178 -24974
464 -24974 3720 21762 25667 18836 8590 5391 10038 20244 32264 29507 8983 -15562 -30796
477 -30796 -25150 -7314 622 -4699 -17617 -29523 -27893 -14675 4273 23229 27895 15743 967
490 967 -3529 9726 30042 33957 19205 -4007 -22669 -24485 -15263 -5541 796 -4382 -19185 -28890
504 -28890 -25321 -6257 17764 25771 16958 3835 -3510 3360 16138 23721 24091 13696 -4225 -18072
518 -18072 -21975 -13268 837 2741 -8396 -21764 -26234 -15516 2054 13641 16960 11226 1487
531 1487 -1402 4164 17018 27674 22367 3602 -13722 -19524 -10110 2287 2761 -6124 -18035 -24494
545 -24494 -18133 -5768 6263 13156 9076 516 -1955 3798 15793 23175 17828 7582 -1199 -5566
559 -5566 -4911 -4836 -6777 -7244 -8673 -11982 -13310 -13695 -9343 -1259 4307 8697 10588 8367 6838 6610 9717
576 9717 16050 16040 6721 -6180 -15786 -14428 -4540 1122 -1440 -10787 -20156 -19543 -8385 5153 14925
591 14925 13172 3896 -1319 2410 13125 22100 18340 5452 -7645 -13558 -9026 -1219 628 -3929
605 -3929 -12312 -18230 -15234 -6964 1503 7135 7018 6074 6873 7628 9317 10302 9422 8286 5407 -1270 -7059
622 -7059 -12188 -13612 -8744 -3742 -1840 -4869 -12239 -13563 -4542 8695 19281 18147 7545 -1718
636 -1718 -1955 5904 15431 15313 4129 -10790 -21750 -18865 -5567 4687 4312 -7026 -18406 -15968
650 -15968 -1770 13614 20601 14871 4073 -1914 -377 6828 13542 11590 2062 -10058 -17235 -13866
664 -13866 -5730 -1407 -1894 -6156 -8614 -6232 -1938 3802 9961 13259 13172 8879 2301 209 1967 4104
680 4104 4379 139 -6877 -12784 -15706 -12578 -3492 3374 3705 -1939 -8152 -5325 5625 15995 18525
695 18525 11795 1615 -3538 -2459 2542 6592 3729 -5185 -14546 -18301 -11683 -759 4835 2760
709 2760 -4239 -7853 -2816 5862 12678 14345 10408 4059 -311 -1688 452 3317 1659 -3734 -9833
724 -9833 -12388 -9323 -5098 -1671 147 413 81 251 1071 4614 9468 11369 8874 3359 -1684 -2620
740 -2620 -1040 -248 -810 -3581 -7318 -9479 -9233 -5366 602 3443 2571 -558 -1189 2640 7819 9626
756 9626 7956 3874 -246 -2153 -2413 -1244 324 -1142 -4726 -7704 -8488 -4989 -112 1789 1978 1035
772 1035 596 1566 3009 4721 6842 6444 3283 -716 -3796 -3294 -1033 -203 -1566 -3699 -5577 -5573 -3628
789 -3628 -922 2673 3948 2477 56 -607 2016 5350 5891 3971 436 -2293 -2601 -2060 -1157 -484 -1102
806 -1102 -3111 -4553 -3985 -1512 1686 2610 1861 776 278 1283 1912 2501 2905 2583 808 -1513 -3366
823 -3366 -3113 -504 573 -155 -1794 -3354 -3111 -1415 1023 3009 3384 1521 -642 -1891 -357 3217
839 3217 4409 2408 -1243 -3917 -3440 -1277 837 1822 418 -1986 -3235 -2674 -108 3089 3537 1304
855 1304 -1053 -1952 12 2294 2718 1706 -199 -1933 -2414 -1463 -254 1096 1019 -717 -1899 -2170 -447
872 -447 1240 1484 1139 714 -24 -398 -545 -88 1286 1804 366 -1158 -2382 -1488 113 940 1053 226
890 226 -1201 -1679 -1085 407 2213 2577 932 -1270 -1994 -855 1388 1963 1049 -662 -2140 -1835 -419
907 -419 746 1391 761 -795 -1791 -1336 705 2131 1982 497 -771 -1239 -475 598 827 718 -213 -1371
925 -1371 -1460 -727 48 802 326 -170 -340 -310 322 811 702 749 579 71 -436 -817 -390 250 320 -49 -927
946 -927 -1128 -886 -141 621 1114 922 276 -312 -277 285 1058 1347 482 -440 -1247 -1002 -268 263 432 -2 -1039
967 -1039 -1343 -628 517 983 1094 255 -265 -391 481 921 857 445 113 -645 -812 -501 -312 24 -71 -672
987 -672 -839 -646 -126 667 693 752 650 225 8 43 298 436 446 1 -543 -877 -958 -408 82 -170 -26 -434
1009 -434 -460 -539 199 797 1174 818 -51 -188 -406 257 643 371 -102 -664 -1134 -901 -160 334 521 37 -496
1030 -496 -518 -35 579 1223 972 383 -91 -373 -159 252 460 363 -420 -1146 -1066 -716 132 509 323 5 -646
1051 -646 -484 -11 625 1025 1079 370 -430 -746 -244 447 541 -32 -572 -970 -891 -123 210 499 483 -12 -470
1072 -470 -601 -85 730 1042 656 86 -239 -585 -266 283 263 401 -402 -1038 -979 -191 232 963 446 -71 -642
1093 -642 -420 138 542 839 695 -22 -1090 -812 -290 656 1139 54 -859 -889 -807 255 1047 855 119 -535
1113 -535 -924 -426 379 1001 996 19 -803 -859 -242 846 854 325 -98 -374 -477 -80 272 604 611 -248 -581 -407
1135 -407 -108 125 323 271 95 -171 -279 -82 189 578 760 230 -460 -459 -324 424 782 657 -7 -534 -941
1156 -941 -637 308 606 861 -138 -760 -754 -108 805 1237 376 -436 -678 -651 147 661 382 -16 -619 -1070 -528
1177 -528 96 767 768 4 -352 -163 301 695 622 375 87 12 -248 59 5 145 -43 -145 -611 -458 -225 102
1199 102 211 524 564 180 -27 -34 33 540 704 500 -288 -680 -788 -345 293 380 -104 -567 -796 -531 90 796
1221 796 1102 504 -119 -483 -27 562 811 318 -297 -597 -806 -320 -238 164 26 -372 -456 -519 315 810 988
1242 988 603 313 108 246 203 334 336 231 -306 -658 -900 -790 -392 170 -30 -59 -562 -506 -143 848 852 843 647
1265 647 -206 -231 128 248 684 167 -643 -1030 -883 -508 -14 464 359 -227 -298 -67 255 985 1280 791 -128
1286 -128 -477 -320 186 382 173 -182 -570 -1148 -813 -404 93 666 321 -247 -338 129 816 1137 1028 63
1306 63 -70 -562 -328 231 171 256 -648 -873 -1100 -300 373 900 590 -129 -278 -97 621 935 744 609 -144
1327 -144 -545 -568 -406 40 120 -346 -637 -881 -315 25 313 507 560 326 115 57 198 405 750 618 -575
1348 -575 -759 -869 -497 -123 336 57 -426 -715 -660 223 1030 1345 567 -293 -479 -31 733 723 400 -472 -907
1369 -907 -1273 -683 -63 242 146 -332 -787 -293 254 994 933 395 334 287 297 425 143 -156 -168 -519 -673 -702
1391 -702 -684 -163 89 -65 223 235 150 205 254 597 976 882 71 -529 -462 -70 278 -33 -471 -900 -1062 -736
1413 -736 -6 431 601 429 -271 -239 358 1111 1133 332 -273 -198 -297 -41 -123 -99 -331 -794 -890 -960 -212 245 315
1436 315 287 151 169 569 548 566 487 552 338 -187 -451 -550 -178 16 -136 -708 -593 -521 -115 294 470 758 754
1459 754 29 28 -17 547 1127 142 -380 -850 -648 -399 -250 -415 -217 -562 -652 -489 81 795 868 545 116 -34
1481 -34 363 594 669 362 -56 -388 -528 -442 -162 -140 31 -451 -673 -431 245 555 480 377 475 128 -26 135
1503 135 246 375 268 -240 -770 -639 -293 20 185 -123 -339 -216 -55 231 294 288 442 252 -237 61 303
1524 303 427 252 -282 -649 -562 -335 -194 -124 -53 -2 -79 -415 -257 238 585 528 117 123 -137 17 220 399 75
1547 75 -213 -312 -582 -597 -86 315 213 -132 -234 -13 -18 475 526 199 4 -63 -280 -52 457 222 -179 -600
1569 -600 -526 -177 15 379 243 -241 -106 -18 24 321 271 321 222 -95 -204 10 289 21 -32 -227 -244 -233 -245
1592 -245 -135 -101 55 198 -250 -238 -194 259 405 468 207 -238 -307 -162 -116 267 264 -180 -256 -365 53 175 590
1615 590 88 -103 -102 33 337 233 353 -10 -17 -203 -109 6 179 130 -85 -17 -333 37 213 197 247 36 -220
1638 -220 76 -157 113 82 41 166 -395 -214 -126 -24 77 58 -181 -249 -23 -271 88 166 25 -5 91 -399 -106
1661 -106 196 251 -6 284 -186 -103 19 232 429 58 49 -203 -274 147 108 299 37 -239 -66 -367 9 -17
1683 -17 115 39 -35 -107 -68 -85 417 215 136 -49 -313 9 224 215 -76 -28 -250 -250 -249 132 306 301 71 -181 -33
1708 -33 251 357 405 75 -107 -30 -96 -53 121 187 57 -29 -309 -182 -60 -70 76 46 -125 -123 -118 87 230 153 -81
1733 -81 -278 -274 -117 106 372 314 -82 -470 -213 -174 -76 156 46 -187 -135 14 -28 288 283 180 -91 -94 -2 165
1757 165 323 101 -134 -264 -28 -274 -153 134 224 -79 -90 -133 -60 12 143 205 7 -119 -173 -122 -6 38 98
1780 98 -216 -303 -307 -68 283 166 242 92 24 28 -37 125 242 221 29 -270 -285 144 183 9 -60 -310 -293 -269 -46
1805 -46 -185 111 258 82 -151 -60 187 240 90 133 -12 -213 -114 -184 8 73 -75 -382 -283 -127 -47 124 216
1828 216 21 -212 56 123 63 242 68 108 12 -222 -194 126 -15 -125 -218 -285 -102 32 199 440 226 164 107
1851 107 -108 -95 55 5 86 -217 -417 -345 65 182 143 -72 -294 -93 -37 -106 288 435 509 277 146 95 193
1874 193 2 -43 140 -194 -436 -196 -179 54 55 72 -241 -269 -79 399 626 294 326 -24 207 -175 109 129 -9
1897 -9 -291 -306 -478 -229 130 1 -138 -150 -250 134 280 146 202 293 151 17 83 -113 73 50 69 -83 -334
1920 -334 -334 -244 16 94 133 115 41 -60 170 393 477 457 135 -192 -89 59 172 166 -197 -253 -345 -378 48 180 312
1945 312 45 -179 -34 204 396 617 428 -96 -202 271 117 110 -172 -82 -254 -302 -465 -332 -31 192 280 -46
1967 -46 57 235 187 -29 170 117 208 27 -96 -400 -28 -40 -9 -168 -330 -252 -334 -67 202 267 116 -41 34
1990 34 150 393 201 290 -146 -353 -314 66 295 15 -26 -186 -228 -117 70 289 236 16 -60 69 -37 190
2012 190 116 119 60 -194 -227 -162 42 13 -31 -129 85 -3 -13 87 135 65 102 9 -108 -146 45 101 322 -202 -74 -88
2038 -88 -274 -39 244 78 268 -75 -286 115 39 194 230 -43 -117 23 -15 326 322 228 -41 -116 -284 -65 101
2061 101 162 -163 -100 -214 -146 -121 -40 140 -103 -163 -145 -77 -146 -104 195 -81 -6 -175 -137 -208 -54 134 -79 -81 -364
2086 -364 -21 40 214 133 136 -64 -47 -77 7 413 7 231 -105 -201 -150 346 -124 30 -158 -125 -109 -241 -139 177
2110 177 8 -328 36 -20 -205 180 -18 -33 129 35 6 -131 119 -194 -67 193 -12 -238 -307 100 109 -71
2132 -71 -101 124 66 -89 -35 405 205 171 64 -218 -15 103 217 180 -233 -242 -82 -28 41 -102 157 -76 -82 -42
2156 -42 150 273 206 -263 106 1 -28 284 -26 -15 -67 31 -154 -30 77 -77 165 144 188 -6 -119 316 -137
2179 -137 199 -32 42 57 -285 -64 -116 20 -44 -109 -194 -7 -62 146 223 43 139 59 207 193 312 82 -168 -214
2203 -214 -145 -76 80 -34 -106 -141 -235 51 218 114 23 265 162 19 185 198 232 33 -176 -288 -276 -54 -336
2226 -336 -1 -230 -280 158 -8 -26 -164 502 224 81 168 -105 -5 -174 -79 251 26 -124 -189 -319 -12 -21
2248 -21 235 -31 -120 -247 -5 63 348 231 131 42 -147 63 -54 -41 -121 -97 -356 -250 -53 120 -168 -66
2270 -66 -178 31 -43 130 66 187 226 194 -118 -220 -29 -159 1 -219 -160 5 -211 -71 -148 -197 -123 196 1
2293 1 -193 62 208 315 143 59 -104 -199 117 -209 9 35 54 -86 -95 58 215 63 -30 143 -100 101 149
2316 149 60 9 276 -19 86 -9 -173 -30 57 -156 -257 -30 -74 -12 -88 -3 11 -228 29 -47 -135 109 200 -124
2340 -124 161 -28 -110 -73 152 6 54 -175 -162 -182 -163 92 260 -38 -130 -179 -44 4 59 98 140 -100 31 -48
2364 -48 -111 120 11 -37 -198 -83 -39 -86 -106 -79 139 -102 -10 -217 -21 86 111 -164 -33 -136 106 93 40 -27
2388 -27 -14 148 -181 55 -20 63 161 -93 -65 -110 -28 38 178 188 119 7 40 59 309 177 114 111 -71 -34 233 18
2414 18 53 13 -65 -39 105 184 109 226 -51 43 -109 -43 113 140 -108 114 -20 68 -194 -97 98 101 321 -62 71
2439 71 -143 11 98 139 90 -20 -36 -115 116 -51 -13 -129 -30 -131 -38 -137 98 150 29 48 -121 14 27 -1 188
2464 188 89 -82 -317 -209 216 131 26 15 10 -222 -75 178 63 -74 -71 -2 127 199 197 -88 146 -129 -117 -71
2488 -71 -119 -88 -128 -101 -160 -73 -33 70 26 40 287 84 169 134 -123 -205 -91 -33 53 28 -16 -162 22 -54 -69 -285
2514 -285 -180 -134 52 82 16 193 -4 -54 48 109 17 99 0 -22 -128 -116 -153 -75 -92 -72 -118 223 25 -107 119
2539 119 -74 31 -155 95 -45 2 8 -184 -132 116 42 -58 -174 -23 71 -35 -69 -155 67 -273 228 130 206
2562 206 130 85 0 -41 -40 -157 -163 -141 -204 55 139 -1 -95 -36 -206 -14 93 125 76 142 -6 -167 10 41 21 -178
2588 -178 84 -118 -33 -197 -94 -207 -62 220 186 -30 -22 -21 -66 147 38 -41 -21 -42 7 -29 -63 -35 -115 176 -40
2613 -40 119 74 -146 18 35 134 74 70 -41 -159 154 46 -95 -167 -53 122 -93 -93 4 -108 -3 152 -120 -13
2637 -13 143 -126 141 89 242 82 -22 67 -18 113 99 -7 149 -45 119 164 -4 -16 40 -108 197 -29 -147
2660 -147 -14 -10 6 -233 -16 -3 -361 -78 -87 47 46 -325 63 -31 95 -155 58 190 326 -140 89 2 92 314
2684 314 253 244 -138 19 182 114 50 -63 -85 71 -118 5 -27 -72 58 66 113 35 -44 -67 -30 108 71 92 96 72 -63
2711 -63 7 46 146 -154 -203 -32 -16 5 6 25 308 -108 -30 140 52 49 79 -60 -145 -103 -64 189 -86 155 53 -53
2737 -53 -266 131 268 131 172 4 286 25 -111 12 -201 56 -61 -65 -116 -34 30 -57 64 -55 102 129 62
2760 62 29 128 42 3 142 -95 -28 149 52 147 -199 -65 42 35 18 134 -35 55 -90 24 -3 88 2 -23 48 59
2786 59 -82 -108 67 146 18 -386 94 35 -85 23 -186 12 -56 108 -115 152 153 18 -189 -54 -9 6 -6
2809 -6 -177 -213 54 -242 -70 -109 -82 178 98 41 -58 52 -77 161 50 55 100 -82 -28 73 -120 111 115 50 -148
2834 -148 127 106 -135 89 -118 65 -186 -80 -70 81 197 45 15 20 23 76 59 99 140 -56 -117 -166 41 -17 59
2859 59 253 -100 -20 136 -65 50 -226 -161 158 15 -157 37 -116 -26 87 -40 -24 -96 -171 118 -200 75
2881 75 38 -63 32 -102 194 37 -41 -173 -204 -229 -48 -51 -59 89 -65 118 116 207 -68 123 -9 -2 -8 -6 74 -54 -56
2908 -56 37 -108 -9 -127 6 6 -4 79 -149 -123 -138 168 112 3 55 -4 103 -9 41 -7 -74 -225 -44 -15 47 -40
2934 -40 22 -83 -119 139 -27 -223 -45 148 126 67 62 150 86 -89 -65 -115 -101 163 -11 78 117 146 127 175 190 -8
2960 -8 252 103 55 12 -114 31 -115 275 20 -6 -131 28 -29 105 -93 -18 13 -59 176 -90 216 28 -95
2983 -95 -80 51 -119 -146 98 55 154 -51 79 -107 -77 95 60 -6 -62 10 43 -190 38 -72 -179 58 -165 -88
3007 -88 45 -29 25 130 120 -62 246 179 -44 76 -296 231 -32 86 -202 127 69 168 105 -19 -30 -80 -99 -21
3031 -21 8 -108 216 144 -76 1 95 -170 59 -92 -229 -25 22 -4 -93 -114 89 16 115 185 -29 -66 49 63 -13
3056 -13 185 0 -171 -236 -181 17 -48 -22 4 -27 -8 -25 7 -83 -100 -39 69 193 149 -91 -26 62 -70 30 -87
3081 -87 129 35 112 -44 -33 177 99 132 55 -12 78 184 32 -34 37 12 -4 230 -27 -209 -198 -154 -12 24 121 -66
3107 -66 208 -163 -29 123 219 0 250 -125 17 -64 81 -206 161 0 -33 50 -124 222 -13 -197 -116 71
3129 71 20 192 56 142 117 -1 117 45 -9 -132 -196 159 41 -108 -182 -239 -244 25 -217 20 -190 -27 106 237
3153 237 -14 136 203 45 -10 -123 -33 140 165 -22 87 -101 -123 -39 15 -36 -54 11 44 -254 -98 -31 -105 -57 -82
3178 -82 -222 -44 -26 57 -26 -116 -57 77 9 103 -101 -87 -209 -153 -86 -102 -126 243 157 -118 -182 -141 -17 242 50
3203 50 -99 -98 -165 252 6 151 63 -47 -203 1 -35 17 -118 -74 -188 -112 -127 -101 -93 -199 -18 -57 -42 31 3 -142
3229 -142 -27 -12 122 100 -64 -73 264 -34 -17 -216 178 -136 -291 -121 80 -185 -235 162 -71 -129 154 114 69
3252 69 -34 -8 29 166 48 18 10 -174 -67 -70 -63 134 -141 -37 -41 57 62 68 -75 -113 62 11 223 -41 4 109 6
3279 6 -136 -59 -182 -45 -6 -28 -48 -211 -177 -76 -145 -68 187 10 95 -79 -193 147 98 127 100 63 64 -53 -98 -5
3305 -5 -62 54 -206 63 -114 134 136 112 -31 8 -104 158 61 -117 -36 -176 -39 -106 -21 28 -106 90 -101 -282
3329 -282 -63 -32 -76 -50 -90 -114 190 179 186 -33 68 9 127 -14 169 -181 -52 57 -39 -182 174 4 79 282
3353 282 37 30 32 -13 1 -22 32 -1 -154 -276 -247 -47 -182 19 -168 138 19 -39 138 -51 -15 201 80 46
3377 46 81 -23 47 59 -88 83 -82 -173 -69 -9 -84 -15 -209 56 179 -64 113 -200 27 -155 -7 -12 128
3400 128 -116 -242 -127 -61 -50 79 22 118 62 -25 -117 -64 240 -70 71 -109 112 286 85 113 -380 -113 65
3423 65 -148 -120 96 -29 -366 -51 4 37 -69 102 -120 -32 118 37 95 82 -104 98 -32 237 206 -148 -12
3446 -12 -211 -3 49 185 -67 -63 -6 -119 183 81 118 -82 152 -13 -119 -47 -65 -62 -134 -110 -89 -17 -205 -4 -103
3471 -103 3 150 178 45 -152 -120 124 220 133 197 -18 -34 -21 -134 -52 -187 -71 -32 -65 66 61 -63 -68 -28 -7
3496 -7 -97 128 61 -143 4 11 151 -36 -173 19 -146 -52 -116 167 -76 89 -137 -51 -36 -1 27 -7 258 212 21
3521 21 3 49 -34 -281 -121 249 72 25 10 165 17 7 120 49 182 132 103 18 20 123 77 24 -3 -16 -219 -113
3547 -113 82 35 61 -138 25 -57 -118 -45 63 -70 -33 49 194 -114 89 59 -193 72 -38 37 -105 140 33
3570 33 -11 -105 -100 -29 75 45 -71 -9 -47 214 65 51 -14 92 -38 -128 37 56 -72 -43 69 -140 -13 119 39
3595 39 35 -116 36 34 81 -207 35 37 -69 23 -80 138 -100 3 167 -206 -176 16 -54 -89 -69 90 19 -31 13
3620 13 -79 148 142 -183 -134 -1 6 -5 49 -25 36 156 -239 80 91 -36 13 -57 122 -39 181 -25 -74 -97 30
3645 30 -13 13 -49 142 -97 15 -39 93 25 -122 -293 -104 71 -159 109 113 171 83 66 -46 -77 84 226 23
3669 23 -259 43 -70 34 -38 -9 -6 -153 -9 -44 101 117 79 -88 38 1 235 -87 -167 100 -26 -83 -14 -63
3693 -63 -13 -101 -112 46 16 23 -71 61 46 -88 -46 -128 66 -69 -110 -17 -46 65 151 57 121 108 -143 88 35 -230
3719 -230 121 44 66 4 148 -181 82 96 95 -70 -156 106 252 -262 53 7 46 26 31 -152 66 104 -11 -61 -70
3744 -70 91 140 90 324 55 -162 -63 -431 -89 149 89 165 -2 -17 -176 13 44 58 183 -18 -46 -90 -71 154
3768 154 94 -238 -93 -6 -160 -164 -185 -224 55 -73 -201 -206 54 -18 178 59 193 -31 294 54 -65 211 93
3791 93 -40 23 108 -9 154 272 8 -85 228 -106 -78 -174 5 -23 127 -39 169 152 -31 -5 -113 -106 -41 46
3815 46 -139 13 19 -166 -51 148 -156 -91 212 -194 68 121 -73 167 -28 57 25 308 3 -85 -125 -146 18
3838 18 8 -96 24 69 91 -40 -2 -65 161 -121 94 -95 -94 69 -94 -249 -14 48 -28 -159 99 -16 -69 -73
3862 -73 -29 36 105 -81 -57 267 23 144 74 43 28 136 -200 119 121 -134 -21 -64 110 -126 6 23 -108 32
3886 32 -112 98 89 15 -47 92 -11 -95 -97 -84 -23 -33 80 18 -70 48 -168 -78 126 28 -69 -327 -22 204 -1
3911 -1 -142 71 19 101 -1 144 -198 -86 -10 -228 153 -62 -63 -110 -70 -78 -29 120 -220 111 59 65 -82 -223 60
3936 60 -298 -169 -202 -26 35 -6 94 -76 8 113 52 71 -20 44 22 26 78 -93 130 11 -74 9 -285 43 37 -58
3962 -58 -105 176 293 -103 52 -67 -110 -49 -97 122 95 -29 28 4 -8 -49 -162 62 137 97 -136 130 -27 -174
3986 -174 37 -42 -219 -105 88 24 -63 -101 -35 -78 69 79 -22 -24 -40 41 -87 -115 9 -1 194 -35 -187 -159 52
4011 52 94 -68 -6 250 -40 43 -22 50 61 -109 7 4 93 -123 -101 -188 -37 154 74 211 -205 65 143 -253 -20
4036 -20 21 130 -34 -71 25 76 187 -248 123 -53 14 150 -153 -214 -141 1 -85 178 92 -89 68 1 -99 160
4060 160 79 214 76 -159 -144 39 17 -188 -85 -35 17 -49 -22 56 -115 -26 16 -36 -42 15 -208 41 104 89 -128
4085 -128 82 -125 -63 -146 107 39 66 -16 24 119 115 100 -189 100 121 -89 -132 156 144 109 -87 -178 110 -91 -90 60
4111 60 -149 -120 201 23 -341 -152 124 71 18 122 -86 -73 -10 111 32 -77 167 -55 74 225 -141 -204 -79
4134 -79 -87 -4 93 -144 7 -120 -118 112 194 152 -120 0 111 71 89 31 -201 -30 39 116 10 -73 69 -107 -26
4159 -26 102 127 -1 -128 33 80 -55 -114 272 55 -128 -58 -309 138 78 85 -21 26 127 107 -94 154 119 -49
4183 -49 40 -96 -62 -103 -113 -49 39 21 -9 -31 -88 97 105 -62 22 136 -73 104 -14 -104 -32 12 -44 -34 17 186 -223
4210 -223 47 -141 78 90 -58 72 -60 22 170 20 27 392 -84 164 23 -137 -210 -37 247 -111 83 114
4232 114 -91 70 41 137 -69 -17 123 -158 -146 -19 -114 -255 122 10 -150 42 -39 -82 39 95 135 48 74 4
4256 4 -120 -77 -138 -204 58 -68 -14 118 -50 5 210 36 263 68 40 -72 -145 82 89 -71 -30 17 3 -62 -97
4281 -97 27 26 -50 -5 -127 -43 -92 -222 6 -33 93 -68 -237 59 -37 -191 -274 40 92 -133 -111 -117 -202 -88 -70
4306 -70 -192 53 -38 -3 -18 -305 24 -26 85 -88 -86 300 -101 84 -181 -126 157 21 118 -20 -41 -55 39 -31
4330 -31 -43 -61 15 6 13 35 -63 108 73 -118 206 124 -11 -9 28 -103 179 50 -84 143 54 -154 -67 -91 129 -29
4356 -29 -130 41 121 307 75 -37 32 25 74 258 158 -75 60 58 -206 82 -183 -67 74 -77 -33 143 95
4379 95 -210 67 -58 92 15 76 -144 17 -17 -122 19 -227 82 178 15 -36 76 138 298 83 -111 -8
4401 -8 15 -250 49 77 -186 -194 -113 -101 71 -127 -53 -29 20 91 -80 98 -104 145 -24 -173 -129 -323 263 -23
4425 -23 -5 19 -13 47 -90 4 -37 -116 -40 17 -21 60 -45 -63 -5 39 -99 -73 -64 40 -218 45 212 -167 91 26
4451 26 -52 121 156 23 11 -163 -149 -155 78 197 -130 42 64 -177 35 -124 -57 83 2 80 -11 -63 -16 114 -129
4476 -129 118 -2 73 61 97 237 67 -156 -207 15 -132 102 178 97 -184 -63 29 -25 -80 35 95 -45 -93 -135
4500 -135 -3 77 -132 39 27 -193 18 -140 195 165 72 -119 41 77 147 -24 85 -11 190 31 134 14
4522 14 110 -292 101 19 -91 83 -50 -277 148 162 2 -65 -131 -19 -72 -37 13 -164 -37 -72 116 292 69
4545 69 -10 120 177 41 -163 -2 -3 148 -79 -23 -173 -208 145 -208 96 -245 174 -25 65 166 -54 -142 84
4568 84 24 -43 -121 -86 91 27 -43 -169 123 -194 -189 -160 -165 12 23 -57 116 -115 177 -132 32 97 101 -42 28 -18
4594 -18 -152 -194 -45 -66 215 -143 -98 9 -27 -92 197 -61 -95 23 209 27 35 -79 204 186 41 -79 147
4617 147 2 -32 -19 -125 61 -138 -50 -71 89 -99 -21 -156 83 -40 11 46 61 -214 64 -12 -183 -105 -26 5
4641 5 -24 130 61 -8 -69 129 -134 -78 -31 24 -45 -95 -98 -114 21 99 39 -32 3 -67 -205 -18 -1 -6 -11 -80 24 -11 -36
4670 -36 -131 -182 83 -60 10 -33 -104 -40 -81 94 -48 -24 -37 55 171 196 186 80 -37 123 -109 297 -53 98
4694 98 -111 65 22 92 -29 137 32 -100 152 28 -52 -21 66 -34 -112 152 45 91 -115 165 -70 -109 98
4717 98 -75 58 56 28 119 20 48 -60 -23 -18 -116 -138 -26 -48 -138 17 111 111 -71 39 -59 53 -101 -50 89 -45
4743 -45 -112 -71 -191 49 118 -188 -69 94 -60 -244 -118 81 101 22 114 -138 112 300 -154 -186 133 34 16
4766 16 83 -112 -113 -102 14 -112 -178 18 -68 24 -198 -61 -155 79 49 -15 77 -77 3 -144 -1 -23 -105 93 -103
4791 -103 301 65 225 -197 -10 -139 -185 -5 -54 -37 -215 -50 51 103 -58 -79 -76 212 -116 64 -137 8
4813 8 69 -8 -56 -8 83 73 26 -29 -91 231 181 -232 -81 209 -101 -117 49 43 -203 -3 -223 -179 -62 160 38
4838 38 -50 -77 -57 161 -93 -59 23 18 -54 37 173 -133 -190 -95 -9 -88 36 120 -80 71 147 75 23 -77 -3 13 -252
4865 -252 -144 -1 121 4 -246 49 39 12 121 -146 81 114 -328 97 279 -13 169 -221 -116 114 -238
4886 -238 -95 -87 -10 275 107 73 10 -136 -46 34 6 -122 150 63 -21 56 210 106 116 -93 -144 -95 -129 92 -130
4911 -130 53 106 -229 -72 -52 39 -75 -28 88 52 -122 90 -50 -154 272 3 39 8 -41 65 -63 62 -14
4934 -14 32 102 -53 -80 22 139 75 8 -27 -92 -2 -66 -122 15 -66 -3 234 45 -51 122 36 75 -81 -132 67 135
4960 135 127 169 -23 105 -16 30 -39 38 -307 -35 62 43 -64 124 -58 96 -216 44 34 246 -19 14 -61 164
4984 164 53 -126 76 146 79 101 47 104 -39 -101 88 -108 -81 -40 53 88 26 -121 133 78 -157 -167 135 -160
5008 -160 17 81 194 71 17 -99 101 -29 206 -78 50 -90 -132 -36 -8 33 -66 -73 165 150 78 160 210 117 37
5033 37 165 17 -4 -167 -71 -150 -9 -92 -70 81 -128 -225 -105 -51 145 -56 142 -46 -80 3 19 -55 -99 20
5057 20 73 -179 106 -220 113 45 -16 -18 85 157 50 48 -72 -34 72 -146 234 -37 -185 34 -55 -204 59 30
5081 30 -20 151 52 122 -153 136 109 122 -12 -24 262 -16 -95 -46 140 78 92 -184 188 22 117 54 139 227 110
5106 110 40 104 65 110 86 -23 258 -54 -48 7 -88 2 82 -44 -252 -130 35 124 19 -66 121 102 -7 -190 93
5131 93 -29 -136 176 230 -119 -37 -47 308 -165 -162 -145 -106 -328 146 77 -109 -29 -148 5 15 301 -259 145 -69
5155 -69 -22 -148 11 80 -17 56 142 -1 -141 65 -229 -3 -39 42 111 -187 -12 -44 -295 -95 -29 40 -84 138
5179 138 -28 64 135 -42 8 163 -10 39 -157 -133 179 51 -94 -6 55 -57 84 -154 82 74 100 -48 -208
5202 -208 113 48 34 -42 -133 33 -30 -148 190 -97 -41 -91 -31 -81 -185 -44 17 0 -51 -134 25 -17 12 161 31
5227 31 -7 -198 -66 -82 -209 163 1 -105 -74 -145 111 -111 45 -69 -22 234 -40 61 -62 69 -14 -100 41
5250 41 139 11 -183 -20 40 94 -146 136 -63 97 47 -124 -96 -172 35 -38 13 -160 81 -75 23 51 -117 -214
5274 -214 -59 -118 -72 -57 -9 -45 119 105 -41 150 132 -93 -128 10 -91 -87 -60 57 69 60 52 -74 110 0 7 -53
5300 -53 -194 -2 120 102 -44 43 -42 -136 -68 -165 79 -118 -191 -155 -98 30 224 46 61 -302 -42 39 240 143
5324 143 -85 359 -49 -51 -98 -105 -296 42 238 60 -25 100 22 133 133 -170 -224 140 236 26 -45 -30 -69 124 -117
5349 -117 -154 24 -34 -223 77 173 -141 -158 66 87 -104 -130 91 -205 132 202 10 -15 -42 67 120 37 249 -12
5373 -12 102 -110 -161 -96 -219 134 -252 -196 -183 -118 39 27 -12 -225 -22 8 -121 -190 -86 -64 -95 131 -206 -30
5397 -30 -87 -83 90 66 -44 -50 -67 8 20 120 -49 20 -10 -118 -155 75 -54 -173 -78 34 -62 91 102 37 112 -127
5423 -127 37 -25 12 -221 45 -232 -106 -133 50 65 8 76 -123 66 7 -300 80 -49 -63 -164 -123 -48 -179
5446 -179 78 41 -108 -27 -91 201 -41 -202 -93 -48 154 32 -213 68 -117 131 107 132 36 -72 62 35 -23
5469 -23 -96 -209 78 -77 130 -129 76 -138 -135 -86 226 -132 12 -110 -70 194 169 49 -27 -115 -113 -28 105 -99
5493 -99 -45 72 -64 -219 104 63 263 125 145 16 -116 109 -9 254 91 75 -45 132 -166 -74 -65 -104 151
5516 151 13 -225 -50 -37 159 18 66 109 136 -8 -34 -22 114 25 65 -184 7 207 95 -67 -280 16 51
5539 51 86 -200 -49 -72 -4 78 -65 -20 -131 -77 189 11 155 -55 -43 -8 -32 -125 198 -95 -26 -50 40 -42 -133
5564 -133 -153 -98 -63 74 -83 23 -143 -228 8 -143 -136 -77 160 -329 19 -237 -80 185 -52 53 -197 124
5586 124 110 -121 -69 -72 -79 -52 181 -33 94 116 -21 -68 108 98 -76 -4 32 -146 157 -27 47 50 142 -27 4 76
5612 76 142 53 4 195 -203 -15 41 19 39 -87 -9 204 -59 60 79 39 -30 -206 -52 -164 28 -101 4 69
5636 69 68 -225 29 75 -2 -234 -180 66 101 -153 -11 -176 -170 -121 93 -169 -120 -98 57 171 -46 85 -130 0
5660 0 125 -143 -51 -13 -38 -138 -31 -44 152 -49 -18 -7 -74 -82 86 161 -72 -142 -1 88 32 -3 -174 -49 122
5685 122 51 -28 -76 -127 -35 -121 2 26 174 40 -22 44 -67 -56 -49 -78 -23 124 -77 -112 -83 -56 -25 -106 113 -139
5711 -139 -57 -33 13 -185 162 12 204 -21 53 -7 88 56 144 64 43 129 107 -133 -35 83 133 -244 -150 6 58
5736 58 84 13 154 110 -282 -2 -122 5 -162 -92 102 50 -91 -3 72 79 -55 178 66 133 193 51 132 55 -153
5761 -153 -220 140 25 -140 -139 16 -64 114 -82 -213 -43 -13 -72 234 -43 -13 -9 -117 -102 -1 -56 -259 105 -225
5785 -225 166 -90 -14 49 100 -68 45 3 -3 -60 22 -124 49 73 -39 -100 -116 -79 -267 -155 -161 95 130 26 -7
5810 -7 -115 -268 -31 -138 25 -20 -6 106 0 -158 8 -82 43 67 -96 -51 101 -27 32 57 94 124 111 150
5834 150 -131 85 -185 174 56 70 143 151 31 91 17 40 -65 -70 -182 -40 122 193 35 -143 54 -123 -67 1
5858 1 -138 76 -166 -71 131 54 -14 -121 -23 35 -1 82 147 123 -118 45 135 64 -104 164 -151 -75 -97 -63 -52 -40
5884 -40 81 -61 65 -138 83 64 -169 -62 173 46 -39 -153 -76 -160 -230 177 123 220 62 -199 2 139 29
5907 29 -33 -4 -65 69 28 -118 -25 -138 28 137 32 64 178 -44 45 53 69 12 40 57 84 91 -28 -36 175 -25
5933 -25 -8 -86 5 201 24 -26 -119 -123 -123 -65 -256 69 4 -118 -198 -326 147 2 -2 42 228 -223 -32 -13 -5 226
5959 226 -79 119 99 -106 -39 47 26 15 169 -3 108 88 -123 -27 123 125 55 196 -21 174 73 23 -93 48
5983 48 5 17 53 -179 -5 62 -16 224 47 -70 34 21 -1 48 -189 -142 9 138 -6 0 -22 -123 -108 6 -61
6008 -61 -88 5 114 21 79 -271 -24 34 -35 -133 43 89 74 84 99 -66 106 80 -63 65 89 35 66 -56 -153 -49
6034 -49 -67 7 -124 84 14 -158 48 128 109 59 70 21 258 60 -161 195 -54 -58 14 93 -75 31 76 100 -44
6059 -44 259 50 18 27 60 -24 -36 -57 266 -61 217 111 101 54 -102 126 15 -201 209 -114 -148 -178 31 229
6083 229 54 -131 -40 117 14 -69 -124 112 -134 -60 64 107 -51 45 9 -147 -78 50 -74 27 47 74 -36
6106 -36 -48 71 55 -174 -18 62 57 173 -3 45 -21 -197 32 -20 -139 -109 40 20 -50 -186 32 -135 29 -103
6130 -103 22 -85 26 -50 -56 -13 -142 156 110 5 28 -120 169 -207 -1 261 0 -142 -16 86 -114 -110 -255
6153 -255 85 91 0 77 -35 -169 -186 19 -48 18 -90 11 -59 -157 -48 -16 -120 -129 -206 114 25 55 2 33 58 28
6179 28 -5 13 81 -132 -73 -49 251 65 110 191 64 42 -158 -121 31 16 -22 136 -40 193 -24 -133 -215 12
6203 12 14 52 -106 -65 -152 -86 -12 14 -27 49 31 30 101 -220 55 -77 -349 -63 -118 79 -95 48 118 -79 -6 28
6229 28 -149 -247 -6 -17 -127 -58 166 90 -110 -202 141 143 -289 200 15 -33 31 -203 9 -99 36 -25 -46 -81
6253 -81 -167 84 -34 128 -48 -2 -44 -45 -19 85 29 -136 94 69 -125 -41 70 -87 157 -31 -67 35 44 134 101
6278 101 164 -165 -48 21 -176 -55 -6 21 123 -10 130 -136 153 -69 -27 -17 -145 238 -50 -185 -33 -155
6300 -155 -63 142 158 178 -71 -89 60 130 51 -146 -151 -125 11 238 2 77 -61 -8 -57 116 0 -21 -251 -18
6324 -18 -70 88 -35 153 -118 85 18 -63 350 -110 -34 -36 27 -275 -50 211 -168 149 -185 5 134 -57 -113
6347 -113 -137 261 46 122 -35 -88 -32 38 109 -145 -98 -120 -61 198 -52 -74 -104 -10 140 6 5 -92 -46 -215 168
6372 168 147 87 -63 20 195 -194 -78 -116 25 122 -39 49 -24 -112 145 9 25 -72 27 46 -49 31 -89 118 72
6397 72 -12 -5 -33 -78 -128 -97 -216 50 -70 -231 89 47 -31 -88 40 -63 -39 5 -37 34 -104 75 -4 -59 -123 -88
6423 -88 204 -93 74 -246 182 -1 216 19 97 -281 25 92 222 153 -23 -90 214 450 65 -15 -48 -6 41
6446 41 -33 160 -163 -114 -16 175 127 135 66 -44 -80 -172 -43 -180 -47 96 -181 -51 -22 91 64 -58 -55 -145 220
6471 220 190 -129 128 42 160 -52 -155 232 -42 -16 112 -163 62 174 173 -1 -61 115 -56 -10 -79 44 -72
6494 -72 46 38 -67 -47 93 -161 152 -207 29 281 10 -164 27 -113 139 -34 -196 48 64 4 34 -302
6516 -302 -20 -27 56 47 -161 -74 11 138 -11 19 98 -58 -73 -16 -118 -57 101 -197 -45 -223 23 -159 29 1
6540 1 -96 -52 -215 -67 109 -7 10 69 144 -201 -81 -19 68 42 -63 39 -24 -3 8 -37 194 -96 -145 -76 -119 -94
6566 -94 220 97 75 -47 -25 79 -82 -43 -186 11 186 -217 34 -34 37 -82 162 -114 -59 -95 -277 -141 30
6589 30 -79 -211 68 -15 -116 43 -158 -162 -49 48 78 53 22 -115 -4 -14 -61 -224 95 -50 103 100 100 142 -35
6614 -35 174 -42 93 1 -106 -307 5 -153 -88 -68 -59 -77 111 -136 62 42 118 -113 1 -119 -139 -148 -142 -41 91
6639 91 104 -36 -64 77 -98 -105 -216 6 -2 -191 200 -13 59 16 128 185 52 58 -174 178 247 -140 -46 -23 74
6664 74 -31 100 -138 216 -141 132 164 -90 -113 118 11 -88 -226 -30 277 -17 136 -5 11 53 23 -17 76
6687 76 80 45 -24 226 33 28 -24 -268 25 -103 7 170 32 -136 130 -72 -215 -61 198 63 -53 -142 74
6710 74 -174 -41 97 -246 -21 -25 -179 55 -40 -214 -103 -38 87 -89 -40 -160 -85 -185 -78 -311 -232 -61 -194
6733 -194 -16 2 182 67 -146 56 66 23 -150 26 -167 116 53 23 136 -48 21 40 2 -213 -63 51 81
6756 81 -60 169 25 -110 -121 -82 49 -79 -110 105 -9 -8 -100 105 174 -137 144 -339 -102 57 159 -16 0
6779 0 -85 113 88 -63 -73 165 72 -129 18 -39 -247 -197 -89 -85 -133 -47 -35 43 144 -31 -145 51 -53 20 -198
6804 -198 39 95 16 192 -241 158 35 192 178 120 69 -80 -15 -108 -31 56 -118 97 54 80 55 -93 87 -55
6828 -55 82 -117 -82 -88 1 -89 -41 21 -101 202 7 -222 52 -5 -112 -148 88 145 28 -59 -117 -39 -18 -2 -164
6853 -164 -55 -138 128 -239 -235 44 -85 -58 -28 98 -92 -32 -69 56 -50 122 -178 -1 76 230 -31 1 -47
6876 -47 -86 27 81 -6 -70 -59 14 -46 -138 -125 -91 146 92 -72 3 -162 31 69 49 -40 175 80 82 -88 -151 -126 192
6903 192 231 347 -6 168 -37 256 47 86 -102 26 -47 38 91 -119 158 33 -12 -63 6 26 -99 68 -75
6926 -75 -33 -146 -18 25 -8 75 -61 80 30 67 28 173 103 225 16 92 151 18 131 -7 8 110 -80 -19
6950 -19 15 -135 -56 112 -118 -59 24 -26 -111 -83 -15 212 11 28 0 -113 -131 47 -58 137 178 57 10 -44 32
6975 32 78 -55 -16 18 -32 -10 41 -124 -52 76 -28 -160 -114 -42 -38 60 89 -84 -154 -91 17 60 -93 204 79 -12
7001 -12 51 -103 123 46 -23 -120 150 -41 182 72 -215 48 162 -41 -144 -16 -28 -151 -120 73 128 17 -187
7024 -187 170 102 128 35 -26 -66 -78 179 47 -84 -229 -72 -54 35 90 -57 -176 77 -160 -6 92 -67 96
7047 96 10 35 -196 -235 -22 84 45 -143 86 201 52 174 -82 161 -85 -59 4 -202 -29 66 -16 17 -129
7070 -129 -37 46 171 -3 -3 90 -24 -112 -200 129 -97 -207 61 131 -85 7 40 -104 -27 -67 185 143 -129 61
7094 61 -87 45 16 -148 -141 -315 106 -90 -45 180 5 4 -9 -35 -68 112 30 -18 184 6 -44 182 -67 0 -9
7119 -9 62 -146 -6 95 42 -21 -95 86 149 -285 -25 -173 -51 21 92 -88 -50 124 6 -98 -237 60 56 45
7143 45 -95 -107 69 38 -98 221 78 -36 -94 -286 -70 126 14 66 -72 159 -4 -34 -101 27 -154 16
7165 16 -71 138 -119 128 -68 120 202 -200 -95 42 -12 32 81 142 -190 22 -91 25 -29 -98 310 104 -142
7188 -142 97 -21 -42 -159 -39 170 42 -44 12 113 -77 109 -29 62 65 369 -105 98 -97 67 -34 -11
7210 -11 1 -270 -109 86 79 132 114 -116 -54 47 -68 -85 -49 30 59 -142 -158 5 -163 171 61 2 -117 -107 60
7235 60 95 49 286 50 -45 41 91 6 11 134 103 47 3 -155 -15 -49 -206 89 -287 67 -62 -45 17 -65 113
7260 113 57 187 -133 -175 7 -74 -110 -53 136 28 -97 134 -51 -110 -71 104 94 48 13 -141 -40 3 -95 164
7284 164 -144 36 -76 36 -198 -59 -97 -13 -80 196 90 50 111 17 67 -91 -33 -69 141 -115 23 71 -81
7307 -81 90 -90 -95 -172 -84 -83 -196 -51 -262 60 55 -1 56 -136 6 174 -295 -8 249 -121 -38 274 82 48
7331 48 -19 -170 -337 -22 159 -26 -114 -116 -9 21 81 61 25 -200 -113 -133 -21 139 -132 118 -30 -31 224 -14
7355 -14 24 -22 16 -265 37 -44 -378 34 -298 42 -77 -338 -150 129 155 -199 -220 -195 133 248 110 29 -24
7378 -24 -114 -12 -33 47 16 57 66 -111 -16 56 -90 106 -240 -90 59 4 -239 11 133 -98 -70 48 -52 19
7402 19 -51 226 -37 -77 -122 -21 -78 -115 43 65 187 0 124 -36 -103 -122 41 165 104 116 -81 -37 115 -66
7426 -66 209 12 32 124 -27 -230 87 7 -25 -143 27 -61 -45 -204 -88 -26 -299 -47 -224 3 -219 17 -27
7449 -27 -66 162 -129 -92 117 152 -117 -39 -1 -150 122 -63 -81 -62 37 51 -12 183 -118 -256 39 -49 -19 145
7473 145 0 113 46 10 -12 -12 -54 173 -97 119 191 -216 -109 46 -101 -69 17 -28 -36 88 11 156 -213 -56
7497 -56 -101 -91 -158 133 187 -47 -32 -32 102 46 23 325 33 32 100 -37 74 -16 0 -152 45 20 -43 66 -78 -84
7523 -84 -60 -4 29 -22 117 59 30 262 10 -24 92 153 -67 -55 39 -146 102 -40 86 -80 -174 -103 -204 -63
7547 -63 44 -50 -69 44 -25 -147 -53 18 -64 -168 52 -49 -74 37 266 -61 -34 -61 95 -51 -40 -59 75 189
7571 189 -40 11 99 25 -91 13 8 159 232 117 67 -58 149 -253 16 92 -67 207 -134 -188 7 181 59
7594 59 -8 -84 -113 110 93 138 253 16 -87 -82 139 76 16 120 -177 -101 92 42 -103 -111 -19 -55 67 -153 -18
7619 -18 39 -21 -84 38 247 -38 81 -66 -66 -6 113 -85 71 80 77 54 -20 260 -35 -119 -45 -48 44 56 -71 191
7645 191 -8 -87 199 89 162 24 -221 -227 133 -179 -209 56 -158 -82 59 6 280 -15 -46 52 -170 -64 -75
7668 -75 147 52 107 25 233 119 -11 -83 -139 -2 92 76 -94 -144 -115 75 -73 86 -85 -80 222 111 8 -101
7692 -101 41 -412 4 -64 124 1 -261 37 5 58 -181 35 4 -88 104 -45 124 -83 163 243 96 -94
7714 -94 -58 -156 -13 12 38 -95 46 -45 -97 -33 249 -56 -76 8 106 -158 41 -15 -76 228 -8 167 -150 -16
7738 -16 60 -40 27 51 30 -101 96 65 38 56 94 -18 131 -189 -107 52 -165 130 -99 -66 61 147 43 99
7762 99 -111 -28 18 128 -178 153 -19 101 -184 71 -37 97 -74 -95 50 -78 -17 -71 -216 -13 178 133
7784 133 -11 -141 -87 70 -39 91 1 235 41 -71 119 -165 -106 33 207 -135 75 37 8 -133 -70 51
7806 51 -59 -243 -61 -47 -101 -64 23 -34 -48 97 -78 -118 59 138 -129 -12 1 -39 -70 237 -178 60 -80 219
7830 219 102 -106 111 -31 -13 282 -279 4 -38 43 59 14 54 -59 97 137 15 41 -77 12 129 -13 77
7853 77 201 -47 16 -25 -107 11 -86 86 193 -63 -39 -26 55 -28 4 -157 -106 -62 -23 -117 250 -22 42 60 -96
7878 -96 148 35 126 4 -32 26 -77 -149 -57 11 175 29 -19 -75 -69 138 55 46 -32 -36 -106 114 52 -233 -100 -101 -49
7905 -49 140 74 83 -167 24 -23 14 124 -169 17 -1 27 -8 -33 101 58 37 18 -127 25 -34 112 -101 -125 62
7930 62 3 -117 -91 -69 -79 -31 208 -148 -34 -89 -133 31 167 -95 72 -200 -158 88 63 233 -114 27 90 70
7954 70 -18 136 199 -74 -131 -199 52 -123 -58 -118 -41 144 94 204 -5 -73 1 -343 -65 -80 2 -65 -72 142 79 8
7980 8 105 236 196 186 -157 124 21 145 56 56 -28 -174 26 -57 -84 -167 -207 -202 70 -33 58 37 -85 -72 -16 188
8006 188 -37 38 36 7 -75 -74 12 -43 189 14 -46 -121 85 -39 -167 147 59 -111 80 -30 14 169 -21 15 -123
8031 -123 39 39 7 137 -56 -36 86 -282 -157 -6 -78 -34 25 86 110 -56 33 218 -7 45 -53 -132 13 -68 84
8056 84 -61 17 89 188 -2 90 -38 -56 191 -75 199 -168 -53 70 14 -86 -129 105 -193 -121 29 54 39 -27
8080 -27 -146 64 69 3 7 24 113 -135 99 26 -358 -150 83 120 -10 -50 -23 74 125 -9 -47 2 212 47 88 22
8106 22 -108 24 -183 -102 57 -134 -237 64 35 63 -67 156 -141 -61 -82 147 20 -63 -26 -116 -69 42 56 223
8130 223 57 -113 46 116 -52 -144 -169 66 -162 119 165 -43 176 42 31 3 108 -121 147 -34 81 44
8152 44 -9 -80 -245 -26 -25 -12 110 54 -34 -52 145 1 114 86 -227 -98 -19 -159 87 0 29 -108 -134 126 -188
8177 -188 -19 139 -194 -98 -166 -48 63 -37 69 -59 216 77 79 115
8191A15
##END NTUPLES=NMR FID
##END=
