##TITLE=1H_Pr DBA-Am-E 
 200.13MHz,CDCl3,
 8 sc
 
 28.11.2025
##JCAMPDX= 6.0         $$ Bruker NMR JCAMP-DX V2.0
##DATA TYPE= NMR FID
##DATA CLASS= NTUPLES
##ORIGIN= UXNMR, Bruker Analytische Messtechnik GmbH
##OWNER= pz
$$ XWIN-NMR		Version 3.5
$$ Fri Nov 28 15:37:18 2025 Russian Standard Time (UT+4h)  she@DPX200
##.OBSERVE FREQUENCY= 200.1313
##.OBSERVE NUCLEUS= ^1H
##.DELAY= (6, 6)
##.ACQUISITION MODE= SIMULTANEOUS
##.ACQUISITION SCHEME= undefined
##.AVERAGES= 8
##.DIGITISER RES= 18
##SPECTROMETER/DATA SYSTEM= spect
##.PULSE SEQUENCE= zg30
##.SOLVENT NAME= CDCl3
##.SHIFT REFERENCE= (INTERNAL, CDCl3, 0, 14.3821)
##AUDIT TRAIL= $$ (NUMBER, WHEN, WHO, WHERE, WHAT)
$$ ##TITLE= Audit trail, XWIN-NMR		Version 3.5
$$ ##JCAMPDX= 5.01
$$ ##ORIGIN= Bruker BioSpin GmbH
$$ ##OWNER= she
$$ F:/spectra/data/she/nmr/H-C/1/audita.txt
$$ ##AUDIT TRAIL=  $$ (NUMBER, WHEN, WHO, WHERE, WHAT)
(   1,<2025-11-28 15:35:58.65 +0400>,<she>,<DPX200>,
      <created by zg, POWCHK disabled, PULCHK disabled
       configuration hash MD5:
       00 E9 B6 7A A2 85 ED C7 34 08 36 98 17 FE 4E 26
       data hash MD5: 16K
       7C BC CC 1C 9F 1A B4 DA E1 3E 44 BD A3 AB 11 FC>)
$$ ##END=
$$ 
$$ hash MD5
$$ B5 EA A7 5E F0 1B 93 4D D3 A6 1C D5 01 D6 2D 7A
##$RELAX= 
##$RELAX= 
##$RELAX= 
##$RELAX= 
##$RELAX= 
##$RELAX= 
$$ Bruker specific parameters
$$ --------------------------
##$DU= <F:/spectra>
##$EXPNO= 1
##$NAME= <H-C>
##$PROCNO= 1
##$TYPE= <nmr>
##$USER= <she>
##$AMP= (0..31)
100 100 100 100 100 100 100 100 100 100 100 100 100 100 100 100 100 100 
100 100 100 100 100 100 100 100 100 100 100 100 100 100 
##$AQSEQ= 0
##$AQ_mod= 1
##$AUNM= <au_zg>
##$AUTOPOS= <>
##$BF1= 200.13
##$BF2= 200.13
##$BF3= 200.13
##$BF4= 200.13
##$BF5= 200.13
##$BF6= 200.13
##$BF7= 200.13
##$BF8= 200.13
##$BYTORDA= 1
##$CFDGTYP= 0
##$CFRGTYP= 5
##$CHEMSTR= <none>
##$CNST= (0..31)
1 1 145 1 1 1 1 1 1 1 1 1 1 1 1 1 1 1 1 1 1 1 1 1 1 1 1 1 1 1 1 1 
##$CPDPRG= <>
##$CPDPRG1= <>
##$CPDPRG2= <>
##$CPDPRG3= <>
##$CPDPRG4= <mlev>
##$CPDPRG5= <mlev>
##$CPDPRG6= <mlev>
##$CPDPRG7= <mlev>
##$CPDPRG8= <mlev>
##$CPDPRGB= <>
##$CPDPRGT= <>
##$D= (0..31)
0 0.7 0 0 0 0 0 0 0 0 0 0.03 0 0 0 0 0 0 0 0 0 0 0 0 0 0 0 0 0 0 0 0 
##$DATE= 1764329757
##$DBL= (0..7)
120 120 120 120 120 120 120 120 
##$DBP= (0..7)
150 150 150 150 150 150 150 150 
##$DBP07= 0
##$DBPNAM0= <>
##$DBPNAM1= <>
##$DBPNAM2= <>
##$DBPNAM3= <>
##$DBPNAM4= <>
##$DBPNAM5= <>
##$DBPNAM6= <>
##$DBPNAM7= <>
##$DBPOAL= (0..7)
0.5 0.5 0.5 0.5 0.5 0.5 0.5 0.5 
##$DBPOFFS= (0..7)
0 0 0 0 0 0 0 0 
##$DE= 6
##$DECBNUC= <off>
##$DECIM= 32
##$DECNUC= <off>
##$DECSTAT= 4
##$DIGMOD= 1
##$DIGTYP= 9
##$DL= (0..7)
0 120 120 120 120 120 120 120 
##$DP= (0..7)
150 150 150 150 150 150 150 150 
##$DP07= 0
##$DPNAME0= <>
##$DPNAME1= <>
##$DPNAME2= <>
##$DPNAME3= <>
##$DPNAME4= <>
##$DPNAME5= <>
##$DPNAME6= <>
##$DPNAME7= <>
##$DPOAL= (0..7)
0.5 0.5 0.5 0.5 0.5 0.5 0.5 0.5 
##$DPOFFS= (0..7)
0 0 0 0 0 0 0 0 
##$DQDMODE= 0
##$DR= 18
##$DS= 0
##$DSLIST= <SSSSSSSSSSSSSSS>
$$ [...]
##$SUBNAM0= <"">
##$SUBNAM1= <"">
##$SUBNAM2= <"">
##$SUBNAM3= <"">
##$SUBNAM4= <"">
##$SUBNAM5= <"">
##$SUBNAM6= <"">
##$SUBNAM7= <"">
##$SUBNAM8= <"">
##$SUBNAM9= <"">
##$SW= 18.0517328524113
##$SWIBOX= (0..15)
0 0 2 0 0 0 0 0 0 0 0 0 0 0 0 0 
##$SW_h= 3612.71676300578
##$TD= 16384
##$TD0= 1
##$TE= 0
##$TE2= 300
##$TE3= 300
##$TEG= 300
##$TL= (0..7)
0 120 120 120 120 120 120 120 
##$TP= (0..7)
150 150 150 150 150 150 150 150 
##$TP07= 0
##$TPNAME0= <>
##$TPNAME1= <>
##$TPNAME2= <>
##$TPNAME3= <>
##$TPNAME4= <>
##$TPNAME5= <>
##$TPNAME6= <>
##$TPNAME7= <>
##$TPOAL= (0..7)
0.5 0.5 0.5 0.5 0.5 0.5 0.5 0.5 
##$TPOFFS= (0..7)
0 0 0 0 0 0 0 0 
##$TUNHIN= 0
##$TUNHOUT= 0
##$TUNXOUT= 0
##$USERA1= <user>
##$USERA2= <user>
##$USERA3= <user>
##$USERA4= <user>
##$USERA5= <user>
##$V9= 5
##$VALIST= <valist>
##$VCLIST= <CCCCCCCCCCCCCCC>
##$VD= 0
##$VDLIST= <DDDDDDDDDDDDDDD>
##$VPLIST= <PPPPPPPPPPPPPPP>
##$VTLIST= <TTTTTTTTTTTTTTT>
##$WBST= 1024
##$WBSW= 4
##$XGAIN= (0..3)
0 0 0 0 
##$XL= 0
##$YL= 0
##$YMAX_a= 648068
##$YMIN_a= -481309
##$ZGOPTNS= <>
##$ZL1= 120
##$ZL2= 120
##$ZL3= 120
##$ZL4= 120
##$ABSF1= 10
##$ABSF2= 0
##$ABSG= 5
##$ABSL= 3
##$ALPHA= 0
##$AQORDER= 0
##$ASSFAC= 0
##$ASSFACI= 0
##$ASSFACX= 0
##$ASSWID= 0
##$AUNMP= <proc_1d>
##$AZFE= 0.1
##$AZFW= 0.1
##$BCFW= 1
##$BC_mod= 2
##$BYTORDP= 1
##$COROFFS= 0
##$CY= -3
##$DATMOD= 1
##$DC= 2
##$DFILT= <>
##$DTYPP= 0
##$F1P= 0
##$F2P= 0
##$FCOR= 0.5
##$FTSIZE= 0
##$FT_mod= 4
##$GAMMA= 1
##$GB= 0.15
##$INTBC= 1
##$INTSCL= 1
##$ISEN= 128
##$LB= 0.25
##$LEV0= 0
##$LPBIN= 0
##$MAXI= 10000
##$MC2= 0
##$MEAN= 0
##$ME_mod= 0
##$MI= 1.114404
##$NCOEF= 0
##$NC_proc= 0
##$NLEV= 6
##$NOISF1= 3.799351
##$NOISF2= 2.8
##$NSP= 1
##$NTH_PI= 0
##$NZP= 0
##$OFFSET= 14.38212
##$PC= 1
##$PHC0= -3506.673
##$PHC1= 8.99234
##$PH_mod= 1
##$PKNL= yes
##$PPARMOD= 0
##$PSCAL= 0
##$PSIGN= 0
##$REVERSE= no
##$SF= 200.129724274929
##$SI= 16384
##$SIGF1= 3
##$SIGF2= 2
##$SINO= 400
##$SIOLD= 16384
##$SREGLST= <1H.CDCl3>
##$SSB= 0
##$STSI= 0
##$STSR= 0
##$SW_p= 3205.1282051282
##$SYMM= 0
##$S_DEV= 0
##$TDeff= 0
##$TDoff= 0
##$TI= <>
##$TILT= no
##$TM1= 0
##$TM2= 0
##$TOPLEV= 0
##$USERP1= <user>
##$USERP2= <user>
##$USERP3= <user>
##$USERP4= <user>
##$USERP5= <user>
##$WDW= 1
##$XDIM= 8192
##$YMAX_p= 0
##$YMIN_p= 0
$$ End of Bruker specific parameters
$$ ---------------------------------
##NTUPLES= NMR FID
##VAR_NAME=  TIME,          FID/REAL,        FID/IMAG
##SYMBOL=    X,             R,               I
##VAR_TYPE=  INDEPENDENT,   DEPENDENT,       DEPENDENT
##VAR_FORM=  AFFN,          ASDF,            ASDF
##VAR_DIM=   8192,          8192,            8192
##UNITS=     SECONDS,       ARBITRARY UNITS, ARBITRARY UNITS
##FACTOR=    0.0002768,     1,               1
##FIRST=     0,             0,               0
##LAST=      2.2672688,     0,               0
##MIN=       0,             -481309,         0
##MAX=       2.2672688,     648068,          0
$$ Real data points
##PAGE= N=1
##DATA TABLE= (X++(R..R)), XYDATA
$$ plain form
0 0 0 0 0 0 0 0 0 0 0 0 0 0 0 0 8 -8 8 -8 12 -16 16 -24 24 -30 36 -43 48 -58 67 -76 86 -98 113 -129 145 -165
36 -165 184 -208 233 -259 291 -323 359 -398 441 -487 535 -594 653 -722 794 -876 963 -1061
54 -1061 1172 -1294 1433 -1588 1768 -1977 2222 -2516 2874 -3319 3893 -4659 5726 -7282 9540
69 9540 -17885 344775 173262 -450867 -481309 -176844 -98185 -205273 -150505 -72476 -82311 -74957
81 -74957 -2813 15360 58391 177029 213424 69809 -8147 123417 242553 141028 -5373
92 -5373 -11646 38647 21122 -16863 -45250 -92233 -120000 -75034 -40308 -78007 -104331 -62871 -30009
105 -30009 -31419 -9757 30321 36893 31707 46441 51144 44671 71820 94212 42590 -21729 667
118 667 53951 27023 -41683 -47906 -15900 -27002 -54661 -38901 -14816 -29327 -43293 -18757 5003
$$ packed form
0@%%%%%%%%%%%%%%Qj6J6j6K0k8L2m0M8n4O6p9R1j06J25j43J62j84K11k42K74l10
36a65L49l92M41m92N50o14O82p57Q39r28J022j129J247j375J516j670J839k024
54a061K233k466K727l021L356l745M199m738N390o193P212q552J0385j3008J6822
69I540k7425L62660j71513o24129l0442L04465P8659j07088N4768P8029r835P354
81g4957P2144J8173M3031J18638L6395j43615p7956J31564J19136j01525j46401
92e373o273N0293j7525l7985k8387m6983k7767M4966L4726l7699k6324M1460L2862
105c0009j410K1662M0078O572n186J4734M703o473K7149K2392n1622o4319K2396
118F67N3284k6928o8706o223L2006j1102k7659J5760K4085j4511j3966K4536K3760
$$ plain form
131 5003 412 1404 18325 19048 10529 23321 37372 23336 6904 15007 21027 5263 -4461 2793
145 2793 -407 -17402 -19788 -7104 -5637 -16130 -17849 -10510 -7926 -7150 -323 4303 1010 -744 4360
160 4360 9390 10089 9844 8401 4208 2817 5966 6061 1467 -234 395 -3897 -8668 -4708 1629 -1963
176 -1963 -9572 -8683 -2286 -104 -1557 -1530 -529 104 1635 3430 3290 3063 4251 4003 1452 951 3480
193 3480 3722 -60 -2915 -1503 45 -1054 -2659 -3226 -3411 -2881 -1268 -273 -1395 -1893 -297 1213 1192
210 1192 1374 2084 1988 1123 1185 1949 1951 1337 439 -702 -1260 -343 442 -612 -2250 -2215 -868 -429 -908 -815 -263
231 -263 -241 -421 309 1126 1018 515 414 650 785 904 819 178 -217 -43 118 -12 -457 -512 -570 -630 -443 -155
253 -155 -255 -536 -588 -66 268 236 86 105 200 237 386 460 362 117 32 57 260 280 50 -291 -364 -185 -44 -56
$$ packed form
131E003m591R92J6921P23q519J2792J4051j4036j6432Q103O020j5764r724P254
145B793l200j6995k386J2684J467j0493j719P339K584P76O827M626l293j754N104
160D360N030O99k45j443m193j391L149R5m594j701O29m292m771L960O337l592
176a963p609Q89O397K182j453K7J001O33J531J795j40k27J188k48k551n01K529
193C480K42l782k855J412J548j099j605n67j85N30J613R95j122m98J596J510k1
210A192J82P10r6q65O2P64Ko14q98j141n58R17P85j054j638L5J347M39m79R3N52
231b63K2j80P30Q17j08n03j01K36J35J19q5o41l95J74J61j30m45n5n8o0J87K88
253a55j00k81n2N22L34l2j50J9R5L7J49P4r8k45q5K5K03K0k30l41p3J79J41j2
$$ plain form
277 -56 -257 -335 -335 -136 2 121 38 -24 -75 35 265 280 218 43 -19 66 170 217 82 -74 -155 -152 24 39 -34 -165
303 -165 -211 -89 -28 102 82 50 -103 -39 110 139 102 24 -2 36 67 98 84 23 -12 -105 34 14 4 -50 -35 -42 -74 -19
331 -19 86 2 -24 15 63 35 -5 66 9 12 1 65 8 56 -30 -28 24 16 -24 -37 19 -33 20 20 -11 -6 -55 10 67 45 29 6 4
364 4 -48 6 21 24 -45 19 12 10 -9 -35 -52 -58 -54 32 7 14 -57 -89 -28 71 30 46 -8 -46 19 -6 27 38 -34 -40 10 -41 18 4 3
399 3 -55 -51 11 48 -7 -38 -35 -2 2 39 36 -16 -1 -37 2 47 51 9 -59 -37 -1 2 -15 -11 36 7 -9 14 85 9 0 43 27 39 13
434 13 -33 13 -6 34 20 62 16 -37 20 -46 -14 -31 -6 1 2 -52 44 20 -15 -8 8 43 -20 1 13 -7 -13 -2 23 -3 60 -67
466 -67 -34 18 11 26 2 6 -22 11 -1 -6 -36 -41 46 14 4 20 -2 -15 -17 9 14 -6 8 16 -36 50 43 -45 3 -2 -51 15 58 5 -37
501 -37 47 27 13 -21 24 10 6 -41 12 21 29 45 7 -26 -51 11 -16 25 6 63 2 -28 -28 6 9 -46 16 40 30 -47 -22 -14 -45 -24
$$ packed form
277e6k01p8%J99J38J19q3o2n1J10K30J5o2j75o2Q5J04M7j35j56q1LJ76J5p3j31
303a65m6J22O1J30k0l2j53O4J49K9l7p8k6L8L1L1j4o1l5r3J39k0j0n4J5pl2N5
331a9J05q4k6L9M8k8m0P1n7Lj1O4n7M8q6KN2qm0j3N6n2N3%l1Nm9O5N7k2j6k3k
364Dn2N4J5Lo9O4pkj9k6j7oMQ6k5Pp1l2O1R9m1J6n4l8O5k5L3J1p2oN0n1N9j4j
399Cn8MO2L7n5l1LL3ML7ln2J5l6L9M5Mm2o8K2L6Lj7MM7k9j6K3P1p6rM3j6J2k6
434A3m6M6j9M0j4M2m6n3N7o6L2j7K5PJn4R6k4l5PJ6L5o3K1J2k0oJ1K5k6O3j27
466f7L3N2pJ5k4Mk8L3j2nl0nQ7l2j0J6k2j3kK6Nk0J4Qn2Q6pq8M8nm9O6M3n3m2
501c7Q4k0j4l4M5j4mm7N3RQJ6l8l3k5O2k7M1j9N7o1l0%L4Ln5O2K4j0p7K5Ql1K1
$$ plain form
535 -24 23 11 1 3 -8 -34 -37 -50 -17 29 5 1 -30 -34 6 -23 -6 -18 -31 31 -14 -37 23 -46 65 -7 19 42 0 10 39 -28
567 -28 17 44 -41 -48 -26 6 -10 11 -44 -37 -12 24 25 -11 39 2 13 -45 -14 -21 44 5 24 19 11 19 -22 -16 -27 16 9 -2 12 -45 -48 73
603 73 -19 6 -46 39 -4 -9 2 3 -19 21 9 -30 49 12 29 18 44 3 -6 9 -25 15 42 16 3 -4 57 -7 17 -9 -42 7 -12
636 -12 24 40 -6 50 19 -14 43 0 2 -9 -11 18 -53 27 1 45 30 47 -13 58 4 -7 -20 -21 11 -24 2 9 31 31 33 104 4
669 4 19 33 -20 39 10 27 12 -1 46 4 -20 -5 -4 29 8 -1 34 -61 2 -39 -8 7 51 -59 -3 -3 -14 16 -7 -26 -14 -72
701 -72 -26 4 -39 25 23 7 26 6 -15 32 32 -1 48 24 -36 0 -39 12 -11 12 -54 -4 11 -17 -2 -4 -60 9 8 32 -7 -36 7
734 7 56 6 -23 -29 -12 83 -37 -32 36 23 2 -1 -18 -72 25 7 1 4 0 33 -40 38 48 -2 56 37 8 -12 -4 -27 9 74 -54 -52
768 -52 34 -14 21 21 22 -14 8 2 33 -33 50 -23 -21 16 21 15 15 -3 -62 3 -50 19 -18 -31 3 65 37 40 -45 33 20 -9 10 27 31
$$ packed form
535b4M7j2j0Kj1k6lj3L3M6k4ml1mM0k9J7j2j3O2m5k3O0o9J11p2K6K3m2J0K9o7
567b8M5K7q5pK2L2j6K1n5PK5L6Jl6N0l7J1n8L1pO5l9J9nqQm1Oj1M3pj1J4n7lJ21
603G3r2K5n2Q5m3nJ1Jk2M0j2l9P9l7J7j1K6m1rJ5l4M0K7k6j3pO1o4K4k6l3M9j9
636a2L6J6m6N6l1l3N7m3Kj1kK9p1Q0k6M4j5J7o0P1n4j1j3jL2l5K6PK2%KP1j00
669DJ5J4n3N9k9J7j5j3M7m2k4J5JL3k1rL5r5O3m1L1J5M4j10N6%j1L0k3j9J2n8
701g2M6L0m3O4kj6J9k0k1M7%l3M9k4o0L6l9N1k3K3o6N0J5k8J5kn6O9jK4l9k9M3
734GM9n0k9oJ7R5j20NO8j3k1lj7n4R7j8oLmL3p3P8J0n0N8j9k9k0Qk3L6O5j28K
768e2Q6m8L5%Jl6K2oL1o6Q3p3KL7No%j8n9O5n3O9l7j3L4O2k8Lq5P8j3k9J9J7M
$$ plain form
803 31 -6 56 -32 -26 -8 129 -33 1 18 -15 -24 4 9 10 19 -30 15 -33 -5 36 2 16 -13 -39 1 19 -44 5 -1 7 -31 -12 -26
836 -26 1 -13 26 8 9 -1 9 35 44 12 -8 10 2 -19 7 -9 -4 -4 8 31 25 -10 6 15 38 -6 -38 33 -7 38 36 4 49 -14 -19
871 -19 -8 37 -50 -4 22 -29 -30 -8 28 -47 20 3 -39 -41 24 2 -82 51 11 14 -58 -22 4 31 -47 29 9 16 26 -36 -12 50
903 50 -2 -75 29 33 19 -20 36 30 2 -25 27 -29 24 -23 16 22 -44 -18 10 -25 -19 8 17 -10 42 55 -21 -13 2 27 -1 -9 -7 41
937 41 6 -77 1 38 -25 40 2 15 -1 19 -19 -9 -51 -3 28 -37 -3 -8 25 -61 5 35 -29 -2 42 24 2 -28 36 -2 -37
968 -37 -26 39 11 -14 4 34 -13 5 26 -18 2 -20 -3 6 42 14 10 -19 44 -76 -1 34 33 21 -2 18 -44 31 24 -6 8 20
1000 20 -42 -13 -30 12 -2 26 -2 49 30 19 -22 16 -2 25 -2 31 25 37 7 5 24 2 13 3 42 -8 -38 11 -10 -15 11 -84
1032 -84 -25 28 35 16 -12 -72 -19 -65 32 53 -1 33 -2 -32 -5 -27 -19 3 -12 -27 12 -9 19 1 21 -10 29 -23 6 -12 5
$$ packed form
803C1l7O2q8OJ8J37j62L4J7l3rK8NJRm9M5m8K8M1l4J4k9k6M0J8o3M9oQl8J9j4
836b6K7j4L9j8Jj0J0K6Rl2k0J8qk1K6j6N%J2K3ol5J6RK3m4l2P1m0M5kl2M5o3n
871a9J1M5q7M6K6n1jK2L6p5O7j7m2kO5k2q4J33m0Lp2L6K6K7p8P6k0PJ0o2K4O2
903E0n2p3J04Mj4l9N6ok8k7N2n6N3m7L9Oo6K6K8l5OK7Rk7N2J3p6QJ5K5k8qKM8
937D1l5q3P8L7o3O5l8J3j6K0l8J0m2M8L1o5L4nL3q6O6L0o4K7M4j8k2l0O4l8l5
968c7J1O5k8k5J8L0m7J8K1m4K0k2J7RL6k8mk9O3j20P5L5jj2k3K0o2P5pl0J4J2
1000B0o2K9j7M2j4K8k8N1j9j1m1L8j8K7k7L3oJ2l0kJ9k2J1j0L9n0l0M9k1nK6r5
1032h4N9N3Pj9k8o0N3m6R7K1n4L4l5l0K7k2QK2j5j5L9k1K8j8K0l1L9n2K9j8J7
$$ plain form
1063 5 -20 -53 30 -9 -5 16 -59 -52 -32 -2 -51 -12 1 -8 13 64 36 -56 -7 -16 19 3 9 4 19 10 -2 -18 -10 10 -14 -18 3 -64 -7
1098 -7 -4 60 27 -5 -40 -25 16 42 28 -59 0 46 2 -24 -10 -22 41 24 21 -40 -7 -8 -2 17 32 20 -48 60 -15 2 -23 42
1130 42 -6 -44 18 -2 -42 19 -38 74 0 17 -9 -15 -5 14 -3 -5 -12 -43 51 43 -16 10 -35 -40 4 -30 -17 -2 -31 76 -42
1161 -42 -28 25 0 -17 -4 -27 -16 -4 -65 2 -23 39 -23 -6 5 -8 -39 -6 36 -13 5 7 9 14 -40 4 0 -22 15 -47 50 -41
1193 -41 28 -9 15 -5 11 34 9 74 -39 -57 -11 -31 -40 -11 -15 8 35 -25 27 31 9 -48 -25 -6 17 -16 17 9 21 -31 -35 13
1225 13 24 -24 -18 2 -5 16 6 -11 -3 24 16 18 -18 3 24 11 -15 26 -62 38 -8 63 25 21 -43 10 -15 3 -24 -14 9 1 4 23
1259 23 -17 29 -36 -1 2 -3 33 10 0 -42 -82 23 21 -7 -43 -30 -59 17 18 28 -17 -17 21 -7 13 -59 -13 25 31 42 -13 -61 -23
1292 -23 38 31 -22 40 -2 49 11 8 -51 21 15 -40 44 28 15 4 10 13 -22 -32 -22 47 11 -32 -33 -21 33 31 -13 -33 -9 32 -38 -15
$$ packed form
1063Ek5l3Q3l9MK1p5PK0L0m9L9J3rK1N1k8r2M9rL5j6OnJ5rj2j6QK0k4mK1o7N7
1098gLO4l3l2l5J5M1K6j4q7N9M6m4k6J4j2O3j7lo1L3jOJ9J5j2o8J08p5J7k5O5
1130D2m8l8O2k0m0O1n7J12p4J7k6oJ0J9j7kpl1R4qn9K6m5nM4l4J3J5k9J07j18
1161d2J4N3k5j7J3k3J1J2o1O7k5O2o2J7J1j3l1L3M2m9J8KKNn4M4mk2L7o2R7r1
1193d1O9l7K4k0J6K3k5O5j13j8M6k0rK9mK3K7o0N2Mk2n7K3J9K3l3L3qJ2n2mM8
1225A3J1m8OK0pK1j0j7QK7qKl6K1K1j3k6M1q8J00m6P1l8mo4N3k5J8k7J0K3qLJ9
1259B3m0M6o5L5LnL6k3j0m2m0J05kk8l6J3k9P6JJ0m5%L8k8K0p2M6L8OJ1n5m8L8
1292b3O1pn3O2m2N1l8ln9P2on5Q4j6j3j1OLl5j0J0O9l6m3jJ2N4km4k0K4M1p0K3
$$ plain form
1326 -15 48 -34 -32 46 14 4 6 26 -5 13 48 -30 -15 30 51 -34 -5 20 56 -24 -20 23 55 34 -3 -9 27 27 -18 -8 -38 26 36
1359 36 40 -27 -22 -15 10 23 -10 -8 -28 -3 9 -16 -38 -61 30 37 -9 17 -48 8 55 -24 -1 -19 20 0 -18 33 18 -68 24 -2 -22
1392 -22 34 13 0 -51 65 18 -6 -6 8 18 11 -32 -45 12 -31 -29 57 12 8 19 36 23 19 -34 -10 18 86 21 49 52 -8 13 -18
1425 -18 -26 58 -47 23 -7 -11 -7 22 -3 16 109 2 11 15 -8 20 7 3 20 18 2 26 29 -35 17 -10 70 35 -31 47 35 -24 19
1458 19 41 23 -59 -28 -13 19 -36 -15 -24 3 10 -4 38 2 -1 -12 -76 16 14 37 45 25 6 13 43 16 -24 -35 -3 4 -52 -7 -1 12
1492 12 -24 9 15 -17 14 -5 26 -16 13 -45 4 52 -23 -22 18 42 62 -41 -32 44 -22 -20 -18 26 -37 -29 -11 5 -19 5 51 54 -33
1525 -33 -26 2 17 7 29 -38 47 71 -64 -18 3 4 7 28 -52 3 18 5 12 17 -26 59 -3 -15 68 -7 -48 -7 -45 -44 24 -25 -28
1558 -28 14 43 -103 -50 -16 2 -12 -60 19 -46 30 10 -14 -16 41 -4 -6 -9 1 6 4 7 8 13 -18 4 -4 -10 3 48 15 6 12 -61 16 -20
$$ packed form
1326a5O3q2KP8l2j0KK0l1J8L5p8J5M5K1q5K9K5L6q0MM3L2k1l7oL6%m5J0l0O4J0
1359C6Mo7NPK5J3l3Kk0K5J2k5k2k3R1Pm6K6o5N6M7p9K3j8L9k0j8N1j5q6R2k6k0
1392b2N6k1j3n1J16m7k4%J4J0pm3j3N7m3KQ6m5mJ1J7j3mn3K4K8O8o5K8Lo0K1l1
1425a8qQ4j05P0l0mMK9k5J9R3j07RMk3K8j3mJ7kj6K4Lo4N2k7Q0l5o6P8j2n9M3
1458A9K2j8q2L1J5L2n5K1rK7Pj4M2l6lj1o4R2kK3Qk0j9PL0k7m0j1L2Pn6M5OJ3
1492A2l6L3Ol2L1j9L1m2K9n8M9M8p5JM0K4K0j03RP6o6KKM4o3QJ8J6k4K4M6Lq7
1525c3PK8J5j0K2o7Q5K4j35M6K1JLK1q0N5J5j3PNm3Q5o2j2Q3p5m1M1l8JO8m9l
1558b8M2K9j46N3L4J8j4m8P9o5P6k0k4kN7m5klJ0NkLJNl1K2qoJ3M5l3rOp3P7l6
$$ plain form
1594 -20 -44 8 13 14 -36 -9 -14 -25 6 -5 16 7 45 -17 26 -19 -13 40 11 20 -8 -30 43 6 -1 -7 15 36 16 18 -7 -4 15 -4 -25
1629 -25 12 3 28 -56 -37 -24 -35 -17 20 2 38 -34 12 -1 21 -6 -40 10 49 -37 51 7 -12 16 -37 1 14 -25 -9 -28 -1
1660 -1 54 23 13 6 41 21 39 -19 7 27 15 -24 -28 -17 -17 2 -16 -1 -3 -4 -42 65 -4 -45 47 20 81 21 -24 6 -45 2 43
1693 43 20 38 -14 24 -11 6 30 37 -23 -21 12 -25 -19 -16 -6 -8 23 5 51 58 4 53 -4 -12 16 31 9 52 -11 -23 -25 -17 15 12 10 48
1729 48 -24 -40 -7 -8 -41 18 31 12 -8 35 21 -17 0 -20 -38 -2 8 -7 33 -20 14 -20 24 17 -5 -6 43 2 -6 -59 -52 22 27
1762 27 20 -32 -10 10 -43 -3 2 -23 -57 10 41 3 18 22 25 -15 -74 23 27 -58 -13 -32 5 16 20 24 -28 -13 6 -51 2 44 -10 31
1796 31 23 8 43 34 14 -12 -8 22 -38 -53 5 27 40 0 -19 19 60 46 5 29 42 -22 35 33 8 -9 53 -33 8 -12 11 -58
1828 -58 -23 2 -7 -9 43 2 41 20 -1 14 -23 18 19 13 9 -21 47 3 18 32 21 2 14 0 38 3 -9 -20 -5 -3 24 -6 25
$$ packed form
1594b0k4N2NJn0K7nj1L1j1K1rL8o2M3m5ON3k9Rk8k2P3l7poK2K1k0Kk5LJ9j9k1
1629b5L7rK5q4J9J3j1J8L7j8L6p2M6j3K2k7l4N0L9q6Q8m4j9K8n3L8J3l9J6j9K7
1660aN5l1j0pL5k0J8n8K6K0j2l9mJ1%J9j8J5kjl8J07o9m1R2k7O1o0m5L0n1M7M1
1693D3k3J8n2L8l5J7K4Po0KL3l7OLJ0kL1j8M6Pn4M9n7qK8J5k2M3o3j2kQL2lkL8
1729D8p2j6L3jl3N9J3j9k0M3j4l8J7k0j8L6J0j5M0n3L4l4M4pk2jM9m1qn3PP4N
1762B7pn2K2K0n3M0Nk5l4O7L1l8J5MLm0n9R7Mq5M5j9L7J1MMn2J5J9n7N3M2n4M1
1796C1qj5L5rk0k6ML0o0j5N8K2J3m0j9L8M1j4m1K4J3o4N7kk5j7O2q6M1k0K3o9
1828e8L5K5rkN2m1L9k1k1J5l7M1Joml0O8m4J5J4j1j9J2j4L8l5j2j1J5KK7l0L1
$$ plain form
1861 25 -25 21 12 -9 -32 20 -24 23 -9 31 -3 -24 0 13 -18 32 -31 46 21 -25 6 -23 18 13 -30 -9 -16 -2 12 -18 -8 14
1893 14 -43 42 -9 -27 33 2 2 -92 30 43 -7 24 7 12 9 15 27 -4 -70 -8 37 64 -22 -7 -15 16 23 64 9 0 -31 8 -8
1926 -8 -39 -49 12 28 -52 37 2 22 43 -15 -52 17 -29 -51 39 14 -61 57 26 -24 32 47 -50 -15 31 -12 22 4 -10 27
1956 27 -47 19 33 8 -11 -56 68 21 65 9 5 6 33 16 11 5 44 15 5 34 3 -39 19 -12 53 -6 28 -24 -12 42 5 40
1988 40 -17 -19 -13 59 -19 -42 -32 6 24 -20 -70 -39 -55 70 57 -16 22 -30 -31 -80 23 31 39 32 23 -13 36 2 22 6 -25 -48 37
2021 37 -31 42 8 -36 12 -13 -20 28 21 -17 -3 -22 36 9 -45 5 34 21 8 -41 -2 -14 -27 43 20 -15 14 -6 34 -11 -21
2052 -21 9 11 14 -16 7 16 20 -34 12 22 16 -23 -9 -11 1 20 13 21 11 53 53 8 11 36 29 -37 -12 -22 40 29 -23 15 56 19 -25 -21
2088 -21 45 33 -21 -1 11 -12 -44 0 7 15 47 18 -45 67 83 -2 -6 22 -24 56 18 48 46 -25 -17 40 10 30 51 41 42 -58
$$ packed form
1861B5n0M6rk1k3N2m4M7l2M0l4k1K4J3l1N0o3P7k5m6L1k9M1nm3K1pJ4J4l0J0K2
1893A4n7Q5n1j8O0l1%r4J22J3n0L1j7NlOJ2l1o6O2M5K7q6J5qL1PM1n5rl1L9j6
1926hl1j0O1J6q0Q9l5K0K1n8l7O9m6k2R0k5p5J18l1n0N6J5r7L5M6m3L4j8j4L7
1956B7p4O6J4k5j9m5J24m7M4n6mJK7j7noL9k9j0K9l1m2N8l1O5n9L4n2J2N4l7L5
1988D0n7kOP2p8k3J0L8J8m4n0L1j6J25j3p3L8n2jm9J03QQprl6M9l4K0j6l1k3Q5
2021C7o8P3l4m4M8k5pM8pl8J4j9N8k7n4N0K9j3j3m9L9j2j3P0k3l5K9k0M0m5j0
2052b1L0KLl0K3RMn4M6J0ol9J4kJ2J9pQj0M2%m5LK5po6K5j0O2j1n2L8M1l7m4M
2088b1O6j2n4K0J2k3l2M4PQL2k9o3J12J6q5mK8m6Q0l8L0kp1QN7l0K0K1j0Jj00
$$ plain form
2120 -58 54 -12 -17 15 11 -38 -11 36 18 -23 10 51 -45 -19 35 -36 44 -10 27 33 -17 -12 7 -36 12 2 13 -16 -67 -10 -41 -6
2152 -6 83 5 29 54 60 46 -41 8 49 35 17 -8 5 0 21 28 80 -3 6 0 -15 23 35 -8 -11 -55 -6 -8 -6 -10 -3 32 -46 -25 -12 9
2188 9 3 34 20 -11 56 59 35 -22 -41 -9 -17 -6 58 -11 22 34 16 -7 65 -24 3 12 53 33 11 29 8 8 25 39 21 -52 4
2221 4 42 6 -14 -40 5 30 -3 -14 15 -44 38 -5 -9 -83 -32 -9 45 -25 42 38 24 10 17 40 53 -36 29 5 -29 11 -16 -6
2253 -6 8 -37 47 35 21 11 29 77 -72 9 13 24 12 -84 -51 0 -13 54 26 2 -20 5 7 1 53 9 6 9 -65 32 29 -71 48
2286 48 41 20 20 100 19 29 42 -6 -31 43 -44 -23 62 23 -2 -62 4 25 -22 -37 28 10 24 -75 21 18 -9 -3 60 -39 -3 -11 20
2319 20 29 -33 20 7 40 11 40 49 -31 26 -38 28 40 -18 -31 62 -7 16 7 38 -33 15 25 29 -5 -25 -33 40 6 -1 43 -43 -30
2352 -30 -25 -30 4 -36 15 53 19 6 52 59 -18 -1 -6 -14 30 -13 -17 28 11 -47 14 6 -17 -49 36 36 -18 33 -35 -13 41 0 -4 24 7
$$ packed form
2120e8J12o6nL2mm9K7M7j8m1L3M1r6K6N4p1Q0n4L7On0NJ9m3M8j0J1k9n1N7l1L5
2152fQ9p8K4K5Oj4q7M9M1j4j8k5J3nK1PN2q3Roj5L8J2m3lm4M9kKmPL5p8K1J3K1
2188IoL1j4l1O7Lk4n7j9L2qJ1O4o9L3J2j8k3P2q9K7RM1k0k2J8k1%J7J4j8p3N6
2221DL8l6k0k6M5K5l3j1K9n9Q2m3mp4N1K3N4p0O7mj4j4PK3J3q9O5k4l4M0k7J0
2253fJ4m5Q4j2j4j0J8M8j49Q1MJ1j2r6L3N1j3O7k8k4k2K5KoN2m4lLp4R7lj00J19
2286D8pk1%Q0q1J0J3m8k5P4q7K1Q5l9k5o0O6K1m7j5O5j8J4r9R6lk7OO3r9L6qL1
2319B0Ro2N3j3L3k9K9Rq0N7o4O6J2n8j3R3o9K3rL1p1M8J0Ml4k0qP3l4pM4q6J3
2352c0NnL4m0N1L8l4j3M6Pp7J7nqM4m3mM5j7n8O1qk3l2Q5%n4N1o8K2N4m1mK8j7
$$ plain form
2387 7 -23 15 0 19 -30 16 -37 -19 31 -15 -25 18 57 17 6 -40 4 34 -48 30 -22 21 19 -19 -12 -38 30 -8 9 31 15 45
2419 45 -28 42 -10 -43 -26 30 40 -24 52 13 24 20 -7 -45 10 2 21 -31 47 -4 6 20 -55 -60 -39 31 -5 -38 75 -5 -28
2450 -28 -29 43 29 14 -26 44 -3 48 -4 50 20 43 20 -2 84 -16 38 -10 -19 -26 -28 8 -3 1 -54 -36 -65 -15 7 37 -9 -20
2482 -20 -24 6 -37 26 -3 48 5 18 9 20 -30 31 -9 46 -13 17 30 -15 -20 30 10 13 -16 -14 36 24 11 0 -7 -44 37 37 39 -35
2516 -35 -8 -13 -17 1 17 -31 18 -12 -40 4 0 21 0 -17 87 11 10 -19 40 14 -2 7 17 4 -30 1 -12 -32 33 26 44 -40 29
2549 29 -6 -37 46 19 0 8 45 -9 -10 7 -45 17 -41 -16 20 -20 23 18 20 37 -26 29 -57 34 -4 -9 -13 22 32 56 27 9 -18
2582 -18 -4 -22 13 27 -38 15 -31 -8 8 -30 32 -25 16 -24 17 -17 -2 1 -22 21 -45 22 10 -2 33 18 1 -51 -43 -51 -2 -11
2614 -11 21 -29 -33 -5 35 -14 -46 -1 -34 -17 -35 -30 18 -5 6 22 -18 54 -30 18 -50 27 -32 -2 -2 11 12 -15 26 -58 -36 -12
$$ packed form
2387Gl0L8j5J9m9M6n3J8N0m6j0M3L9m0j1m6M4L0q2P8n2M3kl8Pk6O8l8J7K2j6L0
2419D5p3P0n2l3J7N6J0o4P6l9J1mk7l8N5qJ9n2P8n1J0J4p5nK1P0l6l3J13q0k3
2450b8jP2j4j5m0P0m7N1n2N4l0K3k3k2Q6j00N4m8rpkL6j1Mn5J8k9N0K2L0m6j1
2482b0mL0m3O3k9N1m3J3rJ1n0O1m0N5n9L0J3m5nN0k0Lk9KN0j2j3j1pl7Q1%Kp4
2516c5K7nmJ8J6m8M9l0k8M4mK1k1j7J04p6jk9N9k6j6RJ0j3l4L1j3k0O5pJ8q4O9
2549B9l5l1Q3k7j9QL7n4jJ7n2O2n8K5L6m0M3nKJ7o3N5q6R1l8nmL5J0K4k9j8k7
2582a8J4j8L5J4o5N3m6K3J6l8O2n7M1m0M1l4J5Lk3M3o6O7j2j2L5j5j7n2QqM9r
2614a1L2n0mK8M0m9l2M5l3J7j8NM8k3J1J6m0P2q4M8o8P7n9L0%J3Jk7M1q4K2K4
$$ plain form
2646 -12 -27 18 30 6 6 37 15 60 11 18 18 -24 10 -38 33 -43 53 -20 -24 -52 66 17 -16 -38 -14 5 22 -4 -57 -9 4 14
2678 14 -12 40 -27 -51 13 -27 27 -19 25 39 1 -60 -32 43 -26 -29 23 0 -20 -2 46 -9 -7 -19 54 38 -22 -23 -51 11 -27 -68
2710 -68 -17 1 27 30 -35 7 16 -11 -39 50 12 -17 -6 57 18 46 -16 -20 6 16 -2 -17 29 14 -29 -55 -9 -5 36 35 36 -31 -22 -36
2744 -36 12 25 -27 -1 -36 -23 35 53 -15 30 66 -3 29 -3 31 -3 -34 39 45 -39 60 30 65 -57 34 33 43 -6 22 -20 -26
2775 -26 14 52 29 -17 7 18 -31 24 43 43 40 -52 -7 20 3 23 -3 46 27 4 18 11 7 -6 4 -3 53 -1 47 14 -9 -41 -24
2808 -24 -28 -4 22 13 46 52 3 -32 -35 -1 5 2 18 18 -36 -17 11 -19 -8 -18 27 -15 8 -3 -16 19 18 -20 88 -9 18 -5 54 40
2842 40 10 -37 -1 7 13 3 49 2 -37 38 42 -7 2 39 -16 12 15 -31 -35 30 36 -27 -31 12 -12 42 -15 0 15 7 -17 19 18 36 -1
2877 -1 11 0 28 -7 -22 -33 10 -19 0 6 49 10 -3 -28 -8 44 -49 -39 -8 -48 14 -6 1 74 15 -2 -8 35 1 30 7 30
$$ packed form
2646a2j5M5J2k4%L1k2M5m9P%m2L4m8P1p6R6p3mk8J18m9l3k2K4J9J7k6n3M8J3J0
2678A4k6N2o7k4O4m0N4m6M4J4l8o1K8P5o9lN2k3k0J8M8n5Kj2P3j6o0jk8O2l8m1
2710f8N1J8K6Lo5M2Rk7k8Q9l8k9J1O3l9K8o2mK6J0j8j5M6j5m3k6M6MM1jJo7Rj4
2744c6M8J3n2K6l5J3N8J8o8M5L6o9L2l2L4l4l1P3Oq4R9l0L5j22R1jJ0m9K8m2o
2775b6M0L8k3m6K4J1m9N5J9%lr2M5K7j7K0k6M9j9k3J4pmj3J0pN6n4M8l3k3l2J7
2808b4mK4K6rL3Om9l5lL4OlJ6%n4J9K8l0J1j0M5m2K3j1j3L5jl8J08r7K7k3N9j4
2842D0l0m7L6QOj0M6m7l9P5Mm9RL7n5K8Lm6mO5Oo3mM3k4N4n7J5J5qk4L6jJ8l7
2877aJ2j1K8l5j5j1M3k9J9OM3l9j3k5K0N2r3J0L1m0O2k0PP3n9j7oM3l4K9k3K3
$$ plain form
2909 30 -38 32 -11 52 18 29 -43 -6 -19 -50 9 -43 14 -19 0 42 44 23 -27 -15 44 -5 6 16 -25 36 -28 -10 24 32 -19
2940 -19 -9 -5 -10 25 22 -26 28 21 35 53 -2 -10 34 -23 64 8 14 53 10 -32 5 9 -26 10 -36 -20 21 32 34 26 -3 45 52 14 49
2975 49 54 17 32 18 15 -93 52 -34 14 36 -33 67 -17 15 12 -20 -8 33 -45 -14 6 21 20 -5 28 36 -12 2 -3 -10 4 -108
3007 -108 7 8 15 12 -20 17 6 19 -10 -47 -50 18 4 -12 45 46 -34 0 -1 38 -8 14 52 8 -7 -39 -15 34 13 -12 47 -11
3039 -11 0 32 -8 -5 -32 15 -41 -33 6 -39 27 -47 -21 -23 18 -8 30 -64 23 -36 -21 20 -17 45 -1 19 6 63 24 -3 -36 -30
3071 -30 21 9 -12 20 -31 24 9 30 36 42 26 17 -1 0 25 49 -36 22 28 7 19 -11 38 62 -12 -7 4 -27 32 -27 6 19 -31
3104 -31 42 4 23 3 -16 0 23 53 15 -31 -12 6 39 -62 56 -16 31 -24 32 4 15 0 -35 4 16 0 -7 33 -17 -5
3134 -5 84 36 35 -63 -44 -11 78 46 25 20 -50 7 21 13 -23 53 20 8 -38 20 -5 23 71 -25 13 -16 -66 5 36 24 -13 75
$$ packed form
2909C0o8P0m3O3l4J1p2L7j3l1N9n2N7l3J9M2Kk1n0J2N9m9J1J0m1O1o4J8L4Qn1
2940a9J0MnL5lm8N4pJ4J8n5qM4n7Q7n6OL9m3m2L7Ml5L6m6J6M1J1Kqk9M8Pl8L5
2975D9Nl7J5j4lj08J45q6M8K2o9J00q4L2ll2J2M1p8L1K0J5jk5L3Qm8J4npJ4j12
3007a08J15JPll2L7j1J3k9l7lO8j4j6N7Jq0L4jL9m6K2L8m4j5l2K4M9k1k5N9n8
3039a1J1L2m0Lk7M7n6QL9m5O6p4K6kM1k6L8r4Q7n9J5M1l7O2m6K0j3N7l9k7l3O
3071c0N1j2k1L2n1N5j5K1OOj6rj8JK5K4q5N8Ok1J2l0M9K4p4NJ1l1N9n9L3J3n0
3104c1P3l8J9k0j9J6K3L0l8m6J9J8L3j01J18p2M7n5N6k8J1j5l5L9J2j6pM0n0J2
3134eQ9m8jr8J9L3Q9l2k1np0N7J4ql6P6l3j2m6N8k5K8M8r6L8k9n0P1L1j2l7Q8
$$ plain form
3166 75 30 26 29 12 5 0 11 -29 -25 8 -18 2 24 -35 4 42 -11 -3 30 30 -35 -32 -74 -5 -41 17 60 -25 -3 27 28 -29 11 -40 -19
3201 -19 -64 2 -19 0 -1 54 -10 34 47 4 57 -29 2 83 12 6 39 3 -32 -19 50 -16 -22 38 -29 -8 17 5 58 25 50 11
3233 11 -46 -53 -7 14 -31 -5 8 41 -16 19 -10 -57 -21 -26 3 38 -3 11 63 80 42 -13 15 -1 30 61 24 -8 36 51 -50
3264 -50 -4 -19 -14 11 33 4 35 65 -11 35 -86 53 6 25 -30 -22 -37 -48 -8 21 -11 -9 -29 40 -44 -17 3 -3 24 -46 58
3295 58 60 -29 -8 -12 12 49 48 24 -40 -20 8 59 -56 -13 53 14 -12 2 60 38 -13 0 12 -25 27 28 -4 -4 -36 24 30 15 23
3328 23 15 -31 -4 12 8 -18 -44 -11 50 -16 -10 -2 18 -34 -9 26 -9 -23 29 5 10 32 -6 50 18 -8 -28 32 -23 25 21 90 21
3361 21 -54 25 -16 -23 38 16 49 57 -49 10 -57 14 0 -38 -2 -7 23 -36 -49 22 30 -5 -13 -24 53 18 22 31 -53 -7 -26 8 -16
3394 -16 -27 9 20 29 -55 -3 -21 -10 11 7 22 12 9 34 31 -16 2 46 50 60 -18 43 8 6 40 -23 -42 -12 31 70 44 11 22
$$ packed form
3166G5m5mLj7pnJ1m0ML3k6K0K2n9L9L8n3QL3%o5Lm2O9l6N8M3q5K2L0Jn7M0n1K1
3201a9m5O6k1J9jN5o4M4J3m3N3q6L1Q1p1oL3l6l5J3O9o6oO0o7K1K5j2N3l3K5l9
3233A1n7pM6K1m5K6J3L3n7L5k9m7L6nK9L5m1J4N2J7l8n5K8j6L1L1l7l2M4J5j01
3264e0M6j5NK5K2k9L1L0p6M6j21J39m7J9n5Qj5j1M0K9l2Kk0O9q4K7K0oK7p0J04
3295E8Kq9K1mK4L7jk4o4K0K8N1j15M3O6l9k6J4N8k2n1J3J2l7N2Jl2%l2O0Oj5Q
3328B3qm6K7J6mk6k6L3O1o6OQK0n2K5L5l5j4N2k4NK2l8N6l2k6k0O0n5M8mO9o9
3361B1p5P9m1pO1k2L3Qj06N9o7P1j4l8L6nL0n9j3P1Ql5qj1P7l5MRq4M6j9L4k4
3394a6j1L6J1Rq4N2j8J1K1mJ5j0lK5lm7J8M4MJ0p8O1l5kL4o3j9L0M3L9k6l3J1
$$ plain form
3427 22 56 -19 -42 -30 2 19 13 -30 36 10 -9 -20 26 -5 8 48 7 -14 -1 46 40 12 8 55 -39 -33 -12 -4 21 -11 -6 7 30
3460 30 3 -16 13 40 -10 -34 -7 40 18 -47 -57 61 31 55 -58 -37 36 -9 64 5 46 -1 -29 -38 -2 1 -25 15 61 44
3490 44 13 -8 36 -22 35 65 -31 -11 0 2 15 52 15 60 9 6 47 34 -67 33 34 23 -6 -5 22 -28 -2 -54 43 -30 -44
3521 -44 -17 31 11 25 -25 32 -29 -12 -32 -31 45 -29 -29 28 -13 -70 24 -28 -44 -17 -8 11 41 -1 42 26 15 18 -14 -19 -33 -23 7
3554 7 22 21 -30 38 50 -25 -3 1 18 -22 22 -16 31 8 19 5 29 42 1 5 -6 0 3 -67 4 5 2 9 -15 24 13 -8 -4 2 20 28
3590 28 -5 -51 3 -3 22 5 35 1 20 32 26 -23 12 9 -5 -6 6 -16 -32 -27 -30 36 -63 10 32 -3 -22 -11 60 10 11 -17 12 -6
3624 -6 52 47 -23 24 -16 -9 -16 47 47 0 49 48 19 -8 9 4 -36 26 -15 -6 19 16 44 -7 -23 6 24 -5 -34 15 39 8 21 1 -9
3659 -9 -2 11 10 38 19 -16 37 49 -11 -9 58 -25 -40 52 7 41 31 9 40 -12 -37 40 -21 -52 -8 3 55 50 18 -9 -30 -33 49
$$ packed form
3427B2L4p5k3J2L2J7om3O6k6j9j1M6l1J3M0m1k1J3M7ok8mM7r4OK1QK5l2NJ3K3
3460C0k7j9K9K7n0k4K7M7k2o5j0J18l0K4j13K1P3m5P3n9M1m7k8rL6Lk6M0M6j7
3490D4l1k1M4n8N7L0r6K0J1KJ3L7l7M5n1lM1j3j01J00Jj1k9JK7n0K6n2R7p3j4
3521d4K7M8k0J4n0N7o1J7k0JP6p4%N7m1n7R4n2j6K7RJ9L0m2M3j6j1Ll2nj4J0L0
3554GJ5jn1O8J2p5K2MJ7m0M4l8M7k3J1j4K4J3m1Mj1OLp0P1JlPk4L9j1k1MOJ8Q
3590B8l3m6N4oK5j7L0l4J9J2om9L5lj4jJ2k2j6NlO6r9P3K2l5j9J1P1n0Jk8K9j8
3624fN8np0M7m0PpO3%m7M9jk9k7J7nm0O2m1RK5lK8n1j6K9J8k9k9M9K4l1J3k0j0
3659iPJ3jK8j9l5N3J2o0KO7q3j5R2m5L4j0k2L1n2k5P7o1l1M4J1N2nl2k7k1lQ2
$$ plain form
3692 49 35 -45 -22 41 36 -2 64 48 -49 -2 15 -22 18 -23 28 -1 7 8 32 9 -8 -3 0 11 -41 -34 -17 -18 -7 24 -15 1 -26 -48
3726 -48 3 36 20 -1 6 -12 5 5 -6 -40 -5 -7 11 -8 13 -23 40 9 -16 -46 52 4 -8 -38 -60 -3 -47 -13 -7 3 31 -17
3758 -17 -17 2 23 18 14 6 -50 -9 -12 10 -69 0 18 4 -17 22 49 18 8 32 15 40 13 71 -23 1 24 6 14 -19 32 69 32
3791 32 13 -46 -3 36 45 26 -11 -35 28 -7 -15 30 15 -12 -18 3 21 -34 0 54 69 -2 -44 21 2 -19 -44 12 -32 2 21 33
3823 33 22 -38 36 12 6 16 -2 -16 -14 43 2 -40 22 -13 -61 12 2 -47 32 13 -38 44 45 44 -27 9 32 15 10 8 24 -23 23
3856 23 -5 3 7 38 -5 26 -8 2 54 14 -7 -25 3 21 -5 31 7 -34 57 31 7 -8 -16 34 28 6 43 23 20 31 -16 -26 -4
3889 -4 48 26 26 40 43 8 -3 15 10 -7 53 64 -1 40 -5 1 59 0 14 15 -5 12 45 18 4 42 20 28 -14 16 -46 29 16 -8
3923 -8 1 4 18 -17 -55 -6 -4 -3 20 -10 5 12 -29 -3 -12 -12 36 -20 -29 5 -11 -26 21 45 -18 -23 22 51 15 -20 23 -31 33 36 15 68
$$ packed form
3692D9j4q0K3O3nl8O6j6r7M7J7l7M0m1N1k9QJK4k3j7NLJ1n2PJ7jJ1L1l9J6k7k2
3726d8N1L3j6k1Pj8J7%j1l4L5kJ8j9K1l6O3l1k5l0R8m8j2l0k2N7m4L4OJ0K8m8
3758a7%J9K1nmqn6M1lK2p9O9J8j4k1L9K7l1j0K4j7K5k7N8r4K4K3j8Ql3N1L7l7
3791C2j9n9M3L9Rj9l7k4O3l5qM5j5k7oK1J8n5L4N4J5p1m2O5j9k1k5N6m4L4J9J2
3823C3j1o0P4k4oJ0j8j4KN7m1m2O2l5m8P3j0m9P9j9n1Q2Jjp1L6K3j7nkJ6m7M6
3856B3k8QML1m3L1l4J0N2m0k1j8K8J8k6L6k4m1R1k6k4j5qN0ok2L7k0lJ1m7j0K2
3889dN2k2%J4Ll5j1J8nj7O0J1o5M1m5ON8n9J4Jk0J7L3k7j4L8k2Qm2L0o2P5j3k4
3923hRLJ4l5l8M9KJK3l0J5Pm1K6r%M8n6rL4j6j5M7K4o3nM5K9l6l5M3n4O4Lk1N3
$$ plain form
3959 68 -5 26 96 1 5 -45 -47 8 5 -32 0 7 1 -17 50 -13 19 -19 -19 -20 25 -47 39 3 14 48 -49 29 17 57 80 29 16 12
3993 12 39 31 -31 33 45 3 27 -31 20 60 5 -26 37 41 34 -42 -19 14 35 -15 -26 -29 -30 -10 14 -19 -10 -18 50 20 -14 49 9 -53
4027 -53 6 52 16 2 -23 -16 -25 -8 18 1 55 9 -1 22 11 -12 -8 44 -24 -12 -12 -20 -17 36 59 22 26 -35 25 -13 -18 20 59 71
4061 71 3 -6 33 10 -13 4 8 45 51 -23 10 16 -24 34 -31 45 34 70 -18 -63 -15 -24 -25 48 6 9 26 -20 -6 -24 31 14 29 -9
4095 -9 23 8 22 -42 -29 33 -32 32 41 3 10 -24 -9 10 18 22 15 8 48 26 -21 23 -21 -37 -20 37 -19 12 -24 -3 -37 19 48 -12
4129 -12 22 -24 27 -45 54 23 18 -36 -37 -26 0 4 13 12 -18 4 29 17 -39 11 -14 34 -11 26 21 -6 3 -23 -14 -36 5 37 -45 -6
4163 -6 -4 14 5 39 33 -23 8 -36 19 -20 -5 44 -35 -9 10 7 17 -35 16 62 33 -17 -38 12 -3 17 18 -59 -17 -3 -48 10 1 -25
4197 -25 6 72 9 22 3 37 35 -11 -33 -3 37 -47 20 27 6 -2 11 -12 83 3 -21 -6 15 53 19 8 -40 -7 12 -39 -11 -21
$$ packed form
3959F8p3L1P0r5Mn0kN5ll7L2Poj8O7o3L2l8%jM5p2Q6l6J1L4r7P8j2M0K3n1j3m
3993A2K7qo2O4J2m2K4n8N1M0n5l1O3Mpp6K3L3K1n0j1ljK0K4l3RqO8l0l4O3m0o2
4027e3N9M6l6j4k5PrJ7K6j7N4m6j0K3j1k3MN2o8J2%qLN3K3l7Mo1O0l8nL8L9J2
4061G1o8rL9k3k3J7ML7Op4L3Om0N8o5P6j1L6q8m5M8rjP3m2LJ7m6J4j8N5j7J5l8
4095iL2j5J4o4J3O2o5O4Rl8Pl4J5J9QMppM0k2m7M4m4j6J7N7n6L1l6K1l4N6K9o0
4129a2L4m6N1p2R9l1nn4jJ1K6MRjl0K2K5j2n6N0k5M8m5L7nk7Rk6Rk2M1L2q2L9
4163fKJ8rL4on6L1m4N5l9J5M9p9K6J9lJ0n2N1M6k9n0k1N0j5K0Jp7M2J4m5N8rk6
4197b5L1O6o3J3j9L4km6k2L0M0q4O7Pk1qJ3k3R5q0k4J5K1L8l4j1m8L3J9n1K8j0
$$ plain form
4229 -21 22 -30 -42 -39 9 5 2 43 0 9 22 -20 53 62 -32 8 37 22 -21 35 54 -10 6 8 28 -6 -16 -26 -28 38 -1 37 -10 -7
4263 -7 24 -19 -20 -38 40 4 48 0 25 -9 -46 -18 6 -13 -16 6 8 13 -23 27 3 4 15 3 -8 -16 9 -3 33 -6 33 -3 13 40
4297 40 -1 8 -4 -9 35 -70 -10 15 -17 -13 10 17 64 64 2 4 5 -6 22 -48 -4 -20 10 3 -12 30 -28 14 34 6 -21 -30 -7 12
4331 12 -35 -8 13 -48 13 37 39 -4 -30 6 -18 -27 7 -38 33 37 -12 14 30 25 -15 -53 15 -28 -17 19 -22 -17 18 -7 -32 60 58
4364 58 32 25 21 -30 14 16 -23 9 -21 25 -32 -36 -13 13 5 5 62 -27 -6 12 24 16 14 13 -20 42 43 -18 5 17 -35 -51 36 9 -15
4399 -15 -15 50 -9 61 6 33 24 8 -45 56 -43 -17 6 -13 61 17 39 14 40 14 -57 16 3 28 65 -5 -26 40 -6 -32 62
4430 62 -22 -8 -15 -15 24 51 -21 24 -16 -10 -34 1 9 -6 54 -2 30 -32 -29 -23 15 4 27 3 -52 43 49 17 -11 -13 86 16 7 9 7 26
4466 26 29 -3 -2 23 20 10 11 -24 16 33 7 3 -22 23 22 50 71 -20 66 7 23 20 -2 25 36 -65 14 18 -26 2 17 -61 -19 -18
$$ packed form
4229b1M3n2j2LM8mlM1m3RJ3m2P3Rr4M0K9j5m3N6J9o4J6KK0l4j0j0kO6l9L8m7L
4263gL1m3jj8P8l6M4m8K5l4l7K8K4j9lK2KNl6N0k4JJ1j2j1qK5j2L6l9L9l6J6K7
4297D0m1Rj2nM4j05O0K5l2MK3PM7%o2KJj1K8p0M4j6L0pj5M2n8M2K0k8k7rK3J9
4331A2m7K7K1o1O1K4Km3k6L6k4rL4m5P1Mm9K6J6nm0l8O8m3J1L6m1NL5k5k5R2k
4364E8k6pmn1M4Kl9L2l0M6n7mK3K6q%N7q9K1J8J2qkjl3O2Jo1K3J2n2j6Q7k7k4
4399a5%O5n9P0n5K7rj6n3J01r9K6K3j9P4m4K2k5K6k6p1P3j3K5L7p0k1O6m6k6R4
4430F2q4J4p%L9K7p2M5m0Ok4L5Qj5O0n6L2o2LOL8j1K3k4n5R5Ol2k8kR9p0rKkJ9
4466B6Ll2JK5lj0Jl5M0J7k6mk5M5jK8K1r1Q6n9J6lk2K7J1j01P9Mm4K8J5p8M2J
$$ plain form
4500 -18 -27 10 24 6 15 -22 -7 39 66 -13 -13 -18 13 72 45 23 90 28 25 21 40 17 12 55 14 -1 6 60 -25 -24 35 31 -4 39 -65
4535 -65 -39 41 15 -2 44 24 10 42 -20 11 6 12 42 -2 2 33 9 1 -26 -37 -16 -24 -34 -19 -14 -21 -52 87 26 -2 -7 33 -14 -5
4569 -5 -4 45 74 4 24 4 -5 -34 29 -20 4 -10 -19 -9 7 8 7 6 8 46 -13 -2 -8 -87 -22 11 12 41 -38 42 59 18 46 35 47
4604 47 -7 12 -10 52 29 6 -14 23 -18 4 -6 30 -34 0 -41 7 25 -15 29 8 22 10 20 73 50 -15 36 -21 15 57
4634 57 22 57 63 65 -9 14 11 -22 2 5 0 -19 -48 39 -7 12 6 15 -19 -30 4 18 -16 4 17 -70 -39 0 58 -7 14 0 12 29
4668 29 29 1 -5 0 22 -26 9 39 16 -2 -5 -20 10 -51 -20 19 29 59 -27 14 -1 -3 34 9 41 -7 -3 15 1 -44 1 -40 -51
4701 -51 -41 -35 6 53 56 37 21 29 42 -7 -43 86 -85 12 -30 45 -17 14 36 0 -18 -24 11 58 23 -12 7 55 22 -20 19
4732 19 -12 41 -9 26 6 -27 -14 2 12 29 14 57 -17 -4 52 43 61 9 31 -33 25 22 -27 -3 -25 18 -51 34 -41 -15 52
$$ packed form
4500a8rL7J4j8Rl7J5M6K7p9%nL1N9k7k2O7o2lmJ9k3nM3m1j5PN4q5JN9ml5M3j04
4535f5K6Q0k6j7M6k0j4L2o2L1nOL0m4ML1k4qk7j1K1qj0J5Npl1J39o1k8nM0m7R
4569eJM9K9p0K0k0rk9O3m9K4j4rJ0J6JjjKL8n9J1op9O5L3JK9p9Q0J7m1K8j1J2
4604D7n4J9k2O2k3k3k0L7m1K2j0L6o4L4m1M8J8m0M4k1J4j2J0N3k3o5N1n7L6M2
4634E7l5L5OKp4K3ll3K4Lnj9k9Q7m6J9oRl4j1L4J4l4K0J3q7L1L9N8o5K1j4J2J7
4668B9%k8oNK2m8L5L0k3j8lj5L0o1L1L9J0L0q6M1j5kL7k5L2m8MJ8j4m5M5m1j1
4701e1J0OM1M7Lj9j6QJ3m9l6J29j71R7m2P5o2L1K2l6j8oL5M7l5l5J9M8l3m2L9
4732A9l1N3n0L5k0l3J3J6J0J7j5M3p4J3N6rJ8n2K2o4N8lm9K4k2M3o9Q5p5K6O7
$$ plain form
4763 52 16 69 49 52 10 5 -10 -9 -19 -3 -3 -2 20 -5 -6 -32 71 17 -4 13 -24 1 36 20 -22 -29 -4 -18 0 32 -27 43 -9
4796 -9 -59 37 35 7 -52 10 67 0 -1 5 48 5 -4 -28 -18 29 53 63 3 -8 29 -18 -19 2 8 35 63 -22 7 1 -13 -20 1 6 -18
4831 -18 39 -23 9 41 11 11 70 -23 7 -17 37 11 29 -11 -45 27 4 8 -9 60 32 -13 -45 59 8 4 9 14 12 -41 -41 -28 -4
4864 -4 -24 7 18 -95 40 -3 19 35 24 21 -17 8 -12 21 26 -38 -61 69 11 -93 -19 60 0 21 -60 -4 25 -7 17 -22
4894 -22 15 28 12 59 9 -15 18 7 34 31 43 3 49 69 50 19 5 10 1 23 32 23 -17 -17 -17 23 32 31 55 -20 14 -49 16 1 -31
4929 -31 36 -36 20 43 -4 31 57 0 -9 60 18 -58 -18 54 -9 -13 1 24 -60 0 37 -15 58 -32 8 41 -7 58 14 -2 -13
4960 -13 -11 -7 28 -11 19 -50 29 24 20 -34 0 -21 -4 -18 31 -65 3 2 -2 17 -32 1 -29 42 17 -11 -43 1 36 -32 -49 15 6 13
4994 13 34 0 -22 -28 -12 15 -6 -9 51 -7 -14 0 -17 37 43 50 -51 -38 36 54 21 -5 -10 6 4 28 15 -9 15 12 -5 -32 14 58
$$ packed form
4763E2l6N3k0Lm2nj5Jj0J6%JK2k5jk6J03n4k1J7l7K5L5j6m2pK5j4J8L2n9P0n2
4796in0R6kk8n9O2N7o7jOM3m3rk4J0M7K4J0o0j1L7m7jK1OK7K8q5K9oj4pK1Nk4
4831a8N7o2L2L2l0%N9r3L0k4N4k6J8m0l4P2k3Mj7O9k8m5l2J04n1mNNkn3%J3K4
4864dk0L1J1j13J35m3K2J6j1ll8K5k0L3No4k3J30n8j04P4P9o0K1q1N6K9l2K4l9
4894b2L7J3j6M7n0k4L3j1K7lJ2m0M6K0j9l1j4NrK2Rrm0%%M0RjK4p5L4o3O5j5l2
4929c1O7p2N6K3m7L5K6n7rO9m2p6M0P2o3mJ4K3q4O0L7n2P3r0M0L3m8O5m4j6j1
4960a3KML5l9L0o9P9nmn4L4k1J7j4M9r6O8jmJ9m9L3l0P1k5k8l2M4L5o8j7O4rP
4994A3K1l4k2oJ6K7k1lO0n8pJ4j7N4OPj01J3P4J8l3k6nJ6kK4j3k4K4lj7k7M6M4
$$ plain form
5028 58 -49 42 -1 -29 26 -22 9 4 -41 -37 -1 -8 4 -27 84 45 -2 -18 -30 23 8 30 9 16 57 43 -11 45 -16 -36 -24
5059 -24 28 -10 10 49 5 -24 15 -10 51 -7 -33 19 28 30 17 -15 33 106 1 31 -52 -24 30 44 -8 14 26 16 25 5 -5
5090 -5 -25 17 -36 25 -20 -13 52 -4 -21 -15 15 -79 24 41 87 9 91 7 -14 2 -48 -27 8 18 -17 -58 3 6 -52 13 13 30
5122 30 49 10 19 47 78 30 -1 -12 -52 -19 -50 19 13 -5 -1 56 10 5 11 -2 15 -44 6 -20 -28 -7 5 -3 8 -31 -17 -56 -6 -10
5156 -10 -43 0 -8 -74 58 37 -57 -36 -47 -25 45 17 -45 -49 49 -67 38 92 5 0 -8 -34 -6 -39 -29 -19 7 -80 11 67 0
5187 0 -9 26 44 -62 -4 26 -44 -47 43 -25 -24 30 -21 -39 -12 29 13 6 -20 15 -38 -44 3 -35 -17 26 30 -19 -27 -23 -22 35 20 -4 11
5222 11 -5 -3 12 -26 -6 -33 78 49 44 18 29 1 4 -13 64 -34 -13 51 -22 71 -25 -48 6 15 -5 -1 -19 28 -6 -10 2 -14 11
5255 11 -13 53 24 -42 -40 28 44 -41 -8 22 -24 4 -38 -23 68 36 -17 0 -54 -2 21 -17 22 -34 -17 -2 -8 -40 -9 -13 -5 37
$$ packed form
5028E8j07R1m3k8N5m8L1nm5ML6pJ2l1J11l9m7j6j2N3j5K2k1PM1j4n4N6o1k0J2
5059b4N2l8K0L9m4k9L9k5O1n8k6N2RKj3l2M8P3j05L0q3K8N4J4n2K2J2j0Rk0j0
5090ek0M2n3O1m5PO5n6j7OL0r4J03J7M6p8Q2q4k1J6n0K1L5J0l5m1O1Ln8O5%J7
5122C0J9l9RK8L1m8l1j1m0L3l1O9oj8MN7m6nOj3J7n9N0k6qK1J2qJ1l9J4l9N0m
5156a0l3M3qo6J32k1r4K1j1K2P0k8o2mR8j16J05N4q7nqk6K8l3J0J0K6q7R1N6o7
5187@rL5J8j06N8L0p0lR0o8JN4n1j8K7M1j6pk6L5n3oM7l8J8M3Mm9qMJN7j5k4J5
5222A1j6KJ5l8K0k7J11k9nk6J1k8Lj7P7r8K1O4p3R3r6k3N4Rk0Mj8M7l4mJ2j6K5
5255A1k4O6k9o6KO8J6q5L3L0m6K8m2J5R1l2n3J7n4N2K3l8L9n6J7J5ol2L1mQM2
$$ plain form
5287 37 6 9 0 -19 -22 17 41 0 33 3 -81 -1 34 6 -8 21 -37 12 51 -19 13 70 -32 3 -18 30 -33 6 -4 -31 4
5318 4 -13 39 31 50 73 8 46 25 41 -28 3 17 60 1 34 29 -22 -4 14 -3 18 -34 -21 -18 12 24 48 61 38 -23 31 45
5350 45 27 4 44 32 -14 -14 5 -9 10 -24 -27 -14 -44 -12 20 71 2 16 -29 37 9 -32 1 -46 -17 -59 -9 -31 36 -16 11
5381 11 -15 -27 -9 3 56 32 11 2 -43 49 20 39 -19 57 24 40 -39 32 12 -6 1 47 78 24 41 -57 24 5 0 -36 33 7
5413 7 67 -20 -28 23 76 40 81 -10 27 30 8 0 -14 16 -37 -13 -7 33 22 7 5 -28 44 11 6 62 -80 -40 41 1 32 -24 42
5446 42 33 21 55 -15 17 -15 -49 28 -8 -9 29 5 -12 -40 10 55 21 11 18 -83 11 24 16 24 -1 -13 13 -2 0 12 20 22 14 -48
5480 -48 23 11 24 35 17 -3 28 -3 33 -17 25 15 -32 0 -11 -53 -49 -39 -2 -27 43 60 -43 -10 25 -47 -7 0 -22 17 -40
5511 -40 0 17 -35 36 -27 50 25 -13 -5 -33 -7 -42 20 13 51 30 -33 3 -20 -9 25 -1 4 12 -3 -48 41 -4 10 -35 29 -12
$$ packed form
5287C7l1Lrj9lL9K4m1L3l0q4Q0L5k8j4K9n8M9L9p0L2N7j02L5k1M8o3L9j0k7L5
5318Dj7N2qJ9K3o5L8k1J6o9L1J4M3n9L3nn1J8J8j7K1n2J3LL0J2K4J3k3o1N4J4
5350D5j8k3M0j2m6%J9j4J9l4lJ3l0L2L2N1o9J4m5O6k8m1L3m7K9m2N0k2O7n2K7
5381A1k6j2J8J2N3k4k1rm5R2k9J9n8P6l3J6p9P1k0j8PM6L1n4J7r8Q1j9nl6O9k6
5413GO0q7qN1N3l6M1r1L7Lk2qj4L0n3K4OM0j1j5kl3P2l3nN6j42M0Q1m0L1n6O6
5446D2rj2L4p0L2l2l4P7l6jL8k4j7k8N0M5l4j0Pj01R4J3qQk5j2K6j5KJ2QKqo2
5480d8P1j2J3J1j8k0L1l1L6n0M2j0m7L2j1m2MJ0L7k5P0J7j03L3L5p2M0Pk2L9n7
5511d0M0J7n2P1o3P7k5l8Qk8K6l5O2pL8k1o3L6k3J1L4k6NQj5m5Q9m5J4m5O4m1
$$ plain form
5543 -12 -15 9 17 49 26 10 -14 -70 -2 26 32 -23 42 46 -23 -24 -34 -8 -24 -6 -27 -53 -15 -25 1 26 -7 -8 63 43 -9 0 5 -10
5577 -10 67 -25 -32 8 -67 4 89 7 19 3 12 -26 48 89 32 29 24 27 4 -7 -14 -28 5 -2 6 42 21 -22 -10 -49 27 1 -4 -18 7
5612 7 15 9 35 -42 -3 23 7 -5 -10 -2 25 25 4 23 -6 54 -6 1 -14 60 -55 16 55 -51 24 -45 -7 37 5 11 21 38 5
5645 5 -31 18 -11 19 48 12 45 25 7 3 11 -28 -45 -4 26 36 38 -1 -43 10 -58 30 -33 -21 -5 13 -27 -16 -44 11 -15 -12 12
5678 12 18 -20 43 37 32 7 62 -19 -7 -3 63 35 33 49 28 -6 -2 63 -27 -23 55 -29 13 -3 14 30 -20 17 -24 -20 35 31 -11 17 65
5713 65 10 9 45 18 -4 -4 2 13 16 -19 10 5 -33 39 80 -26 50 -10 63 25 -5 -4 6 49 84 -13 59 35 -54 -15 -37 22 -36
5746 -36 13 13 33 30 16 -51 -62 -33 40 29 18 22 -1 -19 -17 -46 7 -16 -31 33 9 23 8 -36 41 -23 20 16 10 45 -18 -44 -2
5779 -2 -37 -40 50 22 22 -33 9 40 5 -5 34 3 -11 31 31 -24 -10 -3 -13 -6 18 -10 14 21 29 9 6 16 -43 38 2 -16 20 32 9
$$ packed form
5543a2lK4QL2k3j6k4n6O8K8On5O5Mo9jj0K6j6J8k1k6L8j0K6K5l3jP1k0n2RNj5
5577a0P7r2pM0p5P1Q5q2J2j6Rl8P4M1n7lnLk3j1pj4L3pQL6k1m3J2l9P6k6nj4K5
5612GQoK6p7L9K6j6j2nQK7%k1J9k9O0o0Pj5P4j15P1L9j06P5o9L8M4l2OJ0J7l3
5645El6M9k9L0K9l6L3k0j8mQl9j7M1L0J0Kl9m2N3o8Q8o3J2J6J8m0J1k8N5k6LK4
5678A2Ol8O3onk5N5q1J2MO6k8kJ6k1l4MO5r0MP8q4M2j6J7J6n0L7m1MN5mm2K8M8
5713F5n5jL6k7k2%OJ1Ll5K9nl8P2M1j06P6o0P3l8l0JJ0M3L5r7P2k4q9L9k2N9n8
5746c6M9%K0lj4o7j1K9P3j1j1Mk3j8Kk9N3k3j5O4k4J4j5m4P7o4M3moL5o3k6M2
5779bl5lR0k8%n5M2L1l5j0L9l1j4M2%n5J4Pj0PK4k8K4PQk0lJ0n9Q1l6j8L6J2k3
$$ plain form
5814 9 -6 26 -52 -17 16 30 10 -53 -36 30 -11 -68 38 -14 -38 -9 47 19 -4 -60 -67 -1 33 -39 19 26 2 -21 64 62 5 40
5846 40 -4 -73 8 41 -25 -45 30 24 -10 43 -4 6 33 -11 -7 -76 32 -30 0 12 12 28 8 14 31 54 -72 61 -61 -36
5876 -36 22 -24 -4 -8 4 -17 57 -2 -2 10 -17 14 -14 -33 -3 33 8 -10 1 -11 -38 50 35 -9 -16 -26 -11 -19 0 3 19 17 -51
5909 -51 -20 -11 -40 -14 -22 -31 -50 -28 9 63 -76 45 27 -35 11 3 -13 34 6 -37 50 40 3 22 -27 -20 10 5 -14 3 27 -12
5941 -12 17 -52 -57 7 -21 -33 31 25 33 -18 38 -29 1 -11 109 -11 -9 -5 -25 -43 -21 36 33 39 -47 25 53 -6 -26 0 44 22 1
5974 1 10 19 -10 23 6 -9 10 40 -4 3 11 -42 9 -10 -24 -12 -20 -21 -31 4 -37 -4 34 27 47 12 55 4 2 27 62 -17 1 51 -43
6009 -43 15 -12 -48 13 43 -26 -38 -8 50 61 -41 -66 4 -41 -25 23 3 26 66 27 -28 -71 -17 43 -61 31 -9 1 -5 21
6039 21 -3 -21 7 28 -25 -24 8 -6 21 -53 -5 0 -7 -8 45 43 -8 -88 20 21 6 9 -17 24 1 13 -4 -5 -14 -43 53 15 -20 3
$$ packed form
5814Ij5L2p8L5L3J4k0o3J7O6m1n7J06n2k4K9N6k8k3n6pO6L4p2N8Pk4k3Q5kn7L5
5846D0m4o9Q1L3o6k0P5ol4N3m7J0K7m4Mo9J08o2L0J2%J6k0OJ7K3j26J33j22K5
5876c6N8m6K0mJ2k1P4n9%J2k7L1k8j9L0L6k5j8J1j2k7Q8j5m4pj0J5qJ9LJ6ko8
5909e1L1Rk9K6qrj9K2L7N4j39J21j8o2M6qj6M7k8m3Q7j0l7J9m9PL0nj9J7K4l9
5941a2K9o9nO4k8j2O4oQn1N6o7L0j2J20j20KMk0j8K2N7lOq6P2K8n9k0K6M4k2k1
5974ARRk9L3j7j5J9L0m4PQn3N1j9j4J2qjj0L5m1L3L8pK0l5M3n1kK5L5p9J8N0r4
6009d3N8k7l6O1L0o9j2L0N8J1j02k5P0m5J6M8k0K3M0l9n5m3N4O0j04R2m0J0oK6
6039B1k4j8K8K1n3JL2j4K7p4M8NpjN3kn1q0J08Jj5Lk6M1k3J2j7jrk9R6l8l5K3
$$ plain form
6073 3 -20 11 1 31 74 15 -42 -9 1 -20 18 6 -29 85 -7 16 45 -12 39 3 -55 -51 -10 25 -30 -29 58 -63 -21 14 -23
6104 -23 38 26 49 -14 -35 9 63 -5 31 16 -37 27 55 32 -17 -25 -24 -25 33 35 7 22 52 -7 73 5 36 -67 1 -3 -3 -27 -15
6137 -15 39 3 20 -60 34 50 -20 26 -20 -32 48 34 -17 45 -57 16 8 -7 -16 15 3 -39 2 8 -20 2 -19 19 20 4 5 -13
6169 -13 18 -12 -5 22 -12 20 13 -6 -13 -9 -31 21 57 13 -10 38 -18 -21 97 -6 -11 -25 -29 20 69 -40 -17 -19 -34 -18 40 37 -34
6202 -34 56 -10 7 -10 60 23 7 21 -23 -32 39 -7 39 -7 -25 -2 -62 50 -27 10 2 43 -3 -23 7 -48 34 -33 -27 20 20 39
6234 39 56 -35 60 -43 41 1 6 -14 13 15 -56 4 -16 16 -45 -36 20 -18 -35 8 -42 -5 -23 -26 -2 9 -9 -29 16 -8 13 -33
6266 -33 1 -36 19 54 12 1 -31 -40 37 15 -6 67 41 -19 51 10 16 45 -6 -9 1 -43 64 87 -62 42 -15 -15 15 15 -9
6297 -9 31 29 -7 -31 -25 -8 -67 10 24 30 81 53 -41 0 46 28 -51 -20 -18 57 46 -44 71 -63 29 28 15 69 -4 22 -13 -5 -36
$$ packed form
6073Ck3L1j0L0M3n9n7L3J0k1L8j2l5J14r2K3K9n7N1l6n8MM1L5n5JQ7j21M2L5l7
6104b3O1j2K3o3k1M4N4o8L6j5n3O4K8k3m9qJjN8Kk8J5L0n9Q0o8L1j03O8m%k4J2
6137a5N4l6J7q0R4J6p0M6m6j2Q0j4n1O2j02P3qj5rL1j2m2M1Ok8K2k1L8Jj6Jj8
6169a3L1l0PK7l4L2pj9pMk2N2L6m4k3M8n6lJ18j03nj4mM9M9j09K3kj5J6N8lp1
6202c4R0o6J7j7P0l7j6J4m4rP1m6M6m6j8K3o0J12p7L7qM1m6k0L0n5Q2o7OM7%J9
6234C9J7r1R5j03Q4m0Nk0K7Kp1O0k0L2o1RN6l8j7M3n0L7j8lK4J1j8k0M5k4K1m6
6266c3L4l7N5L5m2j1l2rP7k2k1P3k6o0P0m1OK9n1lJ0m4J07K3j49J04n7%L0%k4
6297iM0kl6k4OJ7n9P7J4ON1k8r4M1M6j8p9L1KP5j1r0J15j34R2jj3N4p3K6l5Ql1
$$ plain form
6330 -36 -27 41 -29 35 41 -10 -9 -44 15 25 -26 -23 48 -8 0 36 40 -23 -6 -17 -7 19 55 67 64 36 -8 5 -23 48 -18 -31 -14 -9
6364 -9 16 -15 2 24 -64 47 45 -1 28 18 15 -1 -16 -30 11 21 33 46 53 -21 4 30 2 -31 -9 -11 11 -24 -45 21 15 9 -4
6397 -4 -29 -49 13 -11 -20 -35 -27 -16 -43 5 29 -49 14 -23 5 -51 -20 8 -19 1 29 0 29 22 77 18 37 54 44 26 14 15 -3
6430 -3 15 44 -61 3 -5 -2 14 36 -25 -31 -10 60 -35 8 -25 -48 -23 4 4 -40 -14 32 -26 0 67 -32 -44 -20 -26 -26 12 -25 18
6463 18 9 -12 -10 53 -44 -18 30 29 23 -25 3 6 42 20 3 0 11 -12 -22 92 22 21 -67 -1 5 31 -10 -24 -21 -17 29 13 23 23 35
6498 35 -35 -14 -44 -32 -5 40 41 -18 -52 -21 23 22 -31 -54 26 -16 -1 -11 -18 -13 -5 -33 19 -30 38 -28 4 77 -1 24 -32 -4 56
6531 56 -28 -47 26 -60 -41 16 -31 -10 -33 -18 -3 28 19 10 6 -50 16 0 2 3 -31 1 8 21 -8 32 -8 9 -8 -38 -13 22 -6
6564 -6 -1 -4 -38 -15 -10 20 12 10 3 51 15 1 0 27 41 -44 -38 -9 1 64 -26 -16 -20 -1 10 -7 -11 -70 -8 -19 0 51 8 -86 -31 -7
$$ packed form
6330c6RO8p0O4On1Jl5N9J0n1LP1n6QL6Mo3J7j1J0K6L6J2lk8m4J3k8P1o6j3J7N
6364iK5l1J7K2q8J11km6K9j0lj6j5j4M1J0J2J3Pp4K5K6k8l3K2kK2l5k1O6ooj3
6397dk5k0O2k4rj5QJ1k7M8K4p8O3l7K8n6L1K8k7K0K8k9K9pN5n9J9J7j0j8j2Jj8
6430cJ8K9j05O4qLJ6K2o1oK1P0r5M3l3k3K5K7%m4K6M6n8K6O7r9j2K4o%L8l7M3
6463A8rk1KO3r7K6M8jom8K8LL6k2j7lJ1k3j0J14p0jq8O6OK6m1j4LMM6j6J0%J2
6498C5p0K1l0J2K7M5Jn9l4L1M4jn3k3Q0m2J5j0pNQk8N2m9O8o6L2P3p8K5n6K8O0
6531E6q4j9P3q6J9N7m7K1k3J5J5L1rrmn6O6j6KJl4L2PJ3k9M0m0J7j7l0K5L5k8
6564fNll4K3NL0qkpM8l6j4jK7J4q5OK9J0O3r0J0mJ9J1j7mn9O2j1J9N1m3r4N5K4
$$ plain form
6600 -7 26 2 10 3 -11 36 -22 12 55 -3 -6 76 -19 -26 6 -3 -15 28 -43 17 40 -40 -26 23 1 23 8 7 65 -35 -16 26 49
6633 49 27 35 -18 50 -63 -28 -30 20 -18 -3 31 23 -27 -11 -52 14 9 -22 17 -18 38 -16 -21 70 20 16 22 3 -32 6 2 -5 -28 -6
6667 -6 11 36 32 -13 -10 -25 74 29 5 -25 -23 22 39 46 5 50 26 -6 -13 -18 -43 -38 -29 -15 -20 -22 -29 5 -8 -5 -15 22 -2 -28 36 24 29
6704 29 11 -19 20 47 -6 -9 1 2 55 15 13 3 37 -30 19 71 39 11 -21 -31 40 -17 -34 24 60 -37 -24 -44 36 -53 -2 52
6736 52 -9 15 -1 -5 25 29 43 29 -4 2 -16 -15 -3 15 -40 1 -8 21 79 -20 12 51 -5 -71 -48 5 -11 21 -25 -26 14 -31 -18
6769 -18 26 -12 6 37 9 -6 50 -8 0 -75 14 37 5 -5 24 -6 37 12 -3 6 -19 16 -19 -28 23 44 4 29 20 13 13 5 -6 42
6803 42 21 -22 -33 2 23 23 -20 -9 4 -29 26 1 -21 1 -22 21 15 -14 5 -2 -17 -36 -10 -50 -27 -23 17 -3 19 -7 9 18 8
6836 8 -24 10 12 -6 12 8 17 -32 3 32 -54 -74 -1 -39 -29 9 53 69 53 10 -23 -51 26 12 -7 -25 -25 -73 -7 -50 -39 -40 -9
$$ packed form
6600gL3k4Qpj4M7n8L4M3n8lQ2r5pL2rj2M3p1O0K3q0J4M9k2K2j5jN8j00J9M2K3
6633D9k2Qn3O8j13L5kN0l8J5L4qn0J6m1O6nl1L9l5N6n4nR1n0mOj9l5L8mpk3K2
6667fJ7K5mm5Lj5R9m5k4l0KM5J7Pm1M5k4l2pnk5NRJ4nkpL4j3Lj0L7k4k6O4j2N
6704B9j8l0L9K7n3lJ0JN3m0kj0L4o7M9N2l2k8l2j0P1n7j7N8L6r7J3k0Q0q9N1N4
6736E2o1K4j6mL0MJ4j4l3Oj8JJ2J8n5M1rK9N8r9L2L9n6o6K3N3j6L2m6jM0m5J3
6769a8M4l8J8L1k8j5N6n8Qp5Q9K3l2j0K9l0M3k5j5Rk5L5l5rN1K1m0K5rp%qj1M8
6803D2k1m3j1L5K1%m3J1J3l3N5k5k2K2k3M3ok9J9pj5j9K6m0K3MM0k0K2k6J6Rj0
6836Hl2L4Kj8J8mRm9L5K9q6k0P3l8J0L8M4J6j6m3l3k8P7j4j9j8%m8O6m3J1jL1
$$ plain form
6869 -9 53 40 -23 6 46 64 -27 8 -2 -23 -12 -2 -6 -6 20 -9 -37 1 61 3 14 7 -12 -1 12 20 -14 -51 -2 -11 -40 16 -18
6902 -18 -40 9 50 -59 -1 28 -30 52 11 3 2 34 29 -11 39 3 -22 -22 37 0 -17 -3 -41 -13 -50 -23 -4 42 -16 20 -10 -44
6934 -44 -27 -10 -36 -8 -21 21 -13 37 -16 -29 -35 -37 -42 12 -29 46 5 -22 32 -24 65 37 -2 28 -1 -30 -11 10 37 -22 12 -25
6966 -25 -46 -46 11 -33 -2 -22 30 59 -28 19 -5 64 -15 -5 7 -36 12 37 21 -43 4 2 43 -12 -2 -37 -20 29 -28 7 -14
6997 -14 19 -19 -63 25 -31 29 15 -7 53 -54 -27 10 -19 12 12 -55 19 44 -7 1 27 -19 -1 9 13 12 22 19 3 13 -28 -33 39
7030 39 -14 32 27 30 43 23 57 -12 -2 -7 -13 -20 10 -22 -2 -75 52 -7 3 12 61 2 -2 -4 1 39 -45 -55 -45 -21 -33 60 16 -67
7064 -67 -13 5 23 10 -6 21 0 67 14 -41 -6 32 -20 -30 -13 -32 -39 -45 -1 10 7 2 -15 26 -31 -2 -32 -21 -32 53 58 -6 -19
7097 -19 7 14 31 4 -53 11 4 36 16 -9 -39 18 -1 6 27 -44 -10 27 21 14 -69 -22 5 -32 -3 -38 27 -1 7 4 -33 -21 -7 15
$$ packed form
6869iO2j3o3K9M0J8r1L5j0k1J1J0m%K6k9k8L8O0n8J1pj9J1J3Ql4l7M9rk9N6l4
6902a8k2M9M1j09N8K9n8Q2m1qjL2nm0N0l6k5%N9l7j7J4l8K8l7K7J9M6n8L6l0l4
6934d4J7J7k6K8j3M2l4N0n3j3oknN4m1P5m1k7N4n6Q9k8l9L0k9k9J9K1K7n9L4l7
6966b5k1%N7m4L1k0N2K9q7M7k4O9p9J0J2m3M8K5j6o4M7kM1n5J0l5J7M9n7L5k1
6997a4L3l8m4Q8n6O0j4k2O0j07K7L7k9L1%o7P4K5n1QK6m6J8J0MjJ0lj6J0m1nP2
7030C9n3M6nLJ3k0L4o9J0nopL0l2K0p3J27n9J0RM9n9mkNL8q4j0J0K4j2R3m4q3
7064f7N4J8J8j3j6K7k1O7n3n5L5L8n2j0J7j9poM4J1lnj7M1n7K9l0J1j1Q5No4j3
7097a9K6PJ7k7n7O4pL2k0k5l0N7j9PK1p1L4L7opq3M7K7l7K9l5O5k8Qll7J2J4K2
$$ plain form
7131 15 -14 54 61 -22 -34 -51 -31 -29 -23 -23 -18 -10 -20 74 -51 -42 -21 -49 -38 29 -36 -40 -56 36 10 58 -3 -48 1 -16 -59 40 -52 42
7165 42 74 1 14 3 -37 80 9 36 42 -53 -35 -23 28 -17 -17 60 4 -4 3 -3 -23 -34 22 -8 -4 11 73 25 -12 -64 -7 -24 -17
7198 -17 -18 -27 -28 26 -17 -15 62 65 -5 -13 11 19 15 -37 -11 20 18 -3 -17 -9 -33 -5 -10 -24 -28 -8 -4 -2 -40 -12 -3 -32 -20 22 -64 -28 6 24
7236 24 -24 -40 -28 13 33 19 -11 3 -2 19 -24 22 22 75 32 7 5 23 51 -12 5 -14 34 -15 14 14 25 -20 -12 19 9 -14 13
7269 13 6 -9 22 -38 -24 -17 24 22 -11 -13 -29 -4 7 34 -6 3 2 35 11 -11 54 11 -8 16 24 1 -8 5 44 2 20 12 -6 -23 -29
7304 -29 -16 11 17 18 27 -21 -40 6 -14 -25 -5 -25 57 -31 -14 11 13 18 70 -16 35 40 -20 3 38 12 56 -23 10 32 -26 22 35
7337 35 10 22 46 41 33 55 -26 -15 2 -10 -19 -4 46 34 19 -43 10 17 4 11 3 -39 -4 -26 -5 -69 -50 15 15 -22 19 -39 18 46
7371 46 54 -20 -11 28 13 -61 44 42 22 37 12 -18 -53 25 13 8 37 13 59 32 -7 -34 13 46 30 -15 -2 -44 -10 -26 4 -34
$$ packed form
7131A5k9O8Pq3j2j7K0KO%NQj0R4j25RK1k8J1O7o5mj6R2k6M8o1m5M9j7m3R9r2R4
7165D2L2p3J3j1m0J17p1K7Or5J8J2N1m5%P7n6qPok0j1N6l0MJ5O2m8l7n2N7j7P
7198a7jrjN4m3KP7Lp0qK4Qmn2K6L1kk1j4Qk4K8nj4mK0MKl8K8Rk9J2M2q6L6L4J8
7236B4m8j6J2M1K0j4l0J4nK1m3M6%N3m3k5kJ8K8o3J7j9M8m9K9%J1m5QL1j0k3K7
7269A3pj5L1o0J4PM1kl3kj6K5J1K7m0RjL3k4k2O5m3j9K4Qk3rJ3L9m2J8qj8j7o
7304b9J3K7OJRm8j9M6k0j1K0k0Q2q8J7K5KNN2q6N1No0K3L5k6M4p9L3K2n8M8J3
7337C5k5J2K4nqK2q1J1J7j2rJ5N0j2j5o2N3Pj3Pqm2L5k2K1o4J9O5%l7M1n8N7K8
7371D6Qp4RL9j5p4J05kk0J5k5l0l5P8j2nK9k4M6k7l9k7M7L3j6m5J3m2L4j6L0l8
$$ plain form
7403 -34 -24 -13 -32 56 33 47 -41 -21 -2 1 43 4 14 -12 9 13 -29 -25 1 20 44 -7 5 30 7 12 26 -38 8 4 28 -4 -2
7436 -2 57 -34 30 -1 16 0 -77 -10 14 44 0 18 -29 -9 59 21 19 9 21 -15 -5 -24 28 -27 12 -13 -26 -54 -15 3 19
7467 19 38 7 -9 35 -44 1 45 5 -34 -13 14 -7 68 -12 47 -34 -28 -8 -48 30 34 -22 24 33 -39 33 17 29 -35 -69 1 30
7499 30 38 -27 -6 -46 -12 12 12 59 -13 17 -41 24 11 57 -53 -41 33 18 22 27 2 91 27 21 -20 7 -18 7 11 9 -1 52 16
7532 16 -15 15 26 28 -18 -15 92 13 -8 -23 25 -15 -6 67 8 19 53 -9 15 33 3 29 -17 -30 3 6 -7 17 41 -47 -39 -61
7564 -61 -17 -18 23 0 -55 -33 -36 -50 20 -5 -16 23 -21 30 -6 -30 3 -7 -23 2 4 -18 0 28 0 73 11 25 -19 -30 -43 4
7596 4 48 -29 24 -8 -12 -9 52 -81 31 17 -5 -8 -44 26 -8 -9 19 12 11 -19 -46 21 37 14 29 -25 55 -40 -14 14 17 68 -9
7629 -9 2 26 -7 -20 1 62 19 -2 -50 32 12 29 -70 39 -21 12 -33 15 47 -45 -12 35 90 5 41 26 -36 11 -1 46
$$ packed form
7403c4J0J1j9Q8k3J4q8K0J9LM2l9J0k6K1Mm2MK6J9K4n1J2K5k3NJ4o4M6mK4l2K
7436bN9r1O4l1J7j6p7O7K4L0m4J8m7K0O8l8kj0J2l6J0j9N2n5L9k5j3k8L9J8J6
7467A9J9l1j6M4p9M5M4m0l9K1K7k1P5q0N9q1OK0m0P8Mn6M6Rp2P2j6J2o4l4P0K9
7499C0Qo5K1m0L4K4%M7p2L0n8O5j3M6j10J2P4j5MNk5Q9o4om1K7k5K5Mkj0N3l6
7532A6l1L0J1Km6LJ07p9k1j5M8m0RP3n9J1L4o2K4J8l0K6m6j3L3Lj3K4K4q8Qk2
7564f1M4jM1k3n5K2lj4P0k5j1L9m4N1l6k4L3j0j6K5Kk2J8K8k8P3o2J4m4j1j3M7
7596DM4p7N3l2mLO1j33J12j4k2ll6P0l4jK8pjl0k7O7J6k3J5n4Q0r5K6K8LN1p7
7629iJ1K4l3j3K1O1m3k1m8Q2k0J7r9J09o0L3m5M8L2r2L3M7N5q5L6j5o2M7j2M7
$$ plain form
7659 46 -1 -24 15 -23 -17 9 -20 15 46 18 32 41 -10 -37 30 72 23 -2 -18 -5 -25 4 49 -4 14 15 -49 -41 30 28 -1 -69 3
7692 3 -47 6 37 -39 -7 -60 7 -38 37 -13 16 34 24 13 -13 8 25 -6 -12 19 -19 -9 -8 24 34 10 21 29 9 -2 48 -29
7724 -29 56 -2 13 40 0 5 -40 20 22 17 -36 -41 -31 -20 -8 -21 -46 -29 9 -14 -31 -33 5 -24 -3 27 4 15 -7 20 -13 -7 -11 37
7758 37 -41 -51 -76 -47 -10 6 -8 12 -35 3 -19 24 -11 -41 -25 -33 39 28 24 10 -16 -16 -25 -36 -19 17 -3 -42 -44 31 68 41 23
7791 23 -11 9 -18 -36 31 42 -16 6 22 -18 0 5 -49 10 -15 29 14 20 -16 15 52 -38 18 -48 52 2 -41 -13 15 -54 89
7822 89 -55 -22 26 47 -71 39 -2 2 -11 -28 8 0 -15 -11 3 54 -16 -49 18 25 4 40 7 32 17 39 14 30 29 -26 0
7853 0 -63 -89 19 52 -20 20 -36 -56 39 -29 -13 24 12 -56 26 -4 58 -69 -48 -2 -46 12 -42 21 2 15 8 -43 -22 14
7883 14 31 17 -10 -17 30 37 24 36 -16 -18 -6 33 52 9 -17 -21 -41 26 -20 19 11 27 -9 56 22 -56 -19 -34 -4 -8 1 -33 16 -23
$$ packed form
7659D6m7k3L9l8OK6k9L5L1k8J4Rn1k7O7M2m9k5j6J3k0K9M5n3J8Jo4QP1kk9o8P2
7692Cn0N3L1p6L2n3O7m5P5n0K9J8j0j1k6K1J7l1oL1l8J0JL2J0k4J1Qk0j1N0p7
7724b9Q5n8J5K7m0Nm5O0Knn3nJ0J1J2j3k5J7L8k3j7kL8k9K1L0k3J1k2K7l3OmM8
7758C7p8j0k5K9L7J6j4K0m7L8k2M3l5l0J6qP2j1mj4k6%rj1J7L6k0l9kP5L7k7j8
7791B3l4K0k7j8O7J1n8K2J6m0J8Nn4N9k5M4j5Ol6L1L7r0N6o6J00n0m3K8K8o9J43
7822H9j44L3M8K1j18J10m1Mj3j7L6qj5MJ4N1p0l3O7Pk1L6l3K5j5K2k5J6jn5K6
7853@o3k6J08L3p2M0n6k0R5o8J6L7j2o8Q2l0O2j27K1M6m4N8n4O3j9J3pn1K1L6
7883A4J7j4k7pM7Pj3J2n2kJ2L9J9m3k6mk0O7m6L9qJ6l6O5l4p8L7j5L0mRl4M9l9
$$ plain form
7917 -23 -4 -24 -35 48 -30 38 -49 -5 -26 -10 -5 21 19 -23 14 0 -31 66 37 -14 -57 -8 6 9 20 -11 38 -8 -55 4 47 -39
7949 -39 37 -39 3 25 18 27 -6 18 35 -36 -3 23 -40 24 -24 43 61 17 12 18 43 -10 -8 29 20 33 47 38 9 -43 -32 40 34 -16
7983 -16 -14 0 -43 -35 -12 -52 52 41 -5 -22 -16 10 -5 21 -29 -57 -49 -60 -10 17 22 -28 31 -1 -31 -42 -35 -3 27 47 41 18 27 15
8017 15 -48 2 -1 -17 24 23 -15 9 36 -3 32 60 16 -36 15 -65 22 30 -27 3 23 20 18 16 18 21 -67 5 -74 -24 -41 -2 19 27 17
8052 17 -29 44 29 -11 -32 -6 -12 -26 -15 27 -12 9 -16 5 -43 -19 -27 -9 -6 -41 8 11 -19 8 -5 -54 -28 39 -3 -48 -2 -37
8084 -37 -8 -11 -31 -43 -49 9 -4 19 1 48 -7 -7 36 21 -13 -46 -2 -52 20 -17 -7 26 9 -11 6 -8 1 27 58 6 -41 -16
8116 -16 18 -7 16 2 -27 -8 20 27 10 61 -22 26 -22 7 65 -13 26 -4 -12 24 9 15 -3 -11 12 1 -32 -42 -38 13 -16 -19 3
8149 3 -21 -11 0 -11 8 23 21 14 31 -3 -2 32 12 -5 52 36 17 22 -34 -19 -5 35 -38 55 52 36 51 -20 -1 5 15 37 -9 43
$$ packed form
7917b3J9k0j1Q3p8O8q7M4k1J6NK6km2L7j4l1R7k9n1m3M9J4LJ1l1M9m6m7N9M3q6
7949c9P6p6M2K2pRl3K4J7p1L3K6o3O4m8O7J8m4nOK5n3KL7rJ3J4rk9n2J1P2on0
7983a6KJ4m3QK3m0J04j1m6j7OK6j5K6n0k8Qj1N0K7Nn0N9l2l0j1PL2L0K0ok3Rj2
8017A5o3N0lj6M1jl8K4K7l9L5K8m4n2N1q0Q7Qn7L0K0lkkKLq8P2p9N0j7L9K1Qj0
8052A7m6P3j5m0k1K6oj4J1M2l9K1k5K1m8K4qJ8Ll5M9Ll0K7j3m9K6O7m2m5M6l5
8084c7K9lk0j2oN8j3K3j8M7n5%M3j5l4l3M4n0P2l7J0L3j7k0J7j4RK6L1n2m7K5
8116a6L4k5K3j4k9J9K8Pj7N1q3M8m8K9N8p8L9l0qL6j5Oj8qK3j1l3j0MN1k9lK2
8149Ck4J0J1j1J9J5kpJ7l4JL4k0j7N7j6j9Nn6J5J4M0p3R3lj6J5p1J9OJ0K2m6N2
$$ plain form
8183 43 41 -24 8 -53 1 -19 41 -16
$$ packed form
8183D3ko5L2o1N4k0O0n7
8191a6
$$ Imaginary data points
##PAGE= N=2
##DATA TABLE= (X++(I..I)), XYDATA
$$ plain form
0 0 0 0 0 0 0 0 -8 0 -8 8 -8 16 -16 24 -24 32 -40 50 -64 74 -88 112 -128 152 -176 208 -240 280 -320 368 -420
31 -420 480 -545 617 -697 784 -881 985 -1098 1226 -1365 1517 -1683 1864 -2059 2276 -2510
47 -2510 2769 -3050 3361 -3704 4081 -4497 4964 -5486 6076 -6745 7517 -8416 9478 -10753
61 -10753 12320 -14306 16904 -20474 25706 -34144 50023 -90429 419045 648068 -183542
72 -183542 -116587 203359 242755 -66713 -119873 -125495 -184900 -264337 -205683 -200535 -171581 -99272
84 -99272 -54236 -153380 -148507 37198 193008 103045 -1976 55696 171196 163517 113518 82355
96 82355 54470 24735 47668 48449 -20260 -79908 -58048 -42888 -69443 -77552 -52713 -54963 -66134
109 -66134 -47254 -22616 -14417 14582 42248 13812 -19743 27600 92727 68633 2397 5606
$$ packed form
0@%%%%%%qQqJ6j6K4l2M0m8N6p2R0j14J38j62K00k40K80l28L84m48N20o00O88p88
31d20R00j025J162j314J481j665J866k083K324k591K882l200L547l923M335m786
47b510N279n819O411p065P785q578R461j0450J1562j2821J4262j5933J7894k0231
61a0753K3073k6626L1210l7378M6180n9850Q4167j40452N09474K29023q31610
72a83542O6955L19946L9396l09468n3160n622n9405p9437N8654N148K8954P2309
84i9272M5036r9144M873J85705J55810q9963j05021N7672J15500p679m9999l1163
96H2355k7885k9735K2933P81o8709n9648K1860J5160k6555q109K4839k250j1171
109f6134J8880K4638Q199K8999K7666k8436l3555M7343O5127k4094o6236L209
$$ plain form
121 5606 48347 38370 -577 2713 17591 -7411 -34412 -20499 -5184 -21873 -33936 -21873 -18877
134 -18877 -26555 -14277 3449 -3967 -13193 3724 20268 12487 7185 19901 22761 9180 7703
147 7703 19604 17447 1054 -5241 -584 -1852 -7801 -7985 -7951 -14075 -16897 -11055 -5234 -4851 -5011 -3462
163 -3462 -2728 282 6732 9615 6781 6156 8480 6506 2896 5922 9731 3650 -5579 -5174 579 129
179 129 -4745 -6587 -5726 -5099 -4031 -2422 -2110 -2126 -243 834 111 1091 4342 5091 1969 291 2691
196 2691 4506 2668 238 -440 -410 -472 -101 -354 -2349 -3355 -1980 -736 -1308 -1713 -992 -747 -1012 -350
214 -350 1064 1392 950 663 527 817 1889 2283 1151 -484 -309 906 879 -334 -902 -601 -827 -1183 -881
233 -881 -258 -601 -1154 -893 -340 135 292 374 192 136 679 1119 855 370 355 451 349 249 237 -53 -545 -618
$$ packed form
121E606M2741r977l8947L290J4878k5002k7001J3913J5315j6689j2063J2063K996
134a8877p678J2278J7726p416r226J6917J6544p781n302J2716K860j3581j477
147G703J1901k157j6393o295M657j268n949j84L4o124k822N842N821L83j60J549
163c462P34L010O450K883k834o25K324j974l610L026L809o081r229M05N753m50
179A29m874j842Q61O27J068J609L12j6J883J077p23R80L251P49l122j678K400
196B691J815j838k430o78L0o2L71k53j995j006J375J244n72m05P21K45k65O62
214c50J414L28m42k87j36K90J072L94j132j635J75J215k7j213n68L01k26l56L02
233h81O23l43n53K61N53M75J57Q2j82n6N43M40k64m85j5R6j02j00j2k90m92p3
$$ plain form
255 -618 -239 -140 -442 -685 -628 -347 -199 -66 41 39 -87 -12 319 494 487 286 4 87 320 373 105 -172 -242 -234
279 -234 -111 19 -73 -288 -300 -223 -95 6 54 -15 -121 -142 109 246 216 28 -25 -76 70 191 190 65 -137 -116
303 -116 17 92 -4 -16 -65 -106 -117 20 136 6 -134 -69 33 92 68 51 35 7 56 64 92 103 -54 -14 -3 -27 78
330 78 -12 -29 -46 -77 57 12 -80 -34 -23 -43 17 65 58 -3 35 10 59 40 6 44 25 -29 10 47 -2 -48 -47 22 -29 -4 -48
361 -48 -30 -10 -10 52 -7 -37 8 -70 43 26 -26 -1 -52 -72 -10 35 -21 29 -52 -16 -16 -7 -54 15 3 2 60 15 -29 -42 -26 -51
393 -51 -38 67 -22 -6 54 -69 -14 25 19 -2 -8 3 -16 31 55 -17 3 -16 14 6 32 27 -34 9 -66 -16 -57 3 -2 -36 -9 -15 35
426 35 5 5 4 -8 8 40 15 3 -53 38 78 50 56 10 -6 -2 -4 6 6 69 22 -5 20 -80 -18 -37 -18 11 -7 27 -27 -2 26
459 26 -12 16 46 -41 30 -41 -24 39 -32 -12 10 -8 18 0 -12 -10 26 6 2 27 70 -38 -18 -9 1 -18 -38 -1 -41 -8 29 22
$$ packed form
255f18L79R9l02k43N7K81J48J33J07kj26P5L31J75pk01k82Q3K33N3k68k77p0Q
279b34J23J30r2k15j2P7J28J01M8o9j06k1K51J37l0j88n3n1J46J21jj25k02K1
303a16J33P5r6j2m9m1j1J37J16j30j40O5J02N9k4j7j6k8M9QK8J1j57M0J1k4J05
330G8r0j7j7l1J34m5r2M6J1k0O0M8po1L8k5M9j9l4L8j9n4L9L7m9m6JO9n1K5m4
361d8J8K0%O2n9l0M5p8J13j7n2K5n1k0O2M5n6N0q1L6%Rm7O9j2jN8m5m4j3J6k5
393e1J3J05q9J6O0j23N5L9ok1oJ1j9M7K4p2K0j9L0qK6no1M3p5N0m1O0nl4K7oN0
426C5l0%jj2J6L2k5j2n6R1M0k8Om6j6MkJ0%O3m7k7K5j00O2j9J9K9j8L4n4K5K8
459B6l8K8L0q7P1p1J7O3p1K0K2j8K6j8j2KL6k0mK5M3j08K0RJ0j9k0L7m0L3L7p
$$ plain form
491 22 -16 -1 -14 0 15 -8 -38 6 66 26 14 -29 72 -21 2 -51 -47 23 15 -9 -15 -37 -12 59 -10 29 5 -19 22 11 -8 25
523 25 -3 30 -2 -2 60 -35 -26 -17 -20 40 -17 53 -14 -44 0 -22 -25 36 -7 -3 -12 1 8 -6 -16 17 21 -49 19 38 -39 -21 -6 43 0
558 0 33 0 10 -28 50 15 0 28 -9 2 10 -47 2 8 76 -3 33 -20 20 74 11 -26 -2 -21 -49 39 -7 -26 -20 -45 6 5 -35
591 -35 -20 24 0 -36 45 -7 18 5 2 1 14 -4 17 -3 36 -55 -8 -13 -4 -4 -21 -38 -11 23 6 48 31 -42 -13 40 22 24 58 35
625 35 -8 20 38 -3 -24 0 -73 -21 7 -16 51 -10 22 55 -18 -7 43 15 36 11 -14 -24 5 -11 4 27 -15 50 -20 8 38
656 38 31 2 6 -25 48 -7 -2 21 -70 -23 44 -12 42 -57 -34 -50 -2 -16 -3 34 24 -32 -56 36 -41 -27 39 15 10 53 -1 5 -7
689 -7 -33 47 1 -5 14 2 11 30 1 17 23 -5 20 20 3 -33 -6 48 -34 41 7 -10 -2 18 29 6 -17 -26 -4 31 51 -11 6 -20
723 -20 7 9 3 -1 42 -9 -34 -38 75 -57 -15 5 -25 74 -2 53 18 63 -9 -36 23 -23 -35 40 7 30 -16 11 64 -6 -26 -19
$$ packed form
491B2l8J5j3J4J5k3l0M4O0m0j2m3J01r3K3n3MP0qk4ok2K5P1o9L9k4k4M1j1j9L3
523B5k8L3l2%O2r5RRlO0n7P0o7l0M4k2lO1m3MrJ3Pj4j0L3Mp0O8J9p7J8J5M9m3
558@L3l3J0l8P8l5j5K8l7J1Qn7M9OO8p9L6n3M0N4o3l7K4j9k8Q8m6j9Ok5N1jm0
591c5J5M4k4l6Q1n2K5j3ljJ3j8K1k0L9r1M7nR%j7j7K7L4j7M2j7p3K9N3j8KL4k3
625C5m3K8J8m1k1K4p3N2K8k3O7o1L2L3p3J1N0k8K1k5k5j0K9j6J5K3m2O5p0K8L0
656C8pk9Ml1P3n5NK3r1M7O7n6N4r9K3j6M8j4J3L7j0n6k4R2p7J4O6k4nM3n4Oj2
689gk6Q0m6oJ9j2RJ9k9J6Ok8K5%j7l6K7N4q2P5l4j7QK0J1k3k3rK2L5K0o2J7k6
723b0K7KomM3n1k5mJ13j32M2K0l0R9p6N5l5M5p2k7N9m6j2P5l3K3m6K7N3p0k0P
$$ plain form
755 -19 -21 -7 15 -36 1 -13 -23 -23 -62 34 36 -18 -20 -27 26 15 -25 -3 52 29 13 19 101 -36 15 56 54 21 -1 -4 -9 44 18 -33 -29
790 -29 -33 12 -46 -13 -72 5 -46 -20 -30 -7 -9 -30 33 21 32 -21 -28 -4 6 -55 34 -9 5 7 12 -32 0 13 38 -1 20 24 -12 -43
824 -43 -40 27 12 49 9 5 46 -1 5 -17 -45 -29 -77 -61 -33 -14 0 -8 -14 -25 4 26 -6 23 8 -62 16 -20 -85 -38 -3 35 71
857 71 -12 15 -29 -29 25 -42 3 33 13 -71 -9 67 42 45 28 -11 2 9 -19 -69 8 30 1 34 -7 24 52 -35 6 9 4 -25 -29 5
891 5 37 -13 -70 -56 -33 -4 -5 44 17 15 42 -39 33 -17 -45 41 28 18 52 0 -17 -33 -38 40 24 -25 21 3 21 -33 -16 6 0
924 0 26 -42 -55 -34 -32 -10 -9 0 -7 9 -27 0 38 8 2 73 -18 -9 2 21 -8 -2 -19 -32 8 17 32 -12 -15 2 27 17 27 -38 10 -30
960 -30 -43 -15 17 -10 0 11 31 -57 27 -6 -60 24 -1 10 12 -47 -14 6 35 -32 -26 21 47 -6 -29 -37 -25 -36 67 58 -37 -28 -7
993 -7 34 7 30 -20 -5 -15 -35 -33 19 -13 -27 -6 37 11 28 35 -29 7 -33 23 84 -8 -18 47 23 -13 27 -2 35 -91 35
$$ packed form
755a9kJ4K2n1L7j4j0%l9R6Kn4kpN3j1m0K2N5k3j6OQ2j37N1M1kl3k2lnN3k6n1M
790b9mM5n8L3n9P7n1K6j0K3kk1O3j2J1n3pK4J0o1Q9m3J4KNm4L2J3K5l9K1Ml6l1
824d3LO7j5L7m0mM1m7Ok2k8J6m8J6K8J9J4qoj1K9K2l2K9j5p0P8l6o5M7L5L8L6
857G1q3K7m4%N4o7M5L0k0q4O2P6k5Lj7l9J3Pk8n0P7K2k9L3m1L1K8q7M1Lnk9mL4
891EL2n0n7J4K3K9jM9k7kK7q1P2n0k8Q6j3j0L4n2j7j6nP8j6m9M6j8J8n4J7K2o
924@K6o8j3K1KK2JRpJ6l6K7L8l0oP1r1RJ1J9k9Oj7j3M0RJ5m4lJ7K5j0J0o5M8m0
960c0j3K8L2k7J0J1K0q8Q4l3n4Q4k5J1Kn9L3K0K9o7OM7K6n3k3qJ2j1J03rr5RK1
993gM1k7K3n0J5j0k0KN2l2j4K1M3k6J7Po4L6m0N6O1r2j0O5k4l6M0k9L7j26J26
$$ plain form
1024 35 38 15 -32 36 3 37 -42 19 2 -11 44 7 7 15 23 -1 -16 -16 19 -16 -28 21 20 -6 32 -24 -38 5 22 47 -15 -63 8
1057 8 0 -4 -38 17 7 1 -34 -17 11 -20 -30 19 38 -17 -4 -12 -37 11 18 43 93 -51 15 -24 30 46 46 2 -45 -9 -19 23 26 -28
1091 -28 -41 38 -4 10 -5 -10 32 28 -2 4 -25 19 0 17 14 55 -4 -31 -7 31 49 -4 1 17 -18 26 72 -11 -10 16 4 22 48
1124 48 32 3 -90 9 -7 -15 -31 -22 -35 2 -82 0 -21 17 9 49 3 -11 -5 25 26 30 -2 -10 10 12 -18 22 10 -9 39 38 -24 29 61
1159 61 -41 11 -37 19 37 3 21 14 32 10 12 32 -19 1 -8 -4 49 24 1 25 -61 21 1 -16 -67 -2 61 40 -18 0 21 5
1191 5 -3 7 41 25 -24 -23 19 5 29 62 48 8 -4 -41 -3 10 -43 0 -53 3 35 35 -15 37 20 -15 -37 -33 -63 1 50 -4 41
1224 41 -12 -3 -27 -42 -12 -15 1 -7 25 10 -43 13 26 -12 -43 -13 -26 -44 -13 21 42 -12 -36 7 23 -3 2 10 6 -12 0 -25 -25 -22
1258 -22 14 -14 -21 14 -19 -2 -15 10 -12 35 -1 62 -55 -7 -44 -18 10 50 20 10 -2 18 10 -6 -18 -5 49 23 0 45 -26
$$ packed form
1024C5Lk3m7O8l3L4p9O1j7j3N5l7%QQk4j5%L5l5j2M9jk6L8n6j4M3J7K5o2m8P1
1057Hqml4N5j0ol5J7K8l1j0M9J9n5J3qk5M8PK5N0j44O6l9N4J6%m4m7L6j0M2Ln4
1091b8j3P9m2J4j5nM2ml0Ok9M4j9J7lM1n9k7K4L8J8n3NJ6l5M4M6q3JK6j2J8K6
1124D8j6k9r3R9j6qj6Rj3L7q4Q2k1L8qM0m6j4OL0JMl2qK0Kl0M0j2j9M8jo2N3L2
1159F1j02N2m8N6J8l4J8pJ8k2KK0n1K0rMN3k5k3K4q6Q2k0j7n1O5O3k1n8J8K1j6
1191EqJ0L4j6m9JM2j4K4L3j4m0j2l7L8J3n3M3n3N6L2%n0N2j7l5k2Ml0O4M9n4M5
1224D1n3Rk4j5L0lJ6qL2j5n3N6J3l8l1L0j3j8L1L4K1n4k4M3J6k6NQmj8J2k5%L
1258b2L6k8pL5l3J7j3K5k2M7l6O3j17M8l7K6K8M0l0j0j2K0qj6j2J3N4k6k3M5p1
$$ plain form
1289 -26 10 54 -25 26 28 -11 -35 49 -43 61 -1 -37 -7 29 -38 -5 -10 -46 16 37 -5 22 3 1 -12 40 13 46 32 -76 -9
1320 -9 28 -4 21 13 -22 23 -27 -4 -18 -6 24 -10 -1 -8 -12 -8 30 -1 -25 -60 -4 43 40 -43 24 -36 17 22 -20 45 -13 -8 -68 -26 57
1355 57 -2 29 53 14 -44 -22 -78 -29 -51 16 36 -27 0 10 26 29 13 31 -10 13 -6 -46 1 13 -3 18 1 34 35 2 -24
1386 -24 -3 -31 -3 11 -7 -1 3 13 -23 -1 29 19 1 -52 -6 4 -1 -22 22 -64 -53 12 -32 28 -4 11 -27 -30 -14 26 5 40
1418 40 -5 -56 59 23 57 -29 -51 40 -15 37 -4 -48 -30 -6 -19 -13 -28 28 -19 17 -35 -20 27 4 35 24 -1 46 -39 31
1448 31 6 -6 34 -14 26 43 29 47 15 -64 -22 -16 1 -20 0 4 8 -3 8 -4 -17 34 12 78 14 -9 -2 1 1 8 10 -39 6 30
1482 30 27 15 -20 -16 41 -3 8 -8 -17 -58 13 37 7 7 1 17 11 4 -16 -7 -40 -41 -20 -44 0 -32 -2 -72 -8 -22 -25 -31 -29 12 -3 -4 -23
1519 -23 32 17 2 -27 2 -36 -6 -2 13 31 -20 27 3 5 0 -5 48 26 11 -4 -17 34 30 -6 14 -33 17 27 -8 -9 -8 -49 -21 -8
$$ packed form
1289b6L6M4p9N1Kl9k4Q4r2J04o2l6L0L6o7L3nl6O2K1m2K7j9kj3N2k7L3j4j08O7
1320iL7l2K5ql5M5n0K3j4J2L0l4RpmML8l1k4l5N6M7lq3O7o0N3Nm2O5n8No0M2Q3
1355E7n9L1K4l9n8K2n6M9k2O7K0o3K7J0J6Lj6J8m1K3j9m0M7J2j6K1j7L3Jl3k6
1386b4K1k8K8J4j8OMJ0l6K2L0j0j8n3M6J0nk1M4q6J1O5m4O0l2J5l8lJ6M0k1L5
1418D0m5n1J15l6L4q6k2R1n5N2m1m4J8K4j3Oj5N6m7L6n2J5M7k3L1j1k5M7q5P0
1448C1k5j2M0m8M0J7j4J8l2p9M2OJ7k1K0MMj1J1j2j3N1k2O6o4k3PL%PKm9M5K4
1482C0lj2l5MN7m4J1j6rm1P1K4l0%oJ6opk0Rl3jK1k4M4l2L0p0O4j4loKM1j5jj9
1519b3N5j5j5k9K9l8L0MJ5J8n1M7k4KnnN3k2j5j5j3N1ml6K0m7N0J0l5jJm1K8J3
$$ plain form
1553 -8 -1 -52 -30 -59 3 33 13 13 65 41 -17 5 -11 -54 -4 13 -1 32 -43 -4 -1 -1 -4 -40 -16 -11 -9 1 -14 27 -10 -11 -1 11 19
1588 19 31 50 -5 88 15 -58 -19 -28 32 -10 -44 42 -41 -15 23 14 -11 -34 -16 11 -7 -1 3 -24 -73 -18 90 50 -37 13 26 33
1620 33 -21 -45 33 -20 18 -16 70 18 46 36 27 14 -50 31 60 3 2 58 -28 -37 25 4 -42 42 -3 26 -10 65 10 -7 36 -8
1652 -8 -21 32 -11 -29 21 24 -27 54 0 9 13 60 -21 -8 -24 2 2 2 36 -42 5 15 -23 -17 -23 -31 -42 21 -4 39 25 -46 49 -62
1686 -62 -53 4 34 -19 20 -11 27 12 -6 -22 1 17 -11 -28 40 57 -16 -31 -11 25 7 0 21 56 24 32 13 21 7 13 32 -8 35
1719 35 15 -65 -36 42 -3 25 -37 14 -12 -3 46 38 -7 8 -3 -31 10 -1 -32 19 -34 -10 -2 -23 -15 27 -23 15 21 -28 -13 -12 -24
1752 -24 12 44 -14 -32 -5 -8 22 17 -15 -20 28 -20 -1 19 8 -25 -14 -10 -10 5 4 26 -27 21 -1 -29 19 -26 -9 -15 42 105 5
1785 5 -10 47 -16 -5 36 22 -67 34 5 19 16 -21 -1 -3 24 -27 37 -35 -26 -21 8 4 -19 39 -17 4 -17 -34 39 54 16 -19 1
$$ packed form
1553hPn1K2k9O2L0k0%N2k4n8K2j6m3N0J7j4L3p5L9L%ll6K4NKJ0j5M1l7jJ0J2Q
1588A9J2J9n5R3p3p3L9rO0m2l4Q6q3K6L8rk5k3J8K7j8OMk7m9N5J08m0q7N0J3P
1620C3n4k4P8n3L8l4Q6n2K8j0rj3o4Q1K9n7jN6q6rO2k1m6Q4m5K9l6P5n5j7M3m4
1652hj3N3m3j8N0Ln1Q1n4RMM7q1J3j6K6%%L4p8M7J0l8Ooqj1O3k5M3j4p1R5j11
1686f2RN7L0n3L9l1L8j5j8j6K3J6k8j7O8J7p3j5K0L6j8pK1L5l2Qj9Qj4OJ9m0M3
1719C5k0q0K9P8m5K8o2N1k6RM9qm5J5j1k8M1j1l1N1n3K4Qk1QM2n0L8Om9J5Jj2
1752b4L6L2n8j8K7lL0nl2nM8m8J9K0j1l3J1M%J5jK2n3M8k2k8M8m5J7oN7O3j00
1785Ej5N7o3J1M1j4q9J01k9J4ll7K0kK7n1O4p2RNK9mk3N8n6K1k1j7P3J5l8l5K0
$$ plain form
1818 1 30 25 -1 -41 -5 -20 -10 26 9 38 -29 -52 19 -21 12 42 -20 -14 19 19 -51 -63 -24 -15 -34 1 2 -34 -22 22 -10 62 38
1851 38 26 -36 -2 10 -8 -29 14 64 -1 -24 31 -12 -5 -10 -39 15 -11 22 36 42 28 24 55 -25 12 14 56 -5 27 32 44 -58 -13
1884 -13 47 11 30 -11 22 -64 73 -16 -26 19 -4 48 -32 69 43 28 -8 -3 32 11 0 34 8 -17 48 24 -27 18 -35 -98
1914 -98 53 -32 10 -39 2 -39 -9 13 6 -30 -54 -22 -9 -34 14 30 15 39 40 33 -16 26 14 -22 16 0 33 -107 -6 35
1944 35 24 -61 -4 34 25 7 -41 -3 -8 39 -11 1 15 18 37 -55 16 -4 35 13 -1 -33 -27 23 -26 -34 -27 -20 -4 1 -25 34 -17 -52
1978 -52 1 -40 -31 -9 -16 27 20 0 -4 36 34 -16 -43 -51 -23 -12 -15 -36 9 -15 25 -48 1 -21 -2 -21 28 43 46 41 -22 17 17 -12 -13 -1
2014 -1 -14 27 19 -1 20 -14 37 15 -76 39 10 7 -19 26 -13 -37 1 -24 -98 -15 4 3 24 0 22 -1 -29 -22 49 0 -5 -8 -4 -35
2048 -35 3 -8 -13 9 33 2 19 30 -10 2 3 12 -38 35 17 -4 -35 -28 -67 24 4 -14 25 17 6 13 -7 -42 -11 23 9 6 61 -69
$$ packed form
1818AK9nk6m0L6j5J0L6j7K9o7k3P1m0L3L0o2OL3%p0j2L9Rj9L5Jl6J2M4l2P2k4
1851C8j2o2L4J2j8k1M3N0o5k3N5m3Pnk9N4k6L3J4Oj4mL1q0L7KM2o1L2NJ2j02M5
1884a3O0l6J9m1L3q6J37q9j0M5k3N2q0J01k6j5l6NL5k1j1L4k6k5O5k4n1M5n3o3
1914i8J51q5M2m9M1m1L0K2pl6k4L2J3k5M8J6j5K4Jpm9M2j2l6L8j6L3j40J01M1
1944C5j1q5N7L8rj8m8L8nM7n0J2J4LJ9r2P1k0L9k2j4l2ON0m9qPPJ6Nk6N9n1l5
1978e2N3m1RK2pM3pk0mM0kn0k7qK8J1lk1M5k4M0p3M9k2J9j9M9J5Lno3L9%k9jJ2
2014aj3M1qk0K1l4N1k2r1J15k9lk6M5l9k4L8k5p4Q3J9jK1k4K2k3k8PP1m9nlMl1
2048c5L8j1nK2K4l1J7J1m0J2JRn0P3j8k1l1Pl9R1k0j8L9qj1Pk0l5L1L4j4lN5j30
$$ plain form
2082 -69 -49 31 -54 -3 -13 -12 5 0 -11 5 -52 -17 -8 -7 16 -14 5 -4 -5 7 -23 -49 -1 -19 26 9 12 45 -12 -4 11 4 -10 12 -10
2117 -10 34 -28 62 19 -41 34 -1 20 0 38 0 7 45 -11 -9 9 -14 26 -6 -14 24 -4 -48 -33 -8 -11 -63 6 26 -57 7 -3
2149 -3 -82 3 -58 -15 -6 -55 -74 -84 8 -9 -37 -4 -3 -17 28 -22 5 13 18 -30 -39 -27 -61 -11 5 -9 16 14 16 9 -6 -36 37 2 -10
2184 -10 -29 -26 16 14 23 2 -14 -30 -56 23 46 -20 -8 29 29 -19 19 -36 -6 -5 48 42 18 -35 31 20 59 42 -33 3 -5 -9 -1 43 -36
2219 -36 -33 -73 6 28 -25 -5 -12 -9 -14 15 11 3 -18 -41 10 36 27 -16 17 37 -31 54 -34 0 -25 21 15 28 35 -30 -18 42 -26 -3 26
2254 26 -1 19 22 28 -36 -15 16 53 -7 -2 -23 34 -5 6 -8 52 -1 28 14 -7 44 -14 -46 56 -47 -34 -26 31 -10 -3 47 15
2286 15 19 -27 34 -31 -32 28 -37 1 -33 53 39 -17 47 43 -13 -24 1 35 15 25 -6 9 -45 -13 -10 -16 -18 -17 -64 38 -57 8 -11
2319 -11 18 52 -3 14 -36 10 0 -47 -12 3 17 42 18 2 20 4 -31 27 6 -9 58 24 -21 0 12 -31 -39 -7 -59 12 28
$$ packed form
2082f9K0Q0q5N1j0JJ7nj1J6n7L5RJK3l0J9rjJ2l0k6M8j8M5j7LL3n7QJ5pj4K2k2
2117a0M4o2R0m3o0P5l5K1k0L8l8PL8n6KJ8k3M0l2qL8k8m4J5K5ln2O9K0q3O4j0
2149cp9Q5o1M3Rm9j9j0R2j7k8L3Jj4M5n0K7QNm8rJ2l4N0J6j4K5kKpj5l0P3l5j2
2184a0j9LM2kRk1j6j6k6P9K3o6J2L7%m8L8n5L0JN3ok4n3O6j1L9j7p5L6qmQM4p9
2219c6Lm0P9K2n3K0pLnK9mqk1k3N1K6rm3L3K0o8Q5q8L4k5M6oJ3Po5J2O0o8K3K9
2254B6k7K0LOo4K1L1L7o0Nk1N7l9J1j4O0n3K9j4k1N1n8l2J02j03J3QN7m1PN0l2
2286A5Mm6O1o5jO0o5L8l4Q6j4n6O4mn6j1K5L4k0J0l1J5n4L2LokJm7J02r5O5j9
2319a1K9L4n5J7n0M6j0m7L5J5J4K5k4j6J8j6l5N8k1j5O7l4m5K1J2m3qL2n2P1J6
$$ plain form
2350 28 -47 -30 -4 1 -34 -20 5 -23 -5 26 -3 7 -51 -51 -30 0 -25 -51 10 -13 -17 85 17 32 -3 41 28 -16 36 -10 -30
2381 -30 28 -4 23 -9 35 -3 27 -6 -10 0 -31 26 -4 12 3 8 0 -26 -38 -20 -38 -7 9 -2 -10 24 -17 25 -4 -26 8 9 17 53
2415 53 14 -13 26 34 25 34 9 9 2 103 -12 10 -55 -13 -25 24 -22 -15 50 13 58 -4 -7 12 44 -22 10 23 23 -25 -76 6 -5
2448 -5 -13 7 -80 -15 -55 -28 4 6 -5 -4 15 -30 -10 -17 33 -14 15 27 28 7 -10 -7 -49 -58 23 -40 14 0 -15 61 -7 -3 -59 15 -29
2483 -29 -14 -10 -27 -13 -27 -47 10 -23 29 13 -10 -4 -8 23 28 -19 -3 27 -17 55 -34 41 -40 -11 -32 -18 -8 -24 -17 -3 -10 16 28
2516 28 -38 -12 -1 -26 11 35 22 -63 38 -20 19 26 -43 16 34 30 -55 -60 -2 23 13 -28 -59 7 -18 -30 26 3 -1 19 -18 -57
2548 -57 -2 -23 1 -53 19 56 -13 32 52 -16 -53 44 22 43 -17 -4 -7 8 -44 -19 34 -28 -14 -8 -65 -21 -37 -57 -30 45 23
2579 23 1 -56 -46 -53 10 -21 -8 -56 1 -11 54 -30 -45 22 -80 1 -10 39 22 17 7 -49 -53 -27 -12 -10 -50 13 -10 -32 18 36
$$ packed form
2350B8p5J7K6Nl5J4K5k8J8L1k9J0n8%K1L0k5k6O1k3mJ02o8J5l5M4j3m4N2m6k0
2381c0N8l2K7l2M4l8L0l3mJ0l1N7l0J6rNqk6j2J8j8L1J6j1qL4m1M2k9k2L4JQL6
2415E3l9k7L9QrRk5%pJ01j15K2o5M2j2M9m6PO5l7M5o2lJ9L2o6L2J3%m8n1Q2j1
2448eqK0q7O5m0K7L2Kj1JJ9m5K0pN0m7K9J2Jk1j7Lm2rQ1o3N4j4j5P6o8Mn6P4m4
2483b9J5Mj7J4j4k0N7l3N2j6k3OmL1Nm7J6L0m4P2q9P5q1K9k1J4J0j6PJ4pK6J2
2516B8o6K6J1k5L7K4j3q5J01n8L9Po9N9J8mq5nN8K5j0m1l1O6k5j2N6k3mK0l7l9
2548e7N5k1K4n4P2L7o9M5K0o8l7R7k2K1o0J3lJ5n2K5N3o2J4On7M4j6k0K7P5k2
2579B3k2n7J0pO3l1J3m8N7j2O5q4j5O7j02Q1j1M9j7nj0n6mK6J5Km0O3k3k2N0J8
$$ plain form
2611 36 -7 -5 20 4 -12 -29 23 -27 -30 -53 19 44 27 2 8 -4 -17 46 17 4 16 30 -24 6 14 18 100 22 4 -14 -4 59 75
2644 75 51 -36 7 -22 -17 -20 -3 2 -5 11 -66 -10 17 34 -29 -2 -45 -31 -43 0 9 -19 -14 -2 -31 15 15 8 -3 49 11 -18 -22 -10 -17
2679 -17 -40 29 -33 15 -25 -14 -5 -57 11 6 -28 -7 -27 4 3 18 -32 -15 17 8 22 26 -2 37 1 36 -44 3 -22 -59 30 37 -18
2712 -18 12 -49 -6 -24 -19 21 14 -36 -35 -29 -21 32 26 34 -7 -20 16 28 -16 -32 -47 8 20 -27 3 -21 -8 -5 6 -3 2 4 83 10 -48 -12
2748 -12 -26 -2 -7 -2 33 50 31 19 -39 14 30 -4 -8 23 -27 13 -24 78 7 -51 -3 -25 -4 -19 15 8 -44 -6 -76 -19 41 25
2780 25 4 31 -53 3 -13 -90 23 4 -51 -33 -31 15 -20 -34 13 -60 44 1 0 -3 -41 -80 7 -29 -31 30 -50 -49 -22 82 15
2811 15 -33 -37 26 -2 -51 -19 20 54 -29 30 -48 -27 -11 -44 -55 40 6 -13 11 -53 -13 -29 3 48 -27 -20 29 -24 36 11 -17
2842 -17 35 31 -23 45 -28 31 2 -4 -15 40 19 16 27 -81 -68 16 18 38 -15 -4 -18 -38 -24 22 -1 24 -30 -71 6 -34 -7 0
$$ packed form
2611C6m3KK5j6j6j7N2n0lk3P2K5j7k5Oj2j3O3k9j3J2J4n4L0QMQ2p8j8j8J0O3J6
2644G5k4q7M3k9NlJ7NpJ6p7N6K7J7o3K7m3J4j2M3Rk8NJ2k9M6%pj1N2l8k9mJ2p
2679a7k3O9o2M8m0J1Rn2O8nl4K1k0L1jJ5n0J7L2rJ4Mk8L9l6L5q0M7k5l7Q9Pn5
2712a8L0o1M3j8NM0pn0JOQN3oQm1j3L6J2m4j6j5N5J2m7L0k4J3LJ1rNKP9p3n8L6
2748a2j4K4nNL5J7j9j2n8N3J6l4mL1n0M0l7J02p1n8M8k2K1j5L4pn2L8p0N7O0j6
2780B5k1K7q4N6j6p7J13j9n5J8KM6l5j4M7p3J04m3jll8l9Q7l6kO1q0JK7J04o7
2811A5m8mO3k8m9L2L9L4q3N9p8K1J6l3j1R5l4j9K4o4M0j6L2M5p5PM9n3O0k5k8
2842a7N2mn4O8p3N9k9oj1N5k1lJ1j08J3Q4KK0n3J1j4k0J4M6k3K5n4m1P7m0K7P
$$ plain form
2874 0 -9 -17 41 -13 -36 35 66 -2 -35 -3 -9 11 -16 -26 43 17 -27 32 10 -43 21 -31 13 -33 10 51 40 7 -43 -42 16 90 3
2907 3 12 8 23 -5 -43 -68 3 -32 4 16 -10 -12 13 8 13 110 -31 -10 45 25 -23 -52 15 -46 -31 -16 5 67 -26 -4 -39 17 16
2940 16 -27 41 46 -24 -33 -42 -54 13 -47 -47 -50 -39 -31 35 -19 1 -28 15 -26 41 -3 -34 -6 7 34 -64 42 28 -5 11 -8 38 59
2973 59 35 55 1 21 2 -7 -16 13 3 -28 -8 -45 4 -59 5 -62 -40 2 2 22 -21 31 -37 -31 32 16 -6 15 8 16 61 -21 -10
3006 -10 -25 -4 29 -31 11 -8 -49 -13 -12 -22 24 -14 22 -12 35 17 21 -29 -12 20 -14 11 -31 7 -5 14 32 -3 -42 -15 -9 -59
3038 -59 -16 -14 -29 -17 11 -11 -10 18 55 -11 -12 -26 -13 -54 -2 18 24 9 -31 39 8 11 -33 -11 -8 -36 6 -21 31 48 -55 25 19
3071 19 10 -16 -44 -2 49 26 44 -11 23 -59 45 -52 -2 6 2 -30 16 -44 -36 7 -18 14 -34 -13 -13 -34 -45 30 -16 -10 -49 -13 -48
3104 -48 12 -12 2 -4 -63 -10 -25 13 -49 -45 -6 -38 -47 98 1 -8 -3 15 -51 -7 -37 -11 31 -50 14 12 -2 -17 5 55 -1 -38 -10
$$ packed form
2874@rqN8n4k3P1L1o8l3L2oK0k7j0O9k6m4N9k2n3O4n2M4m6M3M1j1l3n0JN8P4q7
2907CRmJ5k8l8k5P1l5L6J2k6kK5nNR7j41K1N5k0m8k9O7o1J5J5K1O2r3K2l5N6j
2940A6m3O8Np0rrj2O7o0%lJ1QO6n4K0k9M3m1O7m4l1K8J3K7r8J06j4l3J6j9M6K1
2973E9k4K0n4K0j9rrK9j0l1K0l7M9o3O4o7K2M2%K0m3N2o8OO3j6k2K1pQM5q2J1
3006a0j5K1L3o0M2j9m1L6Jj0M6l8L6l4M7j8Mn0J7L2l4K5m2L8j2J9J8l5l9K7On0
3038e9M3Kj5J2K8k2JK8L7o6jj4J3m1N2K0Oj5m0P0l1Lm4K2Lk8M2k7N2J7j03Q0o
3071A9rk6k8M2N1k3J8n5L4q2J04r7N0Qml2M6o0QM3k5L2m8K1%k1j1P5m6Ol9L6l5
3104d8O0k4J4on9N3j5L8o2ML9l2rJ45r7rNJ8o6M4l0K6M2q1O4kj4j5K2N0n6l7K8
$$ plain form
3137 -10 -13 -50 3 -7 2 -52 15 -13 21 -16 54 17 -29 28 -43 -36 -9 -41 -42 20 -10 12 -9 4 -38 25 -64 29 7 -7 -5 -22 10
3170 10 -26 31 7 -30 -56 50 6 25 11 -30 21 15 -31 37 -4 23 62 6 -18 -1 -43 4 15 -8 -31 -3 -27 36 -67 -28
3200 -28 2 -2 49 27 -38 21 -14 -14 52 -27 -29 19 -57 8 12 3 -3 37 -8 50 1 16 38 41 32 -11 -23 -5 9 -3 -58 -33 -20 13
3234 13 -32 -37 -28 -60 -1 -7 1 7 -8 -14 -18 33 -4 -26 -17 -17 1 5 -31 -42 22 -35 -40 -62 78 47 -56 -26 -5 53 2 54 23 27 -24
3269 -24 64 5 12 7 -25 -19 -35 14 -41 -7 -23 -7 2 35 10 -2 4 21 -65 33 10 6 48 -23 9 12 14 15 1 -12 13 46 -31 17 6
3304 6 -33 15 -6 11 -11 16 -54 37 -8 26 62 -35 -20 -36 54 -63 33 -14 8 64 34 -29 20 -72 3 -34 11 -43 -50 1 -42
3335 -42 21 -51 6 15 -13 25 -43 -45 2 9 19 22 9 -18 -13 -1 9 -36 10 39 5 4 -35 36 78 -11 -24 1 19 -1 3 -49 37 36
3369 36 16 57 21 -49 -16 41 23 55 17 -29 13 -26 26 -27 -6 5 -29 19 44 3 14 32 -17 17 12 9 6 -12 -39 -8 6 11
$$ packed form
3137a0ll7N3j0Rn4O7k8L4l7P0l7m6N7p1PK7l2jO2l0K2k1J3m2O3q9R3k2j4Kj7L2
3170A0l6N7k4l7k6J06m4J9j4m1N1om6O8m1K7L9n6k4J7m2M7J1k3k3K8k4O3j03L9
3200b8L0mN1k2o5N9l5%O6p9kM8p6O5MroM0m5N8m9J5K2Lrm3j2J8J4j2n5K5J3L3
3234A3m5nRl2N9oQOj5omN1l7k2R%J8Ml6j1O4n7nk2J40l1j03L0K1N8n1N2l1Mn1
3269b4Q8n9Pnl2Oj6M9n5L4j6J6RL3k5j2OJ7q6R8k3mM2p1L2LKJj4j3K5L3p7M8j1
3304Fl9M8k1J7k2K7p0R1m5L4L6r7J5j6R0j17R6m7K2N6l0o3M9r2P5l7M5n4pN1m3
3335d2O3p2N7Rk8L8o8kM7PJ0Lj3k7NJ2J0m5M6K9l4jl9P1M2q9j3K5J8k0Mn2Q6j
3369C6k0M1l6p0L3N7j8L2l8m6M2l9N2n3K1J1l4M8K5m1J1J8m9L4nllj8k7L1J4N
$$ plain form
3401 11 52 -40 -61 30 28 58 -7 -24 17 7 3 22 1 -71 -90 -5 28 28 0 43 45 -57 -3 16 8 -15 6 22 5 -36 -27 -5 -49
3434 -49 14 -45 -3 3 18 35 23 57 -33 -1 5 -54 5 -83 14 10 -18 15 -7 -11 -5 16 -48 47 -20 -4 -4 -33 13 -12 18 48 -14
3467 -14 -59 -56 26 -48 1 31 4 -12 39 -45 3 10 -7 34 12 4 -16 -4 81 41 15 -31 41 48 13 -60 -20 -69 45 12 -12 -55
3499 -55 0 56 -18 -34 -13 18 5 -15 -41 5 -31 7 -17 11 -24 39 -32 -28 -31 40 4 -16 37 0 -35 -19 49 -16 -13 -7 27 -30
3531 -30 52 38 37 -35 -29 -4 -15 -22 -34 -36 21 -30 27 18 -1 34 2 -9 -6 -9 11 12 29 -15 23 -56 1 -47 -15 -16 14 -6 0 -35 -43 -48
3567 -48 -22 -23 54 67 38 -19 -55 -18 -13 -32 -37 -24 22 18 -35 -18 -45 -28 -32 -37 -32 -1 -25 -14 -29 -47 -44 62 28 -17 -72 23 2 -62
3601 -62 -29 -17 17 -33 -10 5 -18 -18 -21 -14 16 16 -17 1 4 -6 -20 -3 7 -57 -41 -51 -52 -14 -52 -95 50 23 33 12 -36 -21 -7
3634 -7 17 -13 -17 32 59 -4 59 -31 1 29 -3 9 -20 -20 21 21 -34 34 -22 1 8 -10 -91 11 29 33 -7 5 -7 7 28 60 0
$$ packed form
3401A1M1r2k1R1kL0o5j7M1j0mJ9k1p2j9Q5L3%k8M3Kj02N4J9qk3K1J6j7m1RK2m4
3434d9O3n9M2OJ5J7j2L4r0L2On9N9q8R7mk8L3k2mOK1o4R5o7J6%k9M6k5L0L0o2
3467a4m5LQ2p4M9L0k7j6N1q4M8Pj7M1k2qk0J2Q5m0k6m6P2Pl5p3M0m9J14l3k4m3
3499e5N5N6p4j6K1L1j3k0k6M6l6L8k4K8l5O3p1MlP1l6k0N3l7l5J6O8o5LOL4n7
3531c0Q2j4jp2OK5j1pj2kN7n1N7rj9L5l2j1LlK0JJ7m4L8p9N7m8L2jL0k0Ol5qn
3567d8K6jP7J3k9n7l6L7Nj9nJ3M6mn3J7k7J7mnNL1k4J1j5j8LJ06l4m5n5R5k1o4
3601f2L3J2L4n0K3J5k3%lPL0%l3J8Lj0j4J7J0o4J6j0jL8l8m3J45k7J0k1m8J5J4
3634gK4l0mM9K7o3O3r0L2K8l2J2k9%M1%n5O8n6K3Pj8q1J02J8Mm0J2j2J4K1L2o0
$$ plain form
3667 0 -42 4 -20 75 -39 7 -51 42 -122 -40 0 -16 -48 -10 -17 -1 18 -17 -46 27 -23 -61 2 22 -14 -28 -25 36 -6 22 -6
3698 -6 18 22 -6 25 -10 -5 -33 38 53 -16 7 24 -26 6 -16 25 26 -4 18 2 -15 -13 24 26 -18 17 85 6 -1 24 -49 -15 -4 30
3732 30 -16 -11 39 39 49 -52 -18 -69 23 21 10 25 2 49 -9 21 -41 -21 18 -60 -53 31 0 -8 13 -18 -46 -19 6 -50 -44 -23 6
3765 6 -9 11 42 37 -20 -9 5 13 -23 13 -4 12 23 -25 30 -37 -3 15 -51 40 19 34 25 -34 -24 -10 -56 -15 -8 3 0 17 -4
3798 -4 -9 -19 6 20 -23 -41 -18 11 -27 70 -38 7 -14 -40 29 -9 4 10 16 -24 -31 -10 -26 7 27 -19 20 -18 -10 -22 -29 -16 -15 17
3832 17 -8 15 -36 -17 20 -47 -2 -46 57 20 28 -3 33 -20 -14 12 16 -2 23 65 -19 -2 30 3 4 8 -14 31 -6 -32 24 15 -4
3865 -4 1 -26 50 -12 -65 30 -2 21 2 20 6 -3 -41 15 27 -77 -13 -4 -4 -44 -57 14 -16 14 -18 -33 -47 27 9 -54 6 30
3897 30 10 6 -14 42 76 -5 -20 2 20 -56 24 16 -68 -17 31 7 23 40 4 25 14 11 9 -30 -1 24 -13 17 -9 -3 13 -44 0
$$ packed form
3667@m2M6k4R5j14M6n8R3j64Q2M0j6l2L8pJ6J9l5k9P3n0l8O3K0l6j4LO1m2K8k8
3698fK4Mk8L1l5Nk8P1J5o9K3J7n0L2k2M1Jl0K2j6j7KL7Km4L5O8p9pK5p3L4J1L4
3732C0m6NN0%J0j01L4n1R2kj1J5k3M7n8L0o2K0L9p8PQ4l1qK1l1k8K7K5n6OK1K9
3765Fj5K0L1nn7J1J4Ql6L6j7J6J1m8N5o7L4J8o6R1k1J5rn9J0J4m6M1PJ1lJ7k1
3798dnj0K5J4m3j8K3K9l8R7j08M5k1k6O9l8J3OOm0pK1j6L3K0m6L9l8Qj2pJ3JL2
3832A7k5K3n1J9L7o7M5m4J03l7Ql1L6n3OK6Mj8K5M2q4J7L2k7JMk2M5l7k6N6rj9
3865dNk7P6o2n3R5l2K3j9J8j4rl8N6J2j04O4R%m0j3P1l0L0l2j5j4P4j8o3O0K4
3897C0k0mk0N6L4q1j5K2J8p6Q0qq4N1M8k4J6J7l6K1j1lkl9K9K5l7L0k6OJ6n7M4
$$ plain form
3930 0 8 -10 22 -29 0 16 -13 -4 23 -34 -27 18 7 33 -3 49 -21 -6 -57 -67 -19 -28 -2 20 66 -22 15 19 -30 46 15 22 -55 8
3964 8 -3 7 -55 3 9 -21 17 15 1 -12 4 36 1 -41 -30 -31 -23 -42 -2 10 15 -37 -2 -44 -59 28 -3 -21 2 8 -28 -35 -6 -48
3998 -48 -31 44 -14 -11 -37 -22 0 -40 -27 10 -20 -38 21 17 -35 22 -7 44 19 -67 6 -74 -36 30 30 50 8 8 10 40 50 54 1
4031 1 -27 10 -29 -6 -41 -6 -38 45 14 -43 11 -9 15 -13 18 -37 22 -4 19 9 -17 -14 -15 -17 4 -57 -9 -10 30 21 -26 -12 -16 -58
4065 -58 13 -14 -35 36 44 -56 -12 11 -2 58 -17 -26 -15 7 -6 -40 -28 43 15 35 9 77 -28 44 -14 21 -57 45 5 -47
4095 -47 -29 59 -29 13 4 11 -8 -10 13 4 26 26 22 60 -38 -37 -34 23 21 16 31 -7 -25 -62 44 -14 31 -6 -35 18 -27 -27 -15 29 6
4130 6 14 26 -7 8 22 -1 7 22 -36 -24 -8 42 21 18 -38 -30 60 5 -3 -6 34 21 25 4 6 -9 61 -35 -4 -10 38 9 -20 35 -17
4165 -17 -24 -18 -2 -23 -7 -23 34 -9 -9 7 -17 13 37 13 46 68 18 -6 14 -19 -12 0 -6 22 -32 1 -40 -18 -8 -34 47 19 -15
$$ packed form
3930@Qj8L2n1K9J6k9RK7n7PM5j1K6l6N2p0J5n1j0M8rK6K2M6q8L7Mm9P6l1Pp7O3
3964Hj1J0o2N8Ol0L8kj4j3J6L2l5m2J1jQj9M0J2Nn2L5m2j5Q7l1j8K3Ol6pK9m2
3998d8J7P5n8Lk6J5K2m0J3L7l0j8N9mn2N7k9N1k5q6P3q0L8O6%K0m2%KL0J0Mn3
4031Ak8L7l9K3l5L5l2Q3l1n7N4k0K4k8L1n5N9k6K3j0k6LjkK1o1M8jM0rm7J4mm2
4065e8P1k7k1P1Qj00M4K3j3O0p5rJ1K2j3l4J2P1k8K0k6O8j05P2n8L5p8J02m0n2
4095d7J8Q8q8M2rPj9kK3rK2%mL8r8JLN7knJ5l8j8l7J06n8M5l7k9N3m5%J2M4k3
4130FQJ2l3J5J4k3QJ5n8J2J6N0k1ln6QR0n5qlM0j3Mk1Kj5P0r6L1oM8k9k9N5n2
4165a7pOJ6k1J6j6N7m3%J6k4L0K4k4L3K2n0k4K0l3PJ2oK8n4L3m1K2J0k6Q1k8l4
$$ plain form
4198 -15 -16 1 23 32 -39 -33 33 43 -42 35 34 13 14 -27 2 -68 2 -35 -44 43 -10 3 22 -19 -68 17 14 6 -28 -40 -55 -18 12 -14
4232 -14 24 10 -12 -11 -24 28 -10 -7 48 -30 -39 8 -34 -27 -7 7 -32 8 27 -22 60 34 11 -8 -8 -4 -13 -32 -37 -38 45 -73 26 15
4266 15 -13 1 -48 -61 -41 -37 -19 36 20 -19 13 31 15 17 7 32 2 101 -9 58 18 -42 -6 15 -53 -40 -21 48 21 19 -33
4297 -33 -26 -42 -32 -34 43 -44 -6 2 -3 -12 -60 -19 19 23 14 22 -4 26 -17 24 -26 -7 12 40 -8 12 13 -25 9 -5 -56 18 15 -4 -37
4332 -37 -32 6 -3 18 -12 28 27 11 27 5 5 15 8 -2 -38 12 41 -5 -51 -107 44 24 -8 -24 33 22 2 11 -20 13 32 23 20 -4
4366 -4 31 -13 31 14 52 -10 17 20 -31 -19 99 45 19 7 23 36 21 10 -55 9 21 38 -33 44 27 16 21 -54 -23 -24 21 -21
4398 -21 -48 12 -11 7 21 -12 24 -32 4 34 -32 48 27 45 22 -54 21 39 -54 81 1 6 -1 78 17 -30 -54 -16 33 -18 -2
4429 -2 -38 -47 -74 -1 26 -30 24 26 -65 -39 -33 -11 -31 -30 -13 11 -44 16 14 -19 33 57 25 0 12 1 19 -49 -6 -41 -21 34 -13
$$ packed form
4198a5jJ7K2Rp1OO6J0q5P7jk1Jm1K9p0P0l7rQ7n3J3J9m1m9Q5lql4j2j5L7L0k6
4232a4L8j4k2Jj3N2l8LN5p8rM7m2PK0J4l9M0J9m9Q2k6k3j9%Mrj9njQ3j18R9j1
4266A5k8J4m9j3K0MJ8N5j6l9L2J8j6Kj0K5l0R9j10O7m0o0L6K1o8J3J9O9k7kn2
4297c3Pj6J0kP7q7L8Qnrm8M1L8MrQk6L0m3M1n0J9J9K8m8K0Jl8L4j4n1P4lj9l3
4332c7NL8rK1l0M0jj6J6k2%J0pj0l6N0K9m6m6n6J51k0l2j6N7j1k0Rl1L3J9rlk4
4366dL5m4M4j7L8o2K7Ln1J2J18n4k6j2J6J3j5j1o5O4J2J7p1P7j7j1Np5L1jM5m2
4398b1k7O0k3J8J4l3L6n6L6L0o6Q0k1J8k3p6P5J8r3J35q0NpP9o1m7k4L8M9n1J6
4429bl6rk7P3K7n6N4Kr1K6OK2k0JJ7K4n5O0kl3N2K4l2k5J2j1J8o8M3l5K0N5m7
$$ plain form
4462 -13 -25 -4 5 -5 13 -16 16 -26 50 58 -7 20 -18 8 -76 -56 -4 -2 30 -6 3 -20 -63 -1 42 17 -32 -7 25 -23 20 -23
4494 -23 -22 -24 14 16 30 0 -16 -36 -12 10 -18 20 -59 9 -10 -54 -33 -16 8 -22 -10 0 17 -4 -25 12 -4 -8 -47 14 -26 38
4526 38 1 -26 -50 -14 -14 -20 -3 -3 37 -23 -38 2 34 -20 -24 4 10 -43 -12 -63 -30 11 -4 -6 20 43 74 -5 -1 -39 -17 -42 -27 2
4560 2 -38 -17 -39 7 -63 -54 -67 49 -11 4 20 -11 -15 60 -15 -4 -16 -31 45 -14 50 -2 -9 6 11 41 -13 -3 -14 2 -3 -27 14
4593 14 14 -48 -49 36 3 -3 -6 -32 23 24 -17 -16 -30 50 -16 -16 17 -36 94 58 -12 33 -27 -14 -4 20 34 -14 15 11 11 -31 7 39
4627 39 -2 -19 7 26 -51 10 38 -21 11 -18 26 1 -35 12 38 3 -17 -4 51 13 -20 -18 4 -25 -31 -9 48 -32 3 5 18 -14
4659 -14 -48 5 -15 1 5 -3 -1 -18 18 21 19 -46 11 16 21 17 6 -2 -19 -15 -11 -25 5 42 50 56 15 0 19 -39 -32 13 -3 15 -43 23 37
4696 37 -35 -23 12 12 -34 -42 72 12 0 6 12 -63 48 6 19 12 65 30 14 8 -18 12 -12 17 -14 -41 -8 6 -7 -29 9 -79
$$ packed form
4462a3j2K1Rj0J8k9L2m2P6Qo5K7l8K6q4K0N2KL2l6Rk3m3O2M3k5m9K5L2m8M3m3
4494b3JkL8KJ4l0j6k0K4K2k8L8p9O8j9m4K1J7K4l0J2J0J7k1k1L7j6ml9O1m0O4
4526C8l7k7k4L6%oJ7%M0o0j5M0L2n4mK8On3L1n1L3M1j5kK6K3L1p9Ml8K2k5J5K9
4560Bm0K1k2M6p0Rj3J16o0J5J6l1mP5p5J1j2j5P6n9O4n2pJ5NL0n4J0j1J6nk4M1
4593A4%o2jQ5l3olk6N5Jm1Jj4Q0o6%L3n3J30l6p0M5o0J3J0K4J4m8K9m%m2L8L2
4627C9m1j7K6J9p7O1K8n9L2k9M4k5l6M7K6l5k0J3N5l8l3KK2k9oK2N7q0L5KJ3l2
4659a4l4N3k0J6MqKj7L6Lko5N7NNmj1qj7MMj4L0L7QOm1j5J9n8PM5j6J8n8O6J4
4696C7p2J2L5%m6qJ14o0j2OOp5J11m2J3pN3l5j6ok6L0k4K9l1k7L3J4j3k2L8q8
$$ plain form
4728 -79 -9 17 -5 -10 5 -3 -28 72 36 17 25 -17 -55 -14 8 -30 63 25 -14 5 57 86 -20 39 -44 22 15 43 -69 -23 -3
4759 -3 39 -75 -14 25 29 8 -19 31 2 -65 -37 31 8 33 20 9 -5 -4 12 15 35 45 31 30 -30 60 -2 -12 -50 31 4 24
4791 24 4 -46 64 -12 -37 -13 -14 -26 17 34 -31 15 29 27 29 -44 13 12 -21 -16 -4 10 20 13 -12 43 -21 22 -18 -1 5 10 8 9 -28
4826 -28 -1 66 -6 19 -14 2 -27 -47 59 26 21 9 -6 28 -44 20 41 -10 -38 -22 -15 39 9 -10 -6 25 -20 18 -25 -72 -58
4857 -58 -13 43 40 4 10 -33 -9 -28 20 -10 -29 64 23 23 11 26 -42 -58 61 33 69 -43 50 5 -14 71 0 4 -4 -50 15 -76
4889 -76 44 0 -18 -9 27 20 -45 6 31 20 -9 -8 9 3 34 3 24 -55 -18 15 -32 7 56 23 -3 -16 6 44 7 18 15 11 -30
4922 -30 -79 40 -11 41 3 33 47 -31 33 -6 8 2 -9 -38 -23 -60 -25 14 28 -31 -1 -28 -11 -18 7 4 13 -29 46 1 -34 -43
4954 -43 29 17 63 -1 -32 26 -7 -3 30 10 51 -25 -1 26 -55 -29 15 -19 -8 14 52 20 -22 27 4 57 -17 -6 -67 -20 -10
$$ packed form
4728g9P0K6k2nJ5qk5J00l6j9Qm2l8M1K2l8R3l8l9J9N2K9j06N9q3O6pK8j12M6K0
4759cM2j14O1L9Mk1k7N0k9o7K8O8k3K5j3j1j4JJ6LK0J0j4jo0R0o2j0l8Q1k7K0
4791B4k0n0J10p6k5K4jj2M3J7o5M6J4kKp3N7jl3NJ2J4J0pk5N5o4M3m0J7ONkJl7
4826b8K7O7p2K5l3J6k9k0J06l3nj2j5L4p2O4K1n1k8J6PN4l0j9ML1m5L8m3m7J4
4857e8M5N6ll6Om3K4j9M8l0j9R3m1%j2J5o8j6J19k8L6j12R3m5j9Q5p1Mqm6O5r1
4889g6J20m4j8RL6po5N1K5j1k9JJ7oL1l1K1p9L7L3m7L9M9l3k6j3K2L8l7J1lmm1
4922c0m9J19n1N2l8L0J4p8O4l9J4oj1k9J5l7L5L9J4n9L0k7J7pK5lRm2P5m5l5r
4954d3P2j2M6o4l1N8l3ML3k0M1p6K4K7q1K6M4l4J1K2L8l2m2M9k3N3p4J1o1M7J0
$$ plain form
4985 -10 52 2 24 17 36 10 1 23 -31 18 5 -19 -2 -4 8 10 -50 -23 56 -14 9 -17 9 -27 -1 36 47 -19 -13 -48 -29 17 -57
5018 -57 -31 23 -64 5 -10 20 47 0 -1 -24 42 16 -71 12 -19 -9 1 36 1 32 -40 2 -34 22 57 -32 -18 9 -13 25 48
5049 48 -1 3 40 8 26 67 -19 -11 -17 -3 -36 -31 -5 15 33 -7 -29 12 -7 14 48 -8 23 16 18 -2 29 -11 25 -29 14 79 6
5082 6 10 10 18 9 -40 -20 43 1 1 -11 21 24 -16 -33 -13 13 39 44 -13 -13 22 10 -17 6 5 -20 19 2 11 24 0 -43 12 -24 -59 -47
5118 -47 17 -64 -9 7 -9 15 69 -5 30 25 61 18 -11 11 32 -38 0 -15 10 -6 46 25 58 41 -23 2 20 -32 32 -74
5148 -74 9 25 -40 -26 33 43 -21 27 -22 33 14 27 -15 -8 14 26 9 43 42 12 31 10 77 5 -21 -11 27 2 0 -15 -51 36
5180 36 16 -30 19 28 -24 21 -8 34 35 5 2 1 -27 -62 30 -20 39 -3 18 -37 -9 31 -10 30 8 29 8 4 8 -21 -38 48 18
5213 18 17 -31 -21 21 43 -13 -10 4 -21 -32 39 -24 -20 30 25 53 -28 -2 9 7 -12 32 11 3 17 -4 0 34 4 -24 -13 -27 24 43
$$ packed form
4985a0O2n0K2pJ9k6rK2n4M9j3k4J7kJ2Ko0K7P9p0K3k6K6l6K6L7J1o6Ol5J9M6p4
5018e7K6N4q7O9j5L0K7m7jk3O6k6q7Q3l1J0J0L5l5L1p2M2l6N6L5q9J4K7k2L8K3
5049D8m9ML7l2J8M1q6QoJ4l3NK6K0J8m0k2M1j9K1L4n6L1pKk0L1m0L6n4M3O5p3
5082FM%Qrm9K0O3m2%j2L2Lm0j7K0K6K6Nn7%L5j2k7K3jk5L9j7RJ3k4m3N5l6l5J2
5118d7O4q1N5J6j6K4N4p4L5nL6m3k9K2K1p0L8j5K5j6N2k1L3j7o4K5J8n2O4j06
5148g4Q3J6o5J4N9J0o4M8m9N5j9J3m2PK2J2j7L4jl0J9k1O7p2k6J0L8k5kj5l6Q7
5180C6k0m6M9Rn2M5k9M2Jl0ljk8l5R2n0N9m2K1n5K8M0m1M0k2K1k1mMk9j7Q6l0
5213A8jm8J0M2K2n6LJ4k5j1P1o3MN0nK8q1K6J1kj9M4k1qJ4k1ML4l0k8J1j4N1J9
$$ plain form
5247 43 18 27 11 -8 11 -22 9 43 3 42 -3 -31 41 -14 48 19 15 17 30 7 -20 -31 -57 -8 -36 53 47 -10 15 -3 -11 45 17
5280 17 -32 25 -18 -6 61 37 57 34 -42 22 66 52 -38 3 21 26 -1 -24 29 -22 -59 -2 5 18 8 -50 56 0 -7 -10 8 27
5312 27 -3 7 2 -8 0 -40 41 -34 75 18 -27 22 -11 10 -2 -1 -1 -18 63 -2 11 -1 -10 -35 2 -6 11 -23 37 3 -25 0 -11
5345 -11 -20 -14 -16 -36 36 12 -1 -7 -5 -44 9 -56 -4 1 -37 35 -35 2 20 24 -15 -40 30 -66 0 3 23 -38 12 -42 -6 -11 2 31 -12
5380 -12 43 0 28 37 -1 1 -14 23 -4 23 28 -13 -22 -23 0 -27 13 4 -13 -10 20 -12 -17 10 39 26 8 -5 26 18 -2 14 -4 25 28
5415 28 30 21 -17 35 -16 -16 62 26 33 2 72 23 22 -8 -19 31 -39 -27 -17 25 -17 -17 27 40 -7 22 -5 -56 -29 8 -35 53 29
5448 29 38 -22 7 -6 -12 -18 49 50 -21 22 12 -17 -2 -7 69 59 -20 -14 0 22 -53 1 42 -20 15 -54 -50 25 22 27 13 44 -19 -8 -23
5483 -23 22 -5 -28 -3 72 13 -24 -14 -2 43 -2 11 27 -6 -21 7 -42 -1 -61 -16 -12 7 -20 -4 11 -23 -26 1 39 -54 75
$$ packed form
5247D3k5Rj6j9J9l3L1L4m0L9m5k8P2n5O2k9mKJ3k3k7j1k6M9k8Q9on7K5j8qN6k8
5280A7m9N7m3J2O7k4K0k3p6O4M4j4r0M1J8Nk7k3N3n1l7N7PJ3j0n8J06n6plJ8J9
5312B7l0J0nj0Qm0Q1p5J09n7m5M9l3K1j2J%j7Q1o5J3j2rk5L7qJ7l4O0l4k8K5j1
5345a1rOkk0P2k4j3oKl9N3o5N2Nl8P2p0L7J8Ml9k5P0r6O6LK0o1N0n4L6nJ3K9m3
5380a2N5m3K8Rl8Kj5L7k7K7Nm1rjK3k7M0rj7LL0l2nK7K9j3j8j3L1qk0J6j8K9L
5415B8Krl8N2n1%P8l6Pl1P0m9jl0j1N0p0J2J0M2m2%M4J3m7K9k7n1K7L7m3Q8k4
5448B9Ro0K9j3ooO7Jp1M3j0k9J5nP6j0p9OJ4K2p5N4M1o2L5o9MP5lNj4L1o3J1j5
5483b3M5k7k3K5P5n9l7J0J2M5m5J3J6l3j5K8m9M1o0M5MJ9k7J6J5l4lK7L8r3J29
$$ plain form
5514 75 10 14 45 24 -19 -23 58 -65 -55 39 -16 -40 -24 -33 -23 8 -5 -43 -8 -49 9 -47 7 7 -20 1 0 39 15 3 28 6
5546 6 31 -23 -13 34 19 46 40 14 12 -5 36 -83 53 25 -54 14 -16 1 -31 20 9 -38 -1 8 26 -1 -18 -5 -17 24 -37
5577 -37 -8 14 -33 -30 33 48 6 13 23 47 13 -1 -20 -4 -5 -28 15 -29 -55 -14 16 -4 34 21 -21 -42 0 -14 -14 25 -31 11
5609 11 41 27 26 -54 -49 2 6 -52 -16 -3 31 -8 51 -52 -44 12 35 10 -63 -27 -75 5 -24 8 45 -16 -3 -7 47 -16 24 9
5641 9 -7 42 -3 -10 10 24 -14 0 36 -23 29 -58 10 10 -30 -6 -64 -15 18 -28 18 -30 -49 -8 -55 19 32 44 -7 -48 -4 40
5673 40 -4 15 -2 18 3 17 21 3 18 27 39 3 -40 -46 -7 -18 -7 19 -1 2 46 5 16 -57 -83 19 -51 -15 -40 -11 4 -3
5705 -3 14 4 -4 16 68 -19 -15 -4 -34 -43 -27 -9 3 32 38 15 21 4 17 13 4 -5 -14 31 20 -46 8 -25 18 -33 -36 6 44 38 -19 -11 57
5742 57 -20 -37 26 63 19 37 -33 19 1 9 19 -5 34 -4 -4 -33 7 3 -61 15 -16 -46 -28 59 -6 -61 -3 21 12 -63 -11 31
$$ packed form
5514G5o5ML1k1m3mQ1j23J0R4n5k4J6rJ0L1j3l8L5m1N8n6N4%k7K1jL9k4j2K5k2
5546FK5n4J0M7j5K7ok6kj7M1j19J36k8p9O8l0J7l2N1j1m7L7RJ8k7j7J3j2M1o1
5577c7K9K2m7LO3J5m2PJ0K4l4j4j9J6jk3M3m4k6M1L0k0L8j3m2k1M2j4%L9n6M2
5609A1L0j4jq0NN1Mn8L6J3L4l9N9j03QN6K3k5p3L6m8Q0k9L2L7o1J3mN4o3M0j5
5641Ij6M9m5pK0J4l8J4L6n9N2q7O8%m0K4n8M9L3m6M6m8j9M1m7P4J3J2n1m1M4M4
5673D0m4J9j7K0j5J4Mj8J5RJ2l6m3oL9j1J1K6k0LM4m1J1p3k6J02p0L6k5K9J5p
5705cJ7j0qK0N2q7MJ1l0rJ6J8J2K9Ok3Oj7J3mrrrM5j1o6N4l3M3n1lM2L8on7QO8
5742E7p7j7O3L7m4J8p0N2j8QJ0k4L9l8%k9M0mo4P6l1l0J8Q7o5n5N8K4rp5N2M2
$$ plain form
5774 31 -44 -17 -51 24 22 -67 51 5 -8 -14 16 77 -41 -62 -3 -19 -8 22 10 22 33 30 -2 -20 6 9 -6 12 2 1 74 26
5806 26 -10 -39 -40 49 -30 -15 -21 -5 -12 -29 -3 54 -18 -28 -27 48 -5 12 11 -11 -21 -44 37 6 32 54 2 27 -4 -3 -48 -9 59
5839 59 -57 8 -15 30 -5 -13 7 43 12 25 14 6 21 -35 -53 52 -7 15 -23 -30 -7 -54 -34 -25 -19 -21 19 -10 6 -36 16 42
5871 42 -19 6 15 -43 23 3 1 -33 5 10 91 33 -26 3 -38 3 27 57 25 32 -48 38 -35 11 -36 -4 -3 28 -71 16 40 8 12
5904 12 11 -26 37 6 56 35 16 6 -9 0 -1 -2 -24 -20 -9 6 -79 -6 43 9 -22 2 -24 -37 -22 -19 -38 24 9 -27 -26 37 -21 28
5938 28 15 -37 -8 -9 -44 -21 -18 21 -72 -45 -13 -28 19 -10 8 -38 36 20 43 -37 -23 -11 -8 -9 7 -60 -7 -54 -41 42 -4 74
5970 74 19 33 6 45 37 16 23 -1 -41 6 -13 15 -9 -10 -6 -20 -10 -30 7 7 -12 -40 -25 -28 -52 5 -42 -15 -26 43 -1 -56 21
6003 21 -22 -22 5 26 -27 -18 4 12 -37 -14 -13 52 76 46 -27 40 -49 31 40 56 -37 -7 -24 28 59 -31 1 -8 7 -12 24 18 -69 -12
$$ packed form
5774C1p5K7l4P5kq9J18m6j3oL0O1j18k1N9j6J1L0j2J2J1ll2j8K6Lj5J8j0jP3m8
5806B6l6k9jQ9p9J5oJ6pj7K6N7p2j0JP5n3J7jk2j0k3Q1l1K6K2n2K5l1Jm5L9O8
5839E9j16O5k3M5l5qK0L6l1J3j1qJ5n6j8J05n9K2l8pK3m7K0ROkM0k9J6m2N2K6
5871D2o1K5Rn8O6k0kl4L8NQ1n8n9K9m1M1K4L0l2Pq0Q6p3M6m7L2JL1r9Q7K4l2M
5904A2jl7O3l1N0k1j9j0j5Rjjk2MJ1J5q5P3M9l4l1K4k6j3J5Lj9O2j5l6JO3n8M9
5938B8j3n2K9jl5K3LL9r3K7L2j5M7k9J8m6P4j6K3q0J4J2LjJ6o7N3m7J3Q3m6P8
5970G4n5J4k7L9qk1Pk4m0M7j9K8k4jMj4J0k0L7%j9k8J5lk4N7m7K7j1O9m4n5P7
6003B1m3%K7K1n3RK2Qm9K3JO5K4l0p3O7q9Q0RJ6r3L0j7N2L1r0L2rJ5j9L6oq7N7
$$ plain form
6037 -12 -93 32 -24 31 3 -31 22 13 -15 -5 38 2 44 22 -6 10 -19 71 31 26 -12 -49 -17 -22 3 -8 -5 -56 4 30 -26 12
6069 12 -60 27 -54 -2 50 -14 -17 -18 30 -22 18 -2 2 -11 -9 14 9 -1 -47 -9 -6 24 -8 -7 22 48 17 -11 -22 -57 29 -46 47 14
6103 14 36 -5 -24 25 31 33 -5 -51 -53 -2 -70 48 -20 -19 -29 -30 11 5 61 -23 -28 18 25 20 42 17 -71 30 47 -26 -11 -9 -12 -14 -56
6138 -56 -47 -14 -41 -23 -1 1 16 -11 -42 8 16 -53 32 -22 31 -33 -33 -21 -15 -38 -3 -13 -9 -63 -7 -45 19 8 -54 2 -58 10 3 48
6172 48 40 20 -38 11 -3 0 -4 6 -3 60 -3 27 24 -14 23 2 -9 7 -20 3 -38 43 5 -4 -50 -9 -26 58 -36 5 -10 -67 24
6205 24 -55 -11 -53 -2 41 28 -4 10 -55 36 -67 28 34 -9 59 44 -32 13 -1 -16 52 -5 5 10 39 6 -57 -42 6 -43 -2
6236 -2 12 -52 -4 45 -31 -12 -16 -19 1 2 -30 -78 -36 -26 -30 -9 -17 -28 -8 6 -56 14 22 48 17 47 1 -38 5 0 -1 38 13 49 8
6271 8 18 14 -55 -52 -59 50 -25 -20 1 24 -18 5 4 51 -30 -14 -27 -33 -28 -9 -2 16 -36 14 38 30 -17 -15 -34 -20 24 14 -25 -5 0 -42
$$ packed form
6037a2q1J25n6N5k8l4N3rk8J0M3l6M2k2k8J6k9R0m0nl8l7L2nK5j1Ln1O0K6n6L8
6069A2p2Q7q1N2N2o4ljM8n2M0k0Mj3KK3nj0m6L8LL0l2JK9K6l1k8j1l5Q6p5R3l3
6103A4K2m1j9M9OKl8m6kN1o8J18o8Jj0jM1oN6q4nM6PnK2k5q8J01J7p3J5Klkm2
6138e6RL3k7J8K2KJ5k7l1N0Qo9Q5n4N3o4%J2Ok3L5j0Mn4N6l8O4j1o2N6o0O8pM5
6172D8qk0n8M9j4LmJ0rO3o3L0ll8L7k1j1J6k7K3m1Q1l8rm6M1j7Q4r4M1j5n7R1
6205B4p9M4m2N1M3j3l2J4o5R1j03R5Om3O8j5p6M5j4j5O8n7J0NK9l3o3J5M8m9M1
6236bJ4o4M8M9p6J9mlK0Jl2m8M2J0mK1qj1K0J4o2P0QK6l1L0m6l9M3njL9k5L6m1
6271HJ0mo9LpJ09p5NK1K3m2K3jM7q1J6j3oNJ9PJ8n2N0K4qm7Kj9J4M4j0l9K0Nm2
$$ plain form
6307 -42 2 11 -9 74 13 10 62 -8 1 -17 -9 8 -52 5 -8 0 28 -35 9 15 -35 -15 14 -15 -13 8 -44 0 -22 -21 -28 -10 -23 -22 11
6342 11 -34 -7 18 -47 -33 40 43 28 -17 27 -16 -37 -21 14 -48 83 18 -27 36 -17 4 28 24 -72 -63 -18 -16 -29 -29 3 -32 49
6374 49 -26 2 -45 40 30 -42 -9 -15 -16 8 3 6 27 -12 27 2 -7 52 -1 -9 30 -12 38 -10 35 38 0 14 -32 23 11 87 -12 -10
6408 -10 29 -17 40 -50 -4 5 -18 1 -21 37 -8 0 -6 -37 -65 -17 -4 12 -9 -22 -7 -13 -6 -7 -26 97 23 22 27 40 -52 85 72
6441 72 6 -22 -33 -19 29 -13 -41 -9 14 12 1 18 11 61 -7 -28 -6 -9 10 -27 0 -39 45 -4 11 -5 -26 9 23 -20 -34 4
6473 4 -25 3 65 -30 -50 25 -48 -30 42 -8 11 37 0 -15 15 -35 16 52 10 32 -30 -29 -82 -11 -36 38 -11 19 -58 -13 8
6504 8 -12 28 -10 -28 7 -38 21 -6 16 10 -44 25 -25 34 -11 -28 -13 -6 25 -84 -18 -73 -54 15 -10 14 -1 -15 20 37 2
6535 2 32 -4 -11 34 -51 8 35 32 -18 45 -25 1 -41 -20 4 4 -5 11 8 -19 -7 14 -6 -3 -48 17 -15 -42 -21 15 -8 32 32 -28
$$ packed form
6307d2M4Rk0Q3o1lN2p0Rj8QJ7o0N7j3QK8o3M4On0K0K9k9KK1n2M4k2JpJ8j3JL3
6342A1m5K7K5o5J4P3Lj5m5M4m3k1J6L5o2J31o5m5O3n3K1K4mr6RM5Kj3%L2l5Q1
6374D9p5K8m7Q5j0p2L3ojK4nLK1l9L9k5rN9n3qL9m2N0m8M5Ll8J4m6N5j2P6r9K
6408a0L9m6N7r0M6Rk3J9k2N8m5Qol1k8M8J3J6k1j3J5oPjj9J23p4jNJ3r2J37j3
6441G2o6k8j1J4M8m2k8L2K3kj1J7pN0o8k1K2lJ9l7K7l9Q4m9J5j6k1L5J4m3j4L8
6473Dk9K8O2r5k0P5p3J8P2n0J9K6l7j5L0n0N1L6m2K2o2Jn3P1k5P4m9L0p7M5K1
6504Hk0M0l8j8L5m5N9k7K2on4O9n0N9m5j7J5PL1j09O6n5J9O9k5K4j5j4L5J7l5
6535BL0l6pM5q5N9K7ln0O3p0K6m2K1K4%rJ6lk7J2K1k0Lm5O5l2k7K1L6k3M0%o0
$$ plain form
6569 -28 5 -1 -12 38 -13 21 -69 -40 14 -26 29 -51 22 22 11 -9 -20 -9 -9 20 -13 28 28 -46 -3 -6 -11 2 -26 -36 -9 -56 13
6602 13 -17 76 0 -18 25 -4 -22 32 -7 -24 7 5 36 5 4 12 45 -18 -38 2 -37 -38 -23 -63 6 14 -9 -24 44 -13 34 -11 25
6635 25 53 -20 50 -16 -54 -15 -4 7 55 0 4 -30 28 27 70 -12 -18 3 -20 -28 29 -37 12 -56 12 11 -4 14 -13 18 -59 26 35
6668 35 -30 -41 -39 -28 2 -7 -61 -2 22 -14 -14 -19 -34 -27 -12 -41 -19 33 -26 -32 -19 12 -9 39 -48 -17 -2 4 -62 48 -13 29 -13
6701 -13 -73 59 -33 -8 -8 -32 -7 13 27 72 -33 -29 -59 -10 -1 -16 -12 -4 -29 -39 -39 22 2 7 9 -4 44 -44 28 38 3 33 52
6734 52 41 -12 -94 10 23 27 21 -15 -9 -10 -1 11 10 -29 -68 -6 43 -14 -44 -21 12 25 16 -30 -10 -17 -27 -4 -14 46 36 72 62 15
6768 15 6 42 -6 10 -72 9 -14 10 32 51 20 6 1 5 0 11 -28 21 8 21 8 -12 14 -45 -35 -13 -27 -9 -14 -24 -21 -30 -16 8
6802 8 -62 -39 45 6 -11 16 -16 -1 -9 -22 16 -41 -16 5 -38 -31 39 29 -1 25 -48 -34 27 2 14 -10 -59 13 -8 -20 -25 -11
$$ packed form
6569b8L3oj1N0n1L4r0K9N4m0N5q0P3%j1k0j1J1%K9l3M1%p4M3lnJ3k8j0K7m7O9
6602A3l0R3p6j8M3k9j8N4l9j7L1kL1l1jQL3o3k0M0l9jJ5m0O9Qk3j5O8n7M7m5L6
6635B5K8p3P0o6l8L9J1J1M8n5Ml4N8jM3q2oK1k3qN7o6M9o8O8jj5J8k7L1p7Q5R
6668C5o5j1KJ1L0rn4N9K4l6%nj5PJ5k9K2N2n9oJ3L1k1M8q7L1J5Oo6J10o1M2m2
6701a3o0J32r2K5%k4K5K0J4M5j05Ml0M9Rj5MQk5j0%O1k0NKj3M8q8P2J0l5L0J9
6734E2j1n3q2J04J3Mol6OjRJ2jl9l9O2M9n7l0K3L3J3rm6K0pj0K3j0O0j0L6j0m7
6768A5rL6m8J6q2Q1k3K4K2J9l1j4nMnJ1l9M9j3J3j3k0K6n9J0K2j4J8nj0LrJ4K4
6802Hp0K3Q4l9j7K7l2J5qj3L8n7K5K1m3PP0j0l0K6p3J4O1k5J2k4m9P2k1j2nJ4
$$ plain form
6834 -11 7 32 -30 -41 27 -25 -69 -8 -36 21 31 -15 27 -32 28 -60 17 -30 -14 9 5 -55 -18 -23 46 31 14 0 23 7 -53
6865 -53 -13 16 12 -44 3 -40 29 -47 -40 -24 -45 -28 29 22 -13 19 0 11 -28 14 11 0 51 17 -40 -28 12 39 5 4 -24 -27 -17
6898 -17 22 -19 46 37 -2 -42 12 -12 -28 21 -10 19 -4 21 -7 -25 27 -39 34 -28 29 -14 -36 -18 -45 -20 -9 21 -19 14 -15
6929 -15 7 8 -28 -15 5 29 45 -14 -25 -8 -12 20 14 5 37 -18 -52 -15 37 44 -22 4 -35 -37 -53 -3 8 0 -6 -28 20 3 -19 27
6963 27 -8 36 -18 -15 -43 -37 24 -12 -17 -1 25 -3 6 -36 0 -28 33 -13 11 -23 10 8 -1 2 20 11 -30 -7 30 -48 5 -13 10 5 -27
6998 -27 22 7 27 29 -2 21 35 -9 20 -11 -15 -17 39 3 9 0 -38 -1 -3 17 11 -24 10 25 13 48 41 -28 1 -9 41 35 10 12 -1
7033 -1 -10 43 -10 43 -14 -42 -11 36 3 5 25 42 -2 -35 8 8 -67 -44 0 -16 70 4 -11 32 5 9 -33 48 12 3 -7 -65 13
7066 13 -19 -29 21 -7 -5 21 53 -47 -52 -2 29 -23 31 -82 1 11 -26 -18 -4 -13 5 37 -20 -6 -17 -34 42 17 -2 -6 -38 7
$$ packed form
6834a1J8K5o2j1O8n2m4O1k8N7J0m6M2n9O0q8P7m7J6K3mo0L7nO9j5j7j4K3j6o0
6865e3M0K9mn6M7m3O9p6PJ6k1J7N7pl5L2j9J1l9M2lj1N1l4n7J2M0K7l4jk8lJ0
6898a7L9m1O5rl9m0N4k4j6M9l1K9k3K5k8j8N2o6P3o2N7m3k2J8k7K5J1L0m0L3k9
6929a5K2Jl6J3K0K4J6n9j1J7mL2orL2n5l4L7N2Po6K6l9kj6N0J1qok2M8j7k2M6
6963B7l5M4n4Lk8OO1l6nJ6K6k8Rm2L6k8O1m6K4l4L3krLJ8rm1K3L7p8N3j8K3nl2
6998b7M9j5K0Kl1K3J4m4K9l1mkN6l6Orl8L7kK0ol5L4J5j2L5po9K9j0N0ok5Kj3
7033arN3n3N3n7k8L1M7l3KK0J7m4l3M3%p5K3M4j6Q6o6j5M3k7Mm2Q1l6rj0n8P8
7066A3l2j0N0k8KK6L2j00nN0L1n2N4j13Q3J0l7QJ4rJ8L2n7J4j1j7P6k5j9ml2M5
$$ plain form
7098 7 40 29 -1 32 -9 -44 -32 -28 -7 -23 -34 -40 2 2 -20 31 58 -27 16 12 -2 -22 50 -2 -25 -2 -57 -24 -25 9 -58 6 44
7131 44 -76 19 -16 3 -2 8 -21 -30 -30 -33 33 6 19 23 -26 14 -66 -14 -30 -28 27 41 29 8 -27 -44 4 -19 4 -9 20 -9 -15
7164 -15 -19 -27 16 -42 68 -32 -13 -11 36 -32 11 -19 -50 -47 2 -19 -64 30 -33 6 13 -27 39 15 27 15 -10 25 -24 -12 17 -15
7196 -15 38 -22 31 -17 -17 -17 -22 15 -2 36 -23 -16 13 22 2 43 11 22 -43 -46 -6 -12 0 -74 -17 -18 -16 -20 29 -5 -27 33 -23 -22 -45 -10
7232 -10 -25 -17 -24 -31 43 26 -19 -3 -3 -5 -27 44 37 84 -4 -53 12 1 47 30 -20 49 2 12 -7 -49 10 3 -32 56 -23 -1 -12 55
7266 55 -34 -89 -33 -30 -8 -3 20 15 -48 4 -42 -36 11 -50 6 53 22 -4 -10 32 -22 -17 -13 -4 -19 33 1 5 21 13 -45 32 -23 -48 -25
7301 -25 -15 7 13 35 -17 2 21 16 -5 -9 -1 -48 -12 19 1 -60 7 -9 20 -22 6 10 8 -4 24 41 15 -13 5 22 -15 -11 28 -41
7335 -41 -6 -23 -18 -28 11 -60 -84 37 13 49 -38 33 -2 25 9 -35 35 -26 45 6 12 -22 -19 -20 24 -2 -6 -14 29 -16 0 2 12
$$ packed form
7098GL3j1l0L3m1l5J2MK1j6j1oM2%k2N1K7q5M3mj4k0P2n2k3K3n5L3jL4o7O4L8
7131D4j20R5l5J9nJ0k9r%lO6k7J3Mm9M0q0N2j6KN5J4j2k1l5j7M8k3K3j3K9k9o
7164a5mqM3n8J10j00J9KM7o8M3l0l1LM9k1m5R4o3L9Pm0O6k4J2j2k5L5m9J2K9l2
7196a5N3o0N3m8%%nL7j7L8n9PK9Rk0M1l2J1o5lM0oJ2p4N7jKmM9l4k2O0n6Jk3L5
7232a0j5QppP4j7m5J6%kk2P1pM7q8m9O5j1M6j7n0O9m7J0j9m2N9pl5Q8p9K2j1O7
7266E5q9n5N6LK2NK3no3N2m6OM7o1N6M7l1k6oM2n4NMRj5N2l2MJ6qn8P7n5k5K3
7301b5J0K2OK2n2J9J9nk1mQm7L6L1j8o1O7j6K9m2K8Mkj2K8J7k6k8J8J7l7ML9o9
7335d1L5j7Nj0L9p1k4J21k4L6q7P1l5K7j6m4P0o1P1l9Ol4LjM4k6mqM3m5J6KJ0
$$ plain form
7368 12 47 30 5 -1 23 2 -13 -24 57 -31 6 -51 4 -1 21 37 -29 -7 -6 17 4 6 23 17 -78 3 -5 22 -3 52 40 27 29 14
7402 14 -7 -9 44 38 23 -18 35 11 20 24 -31 -16 3 33 -21 -42 30 27 -30 -57 -11 -6 -63 24 45 -32 -19 -34 10 -10 9 26 -46
7435 -46 19 -7 -10 -13 -39 -13 -26 13 -24 7 -24 7 39 -15 -12 21 10 10 9 49 11 24 -45 -14 6 23 -9 -14 -20 27 -32 -10 -12 -9 33
7470 33 -32 -26 18 15 41 -3 -46 1 36 26 -58 -28 -8 -31 26 20 -13 -19 -55 19 18 49 -24 36 17 -49 -17 -79 51 -32 13 0
7502 0 -14 -6 12 5 -69 -22 -25 54 33 74 -30 -10 -1 -8 -12 -20 -20 34 -4 12 30 -13 11 -34 53 10 -5 40 -10 24 25 10 -16 -60 -42
7537 -42 0 -30 47 10 -12 23 21 -2 -25 3 -6 -28 -18 3 46 -63 -42 39 31 10 -34 -16 -26 -23 -9 -23 -16 -20 38 -60 -6 -48 13
7570 13 3 6 18 17 -23 -13 16 0 11 39 -17 39 14 23 24 22 -9 -7 5 45 16 15 -4 54 -5 4 13 19 -29 27 21 0 -85 -20 33 -22
7606 -22 -9 -46 -11 -5 -26 27 42 -20 56 7 2 25 17 -21 45 33 8 -22 42 -32 -2 -14 -10 10 -23 1 -2 53 14 16 -32 -47 31
$$ packed form
7368A2L5j7k5oK4k1j5j1Q1q8L7n7N5nK2J6o6K2JK3j3KJ7or5Q1qK7k5N5j2j3Kj5
7402A4k1kN3oj5m1N3k4RMn5J5J9L0n4k1P2ln7k7M6Nn7Q7K1p7J3j5M4k0J9J7p2
7435d6O5k6llk6K6j3L9l7L1l1L1L2n4LL3j1%jM0l8J3o9L1K0J7l2noM7n9K2kLM2
7470C3o5OM4lK6m4m3M7L5j0q4L0K0k3N7ol3ol6P4jL1p3O0j9o6L2o2J30q3M5j3
7502@j4QJ8pp4M7lP9k1M1j04K0Rpmq%N4l8J6J8m3K4m5Q7m3j5M5n0L4Jj5k6m4J8
7537d2M2l0P7l7k2L5kk3k3K8rk2J0K1M3j09K1Q1qk1m4J8j0LJ4j4PmN8r8N4m2O1
7570A3j0LJ2jm0J0K9j6J1K8n6N6k5RJkl1KJ2M0k9jj9N8n9RROm8N6ok1q5O5N3n5
7606b2J3l7L5Ok1N3J5o2P6m9nK3ql8O6j2k5l0O4p4L0j2MK0l3K4lN5l9Km8j5P8
$$ plain form
7639 31 -22 -17 -17 -36 57 -27 5 54 -38 -39 1 9 18 -1 4 20 35 -39 -5 20 -8 -44 -37 26 -18 -3 10 11 -76 -15 -23 34 -16 -16 -53
7674 -53 -50 36 -20 87 11 -47 36 10 -36 -29 75 25 -4 1 -55 -4 22 -63 5 43 -14 4 -18 18 -5 61 -8 20 7 29 59
7705 59 -68 14 -11 6 -29 45 20 -29 13 22 5 32 23 -40 -28 2 -15 39 11 2 1 -37 0 -7 47 -11 -53 -12 14 -18 19 -24
7737 -24 13 -28 -17 12 38 47 -20 1 -35 28 4 -39 -54 -18 12 -57 9 -18 4 -7 31 -8 -3 30 -8 -21 -33 36 53 -21 -33
7768 -33 35 -9 -39 9 -26 -22 -4 4 2 26 -6 8 53 -20 8 -21 20 -22 44 31 -11 -2 16 18 -35 -20 -20 45 -57 -23 63 1 -59
7801 -59 16 -29 -31 -33 -47 1 27 -55 -38 -29 22 21 10 0 -60 -7 -68 -12 -27 -10 8 45 -28 -14 -36 -11 23 -22 -57 -4 -20 38
7833 38 0 23 20 29 3 -1 -20 -38 40 6 18 24 34 -8 31 -61 -59 24 -47 30 -55 38 5 20 -1 -17 -33 -62 33 -15 0 49 12
7866 12 22 5 -20 -44 62 7 -7 10 30 -15 18 27 -13 46 -7 -29 9 69 -49 -6 2 -27 36 -15 4 -56 5 13 -18 -38 -10
$$ packed form
7639C1n3N%j9R3q4L2M9r2jM0QRj9NJ6J5p4L4K5k8l6PO3m4J5J3Jq7O1qN7n0%l7
7674e3LQ6n6J07p6n8Q3k6m6PJ04n0k9Nn6N1K6q5O8L8n7J8k2L6k3O6o9K8j3K2L0
7705E9j27Q2k5J7l5P4k5m9M2Rj7K7ro3J2L0j7N4k8rjl8L7pN4n8m2M1K6l2L7m3
7737b4L7m1J1K9K6Ro7K1l6O3k4m3j5L6L0o9O6k7K2j1L8l9NL3l8j3j2O9J7p4j2
7768c3O8m4l0M8l5MJ8QkK4l2J4M5p3K8k9M1m2O6j3m2RJ8Kn3J5%O5j02L4Q6o2o0
7801e9P5m5kkj4M8K6q2J7RN1jj1j0o0N3o1N6j5J7J8L7p3J4k2K5L4m5l5N3j6N8
7833C8l8K3lRk6mj9j8P8l4J2OJ0m2L9r2KQ3p1P7q5R3l3J5k1j6j6k9R5m8J5M9l7
7866A2J0j7k5k4J06n5j4J7K0m5L3Rm0N9n3k2L8O0j18M3Qk9O3n1J9o0O1Ql1k0K8
$$ plain form
7897 -10 -35 40 12 -10 -12 -12 16 40 -10 28 -6 -3 -25 -7 -45 -46 -4 -29 -2 15 13 17 24 5 18 -11 26 -7 4 -2 -21 -53 -35 -40 10
7932 10 -40 0 -24 2 -19 -20 -10 -39 -55 -31 6 35 -14 21 4 -25 -25 18 3 5 14 -6 -15 75 -20 60 23 -13 -60 -3 -4 -25 3
7965 3 -11 -93 -64 -53 2 -12 -30 -32 -27 18 0 7 26 16 -25 -7 15 28 48 8 27 33 22 5 66 3 6 -37 26 -18 -2 16 23 43
7999 43 23 41 -7 -28 21 8 -6 0 -27 6 1 -13 -8 -13 -10 20 -20 0 2 42 23 -60 -9 8 -11 -20 -31 40 22 12 -27 18 71 -13
8033 -13 33 -35 -1 33 -59 43 25 -43 -42 10 -32 7 33 -1 -9 47 -14 11 -51 -15 -33 28 13 18 -13 -8 -46 53 22 33 -17 -40
8065 -40 -61 -16 -13 -36 0 -33 -50 5 -10 3 -29 6 6 0 -1 22 5 -26 4 4 19 22 -14 21 3 14 32 -40 20 -2 18 -17 25
8098 25 20 -7 27 21 -43 25 20 5 -12 15 -24 -59 -31 5 37 -11 -15 12 7 -34 -30 -30 -55 42 32 -4 12 11 -40 46 -26 33 -37 -40 25
8133 25 11 11 -22 61 -18 -5 -47 17 -8 -17 36 -42 -29 -12 -1 -18 -41 20 -76 -15 9 21 -4 0 4 -55 -11 17 -2 12 -6 -23
$$ packed form
7897a0k5P5k8k2k%K8K4n0L8l4Lk2J8l8jM2k5K7J7kMPj9J3k9L7l3J1oj9l2J8nN0
7932A0n0M0k4K6k1jJ0k9j6K4L7K9m9L5j7k9%M3j5KRk0rR0r5Q0l7l6m7N7jk1K8
7965Cj4q2K9J1N5j4j8kNM5j8PJ9j0m1J8K2J3K0m0J9Oj1j7O1o3Lm3O3m4J6J8PK0
7999D3k0J8m8k1M9j3j4Ok7L3nj4NnLL0m0K0KM0j9q3N1J7j9rj1P1j8j0l9M5N3q4
8033a3M6o8L4L4r2J02j8o8JN2m2L9K6l4qN6o1K5o2L6j8O1j5Nl1Nl8R9l1J1n0k3
8065d0k1M5Lk3L6l3j7N5j5J3l2L5%ojK3j7l1L0%J5Ll6L5j8J1J8p2O0k2K0l5M2
8098B5nk7L4oo4O8nj5j7K7l9l5K8L6L2m8mK7nm1M%k5R7j0l6J6jn1Q6p2N9p0lO5
8133B5j4%l3Q3p9J3m2O4k5rN3p8J3J7J1j7k3O1r6O1K4J2k5MMn9M4K8j9J4j8j7
$$ plain form
8165 -23 36 9 -5 -4 -28 -3 16 41 -11 -33 13 -12 -25 39 -28 54 -23 56 -32 -3 -14 -14 1 54 17 -21
$$ packed form
8165b3N9k7j4Jk4K5J9K5n2k2M6k5j3O4o7Q2p7P9q8K9j1%J5N3l7l8
8191b1
##END NTUPLES=NMR FID
##END=
