##TITLE=1H_Pr C8-Boc
 200.13MHz,DMSO+CDCl3,
 8 sc
 
 4.12.2025
##JCAMPDX= 6.0         $$ Bruker NMR JCAMP-DX V2.0
##DATA TYPE= NMR FID
##DATA CLASS= NTUPLES
##ORIGIN= UXNMR, Bruker Analytische Messtechnik GmbH
##OWNER= pz
$$ XWIN-NMR		Version 3.5
$$ Thu Dec  4 14:39:42 2025 Russian Standard Time (UT+4h)  she@DPX200
##.OBSERVE FREQUENCY= 200.1313
##.OBSERVE NUCLEUS= ^1H
##.DELAY= (6, 6)
##.ACQUISITION MODE= SIMULTANEOUS
##.ACQUISITION SCHEME= undefined
##.AVERAGES= 8
##.DIGITISER RES= 18
##SPECTROMETER/DATA SYSTEM= spect
##.PULSE SEQUENCE= zg30
##.SOLVENT NAME= CDCl3
##.SHIFT REFERENCE= (INTERNAL, CDCl3, 0, 14.3821)
##AUDIT TRAIL= $$ (NUMBER, WHEN, WHO, WHERE, WHAT)
$$ ##TITLE= Audit trail, XWIN-NMR		Version 3.5
$$ ##JCAMPDX= 5.01
$$ ##ORIGIN= Bruker BioSpin GmbH
$$ ##OWNER= she
$$ F:/spectra/data/she/nmr/H-C/1/audita.txt
$$ ##AUDIT TRAIL=  $$ (NUMBER, WHEN, WHO, WHERE, WHAT)
(   1,<2025-12-04 14:37:45.67 +0400>,<she>,<DPX200>,
      <created by zg, POWCHK disabled, PULCHK disabled
       configuration hash MD5:
       00 E9 B6 7A A2 85 ED C7 34 08 36 98 17 FE 4E 26
       data hash MD5: 16K
       D6 4A 77 FC 53 BB 46 79 48 10 71 0B BD CF AF 1B>)
$$ ##END=
$$ 
$$ hash MD5
$$ 0B 4C 9A 94 EE 3B 92 16 E6 A7 4A FE 19 8B 5E 56
##$RELAX= 
##$RELAX= 
##$RELAX= 
##$RELAX= 
##$RELAX= 
##$RELAX= 
$$ Bruker specific parameters
$$ --------------------------
##$DU= <F:/spectra>
##$EXPNO= 1
##$NAME= <H-C>
##$PROCNO= 1
##$TYPE= <nmr>
##$USER= <she>
##$AMP= (0..31)
100 100 100 100 100 100 100 100 100 100 100 100 100 100 100 100 100 100 
100 100 100 100 100 100 100 100 100 100 100 100 100 100 
##$AQSEQ= 0
##$AQ_mod= 1
##$AUNM= <au_zg>
##$AUTOPOS= <>
##$BF1= 200.13
##$BF2= 200.13
##$BF3= 200.13
##$BF4= 200.13
##$BF5= 200.13
##$BF6= 200.13
##$BF7= 200.13
##$BF8= 200.13
##$BYTORDA= 1
##$CFDGTYP= 0
##$CFRGTYP= 5
##$CHEMSTR= <none>
##$CNST= (0..31)
1 1 145 1 1 1 1 1 1 1 1 1 1 1 1 1 1 1 1 1 1 1 1 1 1 1 1 1 1 1 1 1 
##$CPDPRG= <>
##$CPDPRG1= <>
##$CPDPRG2= <>
##$CPDPRG3= <>
##$CPDPRG4= <mlev>
##$CPDPRG5= <mlev>
##$CPDPRG6= <mlev>
##$CPDPRG7= <mlev>
##$CPDPRG8= <mlev>
##$CPDPRGB= <>
##$CPDPRGT= <>
##$D= (0..31)
0 0.7 0 0 0 0 0 0 0 0 0 0.03 0 0 0 0 0 0 0 0 0 0 0 0 0 0 0 0 0 0 0 0 
##$DATE= 1764844665
##$DBL= (0..7)
120 120 120 120 120 120 120 120 
##$DBP= (0..7)
150 150 150 150 150 150 150 150 
##$DBP07= 0
##$DBPNAM0= <>
##$DBPNAM1= <>
##$DBPNAM2= <>
##$DBPNAM3= <>
##$DBPNAM4= <>
##$DBPNAM5= <>
##$DBPNAM6= <>
##$DBPNAM7= <>
##$DBPOAL= (0..7)
0.5 0.5 0.5 0.5 0.5 0.5 0.5 0.5 
##$DBPOFFS= (0..7)
0 0 0 0 0 0 0 0 
##$DE= 6
##$DECBNUC= <off>
##$DECIM= 32
##$DECNUC= <off>
##$DECSTAT= 4
##$DIGMOD= 1
##$DIGTYP= 9
##$DL= (0..7)
0 120 120 120 120 120 120 120 
##$DP= (0..7)
150 150 150 150 150 150 150 150 
##$DP07= 0
##$DPNAME0= <>
##$DPNAME1= <>
##$DPNAME2= <>
##$DPNAME3= <>
##$DPNAME4= <>
##$DPNAME5= <>
##$DPNAME6= <>
##$DPNAME7= <>
##$DPOAL= (0..7)
0.5 0.5 0.5 0.5 0.5 0.5 0.5 0.5 
##$DPOFFS= (0..7)
0 0 0 0 0 0 0 0 
##$DQDMODE= 0
##$DR= 18
##$DS= 0
##$DSLIST= <SSSSSSSSSSSSSSS>
$$ [...]
##$SUBNAM0= <"">
##$SUBNAM1= <"">
##$SUBNAM2= <"">
##$SUBNAM3= <"">
##$SUBNAM4= <"">
##$SUBNAM5= <"">
##$SUBNAM6= <"">
##$SUBNAM7= <"">
##$SUBNAM8= <"">
##$SUBNAM9= <"">
##$SW= 18.0517328524113
##$SWIBOX= (0..15)
0 0 2 0 0 0 0 0 0 0 0 0 0 0 0 0 
##$SW_h= 3612.71676300578
##$TD= 16384
##$TD0= 1
##$TE= 0
##$TE2= 300
##$TE3= 300
##$TEG= 300
##$TL= (0..7)
0 120 120 120 120 120 120 120 
##$TP= (0..7)
150 150 150 150 150 150 150 150 
##$TP07= 0
##$TPNAME0= <>
##$TPNAME1= <>
##$TPNAME2= <>
##$TPNAME3= <>
##$TPNAME4= <>
##$TPNAME5= <>
##$TPNAME6= <>
##$TPNAME7= <>
##$TPOAL= (0..7)
0.5 0.5 0.5 0.5 0.5 0.5 0.5 0.5 
##$TPOFFS= (0..7)
0 0 0 0 0 0 0 0 
##$TUNHIN= 0
##$TUNHOUT= 0
##$TUNXOUT= 0
##$USERA1= <user>
##$USERA2= <user>
##$USERA3= <user>
##$USERA4= <user>
##$USERA5= <user>
##$V9= 5
##$VALIST= <valist>
##$VCLIST= <CCCCCCCCCCCCCCC>
##$VD= 0
##$VDLIST= <DDDDDDDDDDDDDDD>
##$VPLIST= <PPPPPPPPPPPPPPP>
##$VTLIST= <TTTTTTTTTTTTTTT>
##$WBST= 1024
##$WBSW= 4
##$XGAIN= (0..3)
0 0 0 0 
##$XL= 0
##$YL= 0
##$YMAX_a= 599486
##$YMIN_a= -617547
##$ZGOPTNS= <>
##$ZL1= 120
##$ZL2= 120
##$ZL3= 120
##$ZL4= 120
##$ABSF1= 10
##$ABSF2= 0
##$ABSG= 5
##$ABSL= 3
##$ALPHA= 0
##$AQORDER= 0
##$ASSFAC= 0
##$ASSFACI= 0
##$ASSFACX= 0
##$ASSWID= 0
##$AUNMP= <proc_1d>
##$AZFE= 0.1
##$AZFW= 0.1
##$BCFW= 1
##$BC_mod= 2
##$BYTORDP= 1
##$COROFFS= 0
##$CY= -3
##$DATMOD= 1
##$DC= 2
##$DFILT= <>
##$DTYPP= 0
##$F1P= 0
##$F2P= 0
##$FCOR= 0.5
##$FTSIZE= 0
##$FT_mod= 4
##$GAMMA= 1
##$GB= 0.15
##$INTBC= 1
##$INTSCL= 1
##$ISEN= 128
##$LB= 0.25
##$LEV0= 0
##$LPBIN= 0
##$MAXI= 10000
##$MC2= 0
##$MEAN= 0
##$ME_mod= 0
##$MI= 1.114404
##$NCOEF= 0
##$NC_proc= 0
##$NLEV= 6
##$NOISF1= 3.799351
##$NOISF2= 2.8
##$NSP= 1
##$NTH_PI= 0
##$NZP= 0
##$OFFSET= 14.38212
##$PC= 1
##$PHC0= -3345.603
##$PHC1= 8.992341
##$PH_mod= 1
##$PKNL= yes
##$PPARMOD= 0
##$PSCAL= 0
##$PSIGN= 0
##$REVERSE= no
##$SF= 200.129724274929
##$SI= 16384
##$SIGF1= 3
##$SIGF2= 2
##$SINO= 400
##$SIOLD= 16384
##$SREGLST= <1H.CDCl3>
##$SSB= 0
##$STSI= 0
##$STSR= 0
##$SW_p= 3205.1282051282
##$SYMM= 0
##$S_DEV= 0
##$TDeff= 0
##$TDoff= 0
##$TI= <>
##$TILT= no
##$TM1= 0
##$TM2= 0
##$TOPLEV= 0
##$USERP1= <user>
##$USERP2= <user>
##$USERP3= <user>
##$USERP4= <user>
##$USERP5= <user>
##$WDW= 1
##$XDIM= 8192
##$YMAX_p= 0
##$YMIN_p= 0
$$ End of Bruker specific parameters
$$ ---------------------------------
##NTUPLES= NMR FID
##VAR_NAME=  TIME,          FID/REAL,        FID/IMAG
##SYMBOL=    X,             R,               I
##VAR_TYPE=  INDEPENDENT,   DEPENDENT,       DEPENDENT
##VAR_FORM=  AFFN,          ASDF,            ASDF
##VAR_DIM=   8192,          8192,            8192
##UNITS=     SECONDS,       ARBITRARY UNITS, ARBITRARY UNITS
##FACTOR=    0.0002768,     1,               1
##FIRST=     0,             0,               0
##LAST=      2.2672688,     0,               0
##MIN=       0,             -617547,         0
##MAX=       2.2672688,     599486,          0
$$ Real data points
##PAGE= N=1
##DATA TABLE= (X++(R..R)), XYDATA
$$ [...]
2137A370K650n907j722M281K79j959O26q37j246M047J634n506j582P492J038p263
$$ 1370 4020 -1887 -3609 672 951 -1008 -382 -1219 -2465 1582 3216 -2290 -3872 3620 4658 -2605
2153b605J31N289o33l219Q74m7j212K998P70o444M44P615j461p428K566O197k295
$$ -2605 -2474 2815 2182 -1037 -163 -210 -1422 1576 2346 -4098 -3654 3961 2500 -4928 -2362 3835 1540
2170A540l675K229P42j139K814l87n432K259O289m001o633M637N143m363l623
$$ 1540 -2135 94 836 -303 2511 2124 -3308 -1049 5240 1239 -5394 -757 4386 23 -3600
2185c600L437L93j337K499j533l700L967M870n607m069O262L531n874j875M323
$$ -3600 -163 230 -1107 1392 -141 -3841 126 4996 -611 -4680 1582 5113 -761 -2636 1687
2200A687m79j612J636j814k232L952K105o259j706O835J231o307l24N141o16j701
$$ 1687 1208 -404 1232 -582 -2814 1138 3243 -3016 -4722 2113 3344 -2963 -3287 1854 1238 -463
2216d63R91p92q22L599M12n663L23O172q94o354J343M504j792k483J062j29j22
$$ -463 528 -264 -1086 2513 2925 -2738 -2415 3757 2863 -3491 -2148 2356 564 -1919 -857 -986 -1108
2233a108K289o08l784K112M884k505m685K772M434k481k974J636O53p68J080n85
$$ -1108 1181 573 -3211 -1099 3785 1280 -3405 -633 3801 1320 -1654 -18 635 -133 947 362
2249C62k994J831L575l161l896L900L513l520k409K954J269j441P35J47j797J520
$$ 362 -2632 -801 2774 -387 -4283 -383 3130 -390 -2799 155 1424 -17 718 865 -932 588
2265E88K754l916k516M314K013m601j694M070n8k691J082N35j275J480J743k749
$$ 588 3342 -574 -3090 1224 3237 -1364 -3058 1012 954 -1737 -655 -120 -1395 85 1828 -921
2281i21j553M524J308n019j26M533j154k991J728P48k136J021J465k916q19L951
$$ -921 -2474 2050 3358 -1661 -1787 2746 1592 -1399 329 1077 -1059 -38 1427 -1489 -2308 1643
2297A643k31m792J562M338k791j772L163K25k344J137K132l061J47L546j660l940
$$ 1643 1412 -3380 -1818 2520 -271 -2043 1120 1345 -999 138 2270 -791 -644 2902 1242 -2698
2313b698K476L305l934j661L705m66k985J955J353k817M42L288j793k511L417
$$ -2698 -222 3083 -851 -2512 1193 727 -2258 -303 1050 -1767 -1325 1963 170 -2341 1076
2328A076J656l901Q2L553j179k636K022R46k846L42K349k371j523L063M34l534
$$ 1076 2732 -1169 -1087 2466 1287 -1349 673 1619 -1227 -885 1464 -907 -2430 633 1067 -2467
2344b467J159L349j967k339L263Q70l045Q94K244j702j101K510m66k526J123J992
$$ -2467 -1308 2041 74 -2265 998 1868 -1177 -283 1961 259 -842 1668 1202 -1324 -201 1791
2360A791k378j535K797K82k974J112K070j906o04K208l64j759J761J273k164q29
$$ 1791 -587 -2122 675 957 -2017 -905 1165 -741 -1345 863 499 -1260 501 1774 -390 -1219
2376a219L551p85l067J409J996k038j237J643k6j762J541P84k244nL130j005k686
$$ -1219 2332 1547 -1520 -111 1885 -153 -1390 253 227 -1535 6 790 -1454 -1459 1671 666 -2020
2393b020J966K131j938j278J984L89j757J300O48k495N42K326j329l418K826K025
$$ -2020 -54 2077 139 -1139 845 1234 -523 777 1425 -1070 -528 1798 469 -2949 -123 1902
2409A902l099j024K803q8j822J560P50k025R16K442j908k229K980J399l549o47
$$ 1902 -1197 -2221 582 494 -1328 232 982 -1043 -127 2315 407 -1822 1158 2557 -992 -1639
2425a639L138p96k225J194N58j976J075J970k664j113L943N79m021O30L735j517
$$ -1639 1499 703 -1522 -328 230 -1746 -671 1299 -1365 -2478 1465 2044 -1977 -1347 2388 871
2441H71j888J898P75k322Q58J606k897o61L581r67l745J813L219k596k006K615
$$ 871 -1017 881 1656 -666 192 1798 -1099 -1760 1821 854 -2891 -1078 2141 -455 -2461 154
2457A54O01j734J492O29k096N47K941j578l330L102K092k973j643K883k20j997
$$ 154 755 -979 513 1142 -954 -407 2534 956 -2374 728 2820 -153 -1796 1087 867 -1130
2473a130J152N01k190N01K666k166j755L376J127l071m0K735o67j739J520J77
$$ -1130 22 523 -1667 -1166 1500 -666 -2421 955 2082 -989 -1029 1706 1039 -700 820 997
2489I97j719J026J256k295p52K626ok783J29K700j185j531J362Q17j307P86Q59
$$ 997 -722 304 1560 -735 -1487 1139 1133 -1650 -1521 1179 -6 -1537 -175 642 -665 121 980
2506I80j445j8K341m15k347P63K083j642k025J977P59j880J14J010j126l42J675
$$ 980 -465 -483 1858 1443 -904 -141 1942 300 -1725 252 1011 -869 -755 255 -871 -1213 462
2523D62l91j794J499K054k203j196K519N52j884J34J573j113p76J503p13j939
$$ 462 71 -1723 -224 1830 -373 -1569 950 1502 -382 -248 1325 212 -564 939 226 -1713
2539a713J639J715k684p43K707Q3k277M61J971j213q31J925m10j530J904P04k441
$$ -1713 -74 1641 -1043 -1786 921 1004 -1273 -812 1159 -54 -885 1040 630 -900 1004 1708 -733
2556g33j10K682j074k581J451K115k504r17K109p97j026J728K71k127J012K581
$$ -733 -843 1839 765 -1816 -365 1750 -754 -1671 438 -359 -1385 343 614 -1513 -501 2080
2572B080j854k250K872J507k948j42K269j032j170J293k94j768J378J378k548
$$ 2080 226 -2024 848 2355 -593 -735 1534 502 -668 625 331 -1437 -59 1319 -1229
2587a229j436L693J77k697N57K230q07j410J349J51r93J374O35k741j50L441j043
$$ -1229 -2665 1028 1205 -1492 -935 1295 488 -922 427 578 -415 959 1594 -1147 -1297 2144 1101
2604A101l070J440J687j298j439J586l5p70J236L21k368Q56L204j781k347K229
$$ 1101 -1969 -529 1158 -140 -1579 7 -28 -798 438 759 -1609 -753 2451 670 -1677 552
2620E52J994k199j438J359N29j109Q56n96j155J120J195j795j475K444J398k631
$$ 552 2546 347 -1091 268 797 -312 544 -52 -1207 -87 1108 -687 -2162 282 1680 -951
2636i51r83K359O10j275L85K71p50J387L93j989j045K843N81k963o95K638j8j858
$$ -951 -1934 425 1035 -240 145 416 -334 1053 1446 -543 -1588 1255 1836 -1127 -1822 816 798 -1060
2654a060J74M0M33J008J35k099M22K710j92l329R20K827p38j848L26N77N1J15
$$ -1060 -886 -846 -413 595 730 -1369 -947 1763 1571 -1758 -838 1989 1251 -597 -271 306 357 472
2672D72l47j669N77K485j154l154J737L023j858k041J619J275m85j78K5j129R55
$$ 472 125 -1544 -967 1518 364 -2790 -1053 1970 112 -1929 -310 965 480 302 327 -802 153
2689A53K150k302k021K084K431k672k250K133J094j530k47N95p47J187J478k498
$$ 153 2303 1 -2020 64 2495 -177 -2427 -294 800 -730 -977 -382 -1129 58 1536 -962
2705i62j047K681J613k694j053K615M06j667m2M33n33Q61J76k280j81K789K21
$$ -962 -2009 672 2285 -409 -1462 1153 1559 -108 -150 283 -250 611 787 -1493 -1674 1115 1336
2722A336l197l8L118r8k118K56J252j43O47j13k012Q17K626q86l125R27K428j057
$$ 1336 -1861 -1899 1219 1121 -997 -741 511 368 1015 902 -1110 -293 2333 1447 -1678 -751 1677 620
2740F20k263P60J239n05J93n11q16J051J695j430j895J853K246j738j845J568
$$ 620 -1643 -883 356 -149 44 -467 -1283 -232 1463 33 -1862 -9 2237 499 -1346 222
2756B22J182j091j41m50l91P90R04j635j325K291Q72k036r20J726Q93j047k19
$$ 222 1404 313 172 -278 -669 121 1025 -610 -1935 356 1228 -808 -1728 -2 891 -156 -375
2773c75O58k16J70R05j338o88J859O30k541j06J651J45j659k2J094m20KJ75n13
$$ -375 283 67 237 1142 -196 -884 975 1605 -936 -1042 609 754 -905 -927 167 -253 -251 -76 -589
2792e89m43J897J59j846K29K094j96k051M36J381r02j74L87q81j46J165l52j908
$$ -589 -1032 865 1024 -822 -593 1501 1305 -746 -310 1071 169 -5 382 -499 -645 520 168 -1740
2810a740J022J967j303j493J688N71j118J04R49k63m40J198l87j474R96J532k009
$$ -1740 -718 1249 -54 -1547 141 712 -406 -302 647 384 -56 1142 755 -719 277 1809 -200
2827b00r87J718J06j688L70Q17n15l86J055j76j290J526R49j798j28J671q6j553
$$ -200 -1187 531 637 -1051 -681 136 -379 -765 290 114 -1176 350 1299 -499 -627 1044 958 -595
2845e95L75J505j157n41Q71j71j179R32P28j857L81J506j068j075J635N56j260
$$ -595 -220 1285 128 -413 458 287 -892 40 768 -1089 -708 798 -270 -1345 290 846 -414
2862d14jJ391m69j028J138M05j505P17P28j061r60J443L95j826K07J430n84r02
$$ -414 -415 976 507 -521 617 1022 -483 234 962 -99 -1059 384 779 -1047 -840 590 6 -896
2880h96J099j6o85M30R58j176k80J658k51j524N09J232q62p44O61J59r91N74N42
$$ -896 203 187 -498 -68 890 -286 -566 1092 841 -683 -174 1058 196 -548 113 272 -719 -145 397
2899C97j102J73J250p23j394J275J024p84r53J191O03j209O17K5n92J03J133q48
$$ 397 -705 -532 718 -5 -1399 -124 900 116 -837 354 957 -252 365 390 -202 -99 1034 186
2917A86j231J096O27j237o82J530J16j046L61O07l61LO47r87k51J329K36j467
$$ 186 -1045 51 678 -559 -1241 289 405 -641 -280 327 -34 -31 616 -371 -622 707 943 -524
2935e24J23J535k86j800N34R04q72k16Q83q92j02J087O9j715L18K097q06j224
$$ -524 -401 1134 848 -952 -418 486 -386 -602 281 -611 -713 374 443 -1272 -954 1143 337 -887
2953h87P65J137p14k89M09n89nQ94m62j512P40J595j246j332J376P75r82k88M53
$$ -887 -122 1015 301 12 421 -168 -173 721 259 -1253 -513 1082 -164 -1496 -120 655 -327 -615 -162
2972a62J79n8R73o66j185J479Q14j598o77J554K26j171l56Q91l20l28N55m26j027
$$ -162 17 -41 932 266 -919 560 1374 -224 -901 653 879 -292 -648 243 -77 -405 150 -276 -1303
2991a303J483O93j899J21J459J81r71j20J302r24K84L24q79l2J232j09j715M8
$$ -1303 180 873 -1026 -905 554 735 -236 -356 946 22 306 630 -249 -281 951 842 -873 -825
3009h25J605m23j504Q45R16r23J6J89j71J00P75j69j258O17J598j040j142J211
$$ -825 780 357 -1147 -302 614 -309 -293 -104 -275 -175 600 431 -827 -210 1388 348 -794 417
3027D17M09j133l73Q47m91KN89r47m16Q41J106j041o67J351M40j168q2O61J42
$$ 417 826 -307 -680 167 -324 -322 267 -680 -1096 -255 851 -190 -857 494 934 -234 -316 345 487
3046D87k68K65m9j004P28M16j310m29J488q1j112J47P72r0n11L61K94m10N93L62
$$ 487 219 484 435 -569 159 575 -735 -1164 324 243 -869 -722 50 -40 -551 -190 104 -306 287 649
3066F49j101L1J421k90j298O44Q16q95o86Q07J56o14M24j42o70N40J004q46n87
$$ 649 -452 -421 1000 710 -588 56 872 -23 -709 98 254 -360 64 -78 -748 -208 796 -50 -637
3085f37Q05R33r69o83J384j20q32K95K01q62N46K71r93n62J279L06j210j59J461
$$ -637 168 1101 132 -551 833 713 -119 176 377 -485 61 332 -661 -1223 56 362 -848 -1007 454
3104D54k95p09L91M49m59K44O63o34n43J615p45j209O35J017r94n88M28N33q65
$$ 454 159 -550 -159 290 -169 75 738 104 -439 1176 431 -778 -143 874 -120 -708 -280 253 -612
3123f12L46K23o21K83J310r13j056J311P60q86p64Q41P31q80k33K34m14L43M03
$$ -612 -266 -43 -664 -381 929 16 -1040 271 1031 145 -619 222 953 73 -160 74 -340 3 406
3142D06r54n44J223M16j442j39J283M62j398L69M04o3N39o6o98j33J373m46q98
$$ 406 -548 -1092 131 547 -895 -1034 249 711 -687 -318 86 23 562 496 -202 -335 1038 592 -306
3161c06l43J426o35q91J90N91j48j82R7m60M76P53j09j321O90J499q85j008O99
$$ -306 -649 777 142 -749 -559 32 -116 -298 -201 -661 -185 568 459 -862 -172 1327 442 -566 133
3180A33M83k11k79r8k05J55N19o73j082J219R25j246q65J338P00r38m05P25n5
$$ 133 616 405 126 28 -177 -22 497 -176 -1258 -39 886 -360 -1225 113 813 -125 -530 195 140
3199A40K57K77n00o62R28Q17j998J31J054L16j166k31L49M23l95N96j106l6J287
$$ 140 397 674 174 -488 440 1257 -741 -610 444 760 -406 -637 -288 135 -260 336 -770 -806 481
3218D81K07j340r3J430M60j202n85J168k91j35K6n05J26P63l77j335L64J512n31
$$ 481 688 -652 -745 685 1145 -57 -642 526 235 100 126 -379 -253 510 133 -1202 -838 674 143
3237A43j085M41J217n04l56L57l37L96O87n66j134P18J369j141j142O76Q05o79
$$ 143 -942 -501 716 212 -144 213 -124 272 959 393 -741 -23 1346 205 -937 -261 544 -135
3255a35n31L38J84j03M36k03p63R62R75j399m44J271N65j616J17O85k26r7K74
$$ -135 -666 -328 -144 -247 189 -14 -777 185 1160 -239 -683 588 1153 -463 -346 339 113 16 290
3274B90o42k74Q15K22j204j01J289qr07j56Q76Q3j4k90l06lJ058K7j222NJ095
$$ 290 -352 -626 189 411 -793 -894 395 387 -520 -676 200 283 269 -21 -327 -330 728 755 -467 -462 633
3295F33m49j004J07O79L5l60PL4j33Q72k01r58M13J286o11p07Q67J76l31o12K67
$$ 633 184 -820 -713 -34 1 -359 -352 -318 -451 421 220 -738 -325 961 350 -357 510 686 355 -257 10
3316A0K6J16J61m57m49K89N65l09q30Q06P83r07l17P40mk10J95jl49L05O78p38
$$ 10 36 152 313 -144 -593 -304 261 -48 -878 -72 711 -196 -513 227 223 13 208 207 -142 163 841 103
3338A03o47P62L30r87J55L91j85m59J78jM3K13N75l31m84Q87J12j096M36P15j89
$$ 103 -544 218 548 -439 -284 107 -78 -537 -359 -360 -317 -104 471 140 -344 543 655 -441 -5 710 521
3359E21r13P57k10n12L24K05n03n0Q36n02q53P82L97m83j07O49R3o50P00m6n19
$$ 521 -392 365 155 -357 -33 172 -331 -381 455 -47 -900 -118 279 -204 -311 338 431 -219 481 435 -84
3380h4J64N89k36o44J99M54p83j81R57k22p04L70J96k35j13O98l25k49O46J75
$$ -84 80 669 433 -211 -12 442 -341 -522 435 213 -491 -121 75 -160 -273 425 100 -149 497 672
3400F72r86L29O56o2r47O46n2o14L01J54k72j69O41l94p55P03N94r09l08P37L73
$$ 672 -314 15 671 609 -338 308 256 -358 -57 97 -175 -344 297 -97 -852 -149 445 -464 -772 -35 338
3421C38n06L67L41k47M2lk69m82P92O3q10P7L16J56p37P9L31J46j96L79k47k29
$$ 338 -168 199 540 293 335 332 63 -419 373 436 -374 -297 19 175 -562 -483 -152 -6 -202 177 -70 -299
3443b99Q65Mp53k2N77Jm75j84O66q6n61J88k52J33Q0J22p26M87P63n70n17N42
$$ -299 566 570 -183 -205 372 373 -102 -286 380 294 -267 -79 -331 -198 -118 4 -722 -235 528 -42 -559 -17
3465a7N52m94k4K0N13p4j43n25NK53L04m43r57R02M75r05l27O44K17J56j56P9
$$ -17 535 41 17 37 550 476 333 -192 -187 66 370 -73 -1030 -128 347 -558 -885 -241 -24 132 -24 55
3487E5k55P09J39n07n78Q68J76r89m9O58k5m14K21m74O6M63J84q92L1J073k50
$$ 55 -200 509 648 141 -437 431 607 -382 -431 227 202 -212 9 -465 -399 64 248 -644 -613 460 210
3508B10n91J50P61k37l35J53J95j80M94k27n35K88M01n56p46M41Q07q00j19M30
$$ 210 -381 -231 530 293 -42 111 306 126 620 393 -142 146 547 -9 -755 -314 493 -307 -426 4
3528DL5j97M40k73l42M14M68n79l88P23J30n56m72P93R9n11R5k05j04K85j7l0
$$ 4 39 -158 282 9 -333 81 549 -30 -418 305 435 -121 -593 200 299 -212 -117 -322 -426 -141 -158 -188
3550a88o00R36K46n28J12K37k22L9K93j69M7J1l3n03rM65k2p24J79R17m97l45
$$ -188 -788 148 394 -134 -22 215 -7 32 325 156 203 214 181 -322 -331 134 112 -612 -433 484 -13 -358
3572c58j1M40q3K30k02r1O1L79j29m29J86M66l58m45L32M02n68k2kL3q2O06l97
$$ -358 -369 71 -12 218 16 -75 -14 365 236 -193 -7 459 101 -344 -12 390 -178 -200 -202 -169 -251 355 -42
3595d2l49J78O33m29n38R94J96q11K38J80l08o3M71l91m19N62J35m73k06N91l2
$$ -42 -391 -213 420 -9 -547 447 643 -168 70 250 -58 -121 350 -41 -460 102 237 -236 -442 149 117
3616A17o05L26O36k30j40j4k37K80K59J77q68K33N89l34k97RJ31n29J31J88q7
$$ 117 -488 -162 474 244 104 90 -147 133 392 569 -299 -66 523 189 -108 -99 32 -497 -366 -178 -265
3637b65J3O35m95m35O37O28q00L1N21Q4n10k49N65k42j44J73j44j04J1K46o90
$$ -265 -252 383 -112 -547 90 718 -82 -51 470 554 44 -205 360 118 -26 147 3 -101 -90 156 -534
3658e34K84K19L17p42M4O53j31j78L17k52j62N50l13m68L86L60m1m96J00L09m18
$$ -534 -250 -31 286 -456 -412 241 110 -68 249 -3 -165 385 72 -396 -10 350 309 -187 -87 222 -196
3679a96l3N2j86K45M18n66o6J15Q86p30j95N63K43m30j96M26m93J00L4m6l49J79
$$ -196 -229 -177 -363 -118 300 -266 -332 -217 669 -61 -256 307 550 120 -76 350 -143 -43 -9 -55 -404 -225
3701b25M76m22k94O23K66p40K4L52J66K9j57Kk2L37J29o75k21N18K04n32m79P79
$$ -225 251 -171 -465 158 424 -316 -292 60 226 255 98 100 78 415 544 -131 -352 166 370 -162 -641 138
3723A38j22m10j32K48L72J69j5l47j87P38P5p03K45J55L01n12PR2n23O76k48o11
$$ 138 16 -394 -526 -278 94 263 248 -99 -286 452 527 -176 69 224 525 13 20 112 -411 265 17 -594
3745e94P4O22k18k71Q4O04K61n20l67L93j80K99L33o40R3M44j80o90L82M99p94
$$ -594 -520 102 -116 -387 -303 301 562 42 -325 68 -112 187 520 -120 -27 417 237 -453 -71 428 -366
3766c66r8N14q4k63J85j30j06L20O27p98r2O39L13m46l31L83j46Q8k45P9k90J91
$$ -366 -464 50 -34 -297 -112 -242 -348 -28 599 -199 -291 348 661 215 -116 267 121 209 -36 43 -247 -56
3788e6K26n16K9N56q8n59K21L01k21o4J66k14J23K28j0j78K13L60l35m48M18p2
$$ -56 170 -346 -317 239 151 -408 -187 114 -107 -171 -5 -219 -96 132 122 -56 157 517 182 -266 152 80
3810H0k31j60K91o3k69M29k01m00K78N07k86q4K06K49jn81K77K00P4j68l88k9
$$ 80 -151 -311 -20 -83 -352 77 -124 -524 -246 261 -25 -109 97 346 345 -236 41 241 315 147 -241 -270
3832b70L30K45m17q6p2M76m91mN1M59l02J31l2k0K36J6j74l76O97J20n52J28q0
$$ -270 60 305 -112 -198 -270 206 -285 -289 -238 221 -81 50 18 -2 234 250 76 -300 397 517 -35 93 13
3855A3j22j88L71j78RQ0K89k72j78J68J21j28K28K03l13k26j58M29j55o4Q9j15
$$ 13 -109 -297 74 -104 -95 -15 274 2 -176 -8 113 -15 213 416 103 -123 -281 148 -7 -71 18 -97
3877i7l53L32L1k34J9K70j58j98K34N31l29p1P3K03k88M20r8l21L27j20j28l14
$$ -97 -450 -118 -87 -321 -302 -32 -190 -388 -154 377 48 -23 50 253 -35 385 287 -34 293 173 45 -269
3899b69J87J24l70m7O21k18k11K56P8n05M46J47l95l6K40K42k64J18L03o15J14
$$ -269 -82 42 -328 -375 246 28 -183 73 151 -354 92 239 -156 -192 48 290 26 144 447 -168 -54
3920e4j5j69p1L82o2l32J68J85j45k93M54q2p8j72N28l76J19K86q0r9J7l0k93
$$ -54 -69 -238 -309 73 11 -321 -153 32 -113 -406 48 -34 -112 -284 244 -132 -13 273 193 94 111 81 -212
3943b12L5K64O6m59J33J72k03K4J08J87l74K39K57l17N6M49k64m01J67L60k3p30
$$ -212 -177 87 153 -306 -173 -1 -204 -180 -72 115 -259 -20 237 -80 -24 425 161 -240 -73 287 264 -466
3965d66M43Q8j24N7k58J37q2L94m16K05j60N58m89j09M05J29k72L08k57O0k42
$$ -466 -23 65 -59 -2 -260 -123 -205 189 -227 -22 -182 376 -113 -222 183 312 40 348 91 151 -91
3986i1K07J15m59K57j8l41M9J80L30m29j48L38J56j41J04k14j40P23m83m06K72
$$ -91 116 231 -228 29 11 -330 -281 -101 229 -200 -348 -10 146 5 109 -105 -245 478 -5 -411 -139
4007a39K53p1k47k4N61n66J36p7J1j90N98l91j78M59J11j83j87J82K02n6k11L93
$$ -139 114 43 -204 -228 333 -233 -97 -174 -163 -353 245 -146 -324 135 246 63 -124 58 260 204 -7 386
4029C86k52L5Rj55m48J27M42n34l28M95Q7nn4N2L02j06K99k90j10L69o2n7m21
$$ 386 134 169 178 23 -425 -298 144 -390 -718 -223 -136 -141 -195 -143 159 53 352 62 -48 321 259 202 -219
4052b19Q7L90k03k90J23J83l3K79l78j65L93k07R3l14K21L33n09L67rl2J19l18
$$ -219 -132 258 55 -235 -112 71 38 317 -61 -226 167 -40 53 -261 -40 293 -216 151 142 110 229 -89
4074h9J54j26K72k03l99L25J13K6m36M48j56nk25N40j68j14L13j17l94K2O00k73
$$ -89 65 -61 211 8 -391 -66 47 73 -363 85 -71 -76 -301 239 71 -43 270 153 -241 -219 381 108
4096A08j19J87k8k68m4L0J54k22L74k16n6J83j02J12l80L94K93o3k40J40L52m91
$$ 108 -11 176 148 -120 -164 -134 20 -202 172 -44 -100 83 -19 93 -287 107 400 337 97 237 589 98
4118I8J00p8l8j34K27k81k04J86K56m92K66MK37k28J69j16K21k51Q4j24L24O2
$$ 98 198 120 82 -52 175 -106 -310 -124 132 -360 -94 -90 147 -81 88 -28 193 -58 26 -98 226 288
4140B88l09k07J00L43k73k53L59r3j24L6n9k3k1N28l27j17K39J53l12K37N4k78
$$ 288 -21 -228 -128 215 -58 -311 48 -45 -169 -133 -192 -215 -236 292 -35 -152 87 240 -72 165 219 -59
4162e9ll6K29l35L51j9l30K8J38rK1k38M08j38j48p2K84m6J53j85j3R7J68j34
$$ -59 -62 -98 131 -204 147 128 -202 -174 -36 -45 -24 -262 146 8 -140 -212 72 26 179 -6 -19 78 246 112
4186A12j74J81M7k11M5r7N06m69Jj55p3J83L84m88M05l3L06n47Q8L60j91R2n29
$$ 112 -62 119 166 -45 0 -97 409 -60 -59 -214 -287 -104 280 -208 197 164 470 -77 11 371 180 272 -257
4209b57L16p8J82k36j31n8K08J64l53M2J58o1O0p9J24K5j31J36j91rJ49M62o31
$$ -257 59 -19 163 -73 -204 -262 -54 110 -243 -201 -43 -104 -44 -123 1 26 -105 31 -160 -169 -20 442 -189
4232a89K62J21k24J04j55K4r9O2j06J24M7L03k60j83k7K97O4l82K05J74j16O3
$$ -189 73 194 -30 74 -81 -57 -156 -94 -200 -76 -29 274 14 -169 -196 101 165 -217 -12 162 46 109
4254A09j54j28R4K28l98J68O4j0o1KM5J12m4k95N38k53L69q6j90l83M83J33k96
$$ 109 -45 -173 -79 149 -249 -81 -17 -27 -88 -86 -41 71 27 -268 270 17 386 300 110 -273 210 343 47
4277D7l01K52j8j03K53R6j61j31j32p4L62J9J02m26K24L27j78k72J28j17K18O0
$$ 47 -254 -2 -20 -123 130 226 65 -66 -198 -272 90 109 211 -215 9 336 158 -114 14 -103 115 175
4299A75q5l45M3K02k5j94M6J26K07m07K64m2Q8L7q3KR1J88k39N8J4j81L6j0K29
$$ 175 90 -255 -212 -10 -35 -229 -183 -57 150 -257 7 -35 53 90 7 9 100 288 49 107 121 -60 -24 -34 195
4324A95p3l96j82L92j83L39k64K76m96K75K22M4k89L17P8O3j97j8j2j54K51j62
$$ 195 122 -274 -456 -64 -247 92 -172 104 -392 -117 105 149 -140 177 255 318 121 103 91 -63 188 26
4346B6j76J94K39l74o9Kp2L07k29Q0k16K35J99R1k79M00l09O7p8n0J19l70J16
$$ 26 -150 44 283 -91 -160 -158 -230 77 -152 -72 -288 -53 146 237 -42 358 49 116 38 -12 107 -263 -147
4369a47j13J0J40m6m2p4L57Ml5lj7k8k28M25k05J96l34J14J02M6k27q4J82k19
$$ -147 -260 -250 -110 -156 -198 -272 85 89 54 51 34 6 -222 203 -2 194 -140 -26 76 122 -105 -189 -7 -226
4393b26N76l55j81J04L31k15k26J70K80k46j9K80l11J37K30l99j48M78m70K06
$$ -226 350 -5 -186 -82 249 34 -192 -22 258 12 -7 273 -38 99 329 -70 -218 260 -210 -4
4413dl29N78j53r7j26L1j19R8j87L35l1K20k89J44R7J64k51L00r9k64K3m67O32
$$ -4 -333 245 92 -5 -131 -100 -219 -121 -308 27 -4 216 -73 71 168 332 81 381 282 18 41 -426 206
4436B06l56O2J33j90q0J23O8j10J18P8Q8o6k1j35m2P4L75k2k26j16N0j36J19J12
$$ 206 -150 -88 45 -145 -225 -102 -34 -144 -26 52 140 74 53 -82 -124 -50 325 303 77 -39 11 -125 -6 106
4460A06l77K24J24J20p46M37p6J69K45k08J87P2k02P5k33Q1J50j0l38l3J50j20
$$ 106 -271 -47 77 197 -549 -112 -188 -19 226 18 205 277 75 150 -83 -2 148 138 -200 -233 -83 -203
4482b03Q6o1Q9R8k5J36k80N0P8K32j34n1j9J60j1K0l28j14L18K57l97r3J15L80
$$ -203 -117 -178 -89 9 -16 120 -160 -110 -32 200 66 15 -4 156 145 165 -163 -277 41 298 -99 -192 -77 303
4506C03k69j16M7M7l41J89J52K18k29K38k72r3K86j73j5J82K17n27J20J69j37
$$ 303 34 -82 -35 12 -329 -140 12 230 1 239 -33 -126 160 -13 -28 154 371 -156 -36 133 -4
4527dj18j06K85j62m9M06k68o5J30LJ78j40m5l00L78k07N3k06J29q7J99j97J91
$$ -4 -122 -228 57 -105 -154 252 -16 -81 49 52 230 90 45 -255 123 -84 -31 -237 -108 -195 4 -193 -2
4550bJ8M8j65K76q1l60M33l04O3N1K61k96J17M7r6J55k84K16j27o2n8J43J34P0
$$ -2 16 64 -101 175 94 -266 167 -137 -74 -23 238 -58 59 106 10 165 -119 97 -30 -92 -150 -7 127 197
4574A97j26J21j63L8J18j02k06K67j47j20J50O0J77L3l98J53n3j8j17J31j86L64
$$ 197 71 192 29 67 185 83 -123 144 -3 -123 27 87 264 297 -101 52 -1 -19 -136 -5 -191 173
4596A73l57M5J78J63k2j18j29PK79p1k43N8R3j38J91Kk67O5J2j84L22l00o8K58
$$ 173 -184 -139 39 202 180 62 -67 -60 219 148 -95 -37 56 -82 109 111 -156 -91 -79 -263 59 -241 -309 -51
4620e1j33p0K89l62K19J15M4K6j16n8L02R0l80J26J6k21J10M6or7j56KL38k98
$$ -51 -184 -254 35 -327 -108 7 51 77 -39 -97 205 295 -85 41 57 -164 -54 -8 -14 -111 -267 -265 73 -225
4644b25N7m7N42m69K32k29R3Q2r8n6K15J32j67o8K04l41M8J51j70O1m15M41j15
$$ -225 -168 -215 327 -142 90 -139 -46 36 -62 -118 97 229 62 -6 198 -143 -95 56 -114 -53 -468 -27 -142
4667a42J21J67p9j40J34r1k48J73J90K05k88j59K34j55K35k73j74J56R1J69K40
$$ -142 -21 146 67 -73 61 -30 -278 -105 85 290 2 -157 77 -78 157 -116 -290 -134 -43 126 366
4688C66l94N4J87l0j24k5L8j83J16q6m2pJ74j15J38R5k85jJ76k43l7K69j3k02
$$ 366 -28 26 213 183 59 34 72 -111 5 -81 -123 -130 44 -71 67 162 -123 -124 52 -191 -228 41 28 -174
4712a74R6K74j22k41M27r4j33j04j13J12R6O9k9j80K5K87q4k14K95j89P1J33m92
$$ -174 -78 196 74 -167 260 166 33 -71 -184 -72 24 93 64 -116 -91 196 112 -102 193 4 75 208 -284
4735b84M77k36J26j66k19L06J12k11J71p5L48m11L0m0p4N7J55L6k59J46K64l73
$$ -284 193 -43 83 -83 -302 4 116 -95 76 1 349 -62 -32 -72 -146 -89 66 102 -157 -11 253 -120
4757a20K11j06J45J01j12M5j87L0o8j16q6N5L14j83j0P9J24k36J18K0kP2J14R0
$$ -120 91 -15 130 231 119 164 -23 7 -61 -177 -263 -208 106 -77 -87 -8 116 -120 -2 18 16 88 202 292
4781B92l62J97k19k3K14J32p22L29P2K21l30J06K9L45l74o7J95q2K53j08p8k85
$$ 292 -70 127 -92 -115 99 231 -491 -162 -90 131 -199 -93 -64 281 -93 -160 35 -47 206 98 20 -265
4803b65J72K50j31j05L33j86J67j65M8j99J16l59K49j18L28O3l3M5o0l56L18n2
$$ -265 -93 157 26 -79 254 68 235 70 118 -81 35 -324 -75 -193 135 198 165 210 150 -206 112 60
4825F0j43K45p5PN4j18k5o1L38k90K42M5k26l8j07j74j63O33j48j66l7m5M5K66
$$ 60 -83 162 87 94 148 30 5 -56 282 -8 234 279 53 15 -92 -266 -429 204 56 -110 -147 -192 -147 119
4849A19Q2j26j79J45P6K7j30J52j66j02J42j32J47j73J19q5M0J51j43j89K56J26
$$ 119 201 75 -104 41 117 144 14 166 0 -102 40 -92 55 -118 1 -84 -44 107 -36 -225 31 157
4871A57l07K14j10o8p3M26j42p0j03N5l5j68J81J71J14k02j34R7oj39J24l4L12
$$ 157 -150 64 -46 -114 -187 239 97 27 -76 -21 -56 -224 -43 128 242 40 -94 3 -3 -142 -18 -52 260
4894B60m12J67p2J01k3k40J9JL37k61J14M9j46J19j3MJ18J18l23N1K39q0l11J16
$$ 260 -152 15 -57 44 21 -219 -200 -199 138 -123 -9 40 -106 13 0 4 122 240 -83 -32 207 127 -184 -68
4918f8K24j63k25M82N7l27j60M15k64j15J93j07L15l06j82K82k35K63J33l29J65
$$ -68 156 -7 -232 250 307 -20 -180 235 -29 -144 49 -58 257 -49 -231 51 -184 79 212 -117 48
4939D8J37Jj51p3m4K75k06n3m5j0L71l65J77P1k01K00k77lK36r1J26j35j19P2
$$ 48 185 186 35 -38 -82 193 -13 -66 -111 -121 250 -115 62 133 -68 132 -145 -148 88 -3 123 -12 -131 -59
4963e9L27k76k6J21k66J97j77K23q1k77K8J75j4J42K3R4k28PJ89k67M05o5j59
$$ -59 268 -8 -34 87 -179 18 -159 64 -17 -294 -266 -91 -105 37 60 154 -74 -67 122 -145 260 195 36
4986C6OJ80k93J90j97lJ75j38N1k47J66K36l34P7j9K39n5j63K26q9J63l0J0j48
$$ 36 42 222 -71 119 -78 -81 94 -44 7 -240 -74 162 -172 -95 -114 125 70 -93 133 44 207 177 187 39
5010C9J9J59j23l06J24J29J22j50r7mJ07j3o9J74k58K74k23RM59k52K21k59n8
$$ 39 58 217 94 -212 -88 41 163 13 -84 -88 19 6 -63 111 -147 127 -96 -87 372 120 341 82 24
5033B4p8K05j05J97k01k37p8K43jM3j68J50N6o9J81k07J32j25n0j03J00P5l6r9
$$ 24 -54 151 46 243 42 -195 -273 -30 -31 12 -156 -6 50 -19 162 -45 87 -38 -88 -191 -91 -16 -52 -151
5057a51K89j96r0J7K72m28O0KL26j53q1P4J33J65K8l42K87j64j92n5J04n7L64
$$ -151 138 -58 -148 -131 141 -287 -227 -225 101 -52 -133 -59 74 239 267 -75 212 48 -144 -199 -95 -152 212
5080B12m7n42K85j15L30k2j32J41k49K20n4p4KO5p9J74l68M36M2k22j53M84j86
$$ 212 165 -377 -92 -207 123 101 -31 110 -139 81 27 -47 -45 20 -59 115 -253 183 225 3 -150 334 148
5103A48k32L4M7n7J12j39k6J65j08R9mj4O3M3k41L02j12o2L03l39J39j80J92j19
$$ 148 -84 -50 -3 -60 52 -87 -113 52 -56 43 39 25 88 131 -110 192 80 18 321 -18 121 -59 133 14
5127A4j16R7o4n1K76r1m1j13J06j42KMj06K45j26K26R9k1k38j10L52l06J75k36
$$ 14 -102 -5 -69 -120 156 65 24 -89 17 -125 -123 -119 -225 20 -106 120 219 198 -40 -150 202 -104 71 -165
5151a65J71q4k3J56j29J44K10j16R4j31K5n3k23K13k51P2M7J8M9k89L43j70Q0
$$ -165 6 -78 -101 55 -74 70 280 164 258 127 152 99 -124 89 -162 -90 -43 -25 24 -265 78 -92 -12
5174a2K41K0k38r5J14R1J52Jj88K36l98L15l17R1m9k63O9J82j8j80o7L9L3K05
$$ -12 229 249 11 -84 30 121 273 274 86 322 -76 239 -78 13 -36 -299 -230 -48 -66 -246 -313 -274 -241 -36
5198c6m5K73l2j25k51K20L40k76K3K90k17j60k69K41j88K13j67R5K1P7j57J12
$$ -36 -81 192 160 35 -216 4 344 68 91 381 164 4 -265 -24 -212 1 -166 -71 -50 27 -130 -18
5220a8Q8r0P0j35K7J33l65J91M03k93j21K27J06m92L68j66N4mp1j63J48K06k09
$$ -18 70 -20 50 -85 -58 75 -290 -99 304 11 -110 117 223 -269 99 -67 -13 -17 -88 -251 -103 103 -106
5243a06K04j08n5j47J02J87j00O6J70j77p7K89r5k7Rj7P0J35k44j69J29j68K49
$$ -106 98 -10 -65 -212 -110 77 -23 43 213 36 -41 248 153 126 135 118 188 323 79 -90 39 -129 120
5266A20O3m31L61k1l11J92L64j46j70J81j09j51J59j25K61m82N06k42j22M5J31
$$ 120 183 -248 113 92 -219 -27 337 191 21 202 93 -58 101 -24 237 -245 261 19 -103 -58 73
5287G3j16k14M09j60J18l9R5n7PJ85l92J63kj91K48q8j10L2j15j56N1J03RJ6K61
$$ 73 -43 -257 152 -8 110 71 166 109 116 301 -91 72 70 -121 127 39 -71 -39 -154 -310 -259 -156 -147 -131 130
5312A30J66j07l16J51j96j8L77k37M08o23K11N6K67l95j04M1J73j03L2j42M73
$$ 130 296 189 -127 24 -172 -190 187 -50 358 -265 -54 2 269 -126 -230 -189 -16 -119 -87 -229 244
5333B44j65j09n8K8QJ75R2j70K75l08j02k36N30m35N7J76j04J15n0k12o1K57k08
$$ 244 79 -30 -88 -60 -52 123 215 45 320 12 -90 -326 204 -231 -174 2 -102 13 -37 -249 -310 -53 -261
5356b61N4M03L4m31M62o8l18J0K80k91K95m58M06lj80o7k2J96r8N8j43K00j31
$$ -261 -207 196 230 -201 261 193 -125 -115 165 -126 169 -289 117 114 -66 -133 -155 41 -57 1 -142 58 -73
5379g3M8jN1j41P9o9r0O3M1j54M32k82R5Q1K3p8k00J13r0K54k12K63p7j50P9K82
$$ -73 -25 -26 25 -116 -37 -106 -196 -133 -92 -246 186 -96 -1 80 103 25 -175 -62 -152 102 -110 153 76 -74 5 287
5405B87k84q3Pj41J20P9M9Q1q3j1k03J05J17r8L23l3m1j82q9q9K91p7N8m67M56
$$ 287 3 -80 -73 -214 -94 -15 34 115 32 21 -182 -77 40 -58 265 232 191 9 -80 -169 122 45 103 -364 92
5430I2l92K16J98j28K05l22Q4J80j19o9j10oM04k95M56m65m6j2J18J5oN6R9k39
$$ 92 -300 -84 114 -14 191 -131 -47 133 14 -55 -165 -171 233 -62 394 -71 -117 -129 -11 4 -2 54 153 -86
5454h6J67n4j86j81M58k71R4J62o6L24n55o6K26l0P9j30K08R3m74K37J66P9j64
$$ -86 81 27 -159 -340 118 -153 -59 103 37 361 -194 -260 -34 -64 15 -115 93 186 -288 -51 115 194 30
5477C0J41r0m1%P1Q7P2k87J42l39L13L9k66J17k7K68nQ6m54M22l66J05N5j04J09
$$ 30 171 81 40 40 111 198 270 -17 125 -214 99 138 -128 -11 -38 230 225 311 -143 279 -87 18 73 -31 78
5502G8k91M22l21J69k3j16O6Q3r6M31l26j81J00Mk60L50J20j46j32j05N7J35r9
$$ 78 -213 209 -112 57 34 -82 -16 67 -29 402 76 -105 -5 -1 -261 89 209 63 -69 -174 -117 18 -81
5525h1K09k12J75o9k28J37J14l8L12m33O4K34l28J39k4K7l5lL00j99J81k19MK8
$$ -81 128 -84 91 22 -206 -69 45 7 319 -114 -50 184 -144 -5 -29 -2 -37 -40 260 61 242 23 27 55
5549E5k41K14l26L55M4m01J75k8N9K36j99J23r5l07L15k36J91K47k72j4j9J79
$$ 55 -186 28 -298 57 101 -300 -125 -153 -94 142 -57 66 -29 -336 -21 -257 -66 181 -91 -105 -124 55
5571E5j60L81l09J29K11j39m3k42L11j67o1L21k59j05J69L3N6k12R2J70j97n8
$$ 55 -105 276 -33 96 307 168 125 -117 194 27 -34 287 28 -77 92 125 181 -31 61 231 34 -24
5593b4J29n6k8j46J97j81M97n51L53l04K85j50L2l96L75J16p1n1m3R8j39k9k4
$$ -24 105 49 21 -125 72 -109 388 -163 190 -114 171 21 53 -343 32 148 77 26 -17 81 -58 -87 -111
5616a11K11j04j87J42J20m15L68J65J5J4j96j55K06j94J67kp6K10j50k4l7j0o9
$$ -111 100 -4 -191 -49 71 -344 24 189 204 218 22 -133 73 -121 46 44 -32 178 28 4 -33 -43 -112
5639a12k1k73M33j19N1J99r9l00O3K20l8l62L93N4j53K23l13K69k2j88N2q9J94
$$ -112 -133 -406 27 -92 -41 158 59 -241 -178 42 4 -358 35 89 -64 159 -154 115 93 -95 -43 -132 62
5662F2m0M6J8k33L64m5k97Q5k32L85k15m8J97j65J55M7O6j58J63k24j96M50p9
$$ 62 22 68 86 -147 217 172 -125 -40 -272 113 -102 -150 47 -118 37 84 150 -8 155 -69 -265 185 106
5685A06j95K47p0N9R3l20k41K57O6J28k33P7J19R2j89J10k28J32k4Qj64K80J85
$$ 106 -89 158 88 147 240 -80 -321 -64 2 130 -103 -26 93 185 -4 106 -122 10 -14 -6 -170 110 295
5708B95j64k09k80J09J90J5j83N18j86m6j92K37j06k58K08l9J84j84j81l2J95
$$ 295 131 -78 -358 -249 -59 -44 -227 291 105 59 -133 104 -2 -260 -52 -91 93 -91 -272 -304 -109
5729a09o0K76k07n8L65k64L82l32o3O0j42J05J02Jk67J40K06l8j46j61K97r2p7
$$ -109 -169 107 -100 -158 207 -57 325 -7 -70 -10 -152 -47 55 56 -211 -71 135 97 -49 -210 87 -5 -82
5752h2J31J37O2m09K03K5J41J9l52L67j28k5r4j5k4Q7p8J49j97J66k87K11k72
$$ -82 49 186 248 -161 42 67 208 227 -125 242 114 89 -5 -20 -44 43 -35 114 -83 83 -204 7 -265
5775b65M81O9l31N6J0j36N9J3J2J67j57L7j02J07J0R2j00mK3k35O5J59j26K11
$$ -265 216 285 -46 10 20 -116 -57 -44 -32 135 -22 15 -87 20 30 122 22 18 41 -194 -129 30 -96 115
5799A15j67J83j17J0P0j28P7K82M1j45j45R9m5l57K71j01p9J93l37K83j14nK77
$$ 115 -52 131 14 24 94 -34 43 325 366 221 76 175 130 -227 44 -57 -136 57 -280 3 -111 -116 161
5822A61k18J69l53K58J33Oj00j17RL49m26J25J51j91p5K27M07n86J64k71o3O74
$$ 161 -57 112 -241 17 150 156 56 -61 -52 297 -129 -4 147 -44 -119 108 515 -71 93 -178 -241 433
5844D33k83k27p0K42R1k41Q4m5j20J31K16P7j18k40o9K99j93K7J39l1m5p9p9k68
$$ 433 150 -77 -147 95 186 -55 29 -16 -136 -5 211 288 170 -70 -139 160 -33 -6 133 102 57 -22 -101 -369
5868c69K00M14l86K65M2o16M55K1k8N7j96L2K65j50j15P7J80k12N9N0l3j11K30
$$ -369 -169 245 -141 124 166 -450 5 26 -2 55 -141 -109 156 6 -109 -32 148 -64 -5 45 12 -99 131
5891A31l9kj5rL88m91K28k90J48k79K00K5P3j04N2j72J34j67J80M6J17j47L31
$$ 131 92 90 75 66 454 -37 191 -99 49 -230 -30 -5 68 -36 16 -156 -22 -189 -9 37 154 7 338
5914C38k45j03L8m2k2J75j79M8nQ9j39q0J12q2Q3r2K61J62j54k18J67p1R5O8o6
$$ 338 93 -10 28 -14 -36 139 -40 8 3 92 -47 -127 -15 -97 -14 -106 155 317 163 -55 112 41 136 204 138
5939A38q9M3k49J10j17K84p9J9K1k1r2J40J6j01J40j05n8m1r3J17j31J0N2K24
$$ 138 49 92 -157 -47 -164 120 41 60 81 60 -32 108 124 23 163 58 0 -41 -134 -17 -148 -138 -86 138
5963A38k38K7m6J80Kj75l1J49N2p5j04r2J94k7J49r7N4j55K37M0j74m3n2J73k6
$$ 138 -100 -73 -119 61 63 -112 -143 6 58 -17 -121 -213 -19 -46 103 6 60 -95 142 182 8 -35 -87 86 60
5988F0j29j21N11j78j54P7k11J82K1j56L08m60L63pn57M09L44k65k44N60l26L7
$$ 60 -69 -190 321 143 -11 66 -145 37 58 -98 210 -250 113 106 -451 -42 302 37 -207 353 27 64
6010F4J77m22M1J66m6j7j7M6m2L30k05J08o5lj80j07K49l36M81M1j17r1j16J62
$$ 64 241 -181 -140 26 -20 -37 -54 -8 -50 280 75 183 118 115 -65 -172 77 -259 222 263 146 55 -61 101
6034A01J66k26m4m6Q9j4J42k07J0j17l4j89M65o8P2N8j38J51l09R9L0p9k9m9K98
$$ 101 267 41 -3 -49 40 26 168 -39 -29 -146 -180 -369 96 28 100 158 20 171 -138 -39 -9 -88 -117 -166 132
6059A32po7K4lm7k06K38q0J59K03l62J65p5j15N1J31k27j19L8K27k7M0mk27p5
$$ 132 125 58 82 79 32 -174 64 -16 143 346 -16 149 74 -41 10 141 -86 -205 -167 60 33 73 69 -158 -233
6084b33K40j06j09J23K6L7J88k51j20J87j0L52l40j30k4K56k6l45M07k85RJ07
$$ -233 7 -99 -208 -85 -59 -22 166 -85 -205 -18 -28 324 -16 -146 -170 86 60 -285 122 -163 -154 -47
6106d7K25n40L64J18j05J56k76K92k08j71J83L1m2J11k60L89k17j03N12o80J98
$$ -47 178 -362 2 120 15 171 -105 187 -21 -192 -9 22 -20 91 -169 220 3 -100 412 -268 -70
6127g0j39L09K77o89J77O7J88J8J04Jk90K72k59N6O1l1l7K85l06j33J20K21m03
$$ -70 -209 100 377 -312 -135 -68 120 138 242 243 -47 225 -34 22 83 52 15 300 -6 -139 -19 202 -201
6150b01P8K03P9k61L1j41L1K2J70K36r2Qm44N80l77K61m25J69L4k73L37J41j41
$$ -201 -123 80 159 -102 -71 -212 -181 -159 11 247 155 163 -281 299 -78 183 -242 -73 -39 -312 25 166 25
6173B5l2p8kL10j67j79L7K63j10P3k14J84j12k7M3o6L9n5L43k31j25j93K36R9
$$ 25 -7 -85 -87 223 56 -123 -86 177 67 140 -74 110 -2 -29 14 -52 -13 -68 275 44 -81 -274 -38 61
6197F1P9k50P1J54m2j31O9j93n3M74l31n7J61m63L63N9j80M62j79k48Q9L7P6J28
$$ 61 140 -110 -39 115 73 -58 11 -182 -235 239 -92 -149 12 -451 -88 -29 -209 253 74 -174 -85 -48 28 156
6221A56k73k6M65k36r5q4J46J9l5L2j20R1j26L57k92j23J97r3Q1l4j69J74k15
$$ 156 -117 -143 322 86 -9 -93 53 72 37 69 -51 40 -86 271 -21 -144 53 -40 41 7 -162 12 -203
6244b03L05k6o8m8q1K66J94m38J80J64l03M25l39J31j23j59L02l47o6J57r9K78
$$ -203 102 76 8 -40 -121 145 339 -99 81 245 -58 367 28 159 36 -123 179 -168 -234 -77 -176 102
6266A02k6o6p1J85r2N0qJ10j4j42J07j42P2o8k34L38j31R5j37j11K13j92M18o02
$$ 102 76 10 -61 124 32 82 74 184 170 28 135 -7 65 -3 -237 101 -30 65 -72 -183 30 -162 256 -346
6290c46L52L1r8j29K64m52M77p7N4K04k53K91j05j69K06k01ll6p5O8O0J02k98
$$ -346 6 37 -61 -190 74 -378 99 22 76 280 27 318 213 44 250 49 46 10 -65 3 63 165 -133
6313a33j42L82N4k58J57J47L2l42J46k2L10l97N2K3K17p5j05m8M8m1K44j20j2
$$ -133 -275 107 161 -97 60 207 239 -103 43 21 331 -66 -14 9 226 151 46 -2 46 5 249 129 117
6336A17r4J06k39j29L93k49K95m7k07R1M3p6K27j35k32K4L6K78r3j39J58k44p9
$$ 117 23 129 -110 -239 154 -95 200 153 -54 37 80 4 231 96 -136 -112 -76 202 109 -30 128 -116 -195
6359a95k43N03j96J96l92J58K21P2k40N95n46M5J68l0K76j98l28K30p3j99j35
$$ -195 -438 65 -131 65 -327 -169 52 124 -116 479 -67 -22 146 116 392 194 -134 96 23 -176 -311
6380c11L87J56k63j09J40J05n7k8K5r0j85L87k27N5PQ9j31j80K28n8R9j48M3J2
$$ -311 76 232 -31 -140 0 105 48 20 45 -45 -230 157 -70 -15 -8 81 -50 -230 -2 -60 39 -109 -66 -54
6404e4K22k19j82%L96l31N00o22O30m22m5Rm9O3K4J84j13j0n2J35k95M02j50K11
$$ -54 168 -51 -233 -233 163 -168 332 -290 340 -82 -127 -118 -167 -104 -80 104 -9 -19 -71 64 -231 171 21 232
6428B32j54N5j4l8j30L33p6j61K57m10M51k72Kl2P9J50m21K14L9j10L6o1Q1O9
$$ 232 78 133 119 81 -49 284 208 47 304 -106 345 73 75 43 122 272 -149 65 104 -6 30 -31 50 119
6452A19o0j56m7L69k42J1K12l24K48r7K0P8k6q3l55J53N3P9J3p7K24k65K56K4
$$ 119 59 -97 -144 225 -17 -6 206 -118 130 33 53 131 105 22 -333 -180 -127 -48 -35 -112 112 -153 103 127
6476A27l74K98P3k42K84l0m64J08K27J2k4j89J38m5k4J5K26k34J80K94m37J89
$$ 127 -247 51 124 -118 166 136 -328 -220 7 19 -5 -194 -56 -101 -125 -110 116 -118 62 356 -81 108
6498A08k92K71J04j88L07l26R1r1Q9j04k58M53j80RO7j06j25p3M55k13K2n9J41
$$ 108 -184 87 191 3 310 -16 75 -16 73 -31 -289 164 -16 -7 60 -46 -171 -244 211 -2 20 -39 102
6521A02K1j78L32m53M7Q2M04m81J36p5J2m37K66M53j43j05n4j59L24j19J77N6
$$ 102 123 -55 277 -176 -129 -47 357 -124 12 -63 -51 -488 -222 231 88 -17 -71 -230 94 -25 152 208
6543B08j59K2q2K48k03J48l41j18L7L49k12R2j04L92k76p7J4K40l6k52L56j48
$$ 208 49 71 -11 237 34 182 -159 -277 -240 109 -103 -11 -115 277 1 -76 -62 178 142 -110 246 98
6565I8m16L15n0Kl5K60M1k47K3q1Q1k76M01j22o0p8J61k44K77O6k49L32j43K53
$$ 98 -318 -3 -53 -51 -86 174 215 -32 -9 -90 -9 -285 116 -6 -66 -144 17 -227 50 116 -133 199 56 309
6589C09j81j38r5J70M5r5J61l59J43k3J04M1R4n11N95m00L31J12l0n8k84p6M69
$$ 309 128 -10 -105 65 110 15 176 -183 -40 -63 41 82 176 -335 260 -140 191 303 273 215 -69 -145 324
6612C24k26n37O21j00q5J55j34k2KJ74j02l32L45k15K17k44K11j65M13l08Q8k08
$$ 324 98 -439 182 82 -3 152 18 -4 -2 172 70 -262 83 -132 85 -159 52 -113 300 -8 80 -128
6634a28j00K35j35L36M2j85k61Q2k10K77k2j88J97J44l10J96M3J49j80k69N23
$$ -128 -228 7 -128 208 250 65 -196 -114 -324 -47 -69 -257 -60 84 -226 -30 13 162 -18 -287 236
6655B36j70q7L9J76l71P8J69j92K21J02l16J6j36J21N3J32R5l15L1J30N7k38K11
$$ 236 66 -21 18 194 -177 -99 70 -122 99 201 -115 -99 -235 -114 -61 71 166 -149 -118 12 69 -169 42
6678D2k1P5J2k60n0J38j39K84m54K52J54o2l3J13m2j01K64J9j91NP1K48l04o9
$$ 42 21 96 108 -152 -202 -64 -203 81 -373 -121 33 -29 -62 51 9 -92 172 191 0 5 76 324 20 -49
6702d9R4K7L0%lj94J02J6p3l9j3K23m24L80J69n56L08j5N4q2j4K45j67K49m33
$$ -49 45 72 102 102 99 -95 7 23 -50 -89 -102 121 -303 77 246 -310 -2 -17 37 -45 -59 186 19 268 -165
6727a65K12m7J7j3r5K14j39j0L76m16q7J65j45J82O3kj06J48o2j08k17Q9J88j17
$$ -165 47 0 17 4 -91 123 -16 -26 350 -66 -153 12 -133 49 112 110 4 152 90 -18 -235 -146 42 -75
6751g5m8j15K64m6k29K14J4Q2R4l67J71K10m11J33L23p8J49l43M3J17m00M15j31
$$ -75 -123 -238 26 -20 -249 -35 -21 61 155 -212 -41 169 -242 -109 214 136 285 -58 -15 102 -298 117 -14
6774a4J8p2K2N4j03q1r4K25L77k57j94nL12j15n5L5J55m14J37j57K59n3p3L0j08
$$ -14 4 -68 -46 8 -95 -176 -270 -45 332 75 -119 -124 188 73 18 53 208 -206 -69 -226 33 -20 -93 -63 -171
6799a71o5m2jL72j17J11j87J66K38j07K9j29j2l25L77m47M78q4J53m37P8P9Q5
$$ -171 -236 -278 -279 93 -24 87 -100 66 304 197 226 97 85 -240 137 -310 168 84 237 -200 -122 -43 42
6822D2M7q8J16M0k74J27j01L87j98q5m4K16k72K5L10o7p7j32K35k43p9J67P1k8
$$ 42 89 1 117 157 -117 10 -91 296 98 13 -31 185 -87 -62 248 181 104 -28 207 -36 -115 52 123 95
6846I5o6j40J54j76L75l12K86r3J19n96O7M52k98L76l00j33p0L07J0j2mP9m2%
$$ 95 29 -111 43 -133 242 -70 216 123 242 -354 -287 165 -133 243 -57 -190 -260 47 57 45 41 120 78 78
6870G8k06J8j5p7K28L97k76l39K79J52m41L59k45j20J41J67j34j55L68m2nj65
$$ 78 -128 -110 -125 -202 26 423 147 -192 87 239 -202 157 -88 -208 -67 100 -34 -189 179 137 132 -33
6892c3L2j00J72J69J0k14j69L27r2K21l94J35m38L6L24K1k13J86n1k46L24k3k03
$$ -33 -1 -101 71 240 250 36 -133 194 102 323 -71 64 -374 -338 -14 7 -206 -20 -71 -317 7 -16 -219
6915b19K66K34l78L07l24Q9N3j69K90l18K47NK41n71L8L96q9mk56L04j87k1Q2
$$ -219 47 281 -97 210 -114 -25 28 -141 149 -169 78 83 324 -247 -209 187 98 94 -162 142 -45 -66 16
6938A6k78K47J0k69K55k36N3M57j79j4k1Jr2R6p6Mo7J82j17K6j60L89q4l52K52
$$ 16 -262 -15 -5 -274 -19 -255 -202 255 76 62 41 42 -50 46 -30 -26 -93 89 -28 -2 -162 227 143 -209 43
6963D3r5J59j32p2K80j29j21J63k29K55k34K31j62m0J0k2L1L1k33J22O2J82k46
$$ 43 -52 107 -25 -97 183 54 -67 96 -133 122 -112 119 -43 -83 -73 -95 -64 -33 -266 -144 -82 100 -146
6986a46L34l24J0J90j60J98j36K9K09l95kO4K95Nl88J71j81K91m6N9O2m44K37
$$ -146 188 -136 -126 64 -96 102 -34 -5 204 -191 -193 -129 166 171 -217 -46 -227 64 18 77 139 -305 -68
7009f8K53k5o7p8q7J03l9o5j9k7K51j13J11p1k57L13j41QK98j83j11J24R6j83
$$ -68 185 160 93 15 -72 31 -8 -73 -92 -119 132 19 130 59 -198 115 -26 -18 280 97 -14 110 206 23
7033B3j33K27k45K10j22R3j38J94J07m20K94J75m25o6L43k63K39o2k29J32n2n3
$$ 23 -110 117 -128 82 -40 53 -85 109 216 -204 90 265 -160 -226 117 -146 93 31 -198 -66 -118 -171
7055a71L87l74J52M9J26m78N70j42j47R8Qm4l0l4K04k56l4J29j34n1J04P3j10
$$ -171 216 -158 -6 43 169 -309 261 119 -28 70 78 34 4 -30 174 -82 -116 13 -121 -172 -68 5 -105
7078a05J06M7j34L04k37p8J73k0k16L03q4o0K00J63m51J39k50M00j93o8J39J0
$$ -105 1 48 -86 218 -19 -97 76 56 -160 143 59 -1 199 362 -89 50 -200 200 7 -61 78 88
7100H8k30K62kk15L26p0j57L7J39j76j01M06j70l69N3J74J01n9l6J17Ll90K31
$$ 88 -142 120 118 -97 229 159 2 39 178 2 -99 307 137 -232 -179 -5 96 37 1 118 121 -269 -38
7123c8P0L2J76j96m1j37K84j88K06k15j16M13j68J04l1j05K04j51k60J58J1L3
$$ -38 32 64 240 44 3 -134 150 -38 168 -47 -163 250 82 186 155 50 254 103 -157 1 12 45
7145D5Q9m05L41J08j65N9J09j33J70k99R2k7j87L62k70j70K83l24J93J31o2L64
$$ 45 134 -271 70 178 13 72 181 48 218 -81 11 -16 -203 159 -111 -281 2 -322 -129 2 -60 304
7167C04k90j27J47m12O44o14J10J39k29N04j83R2j31m0K3J59Rj25l01N88k79J16
$$ 304 14 -113 34 -378 266 -348 -238 -99 -328 176 -7 85 -46 -86 -63 96 105 -20 -321 267 -12 104
7189A04n9L09k58j20J07j35L70k40R8j67K42j92m1j75K06J86j40p9jk84K92J52
$$ 104 45 354 96 -24 83 -52 318 78 176 9 251 59 18 -157 49 235 95 16 15 -269 23 175
7211A75l46K91j22j11K16J18j59k09K60k85L91l61O3Q7J42k77O6j01P1j24L30
$$ 175 -171 120 -2 -113 103 221 62 -147 113 -172 219 -142 -79 8 150 -127 -61 -162 -91 -215 115
7232A15m8J6p3O0r4j51K32j09j37J79P3J80j95q7m2K36l25m0M25k71k6M5J22L1
$$ 115 67 83 10 70 -24 -175 57 -52 -189 -10 63 243 48 -39 -81 155 -170 -210 215 -56 -82 -37 85 116
7256A16j17j73L13J36k41l4J04k4L4M4j04J71l50j70L00k52M43l77K52J58N1k35
$$ 116 -1 -174 139 275 34 0 104 80 114 158 54 225 -125 -295 5 -247 196 -181 71 229 280 45
7278D5k14J57k67J83J13j79K62m8k91L51J06K1l01k9n1L18l19Q4M5J6J82L3J8
$$ 45 -169 -12 -279 -96 17 -162 100 52 -239 112 218 239 -62 -91 -142 176 -143 -59 -14 2 184 217 235
7301B35l95L49k39R4J8k97J96J01P0l9j07L58l67mJ19j80K76K31m70K72m70K22
$$ 235 -160 189 -50 44 62 -235 -39 62 132 93 -14 344 -23 -27 92 -88 188 419 -51 221 -249 -27
7323b7R1p5J55j54j6l04O78m66jK39k49J45O1M2j43j26K09J08k40j13K73j22K41
$$ -27 64 -11 144 -10 -26 -330 348 -118 -119 120 -129 16 77 119 -24 -150 59 167 -73 -186 87 -35 206
7346B06L0l65P1K0q1PJ40n9J7l47J26M0J11j24J79J01r0N6j91K02O7j17j90M31
$$ 206 236 -129 -58 -38 -119 -112 28 -31 -14 -361 -235 -195 -84 -208 -29 72 -18 38 -153 49 116 -1 -191 240
7370B40j49J17j29k77N3L40o5j60o5k1Ok7Q0l9J00J41k98j54L15k06L53j26j2
$$ 240 91 208 79 -198 -145 195 130 -30 -95 -116 -110 -137 -57 -96 4 145 -153 -307 8 -198 155 29 17
7393A7R1j24r2J57k23Q9K15j8j90J82k0l14J37K5j8P3k8K56j40p2k9l2j37N8K10
$$ 17 108 -16 -108 49 -174 -85 130 112 -78 104 84 -230 -93 -68 -86 -13 -41 215 75 3 -26 -58 -195 -137 73
7418G3o4K9j47o5N5o9O29l34j54p4J85R6p5k20K48j56J4K04j25j19l0K93m9m19
$$ 73 9 38 -109 -174 -119 -188 441 107 -47 -121 64 160 85 -135 113 -43 -29 175 50 -69 -99 194 145 -274
7442b74M02J76k19m90M31K9k07J71O8j33L4K03j00l4K14l46o4K58j70j1p4M06
$$ -274 128 304 85 -405 26 55 -152 19 87 -46 -12 191 91 57 271 -75 -139 119 -51 -62 -136 270
7464B70j66J3Rk48J71L7l76J26J51J16K39p16L36O8k81L00L4J88L5n46K91R7j6
$$ 270 104 117 126 -122 49 86 -290 -164 -13 103 342 -374 -38 30 -251 49 83 271 306 -240 51 148 132
7487A32j63L4N9q2j75j9J35K11j04J10J43l28K60m52K65m4k70J79K57j38k29K5
$$ 132 -31 3 62 -20 -195 -214 -79 132 28 138 281 -47 213 -239 26 -18 -288 -109 148 10 -219 -194
7509a94r7L18J01j59R4j64j03L41j49k21K08L8K4j77J19r8L1P3l5J40L6p5j59
$$ -194 -291 27 128 -31 63 -101 -204 137 -12 -233 -25 13 37 -140 -21 -119 -88 -15 -50 90 126 51 -108
7532a08O1J30j03rJ18j65K1L5m4J44ok73L43k61n0q3P5K30n1J31k91P6M0O9l3
$$ -108 -47 83 -20 -29 89 -76 -55 -20 -64 80 74 -199 144 -117 -167 -250 -175 55 4 135 -156 -80 -40 29 -4
7557dm5J68j66o9K33j08Q9o1M1J02k52J0K11j39K64j38k16j63K11%L16k43j64
$$ -4 -49 119 -47 -116 117 9 98 37 78 180 -72 -62 149 10 274 136 -80 -243 -32 -32 284 41 -123
7580a23Q3j81O8K19o4l57J93O7R1j92J61K7M9m0P3k63J36r1J86n5j29K96l02K37
$$ -123 -40 -221 -153 66 2 -355 -162 -95 -4 -196 -35 -8 41 1 74 -189 -53 -144 42 -13 -142 154 -148 89
7604H9j67q5K22k66L36j27l6m7j95M40j61l97M72k80J7K02j85R1P0P1J40O8k67
$$ 89 -78 -163 59 -207 129 2 -34 -81 -276 164 3 -394 78 -202 -185 17 -168 -77 -7 64 204 272 5
7627Em7L1N4j68j05M64k93J76J44l18oL22j99n5J36j47n7J83k15J50J80K6l40
$$ 5 -42 -11 43 -125 -230 234 -59 117 261 -57 -63 259 60 5 141 -6 -63 120 -95 55 235 261 -79
7650g9l3N0J25K12j2m38K00j66M0L66j22L0J85m29K85Q3l52mQ3j61ok5K35k33
$$ -79 -112 -62 63 275 263 -175 25 -141 -101 265 143 173 358 -71 214 297 -55 -59 24 -137 -143 -168 67 -166
7674a66j20K45k22J94Q7j29L74m12M16m01oM03k64J60l1l94M46j45k9R3j36L3
$$ -166 -286 -41 -263 -69 18 -111 263 -149 267 -134 -140 263 -1 159 128 -266 180 35 6 99 -37 -4
7696dj53L08j95J77k34J99Q4o6L8k86K52j93M9O7j29K14k81L54k83L34k03J7k15
$$ -4 -157 151 -44 133 -101 98 182 116 154 -132 120 -73 -24 43 -86 128 -153 201 -82 252 49 66 -149
7719a49R0j97J97j64J63M6j84M96k88j97%J59J25j55K08j31j96P7k45P00l70l0
$$ -149 -59 -256 -59 -223 -60 -14 -198 298 10 -187 -187 -28 97 -58 150 19 -177 -100 -345 355 -15 -45
7741d5J61p3Q0j80K8J47j44J41k4L8l25K84j98R5O6k76K65o1p0J13K33j12k53
$$ -45 116 43 123 -57 -29 118 -26 115 91 129 -196 88 -110 -15 51 -225 40 -21 -91 22 255 143 -110
7764a10Q8J38j09K62p0k16N0m8K5l2J75O9l08O3P5q7J59o1j17Mo4j5J03j3J44
$$ -110 -22 116 7 269 199 -17 33 -15 10 -22 153 222 -86 -23 52 -35 124 63 -54 -50 -114 -129 -26 -39 105
7789A05j31L52l42P5j67J6J3o3J34M3j93k7L39N8k30j5K0l4p9R7j70pK84n7K05
$$ 105 -26 326 -16 59 -108 -92 -79 -142 -8 35 -158 -185 154 212 -18 -33 -13 -47 -126 -29 -199 -206 78 21 226
7814B26m20K26k31O1K68l08O5k9j07L95n5l41K76K5M6P0j94R8P8k67K24k37J76
$$ 226 -194 32 -199 -138 130 -178 -113 -142 -249 146 91 -250 26 51 97 167 -27 71 149 -118 106 -131 45
7837D5k02K90m6j33R7j06r1K38j43P8k84M6J0Q0L79k37k2J8k24P7K08k08K33k96
$$ 45 -157 133 87 -46 51 -55 -146 92 -51 27 -257 -211 -201 -121 258 21 -1 17 -207 -130 78 -130 103 -193
7861a93R9O6L3J49k22M1L08j45J0l29O7K86j38o8J41l4J56j23j16L6k32L1J2L8
$$ -193 -94 -28 5 154 -68 -27 281 136 146 -183 -116 170 32 -36 105 71 227 104 -12 24 -208 -177 -165 -127
7885a27J10J38k65K7N6K17k70n8L43n1j27j23l0R0K52k41J14L34r6N6m46q0R9
$$ -127 -17 121 -144 -117 -61 156 -114 -172 171 120 -7 -130 -160 -70 182 -59 55 389 293 349 -97 -177 -78
7908g8P3P0r3Q5j66J60r5J65j64K18j05p4j48L41j58k06L36k20K9j3o6R2L92j58
$$ -78 -5 65 -28 57 -109 51 -44 121 -43 175 70 -4 -152 189 31 -175 161 -59 -30 -43 -109 -17 375 217
7932B17j19J07j96n5M0j26p3K60j95K18K02k90q2om9Q2k78K18j04n0J52J12J92
$$ 217 98 205 9 -46 -6 -132 -205 55 -140 78 280 -10 -92 -98 -147 -65 -343 -125 -229 -279 -127 -15 177
7955A77j55K04k25k48K13L1L01j76j77l4K70n18K44j4O7J84r0m3K56j36m69L56
$$ 177 22 226 1 -247 -34 -3 298 122 -55 -89 181 -337 -93 -107 -40 144 54 11 267 131 -338 18
7977A8M4k50K8L14o4J42l99j1J53j79J71J19l59K88k55L92j56J27m4k4R4k65j62
$$ 18 62 -188 -160 154 90 232 -167 -178 -25 -204 -33 86 -273 15 -240 152 -4 123 79 55 149 -116 -278
8000b78L54j57l0n3J53j19J12j70K29o3j6J26j32r8k9K17l3J6j45K8J15M2J15
$$ -278 76 -81 -111 -164 -11 -130 -18 -188 41 -22 -38 88 -44 -142 -171 46 13 29 -116 -88 27 69 184
8023A84l02k3J82M1j08O8J59N9k90M9J1K9J6j49J95J90l08J97k33K30k99K65k51
$$ 184 -118 -141 41 82 -26 42 201 260 -30 19 30 59 75 -74 121 311 3 200 -33 197 -102 163 -88
8046h8J41R1k80J29j87K75o4M2j86l8K87p7j73K55n6JM8J07k84j30K19L3j42J48
$$ -88 53 144 -136 -7 -194 81 17 59 -127 -165 122 45 -128 127 71 72 120 227 -57 -187 32 65 -77 71
8070G1ml74K67P3J17q0jmj65O0MJ19J26j31r3K23l57k01K32N9J43M3j55J61j37
$$ 71 67 -307 -40 33 150 70 69 65 -100 -40 -36 83 209 78 -15 208 -149 -350 -118 -59 84 127 -28 133 -4
8095dj15q3K07j08j4l32R1J87q8L35k22J64K2j94J83L8J12k04K42j46j28l4m03
$$ -4 -119 -202 5 -103 -117 -449 -358 -171 -259 76 -146 18 40 -154 29 67 179 -25 217 71 -57 -91 -494
8118d94P00m21J59N2k00J81J21J22Nn55L49R5k32J44J23k06j81L58N3o8j39J98
$$ -494 206 -215 -56 -4 -204 -23 98 220 225 -330 19 114 -118 26 149 -57 -238 120 173 105 -34 164
8140A64l33J3K58Jr1n1Q7m1m5J5m3J12P5k07m9K44k33j02n1J81q5J51j33L52l47
$$ 164 -169 -156 102 103 12 -39 48 7 -38 -23 -66 46 121 -86 -135 109 -124 -226 -277 -96 -181 -30 -163 189 -158
8165a58K83l39J96K41j96n3Q6m2j01K54j3k50O6j53L75k41J8j54J0L52k81k32
$$ -158 125 -214 -18 223 27 -26 60 18 -83 171 158 -92 -26 -179 196 -45 -27 -181 -171 181 -100 -332
8187c32J61L19j10L73
$$ -332 -171 148 38 411
8191D11
$$ Imaginary data points
##PAGE= N=2
##DATA TABLE= (X++(I..I)), XYDATA
0@%%%%%%%qJ6j6J6j6K4l2M0n6P2q8J04j21J45j77K10k49K96l45M02m66N38o18
$$ 0 0 0 0 0 0 0 0 -8 8 -8 8 -8 16 -16 24 -32 40 -48 56 -65 80 -97 113 -136 160 -185 217 -249 289 -329
30c29P07q11R23j044J180j331J498j682J883k104K344k609K896l207L550l925
$$ -329 378 -433 490 -554 626 -705 793 -889 994 -1110 1234 -1375 1521 -1686 1864 -2061
46b061M333m778N266n802O393p043P762q560R451j0452J1586j2882J4377j6128
$$ -2061 2272 -2506 2760 -3042 3351 -3692 4070 -4490 4961 -5491 6095 -6787 7590 -8538
60h538J8210k0732K3863k7874L3221m0738N2148p1698J13941l57998L53670N32011
$$ -8538 9672 -11060 12803 -15071 18150 -22588 29560 -42138 71803 -286195 67475 599486
72E99486r53126L8408P11593l18908m73138O34155K0227o82662L28114O17015
$$ 599486 -353640 -315232 396361 77453 -395685 238470 258697 -423965 -95851 521164
82E21164o42582l46815P40954O8325o89307K25772M50225l94608j64523M40881
$$ 521164 -121418 -468233 272721 341046 -348261 -122489 327736 -66872 -231395 209486
92B09486j57532l38484L87141J65167n01316N6910M74444k14916l41859K86539
$$ 209486 51954 -286530 100611 265778 -235538 -178628 295816 80900 -260959 25580
102B5580J36170k46083N8014J19967k05743N3950K68343k02530k41987K85015
$$ 25580 161750 -84333 -26319 93648 -112095 -58145 210198 7668 -234319 50696
112E0696J45196k75084l3792J70573o6068j3299J18519j42367j05943K63826N1589
$$ 50696 195892 -79192 -112984 57589 -8479 -21778 96741 -45626 -151569 112257 163846
123A63846l03809K4796K57054r3165j48876J16638J0709q9408J16400K5050j95095
$$ 163846 -139963 -115167 141887 48722 -100154 16484 27193 -62215 54185 79235 -115860
134a15860N9142K09656j36293j72843J67712R4480j45237r407P6910m4485K4585
$$ -115860 -56718 152938 16645 -156198 11514 105994 -39243 -48650 28260 -16225 8360
145H360O7361j17652n2194J72894J1170j76410K6106J20797m1022k3936K0744
$$ 8360 75721 -41931 -94125 78769 89939 -86471 -60365 60432 19410 -4526 16218
156A6218p7840L2477J49239j03851j71639J59842J31318j80045m3011J53106o0279
$$ 16218 -61622 -29145 120094 16243 -155396 4446 135764 -44281 -87292 65814 5535
167E535o5891J50764n4715j89627J79091J61589k74271p9039L05765l7965k62510
$$ 5535 -60356 90408 35693 -153934 25157 186746 -87525 -166564 139201 101236 -161274
178a61274J51923J48492k25503J0366K29554j75860j62738K99419M1839l48902
$$ -161274 -9351 139141 -86362 -75996 153558 -22302 -185040 114379 156218 -192684
188a92684J01090L15917k17111k00781K78761L7830k62880J28454J69355k58161
$$ -192684 -91594 224323 7212 -193569 85192 123022 -139858 -11404 157951 -100210
198a00210l0299L14053j17913k88057K33909J90445k87565n0929K62445r1944
$$ -100210 -130509 183544 65631 -222426 11483 201928 -85637 -136566 125879 33935
208C3935j68574J98207L4036k37752J07367K11457k11161j27800K55933J6048
$$ 33935 -134639 63568 97604 -140148 -32781 178676 -32485 -160285 95648 111696
218A11696k33478Q6354J49432j55455l2935J68524q4205j27452J68103N0507k01130
$$ 111696 -121782 -35428 114004 -41451 -74386 94138 9933 -117519 50584 101091 -100039
229a00039L5592J78745j04694j09209J36667J9924j19870O6927O7151j23028N653
$$ -100039 -64447 114298 9604 -99605 37062 56986 -62884 4043 71194 -51834 -46181
240d6181J35769p3301j11963J13902N7110j20145M957Q9180n7037l3000Q2758
$$ -46181 89588 16287 -95676 18226 75336 -44809 -39852 49328 -7709 -40709 42049
251D2049k9926p6403P8332M7352r7984o146Q9505k8919n3509M9432O344m6908
$$ 42049 12123 -64280 14052 61404 -36580 -42726 46779 17860 -35649 13783 20127 -26781
263b6781L5766K2793o1485P370O0585l5635l9647M6419P318l7240K3823J1479
$$ -26781 8985 31778 -29707 -22337 38248 2613 -37034 9385 16703 -20537 3286 14765
275A4765m0604K3932L8285n2570j4715O5450j7436n2189M6267J8954o0547K4676
$$ 14765 -25839 -1907 36378 -16192 -30907 34543 17107 -35082 11185 30139 -30408 -5732
287e732N0953o7490k1451R0559k4039q7848O8757N4671r6949p76R8727n6922o8501
$$ -5732 45221 -22269 -43720 46839 22800 -65048 3709 58380 -38569 -39345 59382 2460 -66041
300f6041J02725J7683j20821M5567J05711j00236n7562J29774j0642j24352P6186
$$ -66041 36684 54367 -66454 -20887 84824 -15412 -72974 56800 46158 -78194 -2008
311b008Q2113j24403j8136J38338n4819j14837J14125N9559j43248J4623J34191
$$ -2008 80105 -44298 -62434 75904 21085 -93752 20373 79932 -63316 -48693 85498
322H5498q3005q5989J29287J6929j38999N7048J12125j15449n5659J41526j6655
$$ 85498 2493 -83496 45791 62720 -76279 -19231 92894 -22555 -78214 63312 46657
333D6657j30489Q0782Q2080j21754j5122J27349n4233r8607J07019M6257j28954
$$ 46657 -83832 -3050 79030 -42724 -57846 69503 15270 -83337 23682 69939 -59015
344e9015J8574J17656p4126p3422J06878J4045j07979M5304P9765q9095l3464
$$ -59015 -40441 77215 3089 -70333 36545 50590 -57389 -12085 67680 -21415 -54879
355e4879J05453k0911r5343O4919N8872q8753j1318Q5804l3111n9680O4414K2172
$$ -54879 50574 29663 -65680 -761 58111 -30642 -41960 43844 10733 -48947 15467 37639
367C7639p3374J9282O4219n0467l8579O6206O019o2355K1914M1377l9197j4904
$$ 37639 -35735 -16453 47766 -2701 -41280 24926 30945 -31410 -9496 31881 -7316 -22220
379b2220M0052j1115l1893K8612J6276l6430J21L4473j1130k2835J5152J1875
$$ -22220 17832 6717 -25176 3436 19712 -16718 -16597 17876 6746 -16089 -937 10938
391A0938r163l880K501Q05L313j342n517J898J434j926M921l964j4887J4509J8702
$$ 10938 1775 -2105 396 1201 4514 3172 -2345 -447 987 -939 3982 18 -14869 -360 18342
406A8342k7913j4822L8620M359l9910J1953L2114k5850j2027L6506j5064l5364
$$ 18342 -9571 -24393 14227 18586 -21324 -9371 22743 -3107 -15134 21372 6308 -29056
418b9056M3617K0560o5113K487O9835k9846n9273N1047L0980o0890O217N3798
$$ -29056 14561 35121 -29992 -27505 42330 12484 -46789 4258 35238 -25652 -19435 34363
430C4363m4343k8094P3670q368q2620M8357P1541p6742m1262Q7898J262p6796
$$ 34363 -9980 -38074 35596 27228 -55392 -7035 64506 -12236 -53498 34400 35662 -41134
442d1134L8168M3449o9247M270P7426n4397o6791R2813L5967j08444K607R9295
$$ -41134 -2966 40483 -28764 -24494 52932 -1465 -68256 24557 60524 -47920 -45313 53982
454E3982l9127o3575O5121J2943o9464M2543N3934q5945k1998J08199j6996j05015
$$ 53982 14855 -48720 16401 29344 -40120 2423 56357 -29588 -51586 56613 39617 -65398
466f5398M9724P6475p0201l3023O9159j7342m8188N9488J1442q3624K9943Q7718
$$ -65398 -15674 60801 -9400 -42423 26736 9394 -38794 20694 32136 -51488 -21545 66173
478F6173o2513p0712Q1882M1244p8900n106N5474k6758j7484M5847k5868n1690
$$ 66173 3660 -67052 14830 56074 -22826 -27932 27542 784 -16700 29147 3279 -48411
490d8411O0691M3904q2596k9811Q5114J1114o8134N635L6430j3833J842J6029
$$ -48411 12280 56184 -26412 -56223 28891 40005 -28129 -22494 13936 103 1945 17974
502A7974l5286j0437O0572L864p1627K747O8077o966n4405N884L0777j244p715
$$ 17974 -17312 -27749 32823 36687 -34940 -32193 35884 28918 -25487 -19603 11174 9930 2215
515B215p124j3991J4077L1203j7954m3533J9162N1121j4335n0925P171M6969L286
$$ 2215 -4909 -18900 -4823 26380 8426 -35107 -15945 35176 20841 -30084 -22913 24056 27342
528B7342l6677j2713K1826J7584j523k1508k2357K0305M3471j8240o0112J3290
$$ 27342 -9335 -22048 -222 17362 15839 -5669 -28026 -7721 35750 17510 -42602 -29312
540b9312O7522q594o3127N657M6744q41j7915n016j3455J4718M3565k4764o4945
$$ -29312 38210 29616 -33511 -27854 18890 18049 134 -4882 -18337 -3619 39946 15182 -49763
553d9763L3958P3352m2405o7373M2360M5619l4242j7147J5041j3594J1731L9226
$$ -49763 -15805 57547 15142 -52231 -9871 35748 1506 -15641 -600 -14194 -2463 36763
565C6763m0436n3545O6717N6649q1083m5127Q0395K6023o0301l617K4236j5628
$$ 36763 -3673 -57218 9499 66148 -14935 -60062 20333 46356 -13945 -17562 6674 -8954
577h954J8154K7343o1930l0932R2945K3739j06599j0361R6592m049o4726J5159
$$ -8954 9200 36543 -25387 -56319 36626 60365 -46234 -56595 39997 35948 -28778 -13619
589a3619K0595j7368K8188J3125o9041J60R5112j6291j00271L0435Q2903l6944
$$ -13619 6976 -10392 17796 30921 -38120 -37960 57152 40861 -59410 -28975 53928 16984
601A6984n2922L2065J3010j7724K4232m853n4869L1500P2091n3599p2227O5625
$$ 16984 -35938 -3873 9137 -8587 15645 10792 -44077 -12577 59514 5915 -66312 -687
613f87O0181o1200l8251M3994J3997j5196J0304j9299k9439N0727L7845p3254
$$ -687 59494 -1706 -39957 4037 18034 2838 13142 -6157 -35596 15131 52976 -20278
625b0278l9447P7832L3511o7909k4144M5118J2530j2585j376j9791n710M8624
$$ -20278 -59725 18107 51618 -16291 -40435 4683 17213 4628 3252 -16539 -22249 26375
637B6375J0073o4891j0760O8921J0748o1718r419M3741P819k1802q328m216Q996
$$ 26375 36448 -28443 -39203 29718 40466 -21252 -30671 13070 20889 -913 -9241 -13457 -4461
650d461K5785j0603m2242J0379N3301p527n5848N010N1377R04l8257o921K0994
$$ -4461 21324 10721 -31521 -21142 32159 24632 -31216 -26206 25171 26075 -12182 -19103 1891
663A891J2549K90j6880k1967J6885L9774j6615n3872J4233N6665j0737n0641O482
$$ 1891 14440 14730 -2150 -24117 -7232 32542 15927 -37945 -23712 32953 22216 -28425 -21943
676b1943L5685q71j3268l477j0452J0199L4200j7091m9426K4000N4464k8839m9579
$$ -21943 13742 12871 -397 -3874 -14326 -4127 30073 12982 -36444 -12444 42020 13181 -36398
689c6398K8544L4450k4331j4808J3482r212K350K9000k1243m0592L8847M3800
$$ -36398 -7854 26596 2265 -12543 939 -8273 -5923 23077 1834 -38758 89 43889
701D3889m9629l6303N3069K2270m3601l861K5235j4250Q66K6045k8921l0766N0457
$$ 43889 -5740 -42043 11026 33296 -10305 -14166 11069 -3181 -2315 23730 -5191 -35957 14500
714A4500K5921o3663j6124O2855K065m9812J2854K4922k1307N806K3720l3180
$$ 14500 40421 -23242 -39366 23489 25554 -24258 -11404 13518 -7789 -1983 21737 -11443
726a1443j6879N3715O307o2188P520N7874k0955m2007K8030J6290k7896R752J8066
$$ -11443 -28322 25393 31700 -30488 -22968 34906 13951 -28056 -26 16264 -11632 -1880 16186
739A6186l2369m201M6749j2189n0278K7204M3929l5508k6636L6427O651k7134
$$ 16186 -16183 -20384 26365 14176 -36102 -8898 35031 -477 -27113 9314 15965 -11169
751a1169J3353J1945k7903N431L4913k2445l5362L3821K6013l9003j3207L4016
$$ -11169 2184 14129 -13774 -8343 26570 4125 -31237 2584 28597 -10406 -23613 10403
763A0403j225k2770J3559Q380k0458Q197K3991k1254k0743L1232J3586l3595m242
$$ 10403 9178 -13592 -33 8347 -12111 -3914 20077 -1177 -21920 9312 22898 -10697 -14939
776a4939K9133n047k1166J1422R198j6864L187J7084j5361j4117K3552Q448k6887
$$ -14939 14194 9147 -12019 -597 8601 -8263 -5076 12008 -3353 -17470 6082 14530 -12357
789a2357q34K6493n642k0282J2663J2391j6844p31J8102j1234j5277J9827Q264
$$ -12357 -13191 13302 7660 -12622 41 12432 -4412 -5143 12959 1725 -13552 6275 14539
802A4539k5924r70K6478r398k2550J7823J3340k3489k76K4288j1547j9153K2712
$$ 14539 -11385 -12355 14123 4725 -17825 -2 13338 -10151 -10427 13861 2314 -16839 5873
815E873J0378k7650K229K7822j4524k1378K4319R211k9894N036K6772j8833j9923
$$ 5873 16251 -11399 -9170 18652 4128 -17250 7069 16280 -13614 -8578 18194 -639 -20562
828b0562K8229O683l1705P715K8178k0816j6474L0265J406l0934J5358K5669k7662
$$ -20562 7667 14350 -17355 -9640 18538 -2278 -18752 11513 12919 -18015 -2657 23012 -4650
841d650j3819L4109p82l4036J5697K3814k7558r007L1249r221k8204K4539J7802
$$ -4650 -18469 15640 14858 -19178 -3481 20333 -7225 -16232 15017 5796 -22408 2131 19933
854A9933l3782l894L6848j0443l0365K3966J7709k9931N06K8280j6871k0027K8483
$$ 19933 -13849 -17743 19105 8662 -21703 2263 19972 -9959 -9453 18827 1956 -18071 10412
867A0412O888l4923O881L1943k0403k3097K7675Q954k8581O653K2396j8468j1107
$$ 10412 17300 -17623 -10742 21201 798 -22299 5376 14330 -14251 -7598 14798 -3670 -14777
880a4777K6983j274k8724J5318K4680k4786j4550K8263K015k5742Q453J6891j7626
$$ -14777 12206 10932 -17792 -2474 22206 -2580 -17130 11133 13148 -12594 -4141 12750 -4876
893d876n963K1555p145k1272J7917J6346k5172o993K6768r71k2983J0051J5745
$$ -4876 -10839 10716 3571 -17701 216 16562 -8610 -15603 11165 10194 -12789 -2738 13007
906A3007j4782n518J8082o568j6287J5962J0031k2885l062K3899m976k2343J1364
$$ 13007 -1775 -7293 10789 4221 -12066 3896 13927 -8958 -12020 11879 6903 -15440 -4076
919d076J5450j5320o110J6722l696j3625J4147P632j9489O71K2672q329k1805
$$ -4076 11374 -3946 -10056 6666 2970 -10655 3492 11124 -8365 -7694 14978 6649 -15156
932a5156J5529J5746k0138p096J8996l213j5450J1402P333j7873K038K1133j1803
$$ -15156 373 16119 -4019 -11115 7881 4668 -10782 620 7953 -9920 -7882 13251 1448
945A448j9439K1361J3499k4725m059K4246m840j8172J2979Q600j8283L129J8750
$$ 1448 -17991 3370 16869 -7856 -11915 12331 7491 -10681 2298 10898 -7385 -4256 14494
958A4494j6181j5548K4871O893k9574K542K7446j1301j9743J7652Q904j9359N939
$$ 14494 -1687 -17235 7636 14529 -15045 -12503 14943 3642 -16101 1551 10455 -8904 -2965
971b965J6757j8179q317K7700k207l0788J2455K6847k0495j8866K3087N741k1357
$$ -2965 13792 -4387 -12704 14996 12789 -17999 -5544 21303 808 -18058 5029 10770 -10587
984a0587P776J2167j8668p71K5623j1645k5991K2918K1896k8179j2432K9007J355
$$ -10587 -2811 9356 -9312 -10083 15540 3895 -22096 822 22718 -5461 -17893 11114 12469
997A2469k2004R044J0206j6954M047J8783j8236j7787K8147J1479l3295l915L1257
$$ 12469 -9535 -491 9715 -7239 -3192 15591 -2645 -20432 7715 19194 -14101 -18016 13241
1010A3241m376k2188J0897R075j2227O400J1337j8920o563K8779K95l2955O370
$$ 13241 8865 -13323 -2426 6649 -5578 822 12159 -6761 -13324 15455 15750 -17205 -10835
1023a0835K9619j1724k1709J2680Q699j0334L154N360j5456J725K4948r771k7390
$$ -10835 18784 7060 -14649 -1969 6730 -3604 -450 4910 -10546 -8821 16127 6356 -21034
1036b1034J6042K6574j8189j9447J6497J1244j0929j788L320q952N970J6023j5799
$$ -21034 -4992 21582 3393 -16054 443 11687 758 -1030 2290 -6662 -692 15331 -468
1049d68k0606K1400K0460k3699j7794K1463J2399j4920m957O097j638N677Q265
$$ -468 -21074 326 20786 -2913 -20707 756 13155 -1765 -6722 -625 -2263 3414 11679
1062A1679j5534j1948K3839J2969k7364j2615K6123R863k2630n074J1997ml08
$$ 11679 -3855 -15803 8036 21005 -6359 -18974 7149 17012 -5618 -10692 1305 1301 993
1075I93L773j2584n343K3113N982k9730m247L3030K018k8461P55J9547k234o434
$$ 993 4766 -7818 -13161 9952 15934 -13796 -18043 14987 17005 -11456 -10701 8846 6612 178
1089A78K085q661r81K1289k055l2235N726L5584r455l2815J1218K3308r153r243
$$ 178 2263 -6398 -7379 13910 11855 -20380 -14654 20930 11475 -21340 -10122 13186 4033 -5210
1103e210N001m331J585J8613q725k8112J6192L1834k1458k8672K1388J9721j7811
$$ -5210 -209 -4540 -2955 15658 6933 -21179 -4987 26847 5389 -23283 -1895 17826 15
1116A5q963Q881l344J410J4120j3782k1077K5324K2541l0851j8429L1480J2514
$$ 15 -8948 -67 -3411 -2001 12119 -1663 -22740 2584 25125 -5726 -24155 7325 19839
1129A9839k4545m498J3346k926J184Q413j7516j1033K9355R519l6880o173L5463
$$ 19839 -4706 -9204 4142 1216 2400 10813 -6703 -17736 11619 21138 -15742 -21915 13548
1142A3548K388k8445J190J6391l303O8L788j5315q12K7672k511l3381O048L2843
$$ 13548 15936 -12509 -11319 5072 1769 1837 5625 -9690 -10502 17170 14659 -18722 -12674 20169
1156B0169p934k7430Q159J5655o405k346P83j0440N213J9366j0793k4786J5069
$$ 20169 12235 -15195 -7036 8619 2214 -132 651 -9789 -4576 14790 3997 -20789 -5720
1169e720K6276j5899k2584J5366J5295r411n813J627l124O340J0462j3996j6644
$$ -5720 20556 4657 -17927 -2561 12734 3323 -2490 -863 -3987 2353 12815 -1181 -17825
1182a7825J8795J8320k1030j8180J9524J3486j3992p549O462J260L540N095j1167
$$ -17825 970 19290 -1740 -19920 -396 13090 -902 -8451 -1989 -729 2811 7906 -3261
1195c261r838J9060J2639k3363j1440K2786Q795j9256n951J1747J030l334K792
$$ -3261 -13099 5961 18600 -4763 -16203 6583 15378 -3878 -9829 1918 2948 -386 2406
1208B406p221n765J7147N718k2952m177K5833K519k3469Q18J7775l460p662N118
$$ 2406 -4815 -10580 6567 12285 -10667 -14844 10989 13508 -9961 -9143 8632 5172 -2490 2628
1222B628l882m454J3842J988k2733J666K5090n419k4550Q282J8536r796q543R131
$$ 2628 -1254 -5708 8134 10122 -12611 -10945 14145 8726 -15824 -7542 10994 1198 -7345 1786
1236A786k412m590J2997n03j9953P323K2997j2550k1102J5863J4909j7211n497
$$ 1786 -626 -5216 7781 7278 -12675 -5352 17645 5095 -16007 -144 14765 -2446 -7943
1249g943J2590m629o218J2345l182j6981J1468J8097j8178j4242K1986Q280k0355
$$ -7943 4647 18 -6200 6145 2963 -14018 -2550 15547 -2631 -16873 5113 13393 -6962
1262f962P98J4544p288n751J2513m732j4488J3730J2031k1152p407K2813K41k0346
$$ -6962 -6164 8380 1092 -4659 7854 3122 -11366 2364 14395 -6757 -14164 8649 8890 -11456
1276a1456O682J3030j0755l837J2349n339j0659J4658O583j9377n0K1028o775
$$ -11456 -4774 8256 -2499 -6336 6013 674 -9985 4673 11256 -8121 -8171 12857 6082
1289F082j7019J0985R653j2835k427J1740o425q601J2967K071j6554M918J5647
$$ 6082 -10937 48 9701 -3134 -5561 6179 -246 -8847 4120 6191 -10363 -5445 10202
1302A0202r542j1495J2868O503j3161P94J1590p068o406J1360K4j3122N857J0963
$$ 10202 660 -10835 2033 8536 -4625 -3831 7759 691 -5715 5645 5669 -7453 -1596 9367
1316I367j0806q242J2793K682j3137K748J1011p595o281J1137M34r915M878Q717
$$ 9367 -1439 -9681 3112 5794 -7343 -4595 6416 -1179 -7460 3677 4111 -5804 -926 7791
1330G791q367n238J1337L80j2143M442R787q810o023J0154O24j0153L214Q812
$$ 7791 -576 -5814 5523 5903 -6240 -1798 7989 -821 -6844 3310 3934 -6219 -3005 5807
1344E807p863m965J0783M20j1403N857R612r620m968J2107P71j2238M038R803
$$ 5807 -2056 -7021 3762 4182 -7221 -1364 8248 -1372 -6340 5767 6538 -5700 -1662 8141
1358H141q563n870J0767j477j0637P057P910j2168l892J4848j147j4374P306J1092
$$ 8141 -422 -6292 4475 2998 -7639 -582 7328 -4840 -8732 6116 4969 -9405 -2099 8993
1372H993j0691m507J2545k546j0486R652N743j3939p90J5454o142j4495J1242
$$ 8993 -1698 -6205 6340 3794 -6692 2960 8703 -5236 -6026 9428 3286 -11209 33
1385C3Q886j4307k011J3469n342q969J1151L715j4489M013J5340j0573j1459J5650
$$ 33 8919 -5388 -7399 6070 728 -8241 2910 6625 -7864 -3851 11489 916 -10543 5107
1399E107M846j5937J582J2972p695p985J1693l54j3343P778J0903j4334o203J7527
$$ 5107 9953 -5984 -4402 8570 875 -7110 4583 4229 -9114 -1336 9567 -4767 -10970 6557
1413F557K54j6231O096J2051r556m975J1963k670j0708R983O531j4842p48J5221
$$ 6557 6811 -9420 -3324 8727 -829 -5804 6159 3489 -7219 2764 9295 -5547 -6295 8926
1427H926n011j3876Q779Q943j1397k864J0936l724p691R729K705j2338L662J2240
$$ 8926 3915 -9961 -1182 7761 -3636 -6500 4436 712 -6979 2750 5455 -6883 -3221 9019
1441I019o975j0068J0656N829j1531j172R589l773o518P342M94q831L660Q564
$$ 9019 2044 -8024 2632 8461 -3070 -4242 5347 1574 -4944 2398 2892 -5939 -2279 6285
1455F285p980o501J0363L982j0738p2J0357l580o083O136J843p129K755O888o998
$$ 6285 -1695 -8196 2167 6149 -4589 -4661 5696 2116 -3967 2169 4012 -3117 -362 6526 -472
1470d72n566R978J853j1824J064J0574m429p724O325L802o948J142O809n449m433
$$ -472 -6038 3940 5793 -6031 -4967 5607 1178 -6546 -221 3581 -3367 -2225 4584 -865 -5298
1485e298J0290M55j1543M175J0861p614q283R076L783r603N86P602o352l831R836
$$ -5298 4992 5447 -6096 -1921 8940 1326 -6957 2119 5902 -3701 -3115 4487 -1865 -5696 4140
1500D140j766j0880O887J0262j0737o778J3487K544j2432L172R071p692k947R804
$$ 4140 2374 -8506 -1619 8643 -2094 -8872 4615 7159 -5273 -2101 6970 -722 -3669 6135
1514F135m287r501R456O687j3810l240J5178j791j3816O428R193r092j702R339
$$ 6135 1848 -7653 1803 8490 -5320 -8560 6618 4827 -8989 -2561 6632 -2460 -4162 5177
1528E177m989o267J1099K468j4495K619J5378p402j2876R903O900j0704p74P965
$$ 5177 188 -6079 5020 7488 -7007 -4388 10990 3588 -9288 615 7515 -3189 -3963 4002
1542D002o083l681J0536j846j3081Q176J2798j1523r222J2971M765j0931O61P087
$$ 4002 -2081 -5762 4774 2928 -10153 -1977 10821 -702 -9924 3047 7812 -3119 -2458 4629
1556D629n088j229P884m904r920J0498P399j3814n325J3865K164j2045J237P567
$$ 4629 -459 -1688 6196 1292 -8628 1870 9269 -4545 -9870 3995 6159 -5886 -4649 2918
1570B918l359j098N369n308m280J0922K826j3536p86J3874j201j2365K319Q332
$$ 2918 -441 -1539 3830 -1478 -5758 5164 7990 -5546 -6332 7542 6341 -6024 -3705 4627
1584D627l315l010K423l733j059Q450q04j1483K685J3342l376j2559M998R677
$$ 4627 1312 -1698 725 -3008 -4067 4383 3579 -7904 -5219 8123 4747 -7812 -2814 6863
1598F863m187m814K837p74m3M907k532r460M572J1638p213j2433Q175J0051p587
$$ 6863 2676 -2138 699 -75 -118 4789 2257 -7203 -2631 9007 1794 -10639 -2464 7587 0
1613@o060N471K035j732L304k542o627O560R819j0064j0143J1899Q425j1856n371
$$ 0 -6060 -589 1446 -286 3018 476 -6151 409 10228 164 -9979 1920 10345 -1511 -6882
1628f882Q204J353m132K016j407n480P637O766j2414o085J5338M946j5354j605
$$ -6882 1322 2675 -1457 559 -848 -6328 1309 8075 -4339 -10424 4914 9860 -5494 -7099
1642g099J2302n45o473K993n73m089P581K910j3723j470J6341j371j6216L032
$$ -7099 5203 4658 -1815 1178 605 -3484 4097 7007 -6716 -8186 8155 6784 -9432 -6400
1656f400J2900m465o963M989l39k814P802M55j2827L857J5350o997j4660Q439
$$ -6400 6500 2035 -4928 61 -278 -3092 4710 5165 -7662 -3805 11545 4548 -10112 -1673
1670a673J1261q737n945O229j109k350O379l141j0192P657J1783j0815j0636J2546
$$ -1673 9588 851 -5094 1135 26 -2324 4055 914 -9278 -1621 10162 -653 -11289 1257
1684A257Q126j0822l605P703o52j968M099m080o085Q815O049j2805n631J3695
$$ 1257 9383 -1439 -5044 2659 2007 39 4138 58 -6027 2788 8837 -3968 -9599 4096
1698D096L433j2500r76Q023r77k268K503l319k395Q742K375j1901j087J3773p87
$$ 4096 7529 -4971 -5947 2076 1099 -1169 1334 -1985 -4380 4362 6737 -5164 -6251 7522 6735
1713F735j1851J458Q072k036l656J369k012p38N860m76r561K187J1410l602j0134
$$ 6735 -5116 -3658 4414 2378 -1278 91 -1921 -2659 3201 2725 -6836 -4649 6761 3159 -6975
1728f975M037Q627l434m810K752J094j125K969p51p165L198Q610n288r583N798
$$ -6975 -2938 5689 2255 -2555 197 1291 166 3135 2384 -4781 -1583 7027 1739 -7844 -2046
1743b046Q459o462n808N419K214l419K429K02n099L666P134n872p572Q033O687
$$ -2046 6413 -49 -5857 -438 1776 -1643 786 988 -4111 -445 6689 817 -6755 1278 7965
1758G965q817m532P702Q70n412K156J187n172K757O451p131n523R931M016j0813
$$ 7965 -852 -5384 2318 3188 -2224 -68 1119 -4053 -1296 5155 -1976 -7499 2432 6448 -4365
1773d365o83J0039k471o104M722J905n576L105M966p700l570J0706q6j1482K882
$$ -4365 -5048 4991 2520 -3584 1138 3043 -2533 572 5538 -2162 -5732 4974 4888 -6594 -3712
1788c712R276n826n323O602J193o052L919M405p563m00R676k889r340O049O950
$$ -3712 5564 -262 -5585 1017 2210 -3842 77 4482 -3081 -3481 6195 3306 -6034 15 6965
1803F965q138l109P825j296o194M548K582p599J205Q212n209o369P880L614q407
$$ 6965 -1173 -4282 3543 2247 -3947 601 3183 -4416 -3211 5001 -208 -6577 1303 4917 -3490
1818c490K99P740l018n098N693J753o768K383N642o012l387O914M71p454J994
$$ -3490 -3191 4549 1531 -3567 2126 3879 -2889 -506 5136 -876 -4263 2651 3122 -4332 -2338
1833b338N983m300m067N856J309n565K007M184m094j367N578p02n621L188M778
$$ -2338 3645 -655 -4722 1134 2443 -3122 -1115 3069 -1025 -2392 3186 2484 -3137 51 4829
1848D829n280k608N221M31n705J495L892l253k004M475o19m331L009L519m223
$$ 4829 -451 -3059 2162 2593 -3112 -1617 2275 -978 -2982 1493 874 -3457 -448 3071 -1152
1863a152k170O229L55n622J327M719k922l128M014J83m297K434K752n167j217
$$ -1152 -3322 2907 3262 -2360 -1033 3686 764 -2364 1650 1833 -2464 -30 2722 -2445 -3662
1878c662O154q86o213K495N863l795l565N300N86m423L086K572n134k12O438k404
$$ -3662 2492 1606 -4607 -2112 3751 -44 -3609 1691 2277 -2146 940 3512 -1622 -1834 4604 2200
1894B200p150M577N433o658l185O828q47m964L730K294n185P99O419l812n484
$$ 2200 -4950 -373 5060 -1598 -4783 2045 1198 -3766 -36 2258 -2927 -2128 4291 479 -5005
1909e005O720M003q146n79P217k105n209M035J820n861K314M697n620l623Q040
$$ -5005 1715 5718 -2428 -3007 4210 2105 -3104 931 2751 -3110 -796 3901 -1719 -5342 2698
1924B698Q63q667K166P498m156m316N699Q15n272L020M040o102j414P787j765
$$ 2698 3561 -5106 -2940 4558 402 -3914 1785 2600 -2672 348 4388 -1714 -3128 4659 2894
1939B894p747M229N458n858k861N506p93m222L451K684n785M31O783l193n456
$$ 2894 -4853 -624 4834 -1024 -3885 1621 828 -3394 57 2741 -3044 -2613 4170 977 -4479
1954d479N657L787o289j293N712j250l998L164J361n337J838M286m024l838N554
$$ -4479 1178 4965 -1324 -2617 3095 1845 -2153 1011 2372 -2965 -1127 3159 -865 -4703 851
1969H51K107n800j65N628j743l352L246J397l507J319L384l498k328M732Q58n650
$$ 851 2958 -2842 -3007 2621 878 -2474 772 2169 -1338 -19 3365 -133 -2461 2271 3129 -2521
1985b521O26M564k232l686L112J462l451R10K987k526j774M357Q40n198J579N257
$$ -2521 -1895 2669 437 -3249 -137 1325 -2126 -1216 1771 -755 -2529 1828 2668 -2530 -951 4306
2001D306l623l046L672J615m056j67L593k493k315L646j23m695K383M436m024
$$ 4306 683 -2363 1309 2924 -1132 -1299 2294 -199 -2514 1132 1009 -3686 -1303 3133 -891
2016h91k868N333J384n209R23M466k461k565M309l77m816L584L075n448k128O075
$$ -891 -3759 1574 2958 -2251 -1328 3138 677 -1888 2421 2044 -2772 812 3887 -1561 -3689 2386
2032B386j62o274K315M540m062j926M936j099l732M046K241n243j32P101k756
$$ 2386 2224 -4050 -1735 2805 -1257 -3183 1753 654 -3078 968 3209 -2034 -2166 4935 2179
2047B179o212M559M109n913j348M841j835l503L930Q15n354J721N963m236m927
$$ 2179 -4033 526 4635 -1278 -2626 2215 380 -3123 807 1622 -3732 -2011 3952 -284 -5211
2062e211O365L203o423J35N174k287k417L520k78m809L521L929o282k723P439
$$ -5211 1154 4357 -2066 -1931 3243 956 -1461 2059 1781 -3028 493 4422 -1860 -4583 2856
2077B856M44p156J359M978k631k382L283n50k430L801J909o145K32O968j830o000
$$ 2856 3300 -3856 -2497 2481 -150 -2532 751 201 -2229 1572 3481 -2664 -2432 4536 2706 -3294
2093c294K433M333k996k302K238o24j316K878k68n248J983O051k894n473L692
$$ -3294 -861 3472 476 -1826 412 -212 -1528 1350 1082 -4166 -2183 3868 974 -4499 -807
2108h07M583k992k730K827L12r41J531q82l533L012L784m146m743M456M218m908
$$ -807 3776 784 -1946 881 1193 252 1783 901 -2632 380 4164 18 -4725 -269 3949 -959
2124i59k780L855P97j727N25o3j331K835K343l666l587N675L044n912k478N123
$$ -959 -3739 116 913 -814 -289 -352 -1683 1152 3495 -171 -3758 1917 4961 -951 -3429 1694
2140A694P59l384K40J6q53J903J587m567j777O641J782p703j91O907o1m447O82
$$ 1694 2453 -931 -691 -675 -1528 375 1962 -2605 -4382 2259 4041 -3662 -3853 3054 2993 -1454 -772
2157g72K030q52J015R94m715n22O855j211p717J774O831k722m772K467K293j742
$$ -772 1258 406 1421 2415 -2300 -2822 4033 2822 -4895 -3121 3710 988 -3784 -1317 976 -766
2173g66J098M97l703J962N816l371o599M666O072m696m206L255J951k457L28O
$$ -766 332 829 -2874 -912 4904 1533 -5066 -400 5672 976 -3230 25 1976 -481 -153 -147
2189a47k840K517M363n126m187O040L845n970k406N268J052k909J006K72k161
$$ -147 -2987 -470 3893 -1233 -5420 620 4465 -1505 -3911 1357 2409 -500 506 778 -1383
2204a383K952K149n351k399O602J506p225p89N629n12l095R81M60q80K677P97
$$ -1383 1569 3718 -1633 -4032 2570 4076 -3149 -3938 1691 1179 -1916 -935 -475 -1355 1322 2119
2220B119m587J56O291n31o868J482N528j663l683J191J146q11J113n75l412J570
$$ 2119 -2468 -2312 3979 3448 -3420 -1938 3590 1927 -1756 -565 581 -230 883 308 -3104 -1534
2236a534M389j836n252K931M703k681l511K423K086j175j26M15j870J144L222
$$ -1534 2855 1019 -4233 -1302 3401 720 -2791 -368 1718 543 417 832 -1038 106 3328
2251C328l042l775L142L660l789k929L001J887k356k53Q91j053J492K250k775
$$ 3328 286 -3489 -347 3313 -476 -3405 -404 1483 -873 -1126 -235 -1288 204 2454 -321
2266c21k141L882K405m538j755M354O93m032O22J692j896M94J592k364j398L519
$$ -321 -2462 1420 3825 -713 -2468 1886 2579 -1453 -831 861 -1035 -541 1051 -1313 -2711 808
2282H08J674m811m22M607l81l465J581K532k291L41J654k042j656M122p8m831
$$ 808 2482 -2329 -2751 1856 1475 -1990 -409 2123 -168 173 1827 -215 -1871 2251 2173 -2658
2298b658Q06M722k744l580L297J605k808K91K256j851j282M141q34l985K400L831
$$ -2658 -1852 2870 126 -3454 -157 1448 -1360 -1069 1187 -664 -1946 2195 1361 -2624 -224 3607
2314C607l522k233L792L51l276L61K672k640q08K788q06l306L129K030l634n12
$$ 3607 85 -2148 1644 1995 -1281 -920 1752 -888 -1696 1092 286 -3020 109 2139 -1495 -2007
2330b007L807o48k693J500K285k685K67K606k177j979K922Q15l702L93K993j466
$$ -2007 1800 1152 -1541 -41 2244 -441 -174 2432 255 -1724 1198 2013 -1689 -1296 1697 231
2346B31k919K369J332k719L30K643j169j556K754J8k168R72J787j405k158K960
$$ 231 -2688 -319 1013 -1706 -1376 1267 98 -1458 1296 1314 -854 118 1905 500 -1658 1302
2362A302N50l289J44K705j540j866K045J91j867J018J988k064j324L306M74l334
$$ 1302 1852 -1437 -1293 1412 -128 -1994 51 242 -1625 -607 1381 -683 -2007 1299 1773 -1561
2378a561R81K803j518j674J624M57j575M61J532k361q15K679m58l189J589K597
$$ -1561 -580 2223 705 -969 655 1112 -463 -2 1530 -831 -1646 1033 575 -2614 -1025 1572
2394A572j788j926K416J024k422Q60J583j675j07K749j270k769K029K262k859
$$ 1572 -216 -2142 274 1298 -1124 -264 1319 -356 -463 2286 1016 -1753 276 2538 -321
2409c21j904K763O07k804Q78J472k154K91K341j169k162K722K116l274j610M211
$$ -321 -2225 538 1145 -1659 -781 691 -1463 -1172 1169 0 -2162 560 2676 -598 -2208 2003
2425B003k40k777J022J480k281K51J690j696j950L573N31m309M87M274j429l039
$$ 2003 1763 -1014 8 1488 -793 -542 1148 -548 -2498 1075 1606 -2703 -2216 2058 629 -2410
2441b410K019J878k114Q49J367j792j026L268J50m192J090M030k881k419K296
$$ -2410 -391 1487 -627 222 1589 -203 -1229 2039 2189 -2003 -913 3117 236 -2183 113
2456A13M48j831N52J440j918l04L193j227k895K544K535k750j758L012P25k370
$$ 113 561 -1270 -718 722 -1196 -1500 1693 466 -2429 115 2650 -100 -1858 1154 1879 -491
2472d91M62J451k009O1J762j410k279K780J370l258l87K729k01j833R30J513j611
$$ -491 -29 1422 -587 -526 1236 -174 -2453 327 1697 -1561 -1948 781 580 -1253 -323 1190 -421
2489d21O66J080j175j398K906M25l282N02K224p41k456J313P87j357rJ492j319
$$ -421 245 1325 150 -1248 1658 2083 -1199 -697 1527 786 -1670 -357 430 -927 -936 556 -763
2506g63m25K109j39k369R85K604j194k103J991R73j926j11J283q84p64J176N9
$$ -763 -1188 921 782 -1587 -602 2002 808 -1295 696 1669 -257 -368 915 31 -733 443 502
2523E02k136Q58K093j667j985K451R91k201L21J654l96q47J311Q9j823J109J623
$$ 502 -1634 -776 1317 -350 -2335 116 1107 -1094 -773 881 485 -362 949 1038 -785 324 1947
2540A947k273j124K491K23k825M54K002q29j831J985K1k000J661J398k095l91
$$ 1947 -326 -1450 1041 1264 -1561 -1107 895 66 -1765 220 241 -1759 -98 1300 -795 -1186
2556a186K994n20k541J337K113k099j364K102L4k219J457M92j833L1K413j298
$$ -1186 1808 1288 -1253 84 2197 98 -1266 836 870 -1349 108 600 -1233 -1202 1211 -87
2572h7k479K324K160k749p57K668k77j409J139L38j282Q47J402k121j325K793
$$ -87 -2566 -242 1918 -831 -1588 1080 803 -606 533 871 -411 436 1838 -283 -1608 1185
2588A185M83l239l6K627j093j526J144N40o87L99R99j615l58L327m68l139J145
$$ 1185 1668 -1571 -1607 1020 -73 -1599 -455 85 -602 -203 796 -819 -1177 2150 1682 -1457 -312
2605c12K522j537j920J379N94r66K23K99j621L89K471j251k537J945K270j970
$$ -312 2210 673 -1247 132 726 -240 -17 282 -1339 -950 1521 270 -2267 -322 1948 -22
2621b2j778K095P95r53L37m5q91Q68J644k167j785K496J266k810j317K617P35
$$ -22 -1800 295 1090 137 474 429 -462 406 2050 -117 -1902 594 1860 -950 -2267 350 1085
2638A085j905J24N43k18P24O20j510p19K587P12k854p53L034N37k686m2Q51j30
$$ 1085 -820 -696 -153 -371 353 973 -537 -1256 1331 2043 -811 -1564 1470 2007 -679 -721 130 0
2656@J04j46j082m82K817j32l191K74L571o41k421R60J389l83j69j2r36K14K093
$$ 0 104 -42 -1124 -1606 1211 1079 -2112 -1838 1733 1092 -1329 -369 1020 637 468 456 -480 -266 1827
2675A827r66k814J023L064j818k542J496J641r88n40L10n83P50J857j654j968
$$ 1827 861 -1953 -930 2134 316 -2226 -730 911 -77 -617 -307 -890 -140 1717 63 -1905
2691a905K538K347k744k297K398J636j663j085O29l01M45P72j532j509K824J290
$$ -1905 633 2980 236 -2061 337 1973 310 -775 -146 -447 -2 770 -762 -2271 553 1843
2707A843l014j036K940Q67k370j53J619n98N51J29j500j81K556j72l073k71L390
$$ 1843 -1171 -2207 733 1600 -770 -923 696 98 649 778 -722 -903 1653 1481 -1592 -1863 1527
2724A527o36k522N25J434m46j53K71q55K13J990j88k643N71L392j508k199J139
$$ 1527 891 -1631 -1106 328 -118 -271 0 -855 -642 1348 1160 -1483 -912 2480 972 -1227 -88
2741h8J453q71n16l43n39P39J359j373j987J868J963j754j711J891R72r72l32
$$ -88 1365 494 -22 -365 -904 -165 1194 -179 -2166 -298 1665 -89 -1800 91 1063 91 -241
2758b41K74J91K42R21j486j227J777J529k670r26J718Q02j313o41P03j04O54L77
$$ -241 33 224 466 1387 -99 -1326 451 1980 -690 -1616 102 904 -409 -1050 -347 -451 203 580
2776E80r14o34J759R49k471k60K202K22j702k72J352m31m88M5k76n45J174P03
$$ 580 -334 -968 791 1740 -731 -991 1211 1433 -269 -541 811 380 -108 -63 -339 -884 290 993
2794I93k381O1K297m21j936P09J681n63n76N62l38j80J034l96j344j10K265j050
$$ 993 -1388 -1327 970 549 -1387 -678 1003 440 -136 426 88 -92 942 546 -798 -908 1357 307
2812C07j812J122J102j275o30J428k73o83R80J84j541J197J107j011j053J539
$$ 307 -1505 -383 719 -556 -1186 242 -31 -714 266 450 -1091 106 1213 202 -851 688
2828F88Q23j911r9J198m46r44P92K55j525P07J527k044m13K050n9j629P52J481
$$ 688 1511 -400 -499 699 253 -691 101 356 -1169 -462 1065 -979 -1392 658 599 -1030 -278 1203
2846A203q95o87J036J63j128O94O01j433K0J460o31j782R44J101j175n92J422
$$ 1203 308 -379 657 820 -308 386 987 -446 -426 1034 403 -1379 -435 666 -509 -1101 321
2863C21j19j493J197Q49j061J05J104n34j142J359P51j684j52J258n76j114R15
$$ 321 202 -1291 -94 755 -306 -201 903 369 -773 586 1337 -347 -499 759 183 -931 -16
2880a6L56j202K68P95l76j111J684L06j618O21J596q82q51O91N36r32Q2P06q65
$$ -16 340 -862 -594 201 -175 -1286 398 704 -914 -293 1303 421 -430 261 797 -135 -53 653 -212
2899b12n48J324k80j531J024R81j163r67J267N50q00j36O99j57p4J037n48q95
$$ -212 -760 564 284 -1247 -223 758 -405 -1372 -105 445 -355 -491 208 51 -23 1014 466 -429
2917d29P63J063j574o01J405J19j328j8Q96o58m08J284n27q59J129N82j167o05
$$ -429 334 1397 -177 -778 627 746 -582 -600 296 -362 -770 514 -13 -872 257 839 -328 -933
2935i33K021q4j467R6J408p14k75L94m49m96P04J69j443J12J624n27j481P13J629
$$ -933 1088 1004 -463 -367 1041 327 52 446 -3 -499 205 374 -1069 -957 667 140 -1341 -628 1001
2954A001j189l47O19m9k88O82K16j337M59J598r90j562J238J025j230j86J13J41
$$ 1001 -188 -535 84 35 -253 429 645 -692 -233 1365 375 -1187 51 1076 -154 -340 -227 -86
2972h6k66M40j71q33Q95J307j701q02K405M27j777r6Q65m8r45Q44m27q28J181
$$ -86 -352 88 -83 -916 -21 1286 -415 -1217 1188 1615 -162 -258 607 559 -386 458 31 -797 384
2991C84M31j526o28J955Nj683J81J179j8n92Q22m34k09J091j22j234j46J502m00
$$ 384 815 -711 -1339 616 621 -1062 -881 298 280 -312 510 76 -133 958 836 -398 -544 958 558
3010E58j422L91J065m68q15O14j09k04O56r5j290O08J862j149r87J018Q37j002
$$ 558 -864 -473 592 124 -691 -77 -186 -390 266 171 -1119 -511 1351 202 -785 233 1070 68
3028F8l26O99k48k80M17l33o44O79L52q42q74J285Q24j482N4R36j70k70M96j21
$$ 68 -258 441 193 -87 330 -3 -647 32 384 -458 -1332 -47 777 -705 -651 285 115 -155 341 220
3048B20k45M23M04q77k02J119Q5j427JO15n8p34L56J80n38N16K81p53N06N03N9
$$ 220 -25 398 802 -75 -277 842 927 -500 -499 116 58 -676 -320 -140 -678 -162 119 -634 -128 375 434
3069D34j029M69J256n67j072Q04M09p35q0M48p28j34Q12l15j037P76Q80j004k01
$$ 434 -595 -126 1130 563 -509 295 704 -31 -111 337 -391 -525 287 -28 -1065 -289 591 -413 -614
3088f14R28J58r24N09L15n27J63Q97j175j18Q70M31j263o03J520m54p98K91L34
$$ -614 314 472 -452 57 372 -155 8 905 -270 -388 482 913 -350 -953 567 113 -685 -394 -60
3107f0j82k58N77j76l33Q76L84j405N23J198r88n82N46Q36n88n20L86m98m46J202
$$ -60 -242 -500 77 -99 -432 444 828 -577 -54 1144 156 -426 120 956 368 -152 234 -264 -710 492
3127D92m52j216N20J541j067q74J119O82p17m15P27j39P6M47o94m78J062L92j414
$$ 492 40 -1176 -656 885 -182 -1056 63 745 28 -387 340 201 277 724 30 -448 614 1006 -408
3146d08p27J537K88j472K11P90k90J26P4n27j6R74k3j129L27J278q6j539O88M87
$$ -408 -1135 402 690 -782 -571 219 -71 55 129 -398 -414 560 537 -592 -265 1013 927 -612 76 563
3166E63l69l00J60k86k72Q29k51j178L54J363o65j023P21J110l32n34J50k32N13
$$ 563 194 -106 54 -232 -504 325 74 -1104 -750 613 -52 -1075 -354 756 424 -110 40 -192 321
3185C21K05l23o23M83J009r98j082Q19Q66q30m40K69M99O2l99j47k56R24N86j188
$$ 321 526 203 -420 63 1072 74 -1008 -189 677 -153 -593 -324 175 237 -162 -309 -565 359 945 -243
3205b43n08J587N85j525l86N64N28o14j06l59J2Q84n3j387Q2J488Q8j351j78J463
$$ -243 -751 836 1421 -104 -490 74 602 -12 -118 -477 -465 419 366 -1021 -939 549 637 -714 -892 571
3225E71n9o24J93n7L3O54O1j248K31J332m39j769M54J065m38n87L20k38M45K05
$$ 571 512 -112 81 24 57 711 772 -476 -245 1087 648 -1121 -667 398 -40 -627 -307 -545 -100 105
3245A05J7q47L99J595q59j430R12J054n29r59M09M14n88L22j48p32N92J088j312
$$ 105 122 -725 -326 1269 410 -1020 -108 946 417 -542 -133 281 -307 15 -133 -865 -273 815 -497
3264d97r12J714L68j193mR92k85J54k38R1l71M81Q91j557o04J344J65j066p5O51
$$ -497 -1409 305 673 -520 -524 468 183 337 99 190 -181 300 1191 -366 -970 374 539 -527 -602 49
3284D9k34l63L75l6j41Q39J21j370M62J263l68j374O28J090m86o80J44R8k00L05
$$ 49 -185 -548 -173 -209 -350 489 610 -760 -298 965 597 -777 -149 941 455 -225 -81 17 -183 122
3304A22l21o99N50P51k56j137O36Q27m82m08P25K3k82M01j96l53K90M55m01r01
$$ 122 -199 -898 -348 403 147 -990 -354 473 -9 -417 308 331 49 450 254 -99 191 646 245 -656
3324f56O65N71r02o15R94k46k28%M42l74O3P91n43l57O71L58r46M1Q01J51q91
$$ -656 9 580 -322 -937 57 -189 -417 -417 25 -349 -286 505 -38 -395 276 634 -312 -271 530 681 -210
3345b10K10J33m08q8O26p78j16P45P5o43r6J131k93o36P20N1m35K9N79n81j08
$$ -210 0 133 -275 -363 263 -515 -631 114 189 -454 -550 581 288 -348 372 423 -12 17 596 15 -93
3366i3O40k50q71O26K04p29j28N33J47o88M55L08j19l11O45k00m15N81M09q13
$$ -93 547 297 -574 52 256 -473 -601 -68 79 -609 -154 154 35 -276 369 169 -246 335 744 -69
3386f9l13Q63m8q50K92N22n34j66L58k25j31L68k38m66L13P89l13p37P51J76j81
$$ -69 -382 481 433 -417 -125 397 -137 -303 55 -170 -301 67 -171 -637 -324 465 152 -585 166 342 161
3407A61o3J03J49l71N69k63o92K15Q11j020m10P05K84n78K1O05k61j58L84M1n40
$$ 161 98 201 350 -21 548 285 -407 -192 619 -401 -811 -106 178 -400 -379 226 -35 -193 191 232 -308
3428c08M90N42q37n7P17k74m22k48P87n03m43N83k16l67O29l7o84N77N68l9o26
$$ -308 182 724 -113 -170 547 273 -149 -397 390 -113 -556 27 -189 -556 73 36 -648 -71 497 458 -168
3449a68l5Q91m68k13J65l6k18J68q9l71o2O97j94q30K63J079o59p26Q46J80k53
$$ -168 -203 688 220 7 172 136 -82 86 -3 -374 -436 261 67 -763 -500 579 -80 -806 40 220 -33
3470c3J55J02k79L27J39k20o98M72P01o50p06P40J18q11P8K66r0M20J59n80j20
$$ -33 122 224 -55 272 411 191 -507 -35 666 16 -690 50 168 -643 -565 -299 -389 31 190 -390 -510
3491e10Q47O38j275n6J227o65j89K02j02j5l0M90j124O6R22j45r10K64P11j79
$$ -510 337 975 -300 -356 871 206 17 219 117 102 72 562 -562 -496 426 281 -629 -365 346 167
3511A67o12M24L23k79j58L46m89L86Q17l97r43M14O72o18p54Q21Q0o28J27j43
$$ 167 -445 -21 302 23 -135 211 -278 108 925 528 -415 -1 671 53 -701 120 200 -428 -301 -444
3531d44k01O70L48l58m33O96K66n21o4L66Oj67p9l5m05K23N32m51n47N90J56r29
$$ -444 -645 25 373 15 -418 278 544 23 -41 325 331 164 85 50 -355 -132 400 -51 -598 -8 148 -781
3553g81J56O74j64Q3k33L30j66K46M38m66k54M92k42m23K49N84l17o33J76L26
$$ -781 -625 49 -115 -32 -265 65 -101 145 583 117 -137 355 113 -310 -61 523 206 -427 -251 75
3573G5k21r9J37j73j52P61n53QJ00M75k84q6L9M86l81l38M96j67j92J21o2n61
$$ 75 -146 -245 -108 -281 -433 328 -225 -217 -117 358 74 -12 27 513 132 -206 290 123 -69 52 -10 -571
3595e71K60N34k93n49Q03j26k48n3J95K82n3L39n58l2M47n2n93N8L87Q1q69K22
$$ -571 -311 223 -70 -619 184 58 -190 -243 -48 234 181 520 -38 -70 377 325 -268 -210 177 258 -611 -389
3617c89M36j35p2m2O8k40P34j04n30J02N34K53r88O70J21l83m21O12j85N3l88
$$ -389 47 -88 -160 -202 -134 -374 360 256 -274 -172 362 615 -373 297 418 35 -386 226 41 94 -294
3638b94L43m91J56P25r03l55Q39L98m44k69O12m8k39Q6%j24R7N70q59k19Q61j88
$$ -294 49 -442 -286 439 -464 -819 20 418 -26 -295 317 269 30 116 116 -8 89 659 -200 -419 442 254
3660B54q03K35L31K64n02J98K0k20K11J58l78J18M34L74p48o6P56k09o03K81m33
$$ 254 -549 -314 17 281 -221 -23 -3 -223 -12 146 -232 -114 320 694 -54 -120 636 427 -176 105 -328
3681c28K93J15o6n80L48P20q03l08M47L33k29j37RL39j14K45l08J43K39K03p66
$$ -328 -35 80 14 -566 -218 502 -301 -609 -162 171 -58 -195 -186 153 39 284 -24 119 358 561 -205
3702b05k26L20M26m85r4J7P1J1l41K33R4K46m2p2k80R31rq93j86R25qn10k72L23
$$ -205 -431 -111 315 -170 -264 -247 -176 -165 -506 -273 -179 67 25 -47 -327 604 595 -298 -484 441 433 -77 -349 -26
3726b6jj4j70Q8m15P97j56o22J68P35r9m50N8L83k14K90j87j27j31L96k37l92
$$ -26 -27 -41 -211 -123 -538 259 103 -519 -351 384 285 -165 -107 276 62 352 165 38 -93 303 66 -326
3748c26P1N45R1j089K93K38K06q1j14j05L02K63j27n18M84M50j25j029N83K33
$$ -326 -255 290 381 -708 -415 -177 29 -52 -166 -271 31 294 167 -351 133 583 458 -571 12 245
3768B45k80j26kJ56l5J71k93m13L19P13p38j06O18M2l42j8J39M50j89L05o06l21
$$ 245 -35 -161 -163 -7 -42 129 -164 -577 -258 455 -283 -389 229 271 -71 -89 50 500 311 616 10 -311
3790c11R07j46r79L04L67k52j78J84J45n3j79L62k82r9N88j36n60L34M74l00o06
$$ -311 596 450 -529 -225 142 -110 -288 -104 41 -12 -191 171 -111 -210 378 242 -318 16 490 190 -416
3811d16P08k60R5j83m8j09j91M16q9j91K71L28m45j43M33n3j84K73j16j34L53
$$ -416 292 32 127 -56 -104 -213 -404 12 -77 -268 3 331 -114 -257 176 123 -61 212 96 -38 315
3832C15j67k2m84M89J75k81l04M76j08j86k5r3K15l42M15j74mK97m4j62n1M90
$$ 315 148 126 -358 131 306 25 -279 197 89 -97 -122 -215 0 -342 73 -101 -105 192 148 -14 -65 425
3854D25j44n98M8L69k00P7J26o85M98K97m42j38n2K01M69m97J63O11k63l18L16
$$ 425 281 -317 -269 100 -100 -23 103 -582 -84 213 -229 -367 -419 -218 251 -246 -83 528 265 -53 263
3875B63l4j83O2K23m33j8K96j90k8l41M98k53J03r3K55l50J96J9m3Q0J33q0k73
$$ 263 229 46 108 331 -102 -120 176 -14 -42 -383 115 -138 -35 -128 127 -223 -27 -8 -51 29 162 82 -191
3898a91J92N20m20P4K84o05k06J29J26J88k55J27k94Q1L58p8k85M10J08j34J24
$$ -191 1 521 101 175 459 -146 -352 -223 -97 91 -164 -37 -331 -250 108 30 -255 155 263 129 253
3919B53jm5k43J68K01l52LP0M78r83L97K36l35L5R5L1r9J50J54j94J11J61k21
$$ 253 252 207 -36 132 333 -19 -16 54 532 -451 -54 182 -153 -118 -23 8 -91 59 213 19 130 291 70
3942G0j56M13Rn48K58R9k15k01J38j65K51J6Q2k39J56K33k21k08N7L54N3m78Q1
$$ 70 -86 327 336 -212 46 145 -70 -271 -133 -298 -47 -31 51 -188 -32 201 -20 -228 -171 183 236 -242 -161
3965a61M95l22L4J35j66N6j52k62OK6M03k45N4k07Q44q93K90L27j31L3L2k58K33
$$ -161 334 12 46 181 15 71 -81 -343 -337 -311 92 -153 -99 -306 538 -355 -65 262 131 164 196 -62 171
3988A71j65M15m00j52J57k2j34j57K20j15K24k52j98J61L81o9k2r0O05m99k7K27
$$ 171 6 421 21 -131 26 4 -130 -287 -67 -182 42 -210 -408 -247 134 65 43 -47 558 59 32 259
4010B59j38L31m34K51k28j30R5N7l76k24M75K17l50J9J80Jk8K33K04l50K2O6l62
$$ 259 121 452 18 269 41 -89 6 63 -313 -537 -62 155 -195 -176 4 5 -23 210 414 64 86 152 -210
4033b10M82k89J04o7J65mk44j70O3L2J05pj25o4L66M9q9m61M65L06l92K23J29
$$ -210 272 -17 87 20 185 181 -63 -233 -170 -138 -33 -40 -165 -229 137 186 97 -364 101 407 15 238 367
4056C67k86J15r5n8j52L35k05j24l16M55q7l66K79J59j12k9L25l70K12n4K76j57
$$ 367 81 196 101 43 -109 226 21 -103 -419 36 -51 -417 -138 21 -91 -120 205 -165 47 -7 269 112
4078A12m7J63l66j50K42L01k30k32O6J1k17L03k4L6k32N80j77l26N02mq6jj93
$$ 112 65 228 -138 -288 -46 255 25 -207 -141 -130 -347 -44 -68 -32 -264 316 139 -187 315 311 225 224 31
4101C1M0j5mk05m4K06j30j73L9K95j97l2j39N49J7l42P8J66N0j36rK51k92K21
$$ 31 71 56 52 -153 -197 9 -121 -294 -255 40 -157 -189 -328 221 238 -104 -26 140 190 54 45 296 4 225
4125B25J49n91pJ01J03k94J20M1J47j48L21l71L88J02K83o27L4M50l77j40J10
$$ 225 374 -217 -224 -123 -20 -314 -194 -153 -6 -154 167 -204 184 286 569 -58 -24 426 49 -91 19
4146A9L44m43K02j17j83o4M13m11n7K58pj00n6L75k4q8j86P9j4J50K08k58k25
$$ 19 363 -80 122 5 -178 -242 171 -240 -297 -39 -46 -146 -202 173 149 61 -125 -46 -60 90 298 40 -185
4169a85K44n1j12J08M8L12m55j08J80J89j05J71l15P6J48k71o2K14mK83m90J64
$$ -185 59 8 -104 4 52 364 -91 -199 -19 170 65 236 -79 -3 145 -126 -188 26 22 305 -185 -21
4191b1Q8l95RJ60m5JR4Pj91N4K76n3k39L90k18n7P5j36L91M2j23j29j52K03J41
$$ -21 67 -328 -319 -159 -204 -203 -109 -102 -293 -239 37 -16 -255 135 -83 -140 -65 -201 190 232 109 -20 -172 31 172
4216A72j49j55K40n9k39J92n1J33k75K95j05J95p1k0O9k1J39o2k79R8J78nk37
$$ 172 23 -132 108 49 -190 2 -49 84 -191 104 -1 194 123 103 172 151 290 228 -51 47 225 220 -17
4239a7Q2p5m6J08m82K05J98K65l26LP0J47j1j36m9M57j11k43M7l58M56k57J11
$$ -17 65 -10 -56 52 -430 -225 -27 238 -88 -85 -15 132 121 -15 -64 393 282 39 86 -272 184 -73 38
4262C8j02P2J43j72r3m2K14j19J76j46k21J64L84L1k98J27L3k98J84k74M67j99
$$ 38 -64 8 151 -21 -114 -156 58 -61 115 -31 -252 -88 296 327 29 156 189 -109 75 -199 268 69
4284F9l04j2J90K18k54J48j73K46j44j71N1K3K49m8r4J45M7L6n5q6k45K19K36
$$ 69 -235 -247 -57 161 -93 55 -118 128 -16 -187 -136 -113 136 88 -6 139 186 222 167 81 -164 55 291
4307B91p14J54J93K9K12k52k46K89q2J04k52L87M12m90m1o8N58m79o0j59R5K5
$$ 291 -423 -269 -76 -47 165 -87 -333 -44 -126 -22 -274 113 525 35 -6 -74 484 5 -55 -214 -119 -94
4329i4K42l81R9O3K80o07Q0L54J39l96P0L73k35J26J66Q8o21K13J85j99oJ75J03
$$ -94 148 -233 -134 -71 209 -398 -318 36 175 -221 -151 222 -13 113 279 367 -254 -41 144 -55 -61 114 217
4352B17l72K1M13j00j71j80L22j39J64k09j03L05j61J62j68J81k95J91J25q6n2
$$ 217 -155 -134 279 179 8 -172 150 11 175 -34 -137 168 7 169 1 182 -113 78 203 117 65
4373F5l30L19n8k93J03M04l47K27j59Q3l2j37K38J76Jk14j07L50r1q9r7j12P8
$$ 65 -265 54 -4 -297 -194 210 -137 90 -69 14 -18 -155 83 259 260 46 -61 289 198 109 12 -100 -22
4396b2L5k37m2Q0J96k53J26L6j29M02q6l3p2K15J59n14L04p0j37N2l47L69Q3l92
$$ -22 13 -224 -266 -186 10 -243 -117 -81 -210 192 106 73 1 216 375 -139 165 95 -42 10 -337 32 115 -277
4420b77J85P6M3j06j8J11j83L62k64n2M06l34j37J53M7K16k74J32j06R4k60L34
$$ -277 -92 -16 27 -79 -97 14 -169 193 -71 -123 283 -51 -188 -35 12 228 -46 86 -20 74 -186 148
4442A48j96n8K34k80NQ8j21k4J98m1K32j09K13k97K7L01j9r4l81K14kJ21k71J85
$$ 148 -48 -106 128 -152 -147 -59 -180 -204 -6 -47 185 76 289 -8 19 320 301 207 -174 40 38 159 -112 73
4466G3k82L69J46m16l8M85k83j43J57J96j03j42j86N61l26j0J08k98J11o9K43
$$ 73 -209 160 306 -110 -148 337 54 -89 68 264 161 19 -167 394 68 58 166 -132 -21 -90 153
4487A53j46j34%M08l53J1j25L06j40L44o01L03Q7J18k52j66K99J03q6k56n7J61
$$ 153 7 -127 -127 281 -72 -61 -186 120 -20 324 -277 26 113 231 -21 -187 112 215 129 -127 -184 -23
4509b3m0k80M19j78j7K77j35k87L00M0K0L7J47j23k03j10K29K7p7J69j47r5J98
$$ -23 -63 -343 76 -102 -119 158 23 -264 36 76 96 133 280 157 -46 -156 73 100 23 192 45 -50 148
4532A48j07m08K29L1p5L4QJ52j22K87j81j5J65k13j13PK54q1j9k67J17K46r3Q0
$$ 148 41 -367 -138 -107 -182 -148 -140 12 -110 177 -4 -19 146 -67 -180 -173 81 0 -19 -286 -169 77 -16 64
4556F4p7k41K82j81J55K18j22J32l56J57M5O9j89J24J76k21K03k08J45k17L0K84
$$ 64 -13 -254 28 -153 2 220 98 230 -126 31 76 145 -44 80 256 35 238 30 175 -42 -12 272
4578B72l60J18m3K15p2k05L51k17J18l06K05p3L1N2k6O3j05J27k62k0K82l71K36
$$ 272 -88 30 -13 202 130 -75 276 59 177 -129 76 3 34 86 60 123 18 145 -117 -137 145 -226 10
4601A0j34O5K67k97J68j34R7j73M71m60K06k2j96L80j38K75l80J80r0j26%N5j70
$$ 10 -124 -59 208 -89 79 -55 42 -131 340 -120 86 64 -132 248 110 385 5 185 95 -31 -31 24 -146
4624a46J55J21k95K48n3O2j70J39J36l30J56K67j31l22j7L40o8k07o9k70M70j26
$$ -146 9 130 -165 83 30 92 -78 61 197 -133 23 290 159 -163 -180 160 92 -115 -184 -454 16 -110
4646a10j9K10k42L71l51K07J28j55R0j06k03j8K87j20jJ25J85l60J2L2l36J78
$$ -110 -129 81 -161 210 -141 66 194 39 129 23 -180 -198 89 -31 -32 93 278 -82 -70 -38 -374 -196
4668a96O2k50L63J59j94M7J73K17P0m69k00N52J26m81RJ58j68p7m3j09P5N5O7
$$ -196 -134 -384 -21 138 -56 -9 164 381 451 -18 -218 334 460 -21 -12 146 -22 -99 -142 -251 -176 -121 -54
4691e4R5O1Kk73K57J7l12K06K59n43J68M4O4J2qJ23j69j25L72l56J85o9N0j12
$$ -54 41 102 104 -169 88 105 -207 -1 258 -285 -117 -73 -9 3 -5 118 -51 -176 196 -160 25 -44 6 -106
4715a06N06k32L8k29J08k64K34m1j31K92k08%P6j90L42l01J2l8j22K09r5K39p7
$$ -106 400 168 206 -23 85 -179 55 14 -117 175 -33 -33 43 -147 195 -106 -94 -132 -254 -45 -140 99 22
4738B2L3O8o4J94l00O7K47l72Q6J65N4k66J59k96M1L08k04lJ68n5r5l6j45J52
$$ 22 55 123 59 253 -47 20 267 -105 -19 146 200 -66 93 -203 -162 146 -58 -61 107 52 -43 -79 -224 -72
4762g2J77o5K10j27k20J82J50l4k71N8m7j27Q7j7j63K05J99k46l0P5n3R2J06j66
$$ -72 105 40 250 123 -97 85 235 201 -70 -12 -59 -186 -99 -116 -279 -74 125 -121 -151 -76 -129 -37 69 -97
$$ [...]
8191H7
##END NTUPLES=NMR FID
##END=
