##TITLE=1H_Pr Am-TF-TEA
 200.13MHz,CDCl3.
 8 sc
 
 12.12.2025
##JCAMPDX= 6.0         $$ Bruker NMR JCAMP-DX V2.0
##DATA TYPE= NMR FID
##DATA CLASS= NTUPLES
##ORIGIN= UXNMR, Bruker Analytische Messtechnik GmbH
##OWNER= pz
$$ XWIN-NMR		Version 3.5
$$ Fri Dec 12 14:45:39 2025 Russian Standard Time (UT+4h)  she@DPX200
##.OBSERVE FREQUENCY= 200.1313
##.OBSERVE NUCLEUS= ^1H
##.DELAY= (6, 6)
##.ACQUISITION MODE= SIMULTANEOUS
##.ACQUISITION SCHEME= undefined
##.AVERAGES= 8
##.DIGITISER RES= 18
##SPECTROMETER/DATA SYSTEM= spect
##.PULSE SEQUENCE= zg30
##.SOLVENT NAME= CDCl3
##.SHIFT REFERENCE= (INTERNAL, CDCl3, 0, 14.3821)
##AUDIT TRAIL= $$ (NUMBER, WHEN, WHO, WHERE, WHAT)
$$ ##TITLE= Audit trail, XWIN-NMR		Version 3.5
$$ ##JCAMPDX= 5.01
$$ ##ORIGIN= Bruker BioSpin GmbH
$$ ##OWNER= she
$$ F:/spectra/data/she/nmr/H-C/1/audita.txt
$$ ##AUDIT TRAIL=  $$ (NUMBER, WHEN, WHO, WHERE, WHAT)
(   1,<2025-12-12 14:44:10.21 +0400>,<she>,<DPX200>,
      <created by zg, POWCHK disabled, PULCHK disabled
       configuration hash MD5:
       00 E9 B6 7A A2 85 ED C7 34 08 36 98 17 FE 4E 26
       data hash MD5: 16K
       43 B5 78 43 3B 53 5B 68 DE FE 09 63 51 2B F8 9C>)
$$ ##END=
$$ 
$$ hash MD5
$$ C9 9E 4B 3C 4A 52 89 85 8C 4C 1A ED 0C 1E 50 76
##$RELAX= 
##$RELAX= 
##$RELAX= 
##$RELAX= 
##$RELAX= 
##$RELAX= 
$$ Bruker specific parameters
$$ --------------------------
##$DU= <F:/spectra>
##$EXPNO= 1
##$NAME= <H-C>
##$PROCNO= 1
##$TYPE= <nmr>
##$USER= <she>
##$AMP= (0..31)
100 100 100 100 100 100 100 100 100 100 100 100 100 100 100 100 100 100 
100 100 100 100 100 100 100 100 100 100 100 100 100 100 
##$AQSEQ= 0
##$AQ_mod= 1
##$AUNM= <au_zg>
##$AUTOPOS= <>
##$BF1= 200.13
##$BF2= 200.13
##$BF3= 200.13
##$BF4= 200.13
##$BF5= 200.13
##$BF6= 200.13
##$BF7= 200.13
##$BF8= 200.13
##$BYTORDA= 1
##$CFDGTYP= 0
##$CFRGTYP= 5
##$CHEMSTR= <none>
##$CNST= (0..31)
1 1 145 1 1 1 1 1 1 1 1 1 1 1 1 1 1 1 1 1 1 1 1 1 1 1 1 1 1 1 1 1 
##$CPDPRG= <>
##$CPDPRG1= <>
##$CPDPRG2= <>
##$CPDPRG3= <>
##$CPDPRG4= <mlev>
##$CPDPRG5= <mlev>
##$CPDPRG6= <mlev>
##$CPDPRG7= <mlev>
##$CPDPRG8= <mlev>
##$CPDPRGB= <>
##$CPDPRGT= <>
##$D= (0..31)
0 0.7 0 0 0 0 0 0 0 0 0 0.03 0 0 0 0 0 0 0 0 0 0 0 0 0 0 0 0 0 0 0 0 
##$DATE= 1765536249
##$DBL= (0..7)
120 120 120 120 120 120 120 120 
##$DBP= (0..7)
150 150 150 150 150 150 150 150 
##$DBP07= 0
##$DBPNAM0= <>
##$DBPNAM1= <>
##$DBPNAM2= <>
##$DBPNAM3= <>
##$DBPNAM4= <>
##$DBPNAM5= <>
##$DBPNAM6= <>
##$DBPNAM7= <>
##$DBPOAL= (0..7)
0.5 0.5 0.5 0.5 0.5 0.5 0.5 0.5 
##$DBPOFFS= (0..7)
0 0 0 0 0 0 0 0 
##$DE= 6
##$DECBNUC= <off>
##$DECIM= 32
##$DECNUC= <off>
##$DECSTAT= 4
##$DIGMOD= 1
##$DIGTYP= 9
##$DL= (0..7)
0 120 120 120 120 120 120 120 
##$DP= (0..7)
150 150 150 150 150 150 150 150 
##$DP07= 0
##$DPNAME0= <>
##$DPNAME1= <>
##$DPNAME2= <>
##$DPNAME3= <>
##$DPNAME4= <>
##$DPNAME5= <>
##$DPNAME6= <>
##$DPNAME7= <>
##$DPOAL= (0..7)
0.5 0.5 0.5 0.5 0.5 0.5 0.5 0.5 
##$DPOFFS= (0..7)
0 0 0 0 0 0 0 0 
##$DQDMODE= 0
##$DR= 18
##$DS= 0
##$DSLIST= <SSSSSSSSSSSSSSS>
$$ [...]
##$SUBNAM0= <"">
##$SUBNAM1= <"">
##$SUBNAM2= <"">
##$SUBNAM3= <"">
##$SUBNAM4= <"">
##$SUBNAM5= <"">
##$SUBNAM6= <"">
##$SUBNAM7= <"">
##$SUBNAM8= <"">
##$SUBNAM9= <"">
##$SW= 18.0517328524113
##$SWIBOX= (0..15)
0 0 2 0 0 0 0 0 0 0 0 0 0 0 0 0 
##$SW_h= 3612.71676300578
##$TD= 16384
##$TD0= 1
##$TE= 0
##$TE2= 300
##$TE3= 300
##$TEG= 300
##$TL= (0..7)
0 120 120 120 120 120 120 120 
##$TP= (0..7)
150 150 150 150 150 150 150 150 
##$TP07= 0
##$TPNAME0= <>
##$TPNAME1= <>
##$TPNAME2= <>
##$TPNAME3= <>
##$TPNAME4= <>
##$TPNAME5= <>
##$TPNAME6= <>
##$TPNAME7= <>
##$TPOAL= (0..7)
0.5 0.5 0.5 0.5 0.5 0.5 0.5 0.5 
##$TPOFFS= (0..7)
0 0 0 0 0 0 0 0 
##$TUNHIN= 0
##$TUNHOUT= 0
##$TUNXOUT= 0
##$USERA1= <user>
##$USERA2= <user>
##$USERA3= <user>
##$USERA4= <user>
##$USERA5= <user>
##$V9= 5
##$VALIST= <valist>
##$VCLIST= <CCCCCCCCCCCCCCC>
##$VD= 0
##$VDLIST= <DDDDDDDDDDDDDDD>
##$VPLIST= <PPPPPPPPPPPPPPP>
##$VTLIST= <TTTTTTTTTTTTTTT>
##$WBST= 1024
##$WBSW= 4
##$XGAIN= (0..3)
0 0 0 0 
##$XL= 0
##$YL= 0
##$YMAX_a= 562881
##$YMIN_a= -567046
##$ZGOPTNS= <>
##$ZL1= 120
##$ZL2= 120
##$ZL3= 120
##$ZL4= 120
##$ABSF1= 10
##$ABSF2= 0
##$ABSG= 5
##$ABSL= 3
##$ALPHA= 0
##$AQORDER= 0
##$ASSFAC= 0
##$ASSFACI= 0
##$ASSFACX= 0
##$ASSWID= 0
##$AUNMP= <proc_1d>
##$AZFE= 0.1
##$AZFW= 0.1
##$BCFW= 1
##$BC_mod= 2
##$BYTORDP= 1
##$COROFFS= 0
##$CY= -3
##$DATMOD= 1
##$DC= 2
##$DFILT= <>
##$DTYPP= 0
##$F1P= 0
##$F2P= 0
##$FCOR= 0.5
##$FTSIZE= 0
##$FT_mod= 4
##$GAMMA= 1
##$GB= 0.15
##$INTBC= 1
##$INTSCL= 1
##$ISEN= 128
##$LB= 0.25
##$LEV0= 0
##$LPBIN= 0
##$MAXI= 10000
##$MC2= 0
##$MEAN= 0
##$ME_mod= 0
##$MI= 1.114404
##$NCOEF= 0
##$NC_proc= 0
##$NLEV= 6
##$NOISF1= 3.799351
##$NOISF2= 2.8
##$NSP= 1
##$NTH_PI= 0
##$NZP= 0
##$OFFSET= 14.38212
##$PC= 1
##$PHC0= -3864.131
##$PHC1= 8.39234
##$PH_mod= 1
##$PKNL= yes
##$PPARMOD= 0
##$PSCAL= 0
##$PSIGN= 0
##$REVERSE= no
##$SF= 200.129724274929
##$SI= 16384
##$SIGF1= 3
##$SIGF2= 2
##$SINO= 400
##$SIOLD= 16384
##$SREGLST= <1H.CDCl3>
##$SSB= 0
##$STSI= 0
##$STSR= 0
##$SW_p= 3205.1282051282
##$SYMM= 0
##$S_DEV= 0
##$TDeff= 0
##$TDoff= 0
##$TI= <>
##$TILT= no
##$TM1= 0
##$TM2= 0
##$TOPLEV= 0
##$USERP1= <user>
##$USERP2= <user>
##$USERP3= <user>
##$USERP4= <user>
##$USERP5= <user>
##$WDW= 1
##$XDIM= 8192
##$YMAX_p= 0
##$YMIN_p= 0
$$ End of Bruker specific parameters
$$ ---------------------------------
##NTUPLES= NMR FID
##VAR_NAME=  TIME,          FID/REAL,        FID/IMAG
##SYMBOL=    X,             R,               I
##VAR_TYPE=  INDEPENDENT,   DEPENDENT,       DEPENDENT
##VAR_FORM=  AFFN,          ASDF,            ASDF
##VAR_DIM=   8192,          8192,            8192
##UNITS=     SECONDS,       ARBITRARY UNITS, ARBITRARY UNITS
##FACTOR=    0.0002768,     1,               1
##FIRST=     0,             0,               0
##LAST=      2.2672688,     0,               0
##MIN=       0,             -567046,         0
##MAX=       2.2672688,     562881,          0
$$ Real data points
##PAGE= N=1
##DATA TABLE= (X++(R..R)), XYDATA
$$ plain form
0 0 0 0 0 0 0 0 0 0 0 0 0 0 0 -4 8 -8 8 -8 13 -16 16 -24 24 -32 37 -44 51 -60 68 -77 92 -103 119 -135 153
35 153 -172 194 -219 244 -273 305 -341 379 -419 463 -513 568 -626 690 -760 839 -923 1016
53 1016 -1120 1237 -1364 1506 -1669 1855 -2072 2321 -2617 2972 -3407 3950 -4640 5508 -6477
68 -6477 6382 12058 562881 287404 -492397 -244692 227181 142832 -2753 519 -172340
79 -172340 -148708 209071 259095 -148810 -262206 34244 204412 96884 -73486 -161176 -21044
90 -21044 188279 113203 -126464 -102753 55968 62335 61747 58947 -115332 -121071 171034 184302
102 184302 -135517 -123203 147550 77074 -88178 67381 95277 -127074 -13728 229910
112 229910 7719 -202115 80250 213031 -92035 -121456 183656 112329 -168846 -37045
$$ packed form
0@%%%%%%%%%%%%%mJ2j6J6j6K1k9L2m0M8n6O9q1R5j11J28j45J69j95K22k54K88
35A53l25L66m13M63n17N78o46P20p98Q82r76J081j194J316j450J599j762J939
53A016k136K357k601K870l175L524l927M393m938N589o379P357q590J0148j1985
68f477J2859N676N50823k75477p79801K47705M71873q4349j45585L272j72859
79a72340K3632L57779N0024m07905j13396K96450J70168j07528j70370q7690J40132
90b1044K09323p5076k39667K3711J58721O367n88k800j74279n739K92105J3268
102A84302l19819J2314K70753p0476j65252J55559K7896k22351J13346K43638
112B29910k22191k09834K82365J32781l05066k9421L05112p1327k81175J31801
$$ plain form
122 -37045 193226 69254 -87184 -21440 59100 68507 57601 -9478 -46964 50406 100975 10310
134 10310 -9424 31064 -14012 21068 132658 31187 -122074 8551 158475 31273 -60491
145 -60491 48431 35568 -45196 88616 134722 -92237 -105711 158753 152555 -89041 -70836
156 -70836 93125 52621 -132 70551 7530 -91160 48306 155311 -4564 -102105 31004
167 31004 103401 20924 -14975 10682 9635 33981 51703 2150 -1204 36230 -2644 -7251 80237
180 80237 51472 -78465 -32610 112068 54703 -68443 -6135 55551 -2569 13772 56666
191 56666 -29330 -57750 72485 92367 -50885 -60262 59338 45664 -22431 16780 22217 -36546
203 -36546 -551 62158 10025 -49271 -4122 38003 12206 -753 -6387 -27849 9694 54085
$$ packed form
122c7045K30271j23972j56438O5744Q0540R407j0906o7079l7486R7370N0569r0665
134A0310j9734M0488m5076L5080J11590j01471j53261J30625J49924j27202r1764
145f0491J08922j2863q0764J33812M6106k26959j3474K64464o198k41596J8205
156g0836J63961m0504n2753P0683o3021r8690J39466J07005j59875r7541J33109
167C1004P2397q2477l5899K5657j047K4346J7722m9553l354L7434l8874m607Q7488
180H0237k8765j29937M5855J44678n7365j23146O2308O1686n8120J6341M2894
191E6666q5996k8420J30235J9882j43252r377J19600j3674o8095L9211N437n8763
203c6546L5995O2709n2133n9296M5149M2125k5797j2959n634k1462L7543M4391
$$ plain form
215 54085 1751 -46745 -6412 29418 14742 1476 -11243 -29869 5720 52093 -9211 -70804
227 -70804 4864 59725 -13582 -51358 3712 17888 -17966 -6484 13673 -21640 -23949 22660
239 22660 5639 -35860 -8185 19150 -7749 -24126 -4735 -270 -16607 -9194 2049 -14444
251 -14444 -19410 -7609 -7623 -6413 -10337 -20554 -8176 5479 -11490 -29518 -10547 13480 -7587
264 -7587 -29871 -8878 -856 -16059 -10201 -5814 -19818 -17980 -64 -5059 -30930 -21899 9320
277 9320 -4064 -29943 -15993 -352 -9241 -17997 -10038 -2073 -13384 -18422 -5692 -6538 -15410 -13607
291 -13607 -8600 -7024 -14437 -17889 -9295 -10090 -12971 -7166 -10275 -17035 -13284 -3745 -2450 -16858 -16963
306 -16963 2530 -1343 -19157 -15435 -981 210 -13034 -15583 -4471 -7727 -12797 -4973 -6805 -12750
$$ packed form
215E4085n2334m8496M0333L5830j4676j3266j2719j8626L5589M6373o1304o1593
227g0804P5668N4861p3307l7776N5070J4176l5854J1482K0157l5313k309M6609
239B2660j7021m1499K7675K7335k6899j6377J9391M465j6337P413J1243j6493
251a4444m966J1801j4J210l924j0217J2378J3655j6969j8028J8971K4027k1067
264g587k2284K0993Q022j5203N858M387j4004J838J7916m995k5871R031L1219
277I320j3384k5879J3950J5641q889q756P959P965j1311n038J2730q46q872J803
291a3607N007J576p413l452Q594p95k881N805l109o760L751R539J295j4408j05
306a6963J9493l873j7814L722J4454J191j3244k549J1112l256n070P824j832n945
$$ plain form
320 -12750 -8040 -3233 -6791 -13749 -6851 4089 -5739 -12740 -2923 -753 -5789 -7041 -2618 1081 -6678
335 -6678 -10148 -1407 -1363 -6686 -6279 -2005 111 -7693 -8145 3125 -518 -6719 1304 2476 -4962 -3473
351 -3473 5529 3378 -8123 -96 11718 -3644 -10933 4512 6681 -2440 -2226 1139 -1300 -2081 6373
366 6373 3756 -6728 2817 10093 104 428 4903 1025 4691 11249 4053 -6378 2058 13786 2700
381 2700 -2102 8957 -105 -6078 14256 12764 -10604 -4575 19422 12126 -7726 4149 12641 -2693
395 -2693 8321 23794 -3329 -14144 16557 22083 -3029 -2834 12068 821 -1224 22452 7741
408 7741 -21978 5931 31275 3681 -10023 7168 6695 3197 22543 15835 -21764 -6043 38645
421 38645 16576 -17258 2031 11068 949 17976 17947 -22860 -17839 39780 30738 -28503 -13304
$$ packed form
320a2750M710M807l558o958O898J0940r828p001R817K170n036j252M423L699p759
335f678l470Q741M4n323M07M274K116p804m52J1270l643o201Q023J172p438J489
351c473R002k151j1501Q027J1814j5362p289J5445K169r121K14L365k439p81Q454
366F373k617j0484R545P276r989L24M475l878L666O558p196j0431Q436J1728j1086
381B700m802J1059r062n973K0334j492k3368O029K3997p296j9852J1875Q492j5334
395b693J1014J5473k7123j0815L0701N526k5112J95J4902j1247k045K3676j4711
408G741k9719K7909K5344k7594j3704J7191m73l498J9346o708l7599J5721M4688
421C8645k2069l3834J9289R037j0119J7027k9m0807N021N7619r042n9241J5199
$$ plain form
434 -13304 26405 6792 2006 22781 -5358 -25054 23826 42402 -13267 -26456 20689 18829
446 18829 -4478 15039 2469 -30294 12743 48273 -9475 -39390 16534 31560 -12007 -1115
458 -1115 22155 -16334 -12387 41324 13096 -36267 3789 32933 -7149 -8955 23198 -6892 -27809
471 -27809 28480 30429 -35878 -14753 35893 -4451 -23387 28344 14016 -41479 -425 51164
483 51164 -5978 -40011 17144 20699 -17078 11640 16459 -35530 -12395 46868 6257 -44708
495 -44708 2329 24614 -20472 1130 34638 -31188 -45263 47376 43634 -49132 -34604 35003
507 35003 14677 -14137 10932 -12133 -38324 29391 47229 -41668 -44978 31771 18039 -23763
519 -23763 6854 3431 -44046 4533 62853 -19158 -72000 20197 51561 -21793 -22825 13240
$$ packed form
434a3304L9709j9613m786K0775k8139j9696M8880J8576n5669j3189M7145j860
446A8829k3307J9517j2570l2763M3037L5530n7748k9915N5924J5026m3567J0892
458a115K3270l8489L947N3711k8228m9363M0056K9144m0082j806L2153l0090k0917
471b7809N6289J949o6307K1125N0646m0344j8936N1731j4328n5495M1054N1589
483E1164n7142l4033N7155L555l7777K8718M819n1989K3135N9263m0611n0965
495d4708M7037K2285m5086K1602L3508o5826j4075R2639l742r2766J4528O9607
507C5003k0326k8814K5069k3065k6191O7715J7838q8897l310P6749j3732m1802
519b3763L0617l423m7477M8579N8320q2011n2842R2197L1364p3354j032L6065
$$ plain form
531 13240 -15972 -13515 39659 5543 -58193 -4847 45676 -11970 -27955 14779 -12938 -28631
543 -28631 36418 25435 -60781 -29244 58897 13119 -52515 2147 26074 -26780 -5018 34317
555 34317 -19681 -39644 23669 22126 -30743 -7827 17765 -26069 -13069 42239 -8141 -57849
567 -57849 14073 44055 -26003 -27086 25319 -4829 -30353 28518 23981 -50641 -18538 48211
579 48211 689 -38021 7671 7337 -25136 13391 28335 -39271 -35557 43995 21695 -43955 -6229
592 -6229 24955 -18431 -6496 33937 -12901 -45596 21770 42745 -27003 -31299 19480 3755
604 3755 -10872 18290 -6891 -39234 14530 41371 -23713 -36743 24875 17560 -25920 6309
616 6309 20771 -28805 -10817 41527 1209 -39904 7692 27886 -16252 -9885 22252 -12264
$$ packed form
531A3240k9212K457N3174l4116o3736N3346N0523n7646j5985M2734k7717j5693
543b8631O5049j0983q6216L1537Q8141m5778o5634N4662K3927n2854K1762L9335
555C4317n3998j9963O3313j543n2869K2916K5592m3834J3000N5308n0380m9708
567e7849P1922K9982p0058j083N2405l0148k5524N8871m537p4622L2103O6749
579D8211m7522l8710M5692l34l2473L8527J4944o7606L714P9552k2300o5650L7726
592f229L1184m3386J1935M0433m6838l2695O7366K0975o9748m296N0779j5725
604C755j4627K9162k5181l2343N3764K6841o5084j3030O1618p315m3480L2229
616F309J4462m9576J7988N2344m0318m1113M7596K0194m4138O367L2137l4516
$$ plain form
628 -12264 -25531 27970 18381 -35845 -7643 31026 -4620 -18756 16947 6113 -23700 10522
640 10522 28711 -19308 -19745 25818 7775 -20447 8523 13638 -18218 -4289 23564 -4202 -21090
653 -21090 14097 12105 -19530 5044 22497 -17214 -15994 28501 13826 -25607 -2788 24261
665 24261 -3618 -10525 16709 -437 -19699 14366 20280 -18408 -13162 18620 6540 -12019 5774
678 5774 7791 -13758 3453 23251 -6379 -17104 12736 12819 -6276 1380 6415 -8072 -202 19495
692 19495 -943 -21342 6982 19119 -7692 -7608 8511 -1451 -4502 12762 6146 -15333 -566
705 -566 21184 -3 -13893 8629 9607 -7370 1848 9812 -4948 -7250 9082 6926 -8642 -1755
719 -1755 7528 -3160 -1474 8360 -1848 -6468 6533 7560 -3973 -2773 6539 2354 -2615 4910
$$ packed form
628a2264j3267N3501r589n4226K8202L8669l5646j4136L5703j0834k9813L4222
640A0522J8189m8019m37M5563j8043k8222K8970N115l1856J3929K7853k7766j6888
653b1090L5187j992l1635K4574J7453l9711J220M4495j4675l9433K2819K7049
665B4261k7879o907K7234j7146j9262L4065N914l8688N246L1782j2080j8559J7793
678E774K017k1549J7211J9798k9630j0725K9840Q3j9095P656N035j4487P870J9697
692A9495k0438k0399K8324J2137k6811Q4J6119r962l051J7264o616k1479J4767
705e66K1750k1187j3890K2522R78j6977R218P964j4760k302J6332k156j5568O887
719a755R283j0688J686R834j0208m620J3001J027j1533J200R312m185m969P525
$$ plain form
733 4910 1274 -6584 4316 7085 -6191 -4374 6469 1903 -6556 411 6461 -3300 -4029 6702
747 6702 1235 -5280 3866 4848 -2903 -1090 4692 1204 -4169 1172 4494 -3351 -2552 3258 -899 -2996
763 -2996 254 291 -400 -536 -561 -522 321 2650 -606 -3222 3047 2994 -2487 -979 834 42 -32 -278 -1469
782 -1469 -2963 -88 2778 -3236 -4394 2006 1099 -2347 -1407 240 680 -699 53 1054 -1755 -639
798 -639 2011 -750 -1312 -841 -1258 -189 -1146 -1825 -1287 -2004 -194 -189 -2445 -1071 -486 -33 1147 -1606
816 -1606 -1957 1322 1103 -731 -1797 -458 1548 -1475 -2191 23 -1883 -1521 450 -1783 -2546 -1282
832 -1282 373 -70 -2695 -242 1460 -1757 -354 1517 -1120 -557 427 -186 -590 -1292 -392 -1062 -1506
849 -1506 728 -2278 -3575 1331 256 -3136 -599 748 -685 -1290 963 876 -2600 759 3523 -2829
$$ packed form
733D910l636p858J0900K769j3276J817J0843m566q459O967O050r761p29J0731
747F702n467o515R146R82p751J813N782l488n373N341L322p845P99N810m157k097
763b996L250L7o91j36k5L9Q43K329l256k616O269n3n481J508J813p92p4k46j191
782a469j494K875K866o014j158O400r07l446R40J647M40j379P52J001k809J116
798f39K650k761n62M71m17J069r57o79N38p17J810Nk256J374N85M53J180k753
816a606l51L279k19j834j066J339K006l023p16K214j906L62J971k233p63J264
832a282J655m43k625K453J702l217J403J871k637N63R84o13m04p02R00o70m44
849a506K234l006j297M906j075l392K537J347j433o05K253q7l476L359K764o352
$$ plain form
865 -2829 -2098 3449 -768 -3361 976 1502 -3246 -2842 2951 -34 -5498 1439 3116 -4381 -557 3795
881 3795 -1734 -2464 3394 2609 -4015 -953 5360 -1285 -4139 3843 158 -4900 2335 2294 -5420 -2139
897 -2139 5279 -55 -6553 2223 4981 -5120 -366 7113 -3297 -4711 7366 3425 -7132 -543
911 -543 7657 -2187 -5971 5996 1478 -8942 3204 7474 -7195 -4890 7419 1438 -6458 2995
925 2995 5831 -6220 -1114 10886 -2317 -8629 7599 5713 -7525 61 7245 -4524 -6023 8673
939 8673 3200 -11352 886 9734 -5893 -4082 9290 -1923 -8597 8253 9321 -10000 -5068
952 -5068 12955 1157 -9502 7006 4920 -11811 2144 13595 -6572 -12292 8429 8072 -8966
965 -8966 -1062 7923 -7418 -3121 15109 -1015 -15073 6432 13250 -6658 -5093 9002 -2347
$$ packed form
865b829P31N547m217k593M337N26m748M04N793k985n464O937J677p497L824M352
881C795n529p30N858p85o624L062O313o645k854P982l685n058P235m1p714L281
897b139P418n334o498Q776K758j0101M754P479j0410j414J2077l941j0557O589
911e43Q200r844l784J1967m518j0420J2146M270j4669K305J2309n981p896R453
925B995K836j2051N106J2000j3203o312J6228j886j3238P586P184j1769j499J4696
939H673n473j4552J2238Q848j5627J811J3372j1213o674J6850J068j9321M932
952e068J8023j1798j0659J6508k086j6731J3955J1451k0167n720K0721l57j7038
965h966P904Q985j5341M297J8230j6124j4058K1505O818j9908J565J4095j1349
$$ plain form
978 -2347 -8514 12054 7211 -17861 -2960 17391 -2012 -11750 5180 3291 -8386 5736 11047
991 11047 -12514 -9395 17781 6019 -14860 2694 9868 -8392 -943 14098 -5030 -16259 9718
1004 9718 14251 -12826 -7880 11514 -2665 -7679 11176 2116 -15508 2938 16259 -5793 -10596
1017 -10596 10356 2693 -11111 9010 10665 -16550 -6358 18606 1049 -15880 3537 8593
1029 8593 -10282 -644 14256 -8585 -15288 14272 10839 -13995 -2509 10598 -5120 -4223 13834
1042 13834 -580 -19010 6156 18932 -10002 -12632 9801 1148 -8531 8211 4626 -16359 -2974
1055 -2974 18933 -729 -16256 5207 7599 -8097 4484 9796 -13427 -8515 18165 6518 -17794
1068 -17794 -2280 12827 -5315 -5483 11027 -5335 -15227 11119 13095 -13761 -9054 11608 2129
$$ packed form
978b347o167K0568m843k5072J4901K0351j9403r738J6930j889j1677J4122N311
991A1047k3561L119K7176j1762k0879J7554P174j8260P449J5041j9128j1229K5977
1004I718M533k7077M946J9394j4179n014J8855r060j7624J8446J3321k2052m803
1017a0596K0952p663j3804K0121J655k7215J0192K4964j7557j6929J9417N056
1029H593j8875R638J4900k2841o703K9560l433k4834J1486J3107j5718Q97J8057
1042A3834j4414j8430K5166J2776k8934k630K2433q653r679J6742l585k0985J3385
1055b974K1907j9662j5527K1463K392j5696J2581N312k3223M912K6680j1647k4312
1068a7794J5514J5107j8142j68J6510j6362r892K6346J976k6856M707K0662r479
$$ plain form
1081 2129 -7706 7088 3022 -14180 3485 17293 -7909 -13693 9315 6358 -9066 1322 6694
1094 6694 -10393 -5923 14751 1153 -16234 2676 10122 -6619 -1927 8380 -5521 -8722 11305
1107 11305 8305 -13650 -4491 12689 -2116 -7950 7964 246 -12277 4169 11845 -8303 -10934
1120 -10934 8461 5168 -8386 2118 5688 -9207 -1103 12950 -2001 -11206 4392 7745 -5421
1133 -5421 -1963 6221 -5378 -6452 10388 3009 -13216 -481 9567 -3170 -5110 5085 -288
1146 -288 -7179 5557 8389 -8816 -5575 10268 1638 -6999 3219 3124 -6259 302 7889 -3488
1160 -3488 -9083 5141 5638 -6944 -1432 5049 -3811 -2523 6791 696 -7052 1599 7185 -2626 -3759
1175 -3759 4982 -115 -4763 4688 2900 -6793 -1268 5983 -1079 -5255 2406 2552 -5094 499 5942
$$ packed form
1081B129r835J4794m066j7202J7665J3808k5202n784K3008k957j5424J0388N372
1094F694j7087M470K0674j3598j7387J8910P446j6741M692J0307j3901l201K0027
1107A1305l000k1955R159J7180j4805n834J5914p718j2523J6446P676k0148k631
1120a0934J9395l293j3554J0504L570j4895Q104J4053j4951r205J5598L353j3166
1133e421L458Q184j1599j074J6840p379j6225J2735J0048j2737j940J0195n373
1146b88o891J2736K832j7205L241J5843q630q637J0218r5r383O561P587j1377
1160c488n595J4224M97j2582N512O481q860J288R314o095p748Q651N586r811j133
1175c759Q741n097m648R451j788r693N525P251p062m176P661J46p646N593N443
$$ plain form
1190 5942 -3748 -4145 5745 2475 -4328 679 3795 -1719 -1864 4153 232 -5205 1963 3760 -3912
1205 -3912 -1668 2875 -1042 -2470 2005 1398 -3318 -186 4197 -969 -2785 3309 1414 -2572 1632
1220 1632 2390 -2047 -1285 2493 666 -3135 368 2378 -2742 -1096 2837 -1102 -2215 1623 1700 -1505
1236 -1505 -635 2482 567 -1810 1716 1513 -1922 632 1664 -938 -552 608 10 -1074 -197 993
1252 993 -1190 -968 1779 -439 -1330 1532 591 -519 539 1068 378 -784 998 1353 -1502 -273 1425
1269 1425 -1048 -1030 291 -253 -549 -500 232 -26 -947 932 666 -1040 799 928 -145 545 380 341 339
1288 339 -202 429 -193 -651 632 -615 -709 381 -775 -362 440 -125 -133 -13 606 864 -724 335 1275
1307 1275 -577 211 899 -370 -289 -24 160 -281 -1237 73 270 -1334 35 84 -683 409 136 -105
$$ packed form
1190E942r690l97R890l270o803N007L116n514j45O017l921n437P168J797p672
1205c912K244M543l917j428M475o07m716L132M383n166j816O094j895l986M204
1220A632P58m437P62L778j827l801L503K010n120J646L933l939j113L838P7l205
1236a505Q70L117j915k377L526k03l435K554J032k602L86J160n98j084Q77J190
1252I93k183K22K747k218q91K862r41j110J058N29o90j162J782L55k855J229J698
1269A425k473J8J321n44k96M9P32k58r21J879k66j706J839J29j073O90j65l9k
1288C39n41O31o22m58J283j247r4J090j156M13Q02n65qJ20O19K58j588J059R40
1307A275j852P88O88j269Q1K65J84m41r56J310J97j604J369M9p67J092k73k41
$$ plain form
1325 -105 474 160 441 119 79 981 -453 -207 1182 -685 -780 513 -374 -667 -157 6 -410 -1070 653
1344 653 692 -1421 536 1271 -998 255 1303 -95 -627 592 1253 -794 -1344 1131 -130 -1630 703
1361 703 -164 -1591 141 848 -554 -1042 573 892 -847 620 1532 -1500 13 2617 -461 -1777
1377 -1777 827 1038 -1241 -874 1264 -833 -2251 1560 1085 -2884 -320 2126 -882 -938 1413 486
1393 486 -1529 729 2820 -1563 -1944 2803 506 -2268 956 825 -2451 -431 2280 -613 -3100 1159
1409 1159 2018 -2458 -71 2559 -1788 -1228 3490 805 -3167 384 3317 -988 -1909 2627 -245 -3636
1425 -3636 2315 2547 -4042 -1842 3179 -54 -2794 1148 1592 -2959 325 4419 -1945 -3544 3788
1440 3788 2113 -2931 417 2360 -1989 -1601 3950 205 -5442 1075 4304 -3151 -1968 3042 -1167
$$ packed form
1325a05N79l14K81l22m0R02j434K46J389j867r5J293q87k93N10J63m16o60J723
1344F53L9k113J957P35k269J253J048j398n32J219O61k047n50K475j261j500K333
1361G03q67j427J732P07j402m88J615L19j739J467R12l032J513K604l078j316
1377a777K604K11k279L67K138k097j418L811m75l969K564K446l008n6K351r27
1393D86k015K258K091m383l81M747k297k774L224j31l276K020K711k893k487M259
1409A159Q59m476K387K630m347N60M718k685l972L551K933m305r21M536k872l391
1425c636N951K32o589K200N021l233k740L942M44m551L284M094o364j599P332
1440C788j675n044L348J943m349L88N551l745n647O517L229p455J183N010m209
$$ plain form
1455 -1167 -2647 3327 2303 -4339 -976 5386 -296 -3715 3009 1336 -3848 1822 3846 -4124 -3335
1470 -3335 4220 1726 -4839 151 3316 -3568 -1099 5207 -1645 -5119 3519 4015 -3291 -1313 3729
1485 3729 -887 -2770 4489 1598 -6416 795 5836 -2822 -3825 3173 473 -3844 2004 3728 -4737
1500 -4737 -2939 6444 1102 -5220 1999 3167 -2970 455 4408 -2525 -4423 4275 3497 -5367 -1199
1515 -1199 4250 -2504 -2460 4537 -715 -5885 2264 5491 -3225 -3775 4431 1138 -3858 3204 2923 -5508
1531 -5508 -442 6189 -1308 -5020 2298 2496 -3769 72 3980 -3803 -3874 5885 1681 -6002 463 4409
1547 4409 -1989 -1770 3876 -230 -4565 3111 4635 -4687 -2417 4592 -806 -3343 2796 708 -4954
1562 -4954 438 5228 -2497 -4973 3950 2470 -4106 1220 3698 -3635 -1616 5379 793 -5123 893
$$ packed form
1455a167j480N974j024o642L363O362n682l419O724j673n184N670K024p970P89
1470c335P555k494o565M990L165o884K469O306o852l474Q638M96p306J978N042
1485C729m616j883P259k891q014P211N041q658j003O998k700m317N848J724q465
1500d737J798R383n342o322P219J168o137L425L953o933j898Q698p78q864M168
1515a199N449o754M4O997n252n170Q149L227q716n50Q206l293m996P062k81q431
1531e508N066O631p497l712P318J98o265L841L908p783p1R759m204p683O465L946
1547D409o398K19N646m106m335P676J524r322K270P009n398k537O139k088n662
1562d954N392M790p725k476Q923j480o576N326K478p333K019O995m586n916O016
$$ plain form
1577 893 4197 -2597 -1786 3593 -1864 -3934 3724 2170 -4987 -1066 4228 -668 -2910 2637 1145
1592 1145 -4061 1818 4794 -3347 -2886 4073 1121 -3278 938 1903 -3137 -950 4267 -1289 -4933
1607 -4933 2450 2856 -3395 -476 2978 -1703 -2134 3450 1750 -4245 44 4623 -1291 -2628 2682
1622 2682 120 -2823 1581 2142 -3041 -1935 3052 197 -3199 1074 1752 -2786 493 3361 -1839
1637 -1839 -2443 2776 1848 -2611 -199 2505 -1434 -1688 3016 -7 -3764 954 2420 -2050 -1694 1912
1653 1912 -53 -2112 1359 1943 -2781 -590 3421 -426 -2053 1645 1186 -1575 184 1665 -1189
1668 -1189 -2012 1644 995 -2556 36 1387 -1505 -453 1539 -604 -1548 1141 1906 -1330 -763 2140
1684 2140 -263 -1423 1626 588 -1930 197 1619 -659 -1658 735 712 -1591 -38 1259 -1441 -656
$$ packed form
1577H93L304o794Q11N379n457k070P658j554p157L921N294m896k242N547j492
1592A145n206N879K976q141M61O959k952m399M216R65n040K187N217n556l644
1607d933P383M06o251K919L454m681m31N584j700n995M289M579n914j337N310
1622B682k562k943M404N61n183J106M987k855l396M273O78m538L279K868n200
1637a839o04N219r28m459K412K704l939k54M704l023l757M718J466m470L56L606
1653A912j965k059L471N84m724K191M011l847j627L698m59k761J759J481k854
1668a189q23L656o49l551K592J351k892J052J992k143r44K689P65l236N67K903
1684B140k403j160L049j038k518K127J422k278r99K393k3k303J553J297k700P85
$$ plain form
1700 -656 1749 117 -1115 521 1054 -151 -205 1167 8 -1193 969 863 -1483 -282 793 -534
1716 -534 -630 234 -58 -814 39 1105 -538 -710 1330 263 -701 826 558 -467 -36 914 346 -1069
1734 -1069 13 982 -978 -584 501 -428 -550 372 53 -342 -201 605 290 -358 626 392 -474 552
1752 552 511 -327 72 234 -139 -360 -284 160 -396 -402 477 -501 -471 540 73 -275 174 376 212 -150 327
1773 327 593 -370 -7 745 -274 -297 190 -260 -195 -316 -18 -9 -507 179 209 -267 363 93 -163 367 167
1794 167 85 364 4 314 -87 -99 328 -393 -416 401 -476 -505 146 -199 -157 -236 127 263 -473 323 616 -279
1816 -279 261 661 -40 62 132 105 -28 -314 155 -83 -625 120 -61 -493 207 -74 -298 151 124 139 89 340
1838 340 432 -234 153 742 -413 -258 492 -176 -380 -171 51 -215 -646 294 126 -837 377 524 -496
$$ packed form
1700f56K405j632j232J636N33j205n4J372j159j201K162j06k346J201J075j327
1716e34r6Q64k92p56Q53J066j643j72K040j067r64J527k68j025M31R50n68j415
1734a069J082R69j960L94J085r29j22R22l19l95J41Q06l15o48R84k34q66J026
1752E52m1q38L99J62l73k21P6M44n56oQ79r78L0J011m67l48M49K02j64l62M77
1773C27K66r63L63P52j019k3M87m50O5j21K98Rm98O86L0m76O30k70k56N30k00
1794A67q2K79l60L10m01j2M27p21k3Q17q77k9O51l45M2p9L63J36p36P96K93q95
1816b79N40M00p01J02P0k7j33k86M69k38n42P45j81m32P00k81k24M49k7J5n0K51
1838C40R2o66L87N89j155J55P50o68k04K09K22k66m31R40j68r63J214J47j020
$$ plain form
1857 -496 120 538 -10 -43 260 581 -243 -196 724 -235 -633 471 -117 -713 157 84 -503 -363 431 237 -698
1878 -698 286 845 -809 52 1080 -283 -395 721 408 -542 -344 715 -313 -986 805 159 -1367
1895 -1367 202 880 -689 -436 580 176 -532 356 1100 -637 -432 1382 -41 -853 881 189 -844
1912 -844 88 522 -523 -1033 749 546 -1449 116 1104 -965 -377 1289 -107 -945 657 1167 -609
1929 -609 -618 1388 -15 -1146 1105 538 -1621 -48 1152 -602 -1226 435 513 -1248 66 1373 -1052
1946 -1052 -854 1813 415 -1187 660 1001 -590 -389 1297 -207 -1638 994 1047 -1694 -528 1208
1962 1208 -714 -785 940 201 -1369 259 1903 -721 -1179 1585 483 -1292 937 1058 -1477 -554
1978 -554 1657 -6 -1865 312 1146 -1464 -472 1433 -992 -1413 1651 607 -1496 101 1510 -344
$$ packed form
1857d96O16M18n48l3L03L21q24M7R20r59l98J104n88n96Q70p3n87J40P94j94r35
1878f98R84N59j654Q61J028j363j12J116l13r50J98J059j028o73J791o46j526
1895a367J569O78j569K53J016m04p08Q88P44j737K05J814j423q12J734o92j033
1912h44R32M34j045n10J782k03j995J565R88k069N88J666j396q38J602N10j776
1929f09rK006j403j131K251n67k159J573J200j754o24J661P8j761J314J307k425
1946a052J98K667j398j602J847L41j591K01J686j504j431K632N3k741J166J736
1962A208j922p1J725p39j570J628J644k624m58K764j102j775K229J21k535R23
1978e54K211j663j859K177Q34k610R92J905k425m21L064j044k103J597J409j854
$$ plain form
1994 -344 -854 1579 262 -1959 890 1720 -1551 -930 1343 -101 -1323 388 778 -1456 -526 2083
2010 2083 -519 -1728 1264 960 -1085 343 1305 -941 -828 1728 661 -2139 169 1801 -1225 -846
2026 -846 1361 -541 -1527 964 1156 -1527 -947 1824 134 -1418 1164 845 -1655 555 1891 -1063
2042 -1063 -1258 1225 655 -1379 -19 1390 -1231 -1003 1791 -315 -1986 606 1126 -933 -365 1006
2058 1006 -118 -1049 1352 1088 -1829 -66 1790 -795 -1163 972 90 -1405 258 1214 -1274 -1391
2074 -1391 1589 498 -1583 492 1049 -1030 -28 1422 -146 -1264 900 1309 -1075 -413 1329 -645
2090 -645 -1060 1288 21 -1517 231 1120 -521 -1017 880 351 -1194 734 1089 -1287 -166 1556
2106 1556 -119 -883 448 654 -890 -305 1123 -633 -1534 1012 541 -1588 7 801 -539 -346 898
$$ packed form
1994c44n10K433j317k221K849Q30l271O21K273j444j222J711L90k234R30K609
2010B083k602j209K992l04k045J428R62k246J13K556j067k800K308J632l026L79
2026h46K207j902r86K491J92k683N80K771j690j552K582l19k500K210J336k954
2042a063j95K483n70k034J360J409k621K28K794k106j671K592N20k059N68J371
2058A006j124r31K401k64k917J763J856k585l68K135q82j495J663R56k488j17
2074a391K980j091k081K075N57k079J002J450j568j118K164M09k384O62J742j974
2090f45m15K348j267j538J748Q89j641m96J897n29j545J928L55k376J121J722
2106A556j675p64J331K06j544N85J428j756r01K546m71k129J595P94j340J93J244
$$ plain form
2123 898 365 -980 324 1379 -632 -532 1059 -25 -773 607 217 -871 -238 738 -274 -1170 469
2140 469 410 -1034 267 919 -590 -307 827 321 -712 136 952 -317 -516 936 -163 -1008 681
2157 681 536 -877 -306 533 -153 -694 208 578 -715 -131 989 -277 -428 570 192 -195 138 456 -91
2176 -91 -420 617 103 -916 171 375 -725 -89 302 -375 -382 337 323 -381 -206 842 -73 -365 740
2195 740 105 -408 268 253 -246 -306 129 185 -576 -182 294 -482 -147 419 -294 -78 226 250 101 34 441 304
2217 304 -218 428 190 -471 77 213 -244 -94 23 -53 -225 -111 376 -271 -336 425 -76 -134 371 124 -23
2238 -23 163 260 188 -345 69 291 -303 -147 123 -336 -107 -62 -197 -4 -27 89 90 -154 216 148 -144 366 149
2261 149 -7 212 71 121 59 -87 122 -227 -201 191 -366 -209 95 -218 -184 49 30 187 -10 110 324 -163
$$ packed form
2123H98n33j345J304J055k011J00J591j084p48J380l90j088O33R76j012q96J639
2140D69n9j444J301O52j509K83J134n06j033Q48Q16j269j99J452j099q45J689
2157F81j45j413N71Q39o86n41R02L70j293N84J120j266j51R98l78l87L33L18n47
2176i1l29J037n14j019J087K04j100O36L91o77pP19j4p04J75J048r15k92J105
2195G40o35n13O76j5m99o0M35N6p61L94M76p76L35N66p13K16L04K4j49o7M07j37
2217C04n22O46k38o61N48J36m57J50J17p6j72J14M87o47o5P61n01n8N05k47j47
2238b3J86R7p2n33M14K22n94J56K70m59K29M5j35J93k3J16Jk44L70o8k92N10k17
2261A49j56K19j41N0o2j46K09l49K6L92n57J57L04l13L4K33j9J57j97J20K14m87
$$ plain form
2283 -163 181 458 -199 84 138 -48 -79 -276 -88 -64 -296 26 -10 -223 88 -137 -67 230 51 44 222 13
2305 13 162 111 32 423 -252 -89 232 -349 -136 51 -115 -133 -260 51 113 -366 147 262 -194 173 396 -60
2327 -60 152 124 70 41 -202 223 -37 -271 185 -111 -330 172 -107 -167 -66 -37 27 -50 153 235 -190 248 429
2350 429 -128 64 266 -55 -57 19 -99 -131 -316 109 73 -470 131 227 -345 138 145 36 157 175 167 -97 -57 556
2374 556 -17 -205 398 7 -345 224 -75 -373 -141 26 -44 -357 152 322 -432 184 452 -263 97 297
2394 297 103 -92 -2 352 -45 -379 334 42 -495 130 156 -337 -109 32 -61 -188 241 284 -459 26 631
2415 631 -54 -173 502 40 -251 142 142 -224 -317 222 -75 -682 40 288 -442 -51 382 -109 -197 296 365 -246
2437 -246 -116 543 -131 -283 523 77 -538 265 313 -310 -413 172 119 -403 -52 399 -470 -98 794 -162 -434
$$ packed form
2283a63L44K77o57K83N4j86l1j97J88K4k32L22l6k13L11k25P0K97j79pJ78k09
2305A3J49n1p9L91o75J63L21n81K13J87j66j8j27L11O2m79N13J15m56L67K23m56
2327f0K12k8n4k9k43M25k60k34M56k96k19N02k79o0J01K9O4p7K03Q2m25M38J81
2350D29n57J92K02l21kP6j18l2j85M25l6n43O01R6n72M83Pj09J21J8qk64M0O13
2374E56n73j88O03l91l52N69k99k98K32J67p0l13N09J70p54O16K68p15L60K00
2394B97j94j95R0L54l97l34P13k92n37O25K6m93K28J41r3j27M29M3p43M85O05
2415F31o85j19O75m62k91L93%l66r3N39k97o07P22K48p30L91M33m91q8M93O9o11
2437b46J30O59o74j52Q06m46o15Q03M8o23j03N85n3n22L51M51q69L72Q92r56k72
$$ plain form
2458 -434 349 302 -156 12 402 -15 -432 473 347 -681 -10 508 -463 -278 253 -119 -414 168 439 -454
2478 -454 -480 788 85 -355 486 299 -311 168 488 -180 -564 284 337 -645 -38 457 -456 -267 558 66
2498 66 -422 167 575 -149 -246 579 241 -432 412 454 -617 3 460 -252 -384 47 89 -531 -119 557 -474
2519 -474 -554 666 70 -580 210 279 -150 -14 500 131 -481 231 660 -538 -195 460 -375 -333 311 14
2539 14 -540 -68 614 -106 -561 527 213 -448 373 343 -405 25 403 135 -370 145 285 -416 -186 426
2559 426 -459 -534 356 120 -465 -10 349 -33 -375 420 270 -474 244 609 -325 -261 343 -39 -333 -63 220
2580 220 -458 -232 589 -56 -647 298 289 -375 153 222 -170 -162 330 388 -282 -50 514 -272 -120 445 -156 -466
2602 -466 227 189 -293 -294 315 2 -470 316 348 -410 255 538 -179 -125 221 305 -183 -54 340 -165 -301 312
$$ packed form
2458d34P83m7m58J68L90m17m17R05j26j028O71N18r71J85N31l72k95N82K71q93
2478d54k6J268p03m40Q41j87o10M79L20o68l84Q48N3r82O07M95r13J89Q25m92
2498F6m88N89M08p24r7Q25l38o73Q44M2j071O20M57p12j32M31M2o20M12O76j031
2519d74q0J220n96o50P90O9m29J36N14l69o12P12M29j198L43O55q35M2O44k97
2539A4n54M72O82p20m55J088l14o61Q21l0p48M30L78k68n05N15J40p01K30O12
2559D26q85p5Q90k36n85M55L59l82l42P95j50p44P18L65r34O4O04l82k94K70K83
2580B20o78K26Q21o45n91R45ro64N28O9l92QM92N8o70K32N64p86J52N65o01l10
2602d66O93l8m82jO09l13m72P86L2p58O65K83p17N4L46Q4m88J29L94n05j36O13
$$ plain form
2624 312 -64 -566 47 186 -197 -94 122 64 -244 184 357 -204 -42 544 -54 -92 339 58 -69 84 207
2645 207 -150 -356 277 12 -403 3 146 -294 12 267 115 -247 139 246 -25 -133 330 -52 -162 384
2665 384 43 -280 -7 15 -125 -169 -30 74 -163 45 318 -128 91 309 73 63 241 141 -5 38 229
2686 229 21 -185 174 64 -375 -85 -15 -150 -103 0 -77 -3 7 293 -14 -84 396 -47 -2 268 -15 -77 -22
2709 -22 -50 100 -170 66 145 -180 -64 103 -235 44 81 -24 101 -83 174 155 -56 110 153 -164 63 39
2731 39 -149 -34 -113 -90 -218 -57 133 -74 -140 89 -43 -80 116 68 109 145 139 208 -86 88 150 -39 -39 175 -173
2756 -173 -52 -39 -156 -75 -100 -8 78 -86 78 97 -38 312 14 24 169 12 12 11 -112 139 -108 -179 22 -180
2780 -180 -101 87 -142 -93 -22 0 90 -53 53 188 47 33 239 -76 154 179 -37 69 -115 -53 59 -103 4
$$ packed form
2624C12l76n02O13J39l83J03K16n8l08M28J73n61J62N86n98l8M31k81j27J53J23
2645B07l57k06O33k65m15M06J43m40L06K55j52l62L86J07k71j08M63l82j10N46
2665C84l41l23K73K2j40m4J39J04k37K08K73m46K19K18k36j0J78j00j46M3J91
2686B29k08k06L59j10m39K90P0j35M7J03p7P4J0K86l07p0M80m43M5K70k83o2N5
2709b2k8J50k70K36P9l25J16J67l38K79L7j05J25j84K57j9k11J66M3l17K27k4
2731C9j88J15p9K3j28J61J90k07o6K29j32l7J96m8M1L6oO9k94J74O2j89%K14l48
2756a73J21J3j17Q1k5R2Q6j64J64J9j35L50k98J0J45j57%jj23K51k47p1K01k02
2780a80P9J88k29M9P1K2R0j43J06J35j41j4K06l15K30K5k16J06j84O2J12j62J07
$$ plain form
2803 4 -63 -77 71 -124 -151 102 96 86 141 74 230 -62 -4 124 -2 80 133 -84 -7 118 -87 -9 -59 54 -41 -119
2829 -119 84 62 -144 66 124 -56 208 -57 12 13 109 67 -94 -22 199 -37 -72 10 -140 -118 5 -138 -80 -13
2853 -13 46 207 -134 115 179 -156 -11 165 -21 79 3 49 1 -70 11 -74 -266 -24 -67 -136 39 4 -26 -37 -31
2878 -31 6 -6 89 196 -223 -124 207 -78 -9 109 -190 -24 -12 137 -55 -152 23 92 -101 84 199 -225 59
2901 59 198 -48 6 -6 271 -14 -68 127 -2 -84 241 -163 -191 -9 -4 -29 -105 -98 64 -113 158 311 -152 36
2925 36 257 86 32 87 -35 -24 -105 207 -106 -327 82 37 -382 -71 86 -168 -26 145 74 -111 -57 281 -49
2948 -49 -105 191 10 -100 188 141 -171 19 80 -68 -143 3 12 -230 134 308 -224 -91 293 30 -56 109 182
2971 182 -109 -47 259 -12 -329 194 191 -293 -141 25 -129 -39 -90 61 -157 -100 251 -48 -171 226 -50 -106
$$ packed form
2803Do7j4J48j95k7K53oj0N5o7J56k92N8J28j26Q2N3k17P7J25k05P8n0J13r5p8
2829a19K03k2k06K10N8j80K64k65O9JR6m2j61P2K21k36l5Q2j50K2J23j43N8O7
2853a3N9J61l41K49O4l35J45J76j86J00p6M6m8p1Q1q5j92K42m3o9J75l5l0j1O
2878c1L7j2R5J07m19R9L31k85O9J18k99J66J2J49j92r7J75O9j93J85J15m24K84
2901E9J39k46N4j2K77k85n4J95j29q2L25m04k8J82Nk5p6PJ62j77K71J53m63J88
2925C6K21j71n4N5j22J1q1L12l13k21M09m5m19L11J57k54J42J71p1j85N4L38l30
2948d9n6K96j81j10K88m7l12J90O1j48p5J46Rk42L64J74n32J33L84k63q6J65P3
2971A82k91O2L06k71l17N23lm84J52J66j54R0n1J51k18N7L51k99j23L97k76n6
$$ plain form
2993 -106 224 151 39 23 153 125 -209 9 121 -350 -46 232 -301 -5 200 49 -31 -31 325 -35 -147 280
3015 280 103 -342 204 220 -117 -68 55 -56 -210 -76 34 -236 -119 217 -188 -190 128 3 -78 133 172 27
3037 27 -91 108 217 -302 33 223 -262 -78 77 -3 -154 -9 128 -39 -130 228 15 -75 268 125 -271
3058 -271 104 129 34 -36 118 78 -54 -4 110 -166 -111 95 -94 -81 -68 12 -140 8 55 -25 -87 227 239 -218
3082 -218 86 253 13 13 1 28 -218 -47 162 -116 -288 56 -73 -220 151 -37 -90 74 134 17 -23 116
3104 116 274 -88 -115 276 -152 -45 122 -85 -164 -137 177 -56 -171 89 115 -145 167 132 -122 47 21 97
3126 97 -7 59 179 -2 -103 202 -28 -202 69 -108 -226 -21 37 -105 -40 239 53 -213 98 192 -96 104
3148 104 261 -6 -3 117 120 -150 -163 115 -47 -161 -7 -25 -195 23 60 11 28 150 182 15 -30 16 -22 -170
$$ packed form
2993a06L30p3j12j6J30k8l34K18J12m71L04K78n33K96K05j51q0%L56l60j12M27
3015B80j77m45N46J6l37M9J23j11j54J34J10k70J17L36m05kL18j25q1K11L9j45
3037B7j18J99J09n19L35J90m85J84J55q0j51J45J37j67r1L58k13r0L43j43l96
3058b71L75K5r5p0J54m0j32N0J14k76N5K06j89J3J3Q0j52J48M7q0o2L14J2m57
3082b18L04J67k40%j2K7k46J71K09k78j72L44j29j47L71j88n3J64O0j17m0J39
3104A16J58l62k7L91m28J07J67k07p9K7L14k33j15K60K6k60L12l5k54J69k6P6
3126I7j04O6J20j81j01L05k30j74K71j77j18K05N8j42O5K79j86k66L11R4k88K00
3148A04J57k67LJ20Lk70j3K78j62j14J54j8j70K18L7m9J7J22L2j67m5M6l8j48
$$ plain form
3172 -170 222 -116 -59 118 80 -143 -136 -64 20 -48 68 140 -153 55 58 -71 179 8 -13 42 182 81 7 -119
3196 -119 16 104 -133 36 -12 -121 -82 -37 -28 -41 -85 134 -76 -87 178 -165 -23 76 50 -9 -7 9 2 -6 -12 -6 -87 70
3224 70 -48 -204 -53 41 -100 -77 -3 185 22 -137 23 55 -54 125 -58 -74 152 -112 -29 -34 -70 19 -123 -201
3248 -201 77 14 31 -21 65 -49 91 40 97 -55 21 74 74 5 92 -85 70 108 -88 -26 5 69 -55 -53 -16 -57 -11
3275 -11 9 -22 -81 136 34 3 -58 109 68 40 -57 108 -118 -7 118 -112 12 -20 -60 82 57 -81 43 64
3299 64 -70 41 48 112 14 -14 24 30 -113 19 59 4 -43 -155 27 -96 -2 -114 -68 -5 54 -21 49 102 165 172 -35
3326 -35 -85 73 -31 144 -14 -60 -22 -40 -93 -30 -114 10 -17 -22 116 -42 -52 148 45 30 47 -55 60 65 -15 113
3352 113 -4 -30 6 -148 -102 95 -39 -50 113 33 26 -45 34 180 -46 1 140 -36 -7 76 -80 11 14 -52 17 -39
$$ packed form
3172a70L92l38N7J77l8k23PP2Q4o8J16P2k93K08Lj29K50j71k1N5J40j01p4j26
3196a19J35Q8k37J69m8j09L9M5Rj3m4K19k10j1K65l43J42R9k6n9KJ6pqoOq1J57
3224G0j18j56J51R4j41K3P4J88j63j59J60L2j09J79j83j6K26k64Q3nl6Q9j42p8
3248b01K78o3J7n2Q6j14J40n1N7j52P6N3%o9Q7j77J55L8j96O2L1O4j24KL7m1M6
3275a1K0l1n9K17j02l1o1J67m1k8r7J65k26J11J25k30J24l2m0J42k5j38J24K1
3299F4j34J11PO4r8k8L8Oj43J32M0n5m7j12J82j23R4j12M6O3N9p5P0N3O3Pk07
3326c5n0J58j04J75j58m6L8j8n3O3q4J24k7nJ38j58j0K00j03j5J7j02J15Nq0J28
3352A13j17k6L6j54M6J97j34j1J63q0pp1P9J46k26M7J39j76K9Q3j56R1Lo6O9n6
$$ plain form
3378 -39 -35 -15 -90 38 -20 -132 -2 14 41 42 55 148 18 -2 92 -42 -30 163 -16 -39 -13 -83 6 -58 -26 36 -135
3405 -135 30 53 -136 -2 81 -47 42 18 19 -16 74 25 7 -122 77 8 -106 -92 79 -18 -63 51 -68 -67 54
3430 54 43 -30 -95 117 -21 -22 106 -159 90 -107 -45 5 -27 18 -32 -180 -10 31 -109 28 -63 -64 -16 -25 25 -41 -65
3457 -65 63 39 -73 95 47 -60 -54 45 -74 -21 34 -127 -69 -1 128 -124 29 190 97 80 27 112 -38 -12 93
3482 93 -39 -85 60 79 -199 67 17 -95 7 -3 -241 -139 34 83 1 11 181 81 -198 109 -41 -102 -35
3505 -35 53 -37 -170 7 152 -17 16 24 -127 -75 73 92 -35 -8 76 76 -108 82 162 -161 210 57 -211 21
3529 21 100 -102 -42 -104 38 -103 -50 138 -133 -5 30 -25 -90 56 -73 12 14 76 -73 -84 74 88 -128 -18 61
3554 61 -79 -64 69 146 -57 -20 35 42 -55 79 -2 -81 131 98 2 -16 32 50 -78 -57 96 -28 -64 88 -70 -39
$$ packed form
3378c9MK0p5J28n8j12J30J6K7JJ3R3j30k0R4j34J2J93j79k3K6p0Q9o4L2O2j71
3405a35J65K3j89J34Q3j28Q9k4Jl5R0m9j8j29J99o9j14J4J71r7m5J14j19JJ21
3430E4j1p3o5K12j38jJ28k65K49j97O2N0l2M5n0j48J70M1j40J37r1jM8rN0o6k4
3457f5J28k4j12J68m8j07OR9j19N3N5j61N8O8J29k52J53J61r3j7n3Q5j50K6J05
3482I3j32m6J45J9k78K66n0j12J02j0k38J02J73M9q2J0J70j00k79L07j50o1O7
3505c5Q8r0j33J77J45j69L3Qj51N2J48J9j27K7Q4%j84J90Q0l23L71j53k68K32
3529B1P9k02O0o2J42j41N3J88k71J28L5n5o5J46j29Q5KO2j49j1J58J4k16J10P9
3554F1j40J5J33P7k03L7N5Pr7J34q1p9K12l3r6j8M8J8j28K1J53j24l6J52j58L1
$$ plain form
3580 -39 54 -35 -64 9 62 13 -136 99 57 -172 173 -10 20 29 36 -18 -57 67 26 4 -64 145 38 -66 -75 5 -101
3607 -101 -3 165 67 -90 50 6 55 -13 46 -44 -40 52 -55 -36 -71 33 -16 -156 113 119 -136 122 18 28 11 -23
3633 -23 -4 160 75 36 104 -24 109 -125 -127 150 -119 -125 -115 -33 0 -44 0 25 -79 88 62 -114 -45 40 -95 28
3659 28 85 -46 101 -44 66 66 -117 41 -22 -75 -14 169 41 48 -5 9 -13 19 110 -6 44 93 12 -1 -26 -39 -9
3686 -9 25 72 -21 -102 25 141 -63 70 52 -6 6 119 -113 73 -21 46 117 -91 5 -11 121 49 -29 -41 2 -58
3712 -58 -7 -152 129 40 -63 -174 64 50 -45 95 -21 114 93 -45 69 125 -185 51 -43 -21 -49 -116 56 -37
3736 -37 -79 -47 74 123 64 -68 83 42 -10 173 10 -41 111 -86 -25 -62 -4 -3 4 -21 40 -51 -77 -20 -57 40 82 -6
3764 -6 27 -103 -60 74 148 21 -25 -31 84 76 -170 36 -52 -87 -69 -68 -136 50 -110 155 4 -13 -19 -26 18 -25 -45 22
$$ packed form
3580c9R3q9k9P3N3m9j49K35m2k29L45j83L0RPn4l9J24m1k2o8K09j07j04rQ0j06
3607a01R8J68r8j57J40m4M9o8N9r0MR2j07J9l5J04m9j40K69Ok55K58j04J0j7l4
3633b3J9J64q5l9O8j28J33k34kK77k69oJ0Q2L3m4M4K5j04J67k6j76O9Q5j35J23
3659B8N7j31J47j45J10%j83J58o3n3O1J83j28Pn3J4k2L2R1j16N0M9q1j3k5j3L0
3686iL4M7r3q1J27J16k04J33j8n8J2J13k32J86r4O7P1k08R6j6J32p2p8j2M3o0
3712e8N1j45K81q9j03j11K38j4r5J40j16J35k1j38J14N6l10K36r4K2k8o7J72r3
3736c7m2L2J21M9n9j32J51m1n2J83j63n1J52j97O1l7N8JPk5O1r1k6N7l7R7M2q8
3764fL3j30M3J34P4j27m6oJ15qk46K06q8l5J8Jo8J86j60K65j51j7opM4m3k0O7
$$ plain form
3792 22 -45 38 -1 -48 5 35 -11 8 18 -74 104 110 -75 55 -40 33 132 72 83 75 -10 28 69 6 66 -56 13 43 17
3821 17 108 -67 -56 -69 -76 -38 42 15 16 46 -46 9 -3 -73 23 -1 -19 -34 100 2 -46 -56 92 -139 -69 -24 -30 -19 36 -37
3851 -37 106 -2 68 13 62 65 -7 -63 13 -54 -65 83 -151 -12 96 -53 -3 -49 -46 51 7 30 41 -108 78 134 -21
3878 -21 133 151 -96 42 0 55 -31 21 7 9 -138 12 3 55 66 31 65 54 -92 -41 -43 -139 172 -36 37 25 17 49
3906 49 -116 25 -11 -99 -121 70 19 -125 35 -38 48 39 -19 86 -4 -90 70 -23 -9 -5 -73 128 71 -101 -27 -34 -7
3933 -7 -1 -9 7 -52 -59 104 16 -17 -10 82 -10 44 -6 38 44 53 -26 -76 -4 16 -26 114 -41 -104 90 46 -15 21 19 50 75 113
3965 113 -44 70 -1 37 38 -89 50 -25 4 37 -58 -93 -59 45 58 -4 -64 118 23 64 -26 161 -32 7 45 22
3991 22 -13 -2 -82 -133 45 -4 -92 19 -164 -36 -85 -162 4 99 143 32 -24 -36 228 -109 -40 36 88 -32 -20 21
$$ packed form
3792B2o7Q3l9m7N3L0m6J9J0r2J78Oj85J30r5P3R9o0J1qq5L8M1o3O0j22O9L0k6
3821A7R1j75J1j3pL8Q0k7JL0r2N5j2p0R6k4j8j5J34r8m8j0J48k31P0M5oJ1N5p3
3851c7J43j08P0n5M9Lp2n6P6o7j1J48k34J39J08j49N0m6LR7m4K3J1j49J86N6j55
3878b1J54J8k47J38m2N5q6N2j4Kj47J50rN2J1l5L4j1j46N1kr6L11k08P3j2qL2
3906D9j65J41l6q8k2J91n1j44J60p3Q6rn8J05r0q6J60r3J4Mo8K01n7j72P4pK7
3933gOqJ6n9pJ63q8l3PR2r2N4n0M4ORp9n0P2K0m2J40j55o3J94m4o1L6kL1K5L8
3965A13j57J14p1L8Jj27J39p5K9L3r5l5L4J04J3o2o0J82r5M1r0J87j93L9L8k3
3991B2l5J1q0n1J78m9q8J11j83J28m9p7J66R5M4j11n6j2K64l37O9P6N2j20J2M1
$$ plain form
4017 21 7 -64 -49 110 -98 -119 -65 74 -43 55 -38 3 -51 70 99 -12 7 -18 -59 -63 -14 -72 68 0 -26 12 68
4044 68 29 -130 -11 58 -24 74 86 36 25 -43 115 67 80 152 8 19 -103 2 -153 -41 7 -75 42 -39 3 -40
4070 -40 -67 73 -21 -117 122 171 -40 83 -29 179 31 -42 127 -56 -68 21 5 -78 21 -51 1 94 18 -8 6 16
4096 16 12 12 74 91 -40 31 138 -37 0 -55 -4 34 -90 42 -125 -32 16 68 -86 131 -87 -96 66 -73 -23 -34
4122 -34 1 -16 -69 -8 -67 36 -6 -3 45 36 -79 55 -46 38 72 101 -20 61 -34 189 17 57 -154 7 -88 -7 72
4149 72 -63 -29 -44 -121 42 -9 -15 35 6 12 -48 -33 2 -53 10 57 -39 60 9 -16 44 6 26 67 -20 106 35 -91 31
4178 31 -101 4 106 -59 13 2 -14 65 -19 60 187 91 7 146 -61 -67 -9 -42 -76 -46 36 3 15 14 63 -28 85
4205 85 -52 8 -91 33 19 -36 21 17 45 87 67 -54 -41 -38 2 -26 -42 117 121 -66 -42 65 -45 6 5 25 101 14 15
$$ packed form
4017B1j4p1J5J59k08k1N4J39j17R8r3M1n4J21K9j11J9k5m1mM9n8J40o8k6L8N6
4044F8l9j59J19O9q2R8J2n0j1o8J58m8J3P2j44J1j22J05j55J12M8q2J17q1M2m3
4070d0k7J40r4r6K39M9k11J23j12K08j48p3J69j83j2Q9j6q3R9p2N2R3p6k6J4J0
4096A6m%O2J7j31P1J07j75L7n5N1L8j24J32j67R3M8N2j54K17k18rJ62j39N0j1
4122c4L5j7n3O1n9J03m2LM8rj15J34j01Q4L4K9j21Q1r5K23j72M0k11J61r5Q1P9
4149G2j35L4j5p7J63n1oN0k9Oo0J5L5n5O3M7r6R9n1k5O0l8K0M1q7J26p1j26J22
4178C1j32J05J02j65P2j1j6P9q4P9J27r6q4J39k07oN8l3l4L0Q2l3J2jM9r1J13
4205H5j37O0r9J24j4n5N7mK8M2k0j21J3LM0k8j6J59Mj87K4J07j10N1jK0P6q7J
$$ plain form
4234 15 96 148 112 54 -60 -61 -92 -150 -2 -49 -70 5 -39 47 -67 -7 -46 88 -67 78 -9 17 -20 31 -34 107 -35
4261 -35 -16 0 69 33 -136 -66 -42 28 69 91 58 -24 19 -23 74 -41 81 55 5 10 36 26 67 28 -38 51 26 -36 -40 -128
4291 -128 -31 -7 -8 136 -39 -72 17 70 3 -14 7 -13 -57 -36 -37 -123 47 0 -80 -77 -52 -55 81 -55 14 123 186 -55
4319 -55 11 55 89 56 -85 -41 -62 29 -55 -37 32 -10 -6 -12 25 -217 -92 -42 -32 101 39 -73 -1 104 23 -38 4 80
4347 80 18 69 -3 -6 91 60 24 21 23 -18 21 105 94 -10 -25 -30 0 68 12 -57 79 -66 41 65 -36 9 -74 -105 44
4376 44 -12 -15 1 43 -22 4 72 -85 76 -129 50 57 -72 -35 -31 76 84 -47 31 -83 -11 1 -120 -10 129 100 -83
4403 -83 18 -9 96 8 24 24 20 -35 103 32 51 68 16 52 -57 -91 -52 -34 -55 -88 -129 37 -117 -32 -14 40 -66 -8
4431 -8 50 -17 99 -91 105 82 27 87 11 -27 9 -125 -111 -108 13 34 -114 75 54 -62 -104 166 -14 -1 -9 11 1
$$ packed form
4234A5Q1N2l6n8j14jl1n8J48m7k1P5m4Q6j14O0l9J34j55J45q7K6l7N1o5J41j42
4261c5J9J6O9l6j69P0K4P0M1K2l3q2M3m2R7j15J22k6n0NK6j0M1l9o6Q9k5o2mq8
4291a28R7K4jJ44j75l3Q9N3o7j7K1k0m4K1jq6J70m7q0LK5lJ36j36O9J09O3k41
4319e5O6M4L4l3j41M4k1R1q4J8O9m2MoL7k42J25N0J0J33o2j12P2J05q1o1M2P6
4347H0o2N1p2lR7l1l6lKm1L9Q4j1j04j5nL0O8n6o9J36j45J07K4j01M5q3l1J49
4376D4n6lJ6M2o5K6O8j57J61k05J79Pj29L7MJ07Qj31P8j14P2J2j21J10J39k9j83
4403h3J01k7J05q8J6%mn5J38p1J9J7n2L6j09l4L9J8k1l3m1J66j54Q5J8N4j06N8
4431hN8o7J16j90J96k3n5O0p6l8L6j34J4LJ21K1j48J89k1j16m2K70j80J3qK0j0
$$ plain form
4458 1 -13 -132 -63 -75 -26 119 -9 74 -83 38 32 -29 81 32 -8 21 -80 136 -35 -63 3 77 5 -26 23 -106
4484 -106 65 12 -51 63 -95 -43 139 -62 8 -31 -52 -9 41 39 52 -40 44 -7 -62 30 57 -84 -37 -35 -23 -54 -62 -22
4512 -22 -71 -80 89 44 -14 47 2 45 56 32 71 -54 -45 -8 -31 14 97 -135 -3 -54 -108 42 -32 3 40 76 45 -6 21
4541 21 9 43 20 88 -33 28 -17 83 -72 -77 47 53 0 -45 -43 68 -15 -32 -22 -4 5 71 47 -17 -55 119 -101 -97 69
4570 69 -27 -53 -96 80 -114 -137 12 -90 17 15 67 -51 -53 6 67 -69 -47 59 -68 -55 108 -16 -60 107 -97
4595 -97 -114 -18 26 -18 -26 -22 -23 -8 0 19 61 24 98 13 -112 -106 -38 -6 76 139 -63 -11 34 -6 -21 -115 -53 -90 50 55 -5 -2
4627 -2 -6 31 -7 51 66 -64 67 117 -5 -15 -56 -54 34 -22 -71 32 -150 -43 32 -57 -72 92 65 119 9 -4 26 58
4655 58 26 65 -159 20 -30 -41 -1 -138 -25 -16 8 33 20 100 8 -5 10 -2 -31 -26 32 45 67 47 12 6 -12 11 10 -86
$$ packed form
4458Aj4j19O9j2M9J45j28Q3j57J21oo1J10m9m0K9j01K16j71k8O6P4p2l1M9j29
4484a06J71n3o3J14j58N2J82k01P0l9k1M3N0kJ3r2Q4n1n5R2K7j41M7KJ2l1qM0
4512b2m9rJ69m5n8O1m5M3J1k4L9j25RL7k3M5Q3k32J32n1n4J50p4L5L7L6l1n1K7
4541B1j2L4k3O8j21O1m5J00j55nJ24On3m5KJ11q3j7J0J8RO6k4o4l8J74k20MJ66
4570F9r6k6m3J76j94k3J49j02J07kN2j18kN9O1j36K2J06j27J3J63j24m4J67k04
4595i7j7R6M4m4qMjJ5QJ9M2l7P4q5j25OO8L2Q2O3k02N2M5m0j5r4O2l7J40No0L
4627bmL7l8N8J5j30J31N0j22j0m1KQ8n6m9J03j82J07P5q9j5J64k7N4j10j3L0L2
4655E8l2L9k24J79n0j1M0j37J13RK4K5j3Q0r2j3J5j2k9NN8J3K2k0l5oj8K3jr6
$$ plain form
4685 -86 38 13 8 20 -10 -1 60 -26 16 -50 57 90 -5 40 64 3 95 -39 -29 34 33 -16 -77 -136 -105 40 -92 -65 -39
4714 -39 -117 36 96 17 175 -18 72 86 -2 106 -79 -7 -71 40 21 34 -8 47 29 5 -35 36 -81 -25 -37 -59 17
4741 17 33 148 -47 13 84 -89 45 14 -55 5 -16 -20 8 -5 -7 -11 4 -16 -14 32 16 41 23 -29 98 140 54 -58 -129
4770 -129 -24 -33 38 -90 -35 -18 -48 98 13 -56 20 -102 20 112 -5 -93 79 6 -69 34 105 -17 -39 -19 -106 -73
4796 -73 70 83 29 50 -12 -67 -25 32 40 -40 -27 -32 100 -48 54 5 -45 70 -31 -37 16 0 142 0 -49 24 -12 -35
4824 -35 -100 54 25 137 -37 42 29 75 -16 -81 44 -45 -30 8 109 -12 8 6 -60 4 44 202 -21 85 -12 72
4850 72 -40 75 -52 97 133 -31 53 17 23 6 38 13 4 -101 40 5 7 -61 98 -52 -108 -92 -122 12 39 -84
4876 -84 -98 58 -6 -29 -28 98 -17 -63 14 69 -17 -56 146 55 -5 34 21 -111 -11 7 -39 -11 52 121 49 19 99 16
$$ packed form
4685h6J24k5nJ2l0RO1q6M2o6J07L3r5M5K4o1R2j34J0O3jm9o1n9L1J45j32K7K6
4714c9p8J53O0p9J58j93R0J4q8J08j85P2o4J11j9J3m2N5j8k4m0P1j17N6j2k2P6
4741A7J6J15j95O0P1j73J34l1o9O0k1mK8j3kmJ5k0KM6j6K5j8n2J27M2q6j12p1
4770a29J05rP1j28N5J7l0J46q5o9P6j22J22R2j17q8J72p3p5J03P1j22k2K0q7L3
4796g3J43J3n4K1o2n5M2N7Qq0J3nJ32j48J02m9n0J15j01oN3j6J42j42m9P3l6k3
4824c5o5J54k9J12j74P9j3M6r1o5J25q9J5L8J01j21K0ko6O4M0J58k23J06r7Q4
4850G2j12J15j27J49L6j64Q4l6Oj7L2k5rj05J41l5Ko8J59j50n6J6l0J34K7j23
4876h4j4J56o4k3JJ26j15m6P7N5q6l9K02r1o0L9j3j32J00J8m6K8O3O9p2l0Q0q3
$$ plain form
4904 16 26 -40 -87 61 17 -25 47 39 70 23 109 0 36 141 -80 123 2 -6 -42 2 3 -13 54 81 -28 -72 51 4
4932 4 30 5 -18 -40 121 -32 15 23 72 12 -15 96 22 -76 29 81 -114 24 -32 -22 0 12 57 -38 6 72 -85 -27
4960 -27 14 -70 16 35 6 65 -11 86 97 -142 -2 80 -184 18 14 -28 -95 60 103 -59 54 142 -99 -41 167 -6
4986 -6 -11 -73 32 -7 17 41 -78 -61 115 25 -102 2 -3 -110 -197 -62 -75 -67 -64 0 20 -46 95 58 -2 -70 41 -106
5014 -106 59 5 0 -44 -22 57 -131 -69 14 78 88 113 85 -54 29 23 2 51 139 127 -93 71 60 -14 67 2 -166 -59
5042 -59 -3 90 -46 -29 12 -35 -59 35 30 -69 15 0 116 1 128 130 -134 -35 18 -35 -58 5 78 -2 32 -2 -34 -29 5
5071 5 87 96 111 -11 -8 -4 59 40 -27 -53 -69 42 -60 -125 -18 -23 14 4 -43 27 46 -54 -32 -59 48 77 1 148 -40
5100 -40 -25 3 63 -49 5 36 -47 -148 -86 -31 -63 -69 -21 -27 -39 26 -78 -10 81 -55 -67 -56 -5 4 -84 63 -88 -41 30
$$ packed form
4904A6J0o6m7J48m4m2P2qL1m7Q6j09L6J05k21K03j21ql6M4Jj6O7K7j09m4J23m7
4932DK6k5k3k2J61j53M7QM9o0k7J11p4r8J05N2j95J38n6J0K2J2M5r5M4O6j57N8
4960b7M1q4Q6J9k9N9p6R7J1k39J40Q2k64K02mm2o7J55M3j62J13Q8k41N8K08j73
4986fno2J05l9K4K4j19J7J76r0j27J04nj07q7J35j3QLO4K0o6J41l7o0o8J11j47
5014a06J65n4nm4K2P9j88O2Q3O4J0K5k8j39Q3ok1M9Q8j2k20J64j1p4Q1o5j68J07
5042e9N6R3j36J7M1m7k4R4nr9Q4j5J16j15J27Kk64R9N3n3k3O3P3q0L4l4l2NL4
5071EQ2RJ5j22LMO3j9o7k6j6J11j02o5J07nL7j0m7P0J9j00K2k7J07K9p6J47j88
5100d0J5K8O0j12N4L1q3j01O2N5l2oM8oj2O5j04O8R1j36j2J1N1Rq8J47j51M7P1
$$ plain form
5129 30 3 -34 -13 -84 13 -109 49 32 34 0 20 -75 -11 25 80 49 95 109 -1 32 -8 94 41 79 -56 -30 61 81
5157 81 -60 -22 -39 -49 -74 30 99 92 -15 33 -40 38 -21 18 -17 12 -97 -41 24 -102 -7 36 24 67 -38 44 72 26
5185 26 -25 -2 -57 43 -93 -23 38 -171 14 45 106 -143 4 -93 64 -38 -23 -76 -53 77 -21 -61 131 89 -137
5210 -137 -119 25 -83 61 87 49 41 -28 88 -26 -3 -59 -94 -234 -33 53 -10 -20 30 23 34 -60 68 -58 -4 -34
5236 -34 -44 -11 -60 34 -49 -27 84 -120 -71 6 95 -69 26 -66 64 8 1 -38 -34 12 7 -26 -42 -10 63 107 12 37 -47 43
5266 43 -4 7 -73 -34 108 -33 -13 50 104 38 28 58 15 -89 28 40 79 19 -17 -67 -26 -5 35 -106 44 82 -114
5293 -114 -3 10 29 20 -17 17 78 106 20 61 -30 5 -20 -40 3 -69 -43 6 87 5 -1 25 61 72 68 -4 -25 9 32 -67 -60
5324 -60 48 28 -6 -46 11 21 -176 75 -39 17 9 83 -77 -31 -80 -96 14 47 -19 -53 76 23 -35 -47 51 -65 -90
$$ packed form
5129C0k7l7K1p1R7j22J58j7Kl4K0r5O4L6N5l1M6J4j10L3m0J02n3L8j35K6R1K0
5157H1j41L8j7j0k5J04O9pj07M8p3P8n9L9l5K9j09N6O5j26R5M3j2M3j05Q2K8m6
5185B6n1K3n5J00j36P0O1k09J85L1O1k49J47r7J57j02J5n3K3J30r8m0J92m2k26
5210a37J8J44j08J44K6l8qo9J16j14K3n6l5j40K01Q6o3j0N0pJ1r4J28j26N4l0
5236c4j0L3m9R4q3K2J11k04M9P7Q9j64R5r2J30n6pl9MM6nl3j6L2P3M4r5K5q4R0
5266D3m7J1q0L9J42j41K0O3N4o6j0L0m3j04J17J2L9o0l6n0M1K1M0j41J50L8j96
5293a14J11J3J9rl7L4O1K8q6M1r1L5k5k0M3p2K6M9Q1q2oK6L6J1mp2k1L4K3r9P
5324f0J08k0l4m0N7J0j97K51j14N6qP4j60M6m9j6J10L3o6l4J29n3n8j2R8j16k5
$$ plain form
5351 -90 12 -36 14 -71 -53 22 55 66 17 -18 -26 129 -153 8 75 66 -66 -73 -48 -36 11 -18 -77 -61 -11 -40 44 -72 -72
5380 -72 -55 -85 -57 59 -60 38 151 -3 25 -31 43 -44 38 16 72 6 65 -2 9 45 17 -72 39 1 -110 34 -15
5407 -15 38 -18 -16 7 -62 -50 11 -133 -46 4 59 36 144 -107 12 -15 -13 -30 10 93 10 77 100 -29 -32 79 -17 20 44
5436 44 -63 154 149 -1 -16 -95 -22 17 -65 -96 47 97 -41 7 24 127 112 14 53 46 13 27 8 -112 -34 -71 -39 -32
5464 -32 102 -61 15 -3 14 -37 -17 -197 70 84 42 66 7 -41 91 122 -2 -32 -113 -92 21 -14 25 35 -37 -93 158
5491 158 -43 32 16 -44 -19 -36 64 -18 57 45 51 -10 -24 -74 -29 -39 -96 -71 71 -48 4 -12 -22 -4 84 31 8 16 -51
5520 -51 -22 -22 108 123 32 -1 -74 -16 -33 -64 -27 -9 -32 136 78 83 -33 -51 -71 -36 99 79 14 -29 27 -33 -26 -61 -33 22
5550 22 12 -57 60 -38 -124 57 -72 30 -12 2 29 -35 88 105 -40 14 34 -90 69 29 12 118 -13 11 -57
$$ packed form
5351i0J02m8N0q5J8P5L3J1m9l5qJ55k82J61O7rj32pK5J2M7k9n9J6N0k9Q4j16%
5380g2J7l0K8J16j19R8J13j54K8n6P4q7Q2k2N6o6N9o7J1L6k8q9J11l8j11J44m9
5407a5N3n6KK3o9J2O1j44Q7N0N5k3J08k51J19k7Kj7M0Q3q3O7K3j29lJ11r6L7K4
5436D4j07K17nj50j5p9P3L9q2l1J43N0j38M8J7J03j5r8L9pl3J4j9j20P8l7L2P
5464c2J34j63P6j8J7n1K0j80K67J4m2K4n9m8J32L1j24l0q1K1J13l5L9J0p2n6K51
5491A58k01P5j6o0K5j7J00q2P5j2Oo1j4n0M5j0n7K5J42j19N2j6j0J8Q8n3k3Qo7
5520e1K9%J30J5r1l3p3N8j7l1L7J8k3J68n8Nj16j8k0L5J35k0o5m3N6o0Pl5K8N5
5550B2j0o9J17r8q6J81j29J02m2J4K7o4J23J7j45N4K0j24J59m0j7J06j31K4o8
$$ plain form
5575 -57 -26 50 16 -57 -6 31 -49 -10 -72 128 16 -105 -28 -87 22 28 -11 38 9 -81 -5 12 -126 -29 22 -17 24 8
5603 8 -60 106 -6 89 80 -127 -15 69 -13 115 123 101 44 -15 -20 -71 -24 11 2 31 -78 24 9 -19 -1 -27 20 3 8 -86
5633 -86 3 -19 23 124 100 -132 -35 -8 120 -92 63 110 -119 17 55 26 33 -93 85 46 -98 -17 -90 52 -144
5658 -144 49 0 78 2 94 -50 12 8 -56 28 73 -89 -21 -2 28 62 -31 57 -134 29 -52 87 -5 20 -39 -122 -81
5685 -81 99 -39 87 -15 -55 18 72 27 -43 27 16 2 -44 -39 -24 90 -26 54 -71 -32 -77 -55 -49 -37 -11 51 42 -92
5713 -92 5 11 -28 -130 10 -31 91 -84 120 87 -49 -7 -48 -9 56 133 -1 -53 -27 86 170 -59 -9 24 -7 67
5739 67 23 29 -59 -13 -41 18 30 50 -44 101 -35 -50 113 -55 -14 -46 -78 -84 57 49 72 25 -113 -112 75 84 14 -38 -30 -29
5769 -29 -127 49 77 -116 -40 121 63 77 26 65 9 85 4 -61 -4 -21 38 -45 -29 137 -5 45 -61 -85 6 52 51 -82
$$ packed form
5575e7L1P6l4p3N1L7q0L9o2K00j12j21P7n9J09Ol9M9k9r0P6J7j38R7N1l9M1j6
5603Ho8J66j12R5rk07J12Q4q2J28Qk2n7n9nn1M7L5rK9j09J02j5k8J8k6M7j7Nr4
5633h6Q9k2M2J01k4k32R7K7J28k12J55M7k29J36L8k9Pj26J78l9j44Q1p3J42j96
5658a44J93m9P8p6R2j44O2mo4Q4M5j62O8J9L0L4r3Q8j91J63q1J39r2K5n9q3M1
5685h1J80j38J26j02m0P3N4m5p0P0j1j4m6NJ5J14j16Q0j25L9m5K2OJ2K6O2rj34
5713i2R7Ol9j02J40m1J22j75K04l3j36M2m1L9O5P7j34n2K6J13Q4k29N0L3l1P4
5739F7m4Oq8M6k8N9J2K0r4J45j36j5J63j68M1l2l2oJ41qK3m7j38JJ87Rp0n2QJ
5769b9r8J76K8j93P6J61n8J4n1L9n6P6q1o5N7j7N9q3J6J66j42N0j06k4R1M6jj33
$$ plain form
5797 -82 -2 39 -77 -61 30 30 106 -29 -19 -28 -16 23 49 -69 -25 136 -32 -33 -27 83 66 60 70 -74 -17 -4 -36 36 34 48
5827 48 74 68 -7 4 29 -51 -111 -62 -29 15 -19 -64 18 25 10 61 23 -91 -79 -57 -13 2 -38 -92 -51 -1 1 14 31 -37 -2
5858 -2 -32 94 114 132 -65 25 -1 1 -48 117 133 33 19 -94 3 -31 -71 5 22 2 -39 -54 142 -15 -84 -57 -9 -57
5886 -57 -12 -81 -63 77 13 -56 -33 41 11 13 -65 33 61 13 67 20 -16 1 21 -117 -50 -8 -12 -129 24 62 -8 103 -22
5915 -22 -27 -18 -78 78 10 -119 58 -28 -46 -50 -106 -14 49 -85 17 7 16 25 32 -68 -11 -64 -19 108 -7 106 -85 14
5943 14 15 -29 29 33 21 12 142 52 17 51 -26 12 24 97 -65 14 105 60 -17 65 -16 35 101 -29 59 124 63 -41 34 -31
5973 -31 -135 134 -78 -69 50 42 -74 -14 -24 28 -5 30 -126 13 18 10 50 108 48 59 66 46 -45 -62 -23 2 28 -9 -43
6002 -43 46 23 -39 -66 -23 -20 -60 -10 30 111 8 -48 3 -42 -88 5 -85 6 46 57 -21 62 -14 30 42 11 12 -3 -2 129 -3
$$ packed form
5797h2Q0M1j16J6R1%P6j35J0rJ2L9K6j18M4J61j68jOJ10j7oJ0j44N7J3l2P2kJ4
5827D8K6op5J1K5q0o0M9L3M4l4m5Q2Pj5N1l8j14J2K2M4J5m0n4M1N0KJ3J7o8L5
5858bl0J26K0J8j97R0k6Km9J65J6j00j4j13R7l4m0P6J7k0m1j5J96j57o9K7M8m8
5886e7M5o9J8J40o4o9K3P4l0Kp8R8K8m8N4m7l6J7K0j38O7M2mj17J53L8p0J11j25
5915b2nRo0J56o8j29J77q6j8mn6R2O3j34J02j0RRPj00N7n3M5J27j15J13j91R9
5943A4Jm4N8Mj2rJ30r0l5L4p7L8J2P3j62P9R1m5p7Q2q1N1O6j30Q8O5o1j04P5o5
5973c1j04K69k12RJ19qj16O0j0N2l3L5j56J39NqM0N8o0J1Pk0r1j7L9K5K6l7l4
6002d3Q9k3o2k7M3Lm0N0M0Q1j03n6N1m5m6R3r0R1M0J1p8Q3p6M4J2l1Jj5JJ31j32
$$ plain form
6033 -3 -15 21 -30 -124 68 43 -88 -29 43 -4 0 36 -20 14 52 89 -4 -118 -142 -20 -57 -103 -71 -41 53 -78 82 -16
6061 -16 -47 -40 30 -55 16 34 126 -28 -91 66 81 120 176 -119 -2 -31 -2 44 -26 0 80 -3 -18 3 -74 2 -91 -28 0
6090 0 22 -16 57 11 71 -71 -23 -102 73 8 -18 -36 100 -28 41 -116 0 -53 -125 -68 -106 -28 82 20 -17 -105 -35
6117 -35 139 71 -16 -37 96 146 -27 -61 12 38 52 -117 80 -75 -43 -33 46 65 58 -55 17 27 101 28 48 -30 45
6144 45 57 -96 -57 2 142 -2 -36 43 19 -23 -2 -39 122 74 -13 -33 -83 24 36 -38 -20 60 174 -15 -3 56 73
6171 73 -29 50 23 0 -5 4 44 -120 10 36 35 1 80 71 40 78 86 48 33 78 -8 80 -1 33 -31 -62 -27 95 54 97 37
6202 37 55 4 13 -99 50 -66 30 15 113 -73 14 -111 -77 60 -83 36 -54 77 -50 32 26 84 -8 114 29 -30
6228 -30 -9 64 -42 69 -11 8 14 -31 -50 115 -5 -98 36 -98 4 14 31 57 87 -71 32 -38 -14 27 11 -42
$$ packed form
6033cj2L6n1r4J92k5j31N9P2m7ML6n6L4L8L7r3j14k4J22l7m6L2L0R4j31J60r8
6061a6l1PP0q5P1J8R2j54o3J57J5L9N6k95J17k9K9M6p0K6Q0q3j5K1p7P6r3O3K8
6090@K2l8P3m6O0j42M8p9J75o5k6j8J36j28O9j57J16n3p2N7l8P8J10o2l7q8P0
6117c5J74o8q7k1J33N0j73l4P3K6J4j69J97j55L2J0P9J9pj13P2J0P4p3K0p8P5
6144D5J2j53L9N9J40j44l4P9k4m2K1l7J61m8q7k0n0J07J2p4J8Q0J14j89J2N9J7
6171G3j02P9k7k3nRM0j64J30K6jl4P9rl1L8Ql8j5M5q6Q8q1L4o4l1L5J22m1M3o0
6202C7J8n1Rj12J49j16R6j5R8j86Q7j25L4J37j43J19r0J31j27Q2oN8r2J22q5n9
6228c0K1P3j06J11q0J9Om5j9J65j20r3J34j34J02J0J7K6L0j58J03p0K4M1j6n3
$$ plain form
6254 -42 -91 11 59 -27 -29 -67 -80 -62 -5 -2 50 65 58 -30 16 36 61 26 49 35 113 10 32 -62 64 -57 40 73 -75
6283 -75 15 42 27 73 87 32 19 -72 46 83 -46 -80 45 25 51 4 31 28 44 -114 -107 36 16 -31 -70 -22 31 47 62
6312 62 37 25 -24 119 32 -62 23 -47 16 21 21 12 36 -35 29 79 -93 64 -65 103 -48 -36 -18 46 -6 6 70 -14 8
6341 8 -24 -26 -139 -57 53 91 -66 -65 40 13 112 38 75 -17 38 15 107 1 -15 -27 -82 171 -34 26 -26 35 99 22
6369 22 17 42 -9 47 38 50 28 28 -11 84 15 -15 15 19 1 -37 4 31 182 -65 48 4 -68 -30 -25 -25 -55 -93 16 37 20
6400 20 18 46 -18 3 66 -88 65 -9 17 -25 -31 19 -36 15 -5 1 25 1 -79 -102 -6 -89 121 -18 -7 -8 -17 -37 7 -52 -8
6431 -8 -39 -42 -36 -14 38 1 -86 -1 30 -40 -46 8 -35 24 32 29 5 -54 -30 62 35 30 23 45 -119 -11 10 5 2 -74 -5 -13 -17 14 -55
6466 -55 -177 51 -15 -11 126 154 170 122 -43 93 -3 -41 -132 159 17 -81 83 37 25 -29 5 73 3 -23 13 43 71
$$ packed form
6254d2m9J02M8q6kl8j3J8N7LN2J5pq8M6K0K5l5K3j4P8j03K2r4J26j21R7L3j48
6283g5R0K7j5M6J4n5j3r1J18L7j29l4J25k0K6m7K7lJ6j58PJ43k0m7l9M8N3J6J5
6312F2k5j2m9J43q7r4Q5p0O3N%rK4p1O4N0j72J57j29J68j51J2J8O4n2J2O4q4K2
6341Hl2kj13Q2J10L8j57JJ05k7R9p4L7r2N5k3R2j06j6j2n5K53k05O0n2O1O4p7
6369B2nK5n1N6rJ2k2%l9R5o9l0L0Mj8l8M1K7J51k47J13m4p2L8N%l0l8J09K1j7
6400B0kK8o4K1O3j54J53p4K6m2oN0n5N1k0OK4k4q0k3R6q3K10j39J1jrk0M4n9M4
6431hl1lOK2N2l7q7Q5L1p0oN4m3N9Qlk4n9K4R2k7npK2j64J08K1nlp6O9qmL1o9
6466e5j22K28o6MJ37K8J6m8j65J36r6l8r1K91j42r8J64m6j2n4L4O8p0k6L6L0K8
$$ plain form
6493 71 -44 36 -88 35 123 83 -71 -90 -67 -7 25 48 16 -55 -11 -15 -33 89 -57 94 63 21 37 -68 -11 -65 44
6520 44 -35 -31 18 -77 90 49 -17 -6 50 -5 -18 125 37 20 86 -28 39 7 33 -31 -29 -35 0 9 -22 38 102 34 -48 27 -119
6551 -119 -56 -22 -77 -43 -5 -17 -96 22 -4 -80 -38 6 55 5 17 22 -100 49 24 -12 -109 6 57 56 15 -25 -2 -22 4
6580 4 -73 71 -46 22 -65 -75 80 -106 27 148 -3 -28 17 82 17 172 -9 -36 -10 -9 36 21 26 -22 -56 28 19 109
6608 109 -29 33 -17 2 93 63 -11 -37 14 -20 122 -8 -11 -48 -8 -39 93 -52 -87 34 -36 50 65 57 -57 70 10
6635 10 -73 -10 -12 -72 -15 -40 17 -4 57 -92 41 5 -14 72 -107 30 -69 85 37 44 -42 11 -7 27 46 -82 -6 0 -2
6664 -2 -18 -139 -68 94 25 40 29 59 -34 49 56 13 -7 -27 55 -52 -49 117 -57 68 -10 -177 -3 34 -57 -50 -87 -65
6692 -65 -28 16 -30 -55 78 -6 18 52 -36 156 63 -44 58 43 -55 -74 146 -121 -72 14 -85 -18 -18 -18 96 -1 87 74
$$ packed form
6493G1j15Q0j24J23Q8m0j54j9K3O0L2K3l2p1M4mj8J22j46J51l1m2J6j05N7n4J09
6520D4p9MM9r5J67m1o6J1N6n5j3J43q8j7O6j14O7l2K6o4KoL5Rl1O0O4o8q2P5j46
6551a19O3L4n5L4L8j2p9J18k6p6M2M4M9n0J2Nj22J49k5l6r7J15N1jm1m0K3k0K6
6580Dp7J44j17O8q7j0J55j86J33J21j51k5M5O5o5J55j81k7K6JM5j5Nm8l4Q4rR0
6608A09j38O2n0J9R1l0p4k6N1l4J42j30ll7M0l1J32j45l5J21p0Q6J5qj14J27o0
6635A0q3O3ko0N7k5N7k1O1j49J33l6j9Q6j79J37r9J54m8Pq6N3j8L4J9j28P6Ok
6664bj6j21P1J62o9J5j1L0r3Q3Pm3k0k0Q2j07LJ66j74J25p8j67J74L7r1Pl7K2
6692f5L7M4m6k5J33q4K4L4q8J92r3j07J02j5r8j9K20k67M9Q6r9O7%%J14r7Q8j3
$$ plain form
6720 74 -17 -46 38 32 111 33 -62 44 6 -34 14 96 -20 -102 -8 68 29 44 -59 -85 29 54 20 10 -99 20 16 13 -42
6749 -42 4 42 -47 -36 48 -13 64 45 12 -36 -49 4 -114 -52 130 -76 91 12 -17 79 -44 -92 -68 76 25 -50 2
6776 2 1 -103 -57 -116 -66 -4 28 109 56 -13 37 -7 -106 -48 83 10 16 -88 -55 -87 9 -11 -69 -16 5 -125 -71 43 -92
6805 -92 18 22 -91 -80 32 -45 77 -15 -27 40 60 27 1 -77 63 65 43 24 -6 -44 2 20 80 -48 -94 61 0 7
6833 7 -52 -20 49 87 24 -21 124 -2 -41 27 -103 9 -15 -2 14 -116 48 81 129 19 -7 -91 85 18 5 95 53
6860 53 -19 66 -5 151 24 -18 24 21 -32 -15 -42 -75 -28 40 33 -11 39 -50 -34 96 72 -98 75 25 15 22 -33 21 32
6889 32 27 -62 56 35 -38 -97 -15 -66 1 53 -7 10 -41 54 26 67 86 -14 90 -83 48 -61 79 -9 -6 31 121 54
6917 54 30 -29 57 -11 -67 44 111 -9 -62 129 16 7 -2 27 -45 -64 -36 -19 49 88 43 49 143 10 93 47 -52 50 -60
$$ packed form
6720G4r1k9Q4oP9p8r5J06l8m0M8Q2j16q2R4P6l9J5j03k6J14K5l4j0j09J19mln5
6749d2M6L8q9J1Q4o1P7j9l3m8j3N3j18O2J82k06J67p9k9R6j23m8K4J44n1p5N2
6776Bjj04M6n9N0O2L2Q1n3o9N0m4r9N8J31p3Oj04L3l2R6k0n8N3K1j30N4J14j35
6805i2J10Mj13J1J12p7J22r2j2O7K0l3k6p8J40Kk2j9l0l8M6J8O0j28m6J55o1P
6833Gn9L2O9L8o3m5J45j26l9O8j30J12k4J3J6j30J64L3M8j10k6q4J76o7j3R0m2
6860E3p2Q5p1J56j27m2M2ln3J7k7l3M7O8pm4N0q9J6J30k4j70J73n0j0Pn5N4J1
6889C2nq9J18k1p3n9Q2n1O7N2o0J7n1R5k8M1J9j00J04j73J31j09J40q8LL7R0o7
6917E4k4n9Q6o8n6J11O7j20n3J91j13rrK9p2j9K8J7O8L9m5OR4j33Q3m6r9J02j10
$$ plain form
6946 -60 -50 -56 -54 -101 4 -29 39 6 3 21 -17 57 -9 36 -12 -40 78 -8 2 121 -44 7 -76 -25 -47 -90 -80 70 70 22
6976 22 -9 -31 80 43 -22 -58 28 8 50 -52 132 -10 -98 118 31 35 42 5 128 -98 -66 -35 28 33 14 -97 15
7003 15 13 -35 33 -19 68 9 47 113 6 5 -6 -74 -49 -145 21 -39 21 66 -4 -88 57 37 61 -11 98 101 -24 -27 55 77
7033 77 -67 44 -61 -64 -30 -4 -23 -76 12 59 10 -26 31 -39 44 64 -28 -25 -6 39 68 30 -26 -14 -103 44 -88 -80 -34
7062 -34 32 4 -50 3 -20 -77 91 5 88 40 -11 62 55 -59 61 50 119 49 51 23 -102 -19 -21 -81 73 -1 -55 -127 -15
7091 -15 88 -42 62 -75 -53 -49 39 32 14 -141 25 23 -55 13 -28 -60 -8 -54 0 92 -24 5 -14 6 12 -21 59 99 83
7120 83 47 126 -74 17 80 9 -52 -18 -82 13 -30 38 -12 -89 -29 7 -55 -30 -71 10 -48 -52 -34 51 20 61 48 48 -68 75
7150 75 -124 -140 74 -81 62 13 37 -69 -35 -21 14 22 -119 -50 65 -62 -69 101 93 90 68 28 108 47 -13 -55 -1 44
$$ packed form
6946f0J0oKm7J05l3O8l3lJ8l8P4o6M5m8k8J18q6J0J19j65N1q3N1k2m3J0J50%m8
6976B2l1k2J11l7o5l6Q6k0M2j02J84j42q8K16q7MPl7J23k26L2L1O3Nj9j11J12
7003A5km8O8n2Q7n9L8O6j07jj1o8K5r6J66o0O0M5p0q4J45k0K4p2J09Lj25lQ2K2
7033G7j44J11j05lL4K6j9n3Q8M7m9l6N7p0Q3K0r2LJ9M5K9l8n6J2q9J47j32QM6
7062c4O6k8n4N3k3n7J68q6Q3m8n1P3pj14J20j1O9p0Kk8j25Q3ko0J54p4n4p2J12
7091a5J03j30J04j37K2MQ8pj8j55J66kp8O8m1l2N2m6N4R2j16K9j9K0Ol3Q0M0j6
7120H3l6P9k00R1O3p1o1L4o4R5m3O8n0p7O0L6o2K5m1Q1n8mJ8Q5l1M1j3%j16J43
7150G5j99j6K14j55J43m9K4j06L4J4L5Qj41O9J15j27pJ70qlk2m0Q0o1o0m2N4M5
$$ plain form
7178 44 -27 74 38 -33 25 -1 -61 105 -3 -84 27 53 22 84 6 -33 -44 98 106 67 9 -72 35 -42 -110 14 -3
7205 -3 -10 -16 -48 -6 16 -18 -83 68 19 -7 38 -67 -92 -67 39 -12 8 15 32 188 22 -27 -39 59 67 52 55 67 -33 -157
7235 -157 -4 12 -1 9 -8 58 11 -33 -13 19 16 27 22 -91 -51 33 102 -131 -6 35 -65 48 -111 32 -203 123
7261 123 -49 66 44 -82 84 49 -39 -13 -14 -59 -106 -19 55 21 4 27 16 -42 -35 -18 63 105 -3 -30 3 -37 -33 -8 2
7290 2 20 24 68 -20 88 -37 -18 -22 -3 -8 54 -6 2 -21 26 -8 90 53 -37 -39 66 -90 9 19 20 -30 -15 64 -30 60 48 42
7322 42 -10 32 -6 26 -10 31 13 113 31 19 52 -22 11 67 -31 25 36 51 -6 -17 -33 -51 44 -17 43 32 -106 44 -154
7351 -154 23 39 70 -34 33 28 91 32 -41 -21 0 61 75 66 46 2 -95 -11 -26 150 54 77 -78 33 -76 -47 27 -14
7379 -14 -49 -1 95 17 -37 21 -96 -79 44 -26 -15 -131 -36 -141 -87 47 -69 -47 22 37 -196 -37 47 19 26 1 27
$$ packed form
7178D4p1J01l6p1N8k6o0J66j08q1J11K6l1O2p8l9j1J42Ql9n8q1J07p7o8J24j7
7205cpol2M2K2l4o5J51m9k6M5j05k5K5J06n1K0PJ7J56j66m9j2R8Qj5LJ2j00j24
7235a57J53J6j3J0j7O6m7m4K0L2lJ1nj13M0Q4O9k33J25M1j00J13j59J43k35L26
7261A23j72J15k2j26J66l5q8K6jm5m7Q7P4l4j7K3j1n8PJ7Q1M2j08k7L3m0MK5J0
7290BJ8MM4q8J08j25J9mJ9nO2o0Qk3M7l4R8l7r0kJ05j56R9J0Jn0J5P9r4R0j2o
7322D2n2M2l8L2l6M1j8J00q2j2L3p4L3N6r8N6J1J5n7j1j6j8R5o1O0j1j38J50j98
7351a54J77J6L1j04O7nO3n9p3K0K1O1J4rk0m4r7Q4j5J76r6K3j55J11j09K9P4m1
7379a4l5M8R6p8n4N8j17J7J23p0J1j16R5j05N4J34j16K2O9J5k33J59Q4k8Pk5K6
$$ plain form
7406 27 17 -72 -16 17 -36 58 21 114 71 105 108 -46 -72 -8 -1 -22 28 4 -139 -8 94 -91 83 16 -79 -40 28 2
7434 2 -6 28 -7 -104 -74 -54 -79 -103 -73 -52 60 -29 -97 97 -59 6 25 -24 34 118 124 105 -18 -5 2 -24 -24 -23 -101 -5 -40
7465 -40 29 -52 -61 52 44 -43 -63 -32 -3 62 12 -61 -34 -112 -109 -23 -26 83 -78 55 17 -32 81 32 36 49 -26 -87 -134 -79
7495 -79 -24 9 10 38 24 80 58 -41 -14 16 -52 13 -14 43 9 -99 -30 -5 -21 -52 113 -6 50 -61 -84 17 51 -70
7523 -70 -34 -17 -8 36 -9 170 72 54 -131 -66 56 33 -58 5 19 31 -93 87 -75 47 89 -81 58 -18 13 -100
7549 -100 24 -107 -31 11 12 -24 -66 -82 -10 -9 20 86 4 -8 -60 -22 -94 -95 -132 -77 2 -41 -80 71 -66 -96 -35 -23 61
7578 61 40 39 2 -86 36 60 6 42 -86 -8 105 28 41 10 55 -81 62 -37 19 -48 -140 -82 20 -36 -9 -34 -58 -79
7606 -79 17 -18 56 -120 -102 -53 -77 -108 -39 -21 63 52 -50 37 -83 12 -12 -42 21 67 -56 -23 64 -9 -122 18 44
$$ packed form
7406B7j0q9N6L3n3R4l7R3m3L4Lj54k6O4Pk1N0k4j43J31J02j85J74o7r5L9O8k6
7434BqL4l5r7L0K0k5k4L0K1J12q9o8J94j56O5J9m9N8Q4Oj9j23J3Pk6%Jp8R6l5
7465d0O9q1rJ13qq7k0L1K9O5n0p3K7p8LQ6lJ09j61J33l8m9J13m9MJ3p5o1m7N5
7495g9N5L3JK8j4N6k2r9K7L0o8O5k7N7l4j08O9K5j6l1J65j19N6j11k3J01L4j21
7523g0L6J7RM4m5J79r8j8j85O5J22k3r1O3J4J2j24J80j62J22M2j70J39p6L1j13
7549a00J24j31P6M2Jl6m2j6P2JK9O6q2j2n2L8p2jl7N5P9m3l9J51j37l0O1J2Q4
7578F1k1jl7q8J22K4n4L6j28P8J13p7J3l1M5j36J43r9N6o7r2N8J02n6K7k5k4k1
7606g9R6l5P4j76J8M9k4l1O9J8Q4j1j02Q7j20R5k4l0O3M6j23L3Q7p3j13J40K6
$$ plain form
7633 44 -32 27 1 1 31 0 -4 40 -123 2 -88 -54 27 -88 50 107 76 -36 -67 -62 -7 -248 -114 68 105 58 58 105
7661 105 20 -49 43 116 -64 27 -36 -101 28 -6 37 46 -72 -98 158 -13 -98 127 -4 -16 103 -38 -9 -53 -52 114
7687 114 20 -41 -9 -41 -72 34 52 -58 -64 44 -46 59 -27 18 -35 17 -78 34 63 -70 69 58 111 -149 16 34
7713 34 88 -83 -17 -87 29 62 40 -22 -23 13 -20 165 9 -77 78 78 20 70 -72 -4 -100 5 -45 -46 -40 -55 -111 120
7741 120 41 -115 20 -30 41 -50 60 36 114 32 125 -69 29 123 65 -21 61 45 -33 17 77 -64 31 45 -1 -59 49
7768 49 153 -5 9 -69 17 84 12 51 -69 9 -39 -18 16 -22 -19 21 -1 -19 20 -12 19 -69 46 -48 -60 110 71 -9
7796 -9 31 -95 -66 102 -12 -54 9 0 30 -81 8 72 -53 5 -29 -20 -22 38 52 -17 54 14 -28 163 160 84 77 24 59 19
7826 19 -8 -44 4 -132 -82 -34 65 -36 10 -23 4 86 33 66 21 17 47 79 42 -3 2 84 -5 -17 -15 -44 55 -10 53 -161
$$ packed form
7633D4p6N9k6%L0l1mM4j63J25r0L4Q1j15J38N7l1j12l1NN5k41J34J82L7m7%M7
7661A05q5o9R2P3j80R1o3o5J29l4M3Rj18k6K56j71q5K25j31j2J19j41K9m4JJ66
7687A14r4o1L2l2l1J06J8j10oJ08r0J05q6M5n3N2r5J12K9j33J39j1N3k60J65J8
7713C4N4j71O6p0J16L3k2o2jL6l3J85j56q6J55%n8N0j42O8r6J05n0jOj5n6K31
7741A20p9j56J35n0P1r1J10k4P8q2R3j94R8R4n8q6Q2j6p8N0O0j41R5J4m6n8J08
7768D9J04j58J4p8Q6O7p2L9j20P8m8K1L4l8LM0k2j8L9l2L1q8J15r4j2J70l9q0
7796iM0j26K9J68j14m2O3rL0j11Q9O4j25N8l4RkO0J4o9P1m0m2J91lp6pn3L5m0
7826A9k7l6M8j36N0M8R9j01M6l3K7Q2n3L3m5mL0L2l7m5NQ2q9j2Kk9R9o5O3k14
$$ plain form
7856 -161 -21 39 0 63 -112 -27 14 25 101 -18 -100 -100 61 -96 53 -1 -33 -20 47 61 27 88 72 14 -79 -52 -55 -108
7884 -108 -10 -49 30 23 -17 50 51 13 -8 89 -81 -132 94 -47 -46 41 -57 -19 27 -107 -20 -47 -138 -73 64 67 68 -14 21 68
7914 68 14 17 89 63 27 -30 89 35 36 -33 44 37 -29 70 30 -11 43 39 -16 117 47 9 -7 -54 -44 -19 -65 23 11 36 95
7945 95 -20 26 131 -84 94 -11 35 27 -12 -66 -63 40 -45 147 -18 -83 9 134 -20 -102 49 13 -39 -73 -66 -30
7971 -30 63 38 -35 -3 -19 -115 -34 -93 -23 -120 74 -72 -17 85 -82 -47 80 -45 -118 -45 36 5 18 44 -22 31 12
7998 12 -25 15 -68 -11 95 40 -60 -71 25 -15 -100 40 90 23 -2 43 -66 -35 80 90 -5 64 57 -28 105 -34 88
8025 88 -44 -68 15 -26 82 -37 -43 -31 -72 35 17 77 -42 8 -114 1 -80 2 -62 1 30 56 121 -70 -14 71 -52
8052 -52 -128 5 110 -26 -50 -9 77 32 1 -38 -86 68 7 14 66 59 -3 -123 67 61 56 111 34 127 -6 5 -43 -78 -36
$$ packed form
7856a61J40O0l9O3j75Q5M1J1P6j19q2%J61j57J49n4l2J3O7J4l4O1j6n8r3K7ln3
7884a08R8l9P9pm0O7Jl8k1R7j70n1K26j41JQ7r8L8M6j34Q7k7r1O5J37LJq2L5M7
7914F8n4LP2k6l6n7J19n4Jo9P7po6R9m0m1N4mn5J33p0l8j6m7J0K5m6Q8j2K5N9
7945I5j15M6J05k15J78j05M6ql9n4LJ03q5J92j65o5R2J25j54q2J51l6n2l4PL6
7971c0R3k5p3L2j6r6Q1n9P0r7J94j46N5J02j67L5J27j25p3P3Q1l1J3K6o6N3j9
7998A2l7M0q3N7J06n5j00j1R6m0q5J40N0o7k5M5j09L1J15J0r5O9pq5J33j39J22
8025H8j32k4Q3m1J08j19oJ2m1J07j8O0j19N0j22J15q1Q2o4O3K9K6O5j91N6Q5j23
8052e2p6J33J05j36k4M1Q6m5l1l9m8J54o1PN2po2j20J90onN5p7R3j33J1m8l5M2
$$ plain form
8081 -36 28 -5 21 90 -59 8 -38 -5 69 91 14 28 -24 33 13 49 -70 15 77 -28 -18 37 -35 1 -66 -59 -77 39 6
8110 6 0 -8 -81 92 2 -24 -55 -96 -29 135 10 -42 65 170 -55 76 -51 29 -40 -37 18 -48 -51 -11 -4 -45 -11 -77 136
8139 136 -7 18 34 -2 0 55 -59 -4 21 23 44 32 -46 -2 -56 51 -43 139 -4 38 -57 4 -19 -69 44 19 -38 -53
8167 -53 34 -20 -12 35 -10 35 79 106 -64 -19 -37 -2 -59 18 -15 -38 -57 -74 93 65 108 -9 -9 30
$$ packed form
8081c6O4l3K6O9j49O7m6L3P4K2p7J4n2N7k0L6j19Q5O2j05J0N5p2L6o7Pj8J16l3
8110Foqp3J73r0k6l1m1O7J64j25n2J07J05k25J31j27Q0o9LN5o6lM0Pm1L4o6K13
8139A36j43K5J6l6KN5j14N5K5KK1j2p8M4n4J07r4J82j43M2r5O1k3n0J13k5n7j5
8167e3Q7n4QM7m5M5M4K7j70M5j8L5n7P7l3k3j9j7J67k8M3j17%L9
8191C0
$$ Imaginary data points
##PAGE= N=2
##DATA TABLE= (X++(I..I)), XYDATA
$$ plain form
0 0 0 0 0 0 0 0 0 8 0 8 -8 8 -16 16 -24 32 -40 48 -56 72 -88 104 -120 144 -168 192 -224 259 -298 344 -392
31 -392 448 -508 576 -650 731 -822 922 -1027 1147 -1277 1419 -1573 1741 -1926 2128 -2348
47 -2348 2588 -2853 3143 -3462 3814 -4204 4640 -5130 5680 -6304 7024 -7864 8852 -10041
61 -10041 11502 -13346 15758 -19061 23881 -31593 45925 -81493 355748 327789 -567046 -181084
73 -181084 341670 268193 -75386 -34908 -61002 -38175 216454 256240 -167381 -227235 134038
84 134038 280526 61383 -109219 -112926 63364 220056 117399 -129373 -85427 118259 119131
95 119131 33092 34095 -59077 -63182 171179 181060 -136479 -134347 171756 136519 -92563 14998
107 14998 110773 -79533 -30552 214621 40497 -196799 55041 227939 -68298 -146767 163756
$$ packed form
0@%%%%%%%QqQj6J6k4L2m0N6p2Q8j04J28j60J92k24K64l12L60m16M83n57O42p36
31c92Q40r56J084j226J381j553J744j949K174k424K696k992L314l667M054m476
47b348M936n441N996o605P276q018Q844r770J0810j1984J3328j4888J6716j8893
61a0041K1543k4848K9104l4819M2942n5474P7518j27418M37241k7959q94835L85962
73a81084N22754p3477l43579M0478k6094K2827K54629L9786m23621n9854L61273
84A34038J46488k19143j70602l707J76290J56692j02657k46772M3946K03686Q72
95A19131q6039J003r3172m105K34361R881l17539K132L06103l5237k29082J07561
107A4998R5775j90306M8981K45173j74124k37296K51840J72898k96237p8469L10523
$$ plain form
118 163756 139236 -162513 -59566 196413 61592 -129274 -26657 90868 58812 9831
128 9831 -33619 -48037 42736 95781 -3837 -48532 17012 4237 2150 85655 16458 -121859
140 -121859 -5836 146766 12189 -114201 8726 54985 -41862 28031 87566 -100219 -126556
151 -126556 131267 136175 -124880 -116546 87924 58605 -50506 8064 2771 -85040 18461
162 18461 119209 -39613 -142440 11560 100147 -10644 -69673 -19273 -4235 -595 16294
173 16294 -22524 -37797 6548 -12178 -35055 30385 20134 -88790 -51093 86414 30321 -110166
185 -110166 -47847 51272 -9083 -33743 13958 -42887 -78410 35727 62787 -76090 -92529
196 -92529 40438 37098 -59457 -30151 9078 -39828 -22344 36670 -13639 -76628 -24168 30933
$$ packed form
118A63756k4520l01749J02947K55979j34821j90866J02617J17525l2056m8981
128I831m3450j4418R0773N3045r9618m4695O5544j2775k087Q3505o9197j38317
140a21859J16023J52602j34577j26390J22927M6259r6847O9893N9535j87785k6337
151a26556K57823M908k61055Q334K04470k9319j09111N8570n293q7811J03501
162A8461J00748j58822j02827J54000Q8587j10791n9029N0400J5038L640J6889
173A6294l8818j5273M4345j8726k2877O5440j0251j08924L7697J37507n6093j40487
185a10166O2319R9119o0355k4660M7701n6845l5523J14137K7060j38877j6439
196i2529J32967l340r6555K9306L9229m8906J7484N9014n0309o2989N2460N5101
$$ plain form
208 30933 -5025 -35583 -27667 -35094 -12749 24960 -20291 -67226 -18970 22416 -7477 -32956
220 -32956 -29685 -28555 -2597 29942 -21654 -80418 -10104 52287 -22091 -68526 -4872 18607
232 18607 -28435 -30136 -97 -21486 -31904 10439 648 -46594 -21734 15529 -9882 -29859
244 -29859 -7692 867 -18113 -16613 -295 -11448 -18747 -4287 -5468 -12738 -13530 -18174 -7378 5840
258 5840 -10437 -27524 -10555 11644 -5412 -27348 -4356 10897 -9668 -11266 -877 -9448 -7811
271 -7811 8316 3554 -20457 -15513 14422 4906 -23028 -7872 11851 -1374 -13610 -4957 5671
284 5671 -1005 -6975 5118 5594 -6374 -3377 5191 6743 1332 -3147 3408 4017 -2169 3280 4358
299 4358 -2116 1143 7003 5223 -5535 -4879 14702 13579 -6358 -2831 12565 12208 845 -344
$$ packed form
208C0933l5958l0558P916p427K2345L7709m5251m6935M8256M1386k9893k5479
220c2956L271J130K5958L2539n1596n8764P0314O2391p4378m6435O3654K3479
232A8607m7042j701L0039k1389j0418M2343r791m7242K4860L7263k5411j9977
244b9859K2167Q559j8980J500J6318j1153p299J4460j181p270p92m644J0796J3218
258E840j6277j7087J6969K2199j7056k1936K2992J5253k0565j598J0389q571J637
271g811J6127m762k4011M944K9935r516k7934J5156J9723j3225j2236Q653J0628
284E671o676n970J2093M76j1968K997Q568J552n411m479O555O09o186N449J078
299D358o474L259N860j780j0758O56J9581j123j9937L527J5396l57j1363j189
$$ plain form
313 -344 12509 11311 937 6253 7878 1779 6968 11768 6309 -807 3360 13360 6676 -1284 9763
328 9763 13195 4712 3340 8345 12806 8534 4417 12208 12386 4092 5206 10504 12285 6300 2950
343 2950 11467 9299 447 8070 12798 5038 4898 11682 9960 745 6882 20627 8474 -2672 12538
358 12538 16446 4149 4350 10845 9239 5927 9479 7937 -1651 5817 16322 5417 904 7835
372 7835 5100 5948 12661 7754 -529 6292 16934 6797 -2181 10380 8901 -756 13343 13655 -9736
387 -9736 -5096 19710 13674 -9183 -1160 13166 -863 858 18368 -975 -14445 15154 22243
400 22243 -6580 -9034 12131 7374 -2254 14083 6449 -22134 367 29917 664 -20094 2041
413 2041 7972 -2025 8018 7379 -20999 -9765 32801 12599 -29072 -6463 16826 1741 5491
$$ packed form
313c44J2853j198j0374N316J625o099N189M800n459p116M167J0000o684p960J1047
328I763L432q483j372N005M461m272m117P791J78q294J114N298J781n985l350
343B950Q517k168q852P623M728p760j40O784j722r215O137J3745j2153j1146J5210
358A2538L908j2297K01O495j606l312L552j542r588P468J0505j0905m513O931
372G835k735Q48O713m907q283O821J0642j0137q978J2561j479r657J4099L12k3391
387i736M640K4806o036k2857Q023J4326j4029J721J7510j9343j3470K9599P089
400B2243k8823k454K1165m757r628J6337p634k8583K2501K9550k9253k0758K2135
413B041N931r997J0043o39k8378J1234M2566k0202m1671K2609K3289j5085L750
$$ plain form
426 5491 8804 -21946 -19257 31461 24805 -35743 -24717 26396 7768 -15567 5531 -6234 -25751
439 -25751 14364 32887 -21341 -37966 16154 23674 -13191 -2784 2335 -26165 2794 38198
451 38198 -13886 -47709 10077 32773 -19105 -22232 12825 -11445 -21248 26954 9299 -44781
463 -44781 -8691 32815 -7597 -23301 12965 -1666 -29769 14734 27383 -36539 -27160 33520
475 33520 934 -35689 11078 13344 -40324 -11403 43363 -7765 -52631 7354 28016 -20617
487 -20617 -6983 14562 -28011 -18124 39515 6587 -50288 -5779 32893 -15198 -17529 22826
499 22826 -21594 -45217 37365 41280 -55178 -45204 39024 22121 -27909 -4530 -1252 -28108 18883
512 18883 42145 -39365 -49977 36594 30728 -31354 -10016 9646 -29273 -2296 52309 -15678
$$ packed form
426E491L313l0750K689N0718o656o0548J1026N1113j8628k3335K1098j1765j9517
439b5751M0115J8523n4228j6625N4120P520l6865J0407N119k8500K8959L5404
451C8198n2084l3823N7786K2696n1878l127L5057k4270r803M8202j7655n4080
463d4781L6090M1506m0412j5704L6266j4631k8103M4503J2649o3922R379O0680
475C3520l2586l6623M6767K266n3668K8921N4766n1128m4866N9985K0662m8633
487b0617J3634K1545m2573R887N7639l2928n6875M4509L8672m8091k331M0355
499B2826m4420k3623Q2582L915r6458R974Q4228j6903n0030K3379L278k6856M6991
512A8883K3262q1510j0612Q6571n866o2082K1338J9662l8919K6977N4605o7987
$$ plain form
524 -15678 -74081 16550 60838 -24438 -40133 16185 1721 -14805 27420 8256 -51871 -5985
536 -5985 54316 -4005 -40067 11656 5665 -23749 24553 26106 -52346 -30607 59265 20135 -58915
549 -58915 -6983 39895 -15454 -15840 31533 -8519 -37798 24284 33608 -27405 -15754 24867 -9139
562 -9139 -15987 35626 2665 -52577 10753 51816 -21529 -36996 26213 12020 -27667 17585
574 17585 28436 -40135 -20231 53909 12224 -42873 5344 24655 -15258 5073 28911 -25980
586 -25980 -32298 43531 30135 -45562 -14159 36630 -5120 -14515 27814 -2788 -39283 20502
598 20502 48557 -22360 -35880 26741 20770 -13291 10182 4555 -27740 13107 42964 -18832
610 -18832 -39532 25769 29940 -24535 -4801 25063 -17213 -14505 39177 8804 -39305 6205
$$ packed form
524a5678n8403R0631M4288q5276j5695N6318j4464j6526M2225j9164o0127M5886
536e985O0301n8321l6062N1723n991k9414M8302J553p8452K1739Q9872l9130p9050
549e8915N1932M6878n5349l86M7373m0052k9279O2082R324o1013J1651M0621l4006
562i139o848N1613l2961n5242O3330M1063p3345j5467O3209j4193l9687M5252
574A7585J0851o8571J9904P4140m1685n5097M8217J9311l9913K0331K3838n4891
586b5980o318P5829j3396p5697L1403N0789m1750r395M2329l0602l6495N9785
598B0502K8055p0917j3520O2621n971l4061K3473n627l2295M0847K9857o1796
610a8832k0700O5301M171n4475J9734K9864m2276K708N3682l0373m8109M5510
$$ plain form
622 6205 37536 -9595 -16696 22559 1783 -22144 23291 24432 -32171 -12348 35871 2713 -24208
635 -24208 11972 13298 -19936 3650 29038 -13311 -22918 26039 16281 -21801 3153 19908 -11307
648 -11307 -6547 23513 1442 -22140 10180 18516 -16414 -3204 22047 -11521 -19463 24341 15871
661 15871 -26775 -7056 27100 1205 -16549 12197 7101 -16992 9963 22241 -16445 -16390 19827
674 19827 10617 -15317 -444 9870 -10679 -2854 18971 -5349 -21031 10571 15903 -9573 -5292
687 -5292 7237 -3705 -1945 15265 770 -20661 4334 21325 -7605 -13811 7972 2076 -7559
700 -7559 6217 4203 -15159 -4275 18286 28 -18838 4113 12077 -8081 -3084 9269 -3491
713 -3491 -8633 7206 7285 -9352 -4996 7814 -1763 -6280 4520 -1950 -9168 3448 5849 -6853
$$ packed form
622F205L1331m7131p101L9255k0776k3927M5435J141n6603J9823M8219l3158k6921
635b4208L6180J326l3234K3586K5388m2349r607M8957r758l8082K4954J6755l1215
648a1307M760L0060k2071k3582L2320Q336l4930J3210K5251l3568p942M3804q470
661A5871m2646J9719L4156k5895j7754K8746n096k4093K6955J2278l8686N5L6217
674A9827r210k5934J4873J0314k0549P825K1825k4320j5682L1602N332k5476M281
687e292J2529j0942J760J7210j4495k1431K4995J6991k8930o206K1783n896r635
700g559J3776k014j9362J0884K2561j8258j8866K2951P964k0158M997J2353j2760
713c491n142J5839P9j6637M356J2810r577m517J0800o470p218J2616K401j2702
$$ plain form
727 -6853 -6645 4092 2054 -5041 1144 2204 -6233 1389 6970 -5813 -6130 6139 2262 -7545 -2256
742 -2256 4871 -3390 -7023 3676 994 -8158 -182 3679 -4753 -3442 3277 775 -4891 -605 4167
757 4167 -2590 -3885 3365 227 -4025 -361 28 -1842 -1789 -1814 -1560 -1426 -287 -1971 -4275 1036 2614
774 2614 -3509 -2386 1513 84 -246 -259 -742 -1338 38 2195 -2413 -4857 1678 1613 -3678 -2560 -480
791 -480 -403 -1553 -1393 302 -1530 -1530 1860 -237 -1488 544 196 580 234 -1252 -210 -481 -175 408
809 408 -2179 -1416 56 -851 -155 -1490 -2278 1214 1114 -1397 -1291 361 2420 303 -1503 1473 526
826 526 -588 1655 -93 -1596 -4 712 -94 -2263 -840 1715 -1314 -1191 1564 -778 -851 1409 916
843 916 531 261 941 1242 87 1668 344 -2045 2189 1900 -2871 -604 1640 -399 -1073 447 1068
$$ packed form
727f853K08J0737k038p095O185J060q437P622N581j2783l17J2269l877r807N289
742b256P127q261l633J0699k682r152P976L861q432J311O719k502n666M286M772
757D167o757j295P250l138m252L664L89j870N3k5K54J34J139j684k304N311J578
774B614o123J123L899j429l30j3m83n96J376K157m608k444O535o5n291J118K080
791d80P7j150J60J695j832%L390k097j251K032l48L84l46j486J042k71L06N83
809D08k587P63J472r07O96j335p88L492j00k511J06J652K059k117j806K976r47
826E26j114K243j748j503J592P16q06k169J423K555l029J23K755k342p3K260m93
843I16l85k70O80L01j155J581j324k389M234k89m771K267K244k039o74J520O21
$$ plain form
860 1068 -1738 -96 3842 -1065 -2185 4418 1627 -2468 2092 3330 -1127 -1429 3653 2044 -4388
875 -4388 664 4509 -3278 -2013 4009 -922 -3269 2642 2923 -2975 -1104 5766 965 -4062 3899
890 3899 3582 -3564 2286 4420 -3516 -1889 5658 1221 -5984 760 5816 -3966 -3182 6458 -1358 -5675
906 -5675 6291 4676 -6632 -1104 8393 483 -5885 5148 5010 -7136 1422 9076 -5409 -6171
920 -6171 7618 2931 -7485 306 6042 -4845 -3695 9153 -380 -9784 5936 8251 -7092 -1604
934 -1604 8581 -1439 -5990 7155 5440 -10181 -1221 10970 -3893 -7588 7541 396 -9505
947 -9505 5111 8936 -9364 -7313 12077 3702 -11133 3703 8341 -9209 -681 13631 -4199
960 -4199 -13077 7795 10525 -9237 -5242 8075 -3962 -6388 11152 511 -16263 3728 14341
$$ packed form
860A068k806J642L938m907j120O603k791m095M560J238m457l02N082j609o432
875d388N052L845p787J265O022m931k347N911K81n898J871O870m801n027P961
890C899l17p146N850K134p936J627P547m437p205O744N056r782P84R640p816m317
906e675J1966j615j1308N528R497p910o368J1033j38j2146Q558P654j4485p62
920f171J3789m687j0416P791N736j0887J150J2848r533r404J5720K315j5343N488
934a604J0185j0020m551J3145j715j5621Q960J2191j4863l695J5129p145r901
947i505J4616L825j8300K051J9390q375j4835J4836M638j7550Q528J4312j7830
960d199q878K0872K730j9762L995J3317j2037k426J7540j0641j6774J9991J0613
$$ plain form
973 14341 -6556 -9181 8252 2045 -8416 7933 8592 -15184 -4936 18710 496 -15351 3267
986 3267 6872 -7501 587 9111 -10088 -11490 15058 7859 -17341 -1797 12852 -5559 -5141 11832
1000 11832 -1806 -15186 7954 16131 -11586 -11930 12337 2210 -10598 6610 4061 -14784 -216
1013 -216 15663 -5283 -14582 7782 6997 -11094 3286 11473 -13059 -8281 18803 4152 -17718
1026 -17718 1178 12332 -7135 -5332 12042 -4789 -16199 11225 12796 -15621 -7575 12161
1038 12161 -1779 -7658 9590 1851 -16734 3758 20177 -7986 -16312 10619 7133 -9388 3577
1051 3577 6220 -13125 -4438 17345 559 -19061 2277 11849 -7403 -1855 8886 -9596 -9244
1064 -9244 16737 8016 -18230 -4272 16299 -995 -9266 8578 34 -13798 8442 14240 -13586
$$ packed form
973A4341k0897k625J7433o207j0461J6349O59k3776J0248K3646j8214j5847J8618
986C267L605j4373Q088Q524j9199j402K6548p199k5200J5544J4649j8411M18J6973
1000A1832j3638j3380K3140Q177k7717l44K4267j0127j2808J7208k549j8845J4568
1013b16J5879k0946r299K2364p85j8091J4380Q187k4532M778K7084j4651k1870
1026a7718J8896J1154j9467J803J7374j6831j1410K7424J571k8417Q046J9736
1038A2161j3940n879J7248p739j8585K0492J6419k8163q326K6931l486j6521J2965
1051C577K643j9345Q687K1783j6786j9620K1338R572j9252N548J0741j8482L52
1064i244K5981q721k6246J3958K0571j7294q271J7844q544j3832K2240N798k7826
$$ plain form
1077 -13586 -12092 12333 5415 -10390 2036 5271 -11215 350 16618 -5705 -15885 9494
1089 9494 10805 -8881 -2054 8208 -5600 -6335 12975 3457 -16675 388 13333 -5449 -6735
1102 -6735 7119 -2479 -8838 8643 8919 -12495 -6517 14086 1914 -10195 5895 4553 -10023
1115 -10023 2603 12568 -6531 -11939 8205 8104 -8948 -2088 6967 -6368 -3776 11424 -726
1128 -726 -12327 3846 10052 -4395 -4476 6505 -1162 -6079 8670 5399 -12294 -1658 11732 -1617
1142 -1617 -7690 3908 1961 -6520 2601 7765 -7475 -7242 10172 3931 -8672 1301 5673 -4274
1156 -4274 -520 7792 -1460 -8281 4661 7843 -6307 -3876 6040 -1700 -4227 5097 1149 -7388
1170 -7388 285 7340 -1991 -5568 4303 2509 -4498 3187 4582 -5460 -1561 6873 192 -5544 1756
$$ packed form
1077a3586J494K4425o918j5805J2426L235j6486J1565J6268k2323j0180K5379
1089I494J311j9686O827J0262j3808p35J9310r518k0132J7063J2945j8782j286
1102f735J3854r598o359J7481K76k1414N978K0603j2172j2109J6090j342j4576
1115a0023J2626R965j9099n408K0144j01j7052O860R055j3335K592J5200j2150
1128g26j1601J6173O206j4447q1J0981p667m917J4749l271j7693J0636J3390j3349
1142a617o073J1598j947q481R121N164j5240K33J7414o241j2603R973M372r947
1156d274L754Q312r252o821J2942L182j4150K431R916p740k527R324l948q537
1170g388P673P055r331l577R871j794p007P685J395j0042L899Q434o681n736P300
$$ plain form
1185 1756 3829 -4011 -1393 5369 -2652 -5686 4792 3250 -5345 -816 4181 -858 -2431 3594 1689
1200 1689 -4402 1481 5323 -2968 -2584 3584 64 -2870 1344 1597 -3152 -1447 3459 -627 -4073
1215 -4073 2156 2111 -2986 671 2742 -1556 -1281 2665 1476 -2438 -21 3156 -1531 -1862 2759 -582
1231 -582 -3008 1147 1444 -2033 -1642 1620 468 -2190 571 1962 -1635 -149 2339 -504 -652 1218
1247 1218 582 -466 -167 934 -728 -1338 1243 -250 -2139 642 447 -1444 -116 634 -92 -831 473
1264 473 1398 -848 -448 2073 -92 -1040 1122 231 -485 -310 -29 17 -1140 -128 427 -1546 -309 700
1282 700 -759 -222 268 -42 374 84 455 469 -325 832 326 -698 556 -160 -720 357 -494 -860 -258
1301 -258 -161 97 -1024 -488 1086 -613 -545 996 -75 -129 715 454 325 -507 247 798 -905 -356 373
$$ packed form
1185A756K073p840K618O762q021l034J0478j542q595M529M997n039j573O025j905
1200A689o091N883L842q291L84O168l520k934M214K53m749J705M906m086l446
1215d073O229m5n097L657K071m298K75L946j189l914K417L177m687l31M621l341
1231e82k426M155K97l477L91L262j152k658K761J391l597J486K488k843j48J870
1247A218o36j048K99J101j662o10K581j493j889K781j95j891J328P50p26p39J304
1264D73R25k246M00K521k165r48K162q91p16J75K81M6j157J012N55j973J237J009
1282G00j459N37M90l10M16k90L71J4p94J157n06j024J254p16n60J077q51l66O02
1301b58R7K58j121N36J574j699O8J541j071n4Q44k61j29q32P54N51j703N49P29
$$ plain form
1320 373 -974 -176 -28 -899 -108 -268 -88 -20 -265 716 31 -340 1318 96 -674 909 419 -459 187
1339 187 148 -283 -822 22 603 -1623 -535 1097 -1074 -661 1033 -217 -728 509 1126 -124 -961 1195
1357 1195 1176 -1304 694 884 -1386 285 1009 -851 -1149 29 707 -1060 -683 1082 -1157 -904 2357
1374 2357 44 -2003 1168 1812 -516 -650 1246 478 -1719 1119 1718 -2788 -959 2399 -719 -1875
1390 -1875 910 321 -1696 95 2422 -994 -2338 2702 1750 -2333 812 1927 -1610 -391 2397
1405 2397 -151 -2916 588 2560 -2122 -1546 2226 -1312 -2210 2741 850 -3401 -130 3490 -287
1420 -287 -2380 2372 1475 -2950 1674 3688 -3257 -2234 3692 779 -3288 191 1898 -2451 -1117
1435 -1117 3731 -1420 -4394 3052 3124 -3355 -605 3080 -910 -1469 3463 1293 -4575 634 5220 -2273
$$ packed form
1320C73j347P98J48q71P91j60J80O8k45R81o85l71J658j222p70J583m90q78O46
1339A87l9m31n39Q44N81k226J088J632k171M13J694j250n11J237O17j250q37K156
1357A195j9k480J998J90k270J671P24j860k98J178O78j767L77J765k239K53L261
1374B357k313k047L171O44k328j34J896p68k197K838N99m506J829L358l118j156
1390a875K785n89k017J791K327l416j344N040r52m083L145J115l537J219K788
1405B397k548k765L504J972m682N76L772l538q98M951j891m251L271L620l777
1420b87k093M752q97m425M624K014o945J023N926k913m067L479J707m349J334
1435a117M848n151k974P446P2o479K750L685l990n59M932k170n868N209M586p493
$$ plain form
1451 -2273 -3365 3020 84 -3184 1963 2146 -4147 -1977 4810 485 -4739 1754 2860 -3394 635
1466 635 4338 -2776 -3328 4484 2690 -4458 -953 4187 -2058 -2672 4259 -739 -5714 2413 4352 -3704
1482 -3704 -2839 3655 419 -3154 3007 2752 -5252 -176 6704 -1675 -4743 3102 2121 -3669 623 3603
1498 3603 -3820 -3853 5367 1874 -6403 237 4243 -2595 -1197 3904 -1244 -4070 3762 4559 -4618 -2418
1514 -2418 5219 -615 -3452 3663 646 -5774 1395 5489 -3239 -5125 3624 2467 -4420 898 3549
1529 3549 -4310 -1468 6517 -250 -5479 2133 4203 -2887 -1300 4014 -2122 -4329 4794 2572 -6653
1544 -6653 -945 5070 -1555 -3269 2808 797 -4390 1836 5063 -3665 -3443 5160 1125 -3808 2062
1559 2062 2150 -4000 -157 5105 -1739 -5636 2878 3619 -4613 -786 3876 -2880 -2784 4799 1361 -5067
$$ packed form
1451b273j092O385k936l268N147J83o293K170O787m325n224O493J106o254M029
1466F35L703p114n52P812j794p148L505N140o245o14O931m998m975Q127J939q056
1482c704Q65O494l236l573O161k55q004N076O880q379l068P845r81n790M292K980
1498C603p423l3R220l493q277O640M006o838J398N101n148k826P832P97r177K200
1514b418P637n834k837P115l017o420P169M094q728j886Q749j157o887N318K651
1529C549p859K842P985o767n229P612K070p090J587N314o136k207R123k222r225
1544f653N708O015o625j714O077k011n187O226L227q728K22Q603m035m933N870
1559B062Q8o150L843N262o844l897Q514P41q232L827M662o756R6P583l438o428
$$ plain form
1575 -5067 332 5121 -1327 -2974 3422 307 -3876 3135 3187 -4718 -1772 4401 -59 -3892 1383
1590 1383 1805 -3884 161 4578 -2761 -3791 4187 2224 -3537 202 2965 -1778 -1381 4043 -27
1605 -27 -4778 1953 3972 -3351 -2014 3032 -1028 -2815 2387 1800 -3918 -999 4654 -456 -3645 2371
1621 2371 1741 -2582 1073 2802 -2097 -2077 3054 992 -3463 116 2321 -2329 -962 2964 -1469 -3017
1637 -3017 2217 2280 -2534 -1067 2867 -260 -2040 2561 1146 -3291 809 3339 -1720 -2086 1785 581
1653 581 -2179 395 1750 -2397 -1560 3190 -49 -2872 1140 1807 -1365 -203 1915 -401 -1650 1675
1669 1675 1821 -2158 -496 1952 -972 -1048 1323 -469 -1899 570 1484 -1481 -1524 1709 437 -1688
1685 -1688 1324 1203 -1566 246 2064 -313 -1280 724 1330 -1065 -542 1447 -970 -1329 1358 131
$$ packed form
1575e067N399M789o448j647O396l115m183P011N2p905K946O173m460l833N275
1590A383M22n689M045M417p339j030P978j963n761L739K763m743L97N424m070
1605b7m751O731K019p323J337N046m060j787N202n87n718K919N653n110l189O016
1621B371o30m323L655J729m899K0N131k062m455L579K205m650J367L926m433j548
1637c017N234O3m814J467L934l127j780M601j415m437M100K530n059l66L871j204
1653E81k760K574J355m147Q37M750l239k823M012O67l172J162K118k316j249L325
1669A675J46l979J662K448k924p6K371j792j430K469R14k965m3L233j272k125
1685a688L012j21k769J812J818k377r67K004O06k395N23J989k417l59K687j227
$$ plain form
1701 131 -1665 46 894 -456 -600 879 419 -1061 768 1413 -1044 -272 1378 -217 -545 407 157
1718 157 -724 -202 648 -680 -1317 805 261 -1265 274 615 -502 -211 842 395 -782 163 1355
1735 1355 -339 -636 863 -1 -688 315 164 -674 -491 131 134 -746 -27 465 -630 114 723 -353 133
1754 133 647 128 -86 2 507 1 -400 486 -50 -993 296 77 -768 -108 -44 -59 -335 -2 569 -219 -189
1775 -189 775 131 -180 542 77 67 100 83 206 -411 -223 188 -549 -180 38 -341 -102 -45 -279 147 49 291
1797 291 162 -1 506 173 -202 616 -6 -314 210 16 -317 -235 -197 33 -583 -306 394 -445 -287 445 -77
1818 -77 -70 360 247 213 4 426 442 -315 134 263 -458 90 -60 -484 -45 -72 -303 -249 -79 264 -165 -214 729
1841 729 -113 -236 715 230 -236 253 281 -40 -381 290 232 -838 -93 520 -641 -436 456 -152 -419 174
$$ packed form
1701A31j796J711Q48j350j44J479m60j480J829O45k457P72J650j595l28R52k50
1718A57q81N22Q50j328o37K122n44j526J539L41j117K91J053m47j177R45J192
1735A355j694k97J499q64o87J003j51q38J83O22Lq80P19M92j095P44O09j076M86
1754A33N14n19k14Q8N05n06m01Q86n36r43J289k19q45O60O4j5k76L33N71p88L0
1775a89R64o44l11P22m65j0L3j7J23o17J88M11p37L69K18l79K39N7k34M26r8K42
1797B91j29j63N07l33l75Q18o22l08N24j94l33Q2L8K30o16K77P00q39J58P32n22
1818g7PM30j13l4k09M22J6p57M49J29p21N48j50m24M39k7k31N4J70L43m29m9R43
1841G29q42j23R51m85m66M89K8l21l41O71n8j070P45O13j161K05Q92o08k67N93
$$ plain form
1861 174 355 -167 -248 699 300 -495 576 448 -555 258 413 -380 -379 172 87 -753 -377 580 -787 -503
1881 -503 793 -297 -707 692 565 -351 -180 781 274 -635 602 658 -1175 -60 997 -682 -788 434
1899 434 111 -739 -185 717 -495 -790 1244 332 -984 592 787 -572 181 864 -103 -738 627 813
1917 813 -1162 -437 1138 -896 -893 987 -157 -1291 336 1041 -595 -923 1157 537 -1063 804 1244
1934 1244 -1325 -87 1521 -269 -1089 449 835 -1100 -460 1218 -861 -1354 1436 480 -1633 230
1950 230 1239 -465 -415 1193 321 -1327 774 1706 -1309 -796 1549 -305 -1222 733 316 -1510 -263
1967 -263 1475 -602 -1787 1110 870 -1557 489 1367 -1189 -560 1708 469 -1528 257 1635 -868
1983 -868 -853 1418 -493 -1652 1148 663 -1854 -469 1418 -182 -1136 937 685 -1484 541 2133
$$ packed form
1861A74J81n22q1R47l99p95J071j28j003Q13J55p93JN51q5q40L76R57j367K84
1881e03J296j090m10J399j27r16J71R61n07r09J237N6j833J115J057j679j06J222
1899D34l23q50N54R02j212k95K034r12j316J576J95j359P53O83r67o35J365J86
1917H13j975P25J575k034LJ880j144j134J627P05j636l28K080o20j600J867M40
1934A244k569J238J608j790q20J538L86j935O40J678k079m93K790r56k113J863
1950B30J009j704N0J608q72j648K101R32l015N13K345j854r17J955m17j826J247
1967b63J738k077j185K897k40k427K046Q78k556O29K268j239j997J785J378k503
1983h68J5K271j911j159K800m85k517J385J887j600r54K073k52k169K025J592
$$ plain form
1999 2133 -1128 -1331 1725 649 -1255 237 996 -1148 -808 1607 -227 -2115 782 1262 -1543 -287
2015 -287 1204 -568 -892 1300 978 -1808 -165 2138 -499 -1250 1390 8 -1561 653 1139 -1495
2031 -1495 -1128 1449 442 -1773 355 1094 -1429 4 1853 -749 -1423 1450 1240 -1200 -341 1438
2047 1438 -461 -1116 1625 164 -2168 368 1327 -1057 -920 814 -94 -1084 687 1150 -1555 -502
2063 -502 2126 -285 -1248 1123 727 -950 191 1463 -642 -1454 1213 872 -1965 -104 1120 -989
2079 -989 -700 1176 -148 -1345 516 1366 -744 -759 1571 47 -986 1186 707 -1496 86 1194
2095 1194 -502 -1278 533 650 -1129 194 1115 -1151 -715 1430 56 -1162 487 905 -454 -185
2111 -185 1148 -102 -1318 933 934 -1376 -370 1004 -473 -899 509 185 -1030 -216 1208 -491 -992
$$ packed form
1999B133l261k03L056j076j904J492P59k144L40K415j834j888K897M80k805J256
2015b87J491j772l24K192l22k786J643K303k637p51K640j382j569K214M86k634
2031a495L67K577j007k215K128P39k523J433J849k602o74K873k10k440Q59J779
2047A438j899o55K741j461k332K536R59k384J37J734r08r90J771M63k705J053
2063e02K628k411r63K371l96j677J141J272k105q12K667l41k837J861J224k109
2079i89K89J876j324j197J861Q50k110j5K330j524j033K172m79k203J582J108
2095A194j696p76J811J17j779J323R21k266M36K145j374j218J649M18j359K69
2111a85J333j250j216K251Jk310J006J374j477m26J408l24j215Q14J424j699n01
$$ plain form
2128 -992 1026 307 -763 609 503 -509 -227 871 117 -1024 308 812 -965 -320 786 -742 -693
2145 -693 745 161 -813 -104 794 -53 -630 768 356 -840 683 852 -717 -324 604 135 -731 70
2163 70 465 -587 -615 770 -328 -882 542 281 -362 16 519 -101 -184 515 415 -519 209 753 -475
2182 -475 -256 436 -393 -549 93 109 -464 -473 498 1 -752 363 341 -406 269 421 -164 -185 340 337 -287 -107
2204 -107 574 -319 -391 498 -162 -351 55 13 -193 -161 150 231 -295 165 462 -373 155 497 -179 16 216
2225 216 104 -61 -125 202 -224 -559 218 53 -517 59 -5 -197 60 116 213 -125 103 465 -108 -24 506 36
2247 36 10 197 -122 -15 -135 -53 48 -268 -135 113 -353 29 82 -102 43 142 71 258 23 192 121 -180
2269 -180 307 62 -247 237 -98 -316 -96 -79 -7 -137 -139 192 -165 -168 316 -73 63 287 39 226 68 1
$$ packed form
2128i92K018p19j070J372j06j012K82J098p54j141J332N04j777O45J106j528M9
2145f93J438n84r74P09Q98q47n77J398m12j196J523J69j569L93R28m69q66Q01
2163G0L95j052k8J385j098n54J424k61o43L78N03o20q3O99j00r34P28N44j228
2182d75K19O92q29j56O42J6n73rR71m97p53J115k2p47O75J52n85k1N25lo24J80
2204a07O81q93p2Q89o60j89M06m2k06L2L11Q1n26M60K97q35N28L42o76J95K00
2225B16j12j65o4L27m26l35P77j65n70N76o4j92K57N6R7l38K28L62n73Q4N30m70
2247C6k6J87l19J07j20Q2J01l16J33K48m66L82N3j84J45R9p1J87k35J69p1l01
2269a80M87k45l09M84l35k18K20J7P2j30kL31l57lM84l89J36K24k48J87j58o7
$$ plain form
2291 1 250 -86 -10 177 -213 74 -30 -402 24 7 -128 156 -191 -13 62 -110 220 115 -5 377 -32 -148
2313 -148 227 -9 48 -69 -32 -96 -311 -181 183 -408 -181 188 -129 36 75 -34 144 46 305 116 -176 209
2335 209 126 -295 216 -97 -365 11 -117 -88 -192 -164 27 -42 -228 371 -140 -189 383 -11 -87 207 174 75 -19
2358 -19 252 223 -421 -128 246 -574 -254 81 -213 -161 -94 -36 -91 -131 408 69 -191 354 235 -234 255 194 -228
2381 -228 1 41 33 -319 -70 305 -279 -258 318 -360 -355 383 17 -245 172 345 110 -207 288 273 -413 92
2403 92 467 -343 -195 249 -134 -293 -131 171 -302 -351 395 -26 -389 382 250 -253 148 257 -32 -218 309
2424 309 282 -451 -32 464 -446 -309 315 -289 -465 171 164 -383 -325 501 170 -395 364 352 -525 373 571 -342
2446 -342 -279 318 190 -385 -51 385 -333 -428 356 -67 -635 156 301 -214 -206 352 170 -343 438 456 -570
$$ packed form
2291AK49l36P6J87l90K87j04l72M26j7j35K84l47J78P5j72L30j05j20L82m09j16
2313a48L75k36N7j17L7o4k15J30L64n91K27L69l17J65L9j09J78r8K59j89k92L85
2335B09q3m21N11l13k68L76j28K9j04K8J91o9j86N99n11m9N72l94p6K94l3r9r4
2358a9K71k9o44K93L74q20L20L35k94N2O7N8n5m0N39l39k60N45j19m69M89o1m22
2381b28K29M0ql52K49L75n84K1N76o78NP38l66k62M17J73k35l17M95j5o86N05
2403I2L75q10J48M44l83j59J62L02m73m9P46m21l63P71j32n03M01J09k89j86N27
2424C09k7p33M19M96r10J37O24o04j76O36pn47N8Q26l31n65P59j2q77Q98J98r13
2446c42O3N97j28n75L34M36p18r5P84m23n68P91J45n15QN58j82n13P81J8j026
$$ plain form
2467 -570 -77 706 -178 -362 406 -34 -456 89 382 -241 -650 486 274 -760 241 410 -392 136 502
2486 502 -58 -283 403 629 -352 -243 586 -182 -411 486 22 -704 87 390 -229 -459 246 238 -414 189 538
2507 538 -422 -13 739 -24 -338 198 380 -315 -133 530 -320 -529 428 200 -759 2 135 -334 -7 392
2527 392 75 -569 123 670 -262 -305 557 -108 -405 495 98 -414 -174 468 -133 -672 294 311 -539 179 400
2548 400 -449 -113 606 194 -282 57 580 -100 -176 581 -206 -604 438 306 -517 -171 311 -102 -362 159
2568 159 205 -608 -75 622 -219 -381 497 159 -146 251 348 -124 -301 382 190 -614 31 344 -454 -65 217
2589 217 -218 -299 255 228 -360 -85 517 -18 -229 318 79 -368 231 313 -204 -309 223 39 -403 -66 237
2610 237 -428 -152 477 -64 -311 208 192 -113 53 387 207 -281 427 256 -367 94 229 -353 -193 185
$$ packed form
2467e70M93P83q84j84P68m40m22N45K93o23m09J136k12j034J001J69q02N28L66
2486E02n60k25O86K26r81J09Q29p68k29Q97m64p26P91L03o19k30P05qo52O03L49
2507E38r60M09P52p63l14N36J82o95J82O63q50k09R57k28r59P61J33m69L27L99
2527C92l17o44O92N47r32m3Q62o65k97R00l97n12K40O42o01n39R66J7q50P18K21
2548D00q49L36P19m12m76L39N23o80p6P57p87l98J042j32q23L46M82m13k60N21
2568A59M6q13N33O97q41j62Q78l38l05L97R7m72j77O83j92q04O45L13p98L89K82
2589B17m35q1N54k7n88K75O02n35k11N47k39m47N99Q2n17j05N32j84m42L37L03
2610B37o65K76O29n41k47N19j6l05J66L34j80m88P08j71o23M61J35n82J60L78
$$ plain form
2630 185 -85 -338 -58 199 -226 -310 570 -125 -201 382 42 -197 162 206 -122 -218 126 325 -321 -90 281
2651 281 -331 -155 226 -117 -268 -42 118 -31 -232 389 129 -247 347 258 -192 106 255 -52 -52 6 87 -134
2673 -134 -99 252 -158 -227 224 -39 -190 2 132 47 -44 199 166 -162 165 333 -130 67 199 -131 -110 49
2695 49 -58 -197 -188 91 -24 -284 210 60 -183 161 113 -37 40 185 190 45 45 142 -73 -169 147 -123 -119 -6
2719 -6 -239 -48 -16 -58 -35 -133 10 128 -127 144 186 -74 226 107 -5 5 -107 55 15 -254 84 9 -248
2742 -248 25 -103 -150 54 -89 50 33 -59 118 -6 -40 299 156 86 114 -37 -37 -122 -21 -32 -243 -171 -9 -203
2766 -203 -28 34 -119 48 97 20 -62 -27 66 15 104 145 -25 -65 101 51 -39 -44 -164 -90 -137 -163 57 -5 -204 123
2792 123 -16 5 242 -36 132 105 85 4 32 37 101 -124 42 -54 -300 9 36 -192 -16 -143 -177 9 1 122
$$ packed form
2630A85k70k53K80K57m25q4Q80o95p6N83l40k39L59M4l28r6L44J99o46K31L71
2651B81o12J76L81l43j51K26J60j49k01O21k60l76N94q9m50K98J49l07%N8Q1k21
2673a34L5L51m10o9M51k63j51J92J30q5r1K43l3l28L27J68m63J97J32l30K1J59
2695D9j07j39RK79j15k60M94j50k43L44m8j50P7J45Nj45%R7k15r6L16k70MJ13
2719fk33J91L2m2K3r8J43J18k55K71M2k60L00j19j12J0j12J62m0k69L38p5k57
2742b48K73j28m7K04j43J39j7r2J77j24l4L39j43p0K8j51%q5J01j1k11P2J62j94
2766b03J75O2j53J67M9p7q2L5R3n1Q9M1j70m0J66n0r0nj20P4m7k6K20o2j99L27
2792A23j39K1K37k78J68k7k0q1K8NO4k25J66r6k46L09K7k28J76j27l4J86qJ21
$$ plain form
2816 122 0 43 234 -33 -37 186 -68 53 6 -50 -48 -130 -69 30 -175 -140 47 -161 -99 37 -63 31 94 43 154
2841 154 22 144 137 34 166 54 -149 -32 39 -73 -180 -102 -14 -117 -131 184 -151 -52 193 15 -66 177 50
2864 50 121 -3 -77 17 -149 67 59 -232 81 84 -137 -184 10 -112 -42 29 120 -19 -20 189 98 -143 105 -48 -12
2889 -12 155 38 82 -77 -16 111 -168 -98 165 -165 -190 85 -106 -127 80 56 127 -227 168 78 -99 114 180
2912 180 -166 68 58 -219 -90 -94 -37 -214 -193 145 -203 -173 259 121 -194 193 93 -90 112 -38 83 -146
2934 -146 105 212 -244 -56 220 -130 -210 125 -48 -70 -58 55 -68 -249 111 45 -229 161 48 -155 105
2955 105 96 55 -2 38 188 -115 -94 187 -220 -209 178 53 -251 -49 122 32 -101 101 127 -238 194 234 -139
2978 -139 7 188 -233 -67 8 21 -152 -143 189 -40 -308 36 -18 -197 46 141 -64 27 103 169 -135 -68 182
$$ packed form
2816A22j22M3J91k67mK23k54J21m7n6Kq2O1R9k05L5J87k08O2J36j00R4O3n1J11
2841A54j32J22pj03J32j12k03J17P1j12j07P8Q8j03j4L15l35R9K45j78q1K43j27
2864E0P1j24p4R4j66K16qk91L13Lk21m7J94j22P0P1R1j39jK09r1k41K48j53L6
2889a2J67j17M4j59O1J27k79P0K63l30k5K75j91k1K07k4P1l54L95r0j77K13O6
2912A80l46K34j0k77J29mN7j77K1L38l48L0M32j38l15L87j00j83K02j50J21k29
2934a46K51J07m56J88K76l50q0L35j73k2J2J13j23j81L60o6k74L90j13k03K60
2955A05rm1n7M0J50l03K1K81m07J1L87j25l04K02J71r0j33K02K6l65M32M0l73
2978a39J46J81m21J66P5J3j73RL32k29k68L44n4j79K43R5k05R1P6O6l04O7K50
$$ plain form
3001 182 -78 -48 219 -98 -290 159 41 -177 -106 158 48 -185 69 162 -231 127 316 -26 14 234 35
3022 35 -15 -121 296 -180 -126 171 -194 -341 92 43 -112 -87 127 -92 -89 92 135 -130 -79 413 38 -131 249
3045 249 51 -2 -6 106 47 -158 60 124 -409 0 64 -205 -49 264 -51 -96 145 228 -94 -7 114 2 -71
3068 -71 331 -41 -194 -22 56 -71 -125 -3 -20 -289 74 330 -154 92 250 -44 -167 99 106 73 33 60 79
3091 79 -185 53 30 -168 -39 -49 -289 -96 136 -18 -179 33 186 -107 -98 285 -58 -189 291 59 32 17
3113 17 164 -46 -33 -106 88 -192 69 128 -204 -135 105 40 -53 43 110 74 -37 236 86 -115 121 172 -134 4
3137 4 31 -8 -92 9 75 -231 -229 45 -94 1 112 15 36 112 -39 -35 48 163 136 -71 8 66 -226 -23 52 -50
3163 -50 -63 66 14 55 -92 152 55 -100 241 78 -54 88 151 -80 29 103 88 -29 -83 129 -121 -216 67
$$ packed form
3001A82k60L0K67l17j92M49j18k18P1K64j10k33K54R3l93L58J89l42M0K20j99
3022C5n0j06M17m76N4K97l65j47M33m9j55K5K14k19LJ81M3k65N1M92l75j69L80
3045B49j98n3mJ12n9k05K18O4n33M09O4k69J56L13l15m5K41Q3l22Q7J21j12p3
3068g1M02l72j53J72P8j27n4J22j7k69L63K56m84K46J58k94j23K66Pl3m0K7J9
3091G9k64K38k3j98J29j0k40J93K32j54j61K12J53k93RL83l43j31M80k32k7j5
3113A7J47k10J3p3J94k80K61N9l32O9K40o5r3R6O7l6j11K73j50k01K36N1l06J38
3137DK7l9q4J01O6l06KK74j39R5J11r7K1P6j51MQ3J15k7k07P9N8k92K03P5j02
3163e0j3J29n2M1j47K44r7j55L41j63j32J42O3k31J09P4j5j17n4K12k50r5K83
$$ plain form
3186 67 -186 -62 27 44 38 -27 15 -38 59 153 210 -20 134 105 -8 113 10 6 86 -160 44 116 -176 -37 -93 -37
3212 -37 121 -84 60 29 -18 16 -3 6 233 -61 -32 132 24 -42 0 -115 -53 65 -90 7 -77 28 -70 -222 82
3237 82 97 -105 150 24 -10 57 -27 117 -127 -206 82 -29 -120 -23 -106 -118 -58 -151 18 48 42 177 7 144 189
3262 189 -44 157 33 -32 98 -45 -20 19 16 -2 -88 -152 -21 -36 -189 -127 -62 -26 41 28 50 65 5 172 -11 -6
3288 -6 23 60 49 25 -130 -3 -50 41 61 -129 -62 50 -14 22 78 -39 113 98 3 21 20 -2 64 -85 72 -102 -120
3315 -120 127 -54 -72 52 -84 -90 -59 -95 -33 62 7 155 -15 81 175 -6 -27 127 -128 61 9 79 46 -209 42
3340 42 32 -117 34 56 -124 97 97 -29 70 -52 144 -29 -78 3 38 -2 11 -86 -39 -61 -10 102 -11 -108 -81 22
$$ packed form
3186F7k53J24Q9J7oo5M2n3R7R4N7k30J54k9j13J21j03mQ0k46K04P2k92J39n6N6
3212c7J58k05J44l1m7L4j9RK27k94K9J64j08o6M2j15O2J18j55R7q4J05r8j52L04
3237H2J5k02K55j26l4O7q4J44k44p9K88j11r1R7q3j2O0r3J69L0oJ35j70J37M5
3262A89k33K01j24o5J30j43K5L9lj8q6o4J31j5j53O2O5L6O7j3K2J5o0J67j83N
3288fK9L7j1k4j55J27m7R1K0j90O7J12o4L6N6j17J52j5r5J8jk2O6j49J57j74j8
3315a20K47j81j8J24j36oL1l6O2R5n5J48j70R6R4j81k1J54k55J89n2P0l3k55K51
3340D2j0j49J51K2j80K21%j26R9j22J96j73m9Q1L5m0J3r7M7k2N1J12j13r7K7J03
$$ [...]
8191A0
##END NTUPLES=NMR FID
##END=
