##TITLE=1H_PrA-156-251 
 200.13MHz,CDCl3,
 8 sc
 
 28.11.2025
##JCAMPDX= 6.0         $$ Bruker NMR JCAMP-DX V2.0
##DATA TYPE= NMR FID
##DATA CLASS= NTUPLES
##ORIGIN= UXNMR, Bruker Analytische Messtechnik GmbH
##OWNER= pz
$$ XWIN-NMR		Version 3.5
$$ Fri Nov 28 16:16:09 2025 Russian Standard Time (UT+4h)  she@DPX200
##.OBSERVE FREQUENCY= 200.1313
##.OBSERVE NUCLEUS= ^1H
##.DELAY= (6, 6)
##.ACQUISITION MODE= SIMULTANEOUS
##.ACQUISITION SCHEME= undefined
##.AVERAGES= 8
##.DIGITISER RES= 18
##SPECTROMETER/DATA SYSTEM= spect
##.PULSE SEQUENCE= zg30
##.SOLVENT NAME= CDCl3
##.SHIFT REFERENCE= (INTERNAL, CDCl3, 0, 14.3821)
##AUDIT TRAIL= $$ (NUMBER, WHEN, WHO, WHERE, WHAT)
$$ ##TITLE= Audit trail, XWIN-NMR		Version 3.5
$$ ##JCAMPDX= 5.01
$$ ##ORIGIN= Bruker BioSpin GmbH
$$ ##OWNER= she
$$ F:/spectra/data/she/nmr/H-C/1/audita.txt
$$ ##AUDIT TRAIL=  $$ (NUMBER, WHEN, WHO, WHERE, WHAT)
(   1,<2025-11-28 16:14:38.17 +0400>,<she>,<DPX200>,
      <created by zg, POWCHK disabled, PULCHK disabled
       configuration hash MD5:
       00 E9 B6 7A A2 85 ED C7 34 08 36 98 17 FE 4E 26
       data hash MD5: 16K
       30 7F 23 0F 8F E7 25 36 A1 3E 11 B4 FD 36 3D 7F>)
$$ ##END=
$$ 
$$ hash MD5
$$ 5E 32 33 C9 16 7A BF 86 B4 4D BC 1C 06 B4 2A 38
##$RELAX= 
##$RELAX= 
##$RELAX= 
##$RELAX= 
##$RELAX= 
##$RELAX= 
$$ Bruker specific parameters
$$ --------------------------
##$DU= <F:/spectra>
##$EXPNO= 1
##$NAME= <H-C>
##$PROCNO= 1
##$TYPE= <nmr>
##$USER= <she>
##$AMP= (0..31)
100 100 100 100 100 100 100 100 100 100 100 100 100 100 100 100 100 100 
100 100 100 100 100 100 100 100 100 100 100 100 100 100 
##$AQSEQ= 0
##$AQ_mod= 1
##$AUNM= <au_zg>
##$AUTOPOS= <>
##$BF1= 200.13
##$BF2= 200.13
##$BF3= 200.13
##$BF4= 200.13
##$BF5= 200.13
##$BF6= 200.13
##$BF7= 200.13
##$BF8= 200.13
##$BYTORDA= 1
##$CFDGTYP= 0
##$CFRGTYP= 5
##$CHEMSTR= <none>
##$CNST= (0..31)
1 1 145 1 1 1 1 1 1 1 1 1 1 1 1 1 1 1 1 1 1 1 1 1 1 1 1 1 1 1 1 1 
##$CPDPRG= <>
##$CPDPRG1= <>
##$CPDPRG2= <>
##$CPDPRG3= <>
##$CPDPRG4= <mlev>
##$CPDPRG5= <mlev>
##$CPDPRG6= <mlev>
##$CPDPRG7= <mlev>
##$CPDPRG8= <mlev>
##$CPDPRGB= <>
##$CPDPRGT= <>
##$D= (0..31)
0 0.7 0 0 0 0 0 0 0 0 0 0.03 0 0 0 0 0 0 0 0 0 0 0 0 0 0 0 0 0 0 0 0 
##$DATE= 1764332077
##$DBL= (0..7)
120 120 120 120 120 120 120 120 
##$DBP= (0..7)
150 150 150 150 150 150 150 150 
##$DBP07= 0
##$DBPNAM0= <>
##$DBPNAM1= <>
##$DBPNAM2= <>
##$DBPNAM3= <>
##$DBPNAM4= <>
##$DBPNAM5= <>
##$DBPNAM6= <>
##$DBPNAM7= <>
##$DBPOAL= (0..7)
0.5 0.5 0.5 0.5 0.5 0.5 0.5 0.5 
##$DBPOFFS= (0..7)
0 0 0 0 0 0 0 0 
##$DE= 6
##$DECBNUC= <off>
##$DECIM= 32
##$DECNUC= <off>
##$DECSTAT= 4
##$DIGMOD= 1
##$DIGTYP= 9
##$DL= (0..7)
0 120 120 120 120 120 120 120 
##$DP= (0..7)
150 150 150 150 150 150 150 150 
##$DP07= 0
##$DPNAME0= <>
##$DPNAME1= <>
##$DPNAME2= <>
##$DPNAME3= <>
##$DPNAME4= <>
##$DPNAME5= <>
##$DPNAME6= <>
##$DPNAME7= <>
##$DPOAL= (0..7)
0.5 0.5 0.5 0.5 0.5 0.5 0.5 0.5 
##$DPOFFS= (0..7)
0 0 0 0 0 0 0 0 
##$DQDMODE= 0
##$DR= 18
##$DS= 0
##$DSLIST= <SSSSSSSSSSSSSSS>
$$ [...]
##$SUBNAM0= <"">
##$SUBNAM1= <"">
##$SUBNAM2= <"">
##$SUBNAM3= <"">
##$SUBNAM4= <"">
##$SUBNAM5= <"">
##$SUBNAM6= <"">
##$SUBNAM7= <"">
##$SUBNAM8= <"">
##$SUBNAM9= <"">
##$SW= 18.0517328524113
##$SWIBOX= (0..15)
0 0 2 0 0 0 0 0 0 0 0 0 0 0 0 0 
##$SW_h= 3612.71676300578
##$TD= 16384
##$TD0= 1
##$TE= 0
##$TE2= 300
##$TE3= 300
##$TEG= 300
##$TL= (0..7)
0 120 120 120 120 120 120 120 
##$TP= (0..7)
150 150 150 150 150 150 150 150 
##$TP07= 0
##$TPNAME0= <>
##$TPNAME1= <>
##$TPNAME2= <>
##$TPNAME3= <>
##$TPNAME4= <>
##$TPNAME5= <>
##$TPNAME6= <>
##$TPNAME7= <>
##$TPOAL= (0..7)
0.5 0.5 0.5 0.5 0.5 0.5 0.5 0.5 
##$TPOFFS= (0..7)
0 0 0 0 0 0 0 0 
##$TUNHIN= 0
##$TUNHOUT= 0
##$TUNXOUT= 0
##$USERA1= <user>
##$USERA2= <user>
##$USERA3= <user>
##$USERA4= <user>
##$USERA5= <user>
##$V9= 5
##$VALIST= <valist>
##$VCLIST= <CCCCCCCCCCCCCCC>
##$VD= 0
##$VDLIST= <DDDDDDDDDDDDDDD>
##$VPLIST= <PPPPPPPPPPPPPPP>
##$VTLIST= <TTTTTTTTTTTTTTT>
##$WBST= 1024
##$WBSW= 4
##$XGAIN= (0..3)
0 0 0 0 
##$XL= 0
##$YL= 0
##$YMAX_a= 181722
##$YMIN_a= -204395
##$ZGOPTNS= <>
##$ZL1= 120
##$ZL2= 120
##$ZL3= 120
##$ZL4= 120
##$ABSF1= 10
##$ABSF2= 0
##$ABSG= 5
##$ABSL= 3
##$ALPHA= 0
##$AQORDER= 0
##$ASSFAC= 0
##$ASSFACI= 0
##$ASSFACX= 0
##$ASSWID= 0
##$AUNMP= <proc_1d>
##$AZFE= 0.1
##$AZFW= 0.1
##$BCFW= 1
##$BC_mod= 2
##$BYTORDP= 1
##$COROFFS= 0
##$CY= -3
##$DATMOD= 1
##$DC= 2
##$DFILT= <>
##$DTYPP= 0
##$F1P= 0
##$F2P= 0
##$FCOR= 0.5
##$FTSIZE= 0
##$FT_mod= 4
##$GAMMA= 1
##$GB= 0.15
##$INTBC= 1
##$INTSCL= 1
##$ISEN= 128
##$LB= 0.25
##$LEV0= 0
##$LPBIN= 0
##$MAXI= 10000
##$MC2= 0
##$MEAN= 0
##$ME_mod= 0
##$MI= 1.114404
##$NCOEF= 0
##$NC_proc= 0
##$NLEV= 6
##$NOISF1= 3.799351
##$NOISF2= 2.8
##$NSP= 1
##$NTH_PI= 0
##$NZP= 0
##$OFFSET= 14.38212
##$PC= 1
##$PHC0= -3504.217
##$PHC1= 10.39234
##$PH_mod= 1
##$PKNL= yes
##$PPARMOD= 0
##$PSCAL= 0
##$PSIGN= 0
##$REVERSE= no
##$SF= 200.129724274929
##$SI= 16384
##$SIGF1= 3
##$SIGF2= 2
##$SINO= 400
##$SIOLD= 16384
##$SREGLST= <1H.CDCl3>
##$SSB= 0
##$STSI= 0
##$STSR= 0
##$SW_p= 3205.1282051282
##$SYMM= 0
##$S_DEV= 0
##$TDeff= 0
##$TDoff= 0
##$TI= <>
##$TILT= no
##$TM1= 0
##$TM2= 0
##$TOPLEV= 0
##$USERP1= <user>
##$USERP2= <user>
##$USERP3= <user>
##$USERP4= <user>
##$USERP5= <user>
##$WDW= 1
##$XDIM= 8192
##$YMAX_p= 0
##$YMIN_p= 0
$$ End of Bruker specific parameters
$$ ---------------------------------
##NTUPLES= NMR FID
##VAR_NAME=  TIME,          FID/REAL,        FID/IMAG
##SYMBOL=    X,             R,               I
##VAR_TYPE=  INDEPENDENT,   DEPENDENT,       DEPENDENT
##VAR_FORM=  AFFN,          ASDF,            ASDF
##VAR_DIM=   8192,          8192,            8192
##UNITS=     SECONDS,       ARBITRARY UNITS, ARBITRARY UNITS
##FACTOR=    0.0002768,     1,               1
##FIRST=     0,             0,               0
##LAST=      2.2672688,     0,               0
##MIN=       0,             -204395,         0
##MAX=       2.2672688,     181722,          0
$$ Real data points
##PAGE= N=1
##DATA TABLE= (X++(R..R)), XYDATA
0 0 0 0 0 0 0 0 0 0 0 0 0 0 0 0 0 0 0 0 3 -8 8 -8 8 -8 11 -16 16 -16 22 -24 28 -32 36 -40 46 -52 60 -68 76 -84
40 -84 92 -105 114 -129 141 -157 173 -189 210 -233 256 -280 311 -341 378 -415 461 -511 569 -636
60 -636 717 -813 929 -1076 1266 -1527 1895 -2475 3515 -10311 64963 -13391 -177431 -166098
74 -166098 -119590 -80617 -24924 -59637 -163990 -76310 121275 113361 -12806 24830 118883 130087
86 130087 143666 119150 2821 1475 118675 78126 -85191 -102034 -36522 -62830 -90293 -73140
98 -73140 -121860 -136256 -19880 19595 -66496 -39874 66607 60761 40109 98664 96135 41310
110 41310 77357 109608 31020 -1009 45367 -6588 -82927 -30679 -7016 -94415 -106890 -44278
122 -44278 -51269 -56939 -4818 -20460 -63053 22891 108413 34537 -20914 53483 87153 56867
134 56867 61367 24940 -42403 12663 87574 -3365 -108694 -53885 14314 -15451 -37945 -48847
146 -48847 -85684 -31146 72162 18377 -88183 -26894 75626 56052 14735 9895 -10590 15431
158 15431 93181 54620 -65902 -41340 63281 38849 -31035 -29439 -33956 -30496 31530 21850
170 21850 -76064 -66907 37203 35316 -34988 -23637 3200 -8875 26547 49049 -22566 -36764
182 -36764 51139 55895 -15313 -6434 27986 295 -167 33273 -5824 -46563 7629 26052 -38877
195 -38877 -34352 13877 -19872 -42463 8278 7663 -35208 -5003 29507 -7743 -7881 44923 21999
208 21999 -22637 26339 55208 -1309 -8264 26883 -1099 -17152 21427 -626 -57969 -22895
220 -22895 26892 -18968 -51326 -8183 -2345 -21657 15624 19081 -33751 -4917 62428 28982
232 28982 -19788 14708 35350 7449 17130 25610 -25793 -28755 33266 12600 -54267 -29474 7692
245 7692 -21010 -21219 4143 -24742 -33465 26238 33203 -24167 -10709 42199 21511 -139 30139
258 30139 15113 -16651 22950 37566 -22529 -30045 16807 1305 -33800 -9172 -2101 -36436
270 -36436 -14553 22443 -16657 -34384 20001 23372 -15367 8339 31693 -1324 1491 38618
282 38618 13423 -21515 13331 26978 -19829 -17387 15835 -14503 -32889 7040 111 -38047
294 -38047 -9550 19451 -14757 -19706 21607 12530 -14795 18195 32389 -9125 -478 36770 5745
307 5745 -18951 16477 13300 -25165 -7832 13674 -21558 -29441 9771 -1362 -34267 -2517 18531
320 18531 -16605 -8338 28738 4817 -12990 25624 26608 -11096 4291 30150 -1862 -16432 16197
333 16197 3902 -30553 -3812 11534 -28719 -24849 12732 -7019 -26776 7583 13861 -16261
345 -16261 1925 31492 2997 -9446 28912 22840 -12533 9385 24595 -12745 -12546 17098 -7641
358 -7641 -32528 -1356 6092 -28533 -19292 10549 -11502 -21319 16516 11809 -18588 10606 34223
371 34223 782 -2311 28913 14042 -8544 15302 17326 -20002 -11351 18305 -11340 -34025 -1761
384 -1761 -1553 -29550 -8706 8113 -20955 -15646 23236 11236 -15096 12378 30203 2712 6953
397 6953 30956 5059 -9613 24144 16539 -23754 -9903 11193 -16387 -25552 -1215 -12871 -33507
410 -33507 -4424 9830 -22582 -15172 21594 6171 -8671 23286 25086 -2007 15113 34476
422 34476 5860 -4526 21130 8551 -21364 -1700 8982 -28117 -29527 969 -14366 -30842
434 -30842 -5338 -4623 -25073 313 27292 -199 -11785 26068 33432 8534 17572 22899 -2485
447 -2485 9746 34799 -2657 -36685 -5669 11469 -17779 -27932 -19870 -29909 -17805 15930
459 15930 -5052 -42554 -5520 39579 17933 -1416 11929 12327 20368 45455 22986 -25279 -7041
472 -7041 38641 15096 -30076 -25446 -15701 -16483 2250 -8151 -51595 -34289 24001 17978 -22541
485 -22541 -13571 13966 18658 28441 29097 -5558 -7101 41556 38484 -14009 -16994 6729 -1593 -6715
499 -6715 -2526 -26401 -37573 -1349 11229 -24774 -26751 7217 4431 -5271 16733 14634 -6313
512 -6313 13306 31047 6316 -579 19867 7181 -15368 4914 16651 -16247 -25118 -1104 -5357
525 -5357 -12813 2944 -10176 -31323 2545 33254 637 -26178 -127 20889 15236 13523 -2488
538 -2488 -26023 4958 45855 7808 -41787 -17282 20407 17220 2381 -16958 -32347 220
550 220 45955 15750 -45709 -27513 28195 28089 -284 -18502 -29921 -2614 42741 18049 -45465
563 -45465 -34886 26415 34536 -1352 -18169 -16803 2966 40984 29475 -31218 -31055 27909 35442
576 35442 -4804 -21066 -16521 -7139 14878 12606 -31473 -41108 8342 23678 -11764 -17986 -6
589 -6 1554 13529 26749 2877 -12080 18016 31253 3791 -3405 11403 -1369 -13446 4720
602 4720 757 -25787 -18395 -4848 -18544 -13680 6177 -9513 -25696 4968 29839 9418 -3782
615 -3782 10474 14229 20502 35214 9493 -25593 1198 35656 7486 -30499 -27892 -13403 -2498
628 -2498 5192 -18630 -51564 -22228 33319 18942 -26729 -18848 14423 31417 36358 13068 -20311
641 -20311 1664 52467 37605 -22317 -30700 3747 14459 3523 -17402 -46900 -33765 17947
653 17947 15398 -36420 -39920 3441 22946 15016 5179 -7543 -562 38724 45415 -2121 -17362
666 -17362 17509 25740 4718 -5020 -16320 -23626 -2515 7641 -23488 -39083 -9729 4918 -10670
679 -10670 -7582 2819 -4966 5471 27210 13871 -1389 17048 24206 6351 6933 16573 -687
692 -687 -14397 1180 1775 -18604 -15534 -8648 -22484 -15265 6683 -6821 -24269 -2269 18393
705 18393 8503 3338 10410 6161 11073 31258 17654 -15141 -3018 22803 7866 -12684 -12779 -15717
719 -15717 -12127 5023 -3559 -33472 -24588 12340 11259 -11588 -6969 3488 7200 23607 21892
732 21892 -7716 -5966 26838 25655 -4297 -10280 -271 -1536 1108 1654 -22374 -29658 2091 9999
746 9999 -17326 -19413 -525 2685 5621 12672 1127 -6899 16078 28983 4256 -6883 10496
759 10496 9909 -865 4032 -3807 -19719 -6661 6914 -11262 -22457 -5454 1002 -8392 -1480
772 -1480 6108 -5146 55 19794 10196 -4063 10649 16269 1210 2324 9381 -3334 -9948 2843
786 2843 13 -16946 -9938 1445 -11487 -12558 4100 -1553 -10499 5116 11378 -896 3171 15256
800 15256 6558 -543 12037 10465 -6936 -1076 9015 -5976 -11304 846 -5896 -15226 -2332
813 -2332 1594 -12201 -8531 7448 2654 -5196 7323 10094 -1723 6853 16018 -80 -3889 11162
827 11162 5942 -7800 -1797 1819 -9387 -7928 2787 -6947 -15892 388 5637 -8726 -3409 8336
841 8336 -76 -375 12236 6156 -4619 6422 13912 -487 -5153 6058 781 -8226 1719 563
855 563 -14327 -5991 6646 -5305 -11126 1687 2942 -4584 2607 8012 -3199 -1583 13704 6169
869 6169 -6952 4187 8663 -3815 -1172 5299 -5664 -8185 4635 2162 -11341 -4991 5795
882 5795 -3513 -6143 5458 268 -7104 6332 8739 -5728 -1935 9409 1968 -4532 3988 3662
896 3662 -6335 366 8049 -5171 -8143 6246 2102 -8285 1072 4247 -5930 -1951 7017 -1482
910 -1482 -7671 3997 6020 -6550 -2599 6686 -2741 -4391 7457 1229 -8035 3268 8214 -3392
924 -3392 -3427 6147 1769 -4148 4514 3860 -8453 -1672 8710 -4008 -9852 2008 857 -6000 824
939 824 2203 -7525 -2997 10083 3273 -7791 2634 9581 554 2592 7060 -3709 -2830 10567
953 10567 3675 -11287 -5284 4323 -2070 -6276 -1894 -6928 -9231 5342 5880 -10883 -5883 10158
967 10158 6205 578 5213 2917 122 10120 11980 -4354 -7775 7306 5816 -7268 -4919 -3814
981 -3814 -10495 -2866 3220 -9810 -13495 1776 5861 -3098 -917 6122 1834 3412 13805 6794
995 6794 -3411 7114 11004 -1011 -1102 3915 -4853 -9474 -760 -1426 -12308 -9744 -1724 -6931 -6192
1010 -6192 4566 -1199 -8858 5659 14438 4283 1695 7771 6730 7273 12460 4064 -10426 -2227
1024 -2227 11619 -694 -15158 -10384 -6880 -5058 1290 -6780 -20126 -7883 13822 9317 -7685
1037 -7685 -4771 8504 13440 15811 9083 -7615 -1301 21561 15034 -10326 -13762 -1863 2945 445
1051 445 -8523 -21649 -17428 6001 9038 -14255 -17581 2455 11054 9672 6569 -2906 -527 19287
1065 19287 22714 1144 -8699 5204 11736 2461 -3730 -10164 -15319 -3116 4724 -12140 -20900 -6535
1079 -6535 1666 -2207 -1549 470 -1875 4547 16358 10979 333 8000 13384 4603 4949 7759 -3460
1094 -3460 -8738 -447 -622 -9991 -11258 -8858 -12084 -7582 3290 -3771 -14294 -851 13334 8458
1108 8458 4347 4662 3199 10924 20708 9477 -9378 -4272 12777 8041 -8442 -13517 -13331 -6725
1122 -6725 5134 -4001 -24694 -16869 8104 11442 -3115 -8614 -1317 10352 20877 14921 -6651
1135 -6651 -6267 18900 21788 -556 -11352 -7254 137 6506 -1036 -20728 -22401 438 10285 -7386
1149 -7386 -17600 -6145 4539 10486 10834 -2636 -6450 13201 22606 6688 -5114 693 6749
1162 6749 5375 2496 -6204 -15082 -5707 5516 -5870 -15982 -7599 -2076 -2539 1617 1473 -3998 695
1177 695 11655 9588 1101 4844 8220 1862 3768 7939 -2027 -7755 -156 241 -5849 -5329 -5221 -9621
1193 -9621 -5513 4807 766 -9739 -2862 7736 5482 4262 3903 -2551 1863 14032 8594 -6922
1207 -6922 -6416 4937 5753 -1415 -5395 -9566 -7249 6468 5610 -12206 -12281 4007 8190 1976 -2493
1222 -2493 -4646 -502 10788 11634 -4553 -10503 5176 11688 834 -4887 -5540 -4237 5343 7567
1236 7567 -7085 -13107 637 9721 1361 -6214 -3605 -816 4123 8836 -1426 -10850 925 10408
1250 10408 1716 -5207 -2968 -833 1846 5024 40 -8339 -2210 8902 3077 -5348 -631 1646
1264 1646 -59 4193 2385 -5934 -3357 4930 2061 -5330 -2964 835 -2510 -812 3506 -2728 -4619
1279 -4619 4415 4394 -1896 1193 3955 50 809 5397 1810 -4285 -171 3424 -2789 -3374 493 -4753
1295 -4753 -5863 2194 738 -6168 -2935 2652 1307 445 3474 1511 -1034 6199 8738 -1256 -2736
1310 -2736 4614 2762 -1060 104 -3557 -6707 -681 2599 -5454 -9640 -1721 2443 -1700 -616 564
1325 564 -2324 3906 10378 2309 -3297 3887 8093 3523 201 -326 -2783 -1484 3644 -1995 -11532
1340 -11532 -5550 2226 -2716 -5309 -2817 -3305 -229 6017 3694 -3099 633 9693 7239 485 2447
1355 2447 2852 485 4230 2475 -7172 -6135 1346 -1003 -7108 -5971 -3105 -3603 -1084 2056 -2738
1370 -2738 -3727 5842 7239 411 2407 5807 3071 3680 5223 405 -3468 621 2435 -4351 -6290
1385 -6290 -1707 -3865 -5949 -894 -1793 -6031 -712 3759 308 168 4594 4412 1818 4736 6235 377
1401 377 -234 4670 666 -3625 -98 -1679 -6168 -2956 -422 -4764 -5876 -885 406 -2337 565
1416 565 3477 -356 1516 7347 3149 -873 3992 4630 285 672 1164 -2543 -3347 633 -941 -6932
1432 -6932 -3890 852 -2907 -3049 1154 -1167 -1720 3985 3847 -805 989 5324 3274 104 2416 1891
1448 1891 -2290 626 2340 -4196 -4445 778 -1322 -4231 -1309 -417 -2620 -811 2616 68 -2046
1463 -2046 3337 4169 -835 1417 4243 -230 -235 3099 -141 -3040 106 1102 -2785 -3044 638 -1119
1479 -1119 -3712 687 992 -3192 329 3519 -689 -771 3125 1866 -708 1341 2449 -1131 -1078 2911
1495 2911 -101 -3775 513 1197 -3106 -969 1015 -2298 -1676 2254 851 -2477 62 3245 202
1510 202 -1008 2281 202 -1667 3101 2075 -3453 -1125 2444 -5 -1892 -316 -507 -1884 898
1525 898 2489 -2682 -2898 3331 2086 -1842 376 535 -1053 1919 2888 -1923 -3358 1574 3019 -1753
1541 -1753 -2187 383 -1317 -160 3042 -1393 -4073 1766 3588 -624 -1555 674 799 484 2385 591
1557 591 -3741 -257 3993 -882 -3399 48 -545 -1360 1247 112 -3208 -1052 3107 1391 -2076 534
1573 534 2291 -201 1739 3254 -1673 -1724 2815 1057 -2204 -897 -323 -2267 -1488 1048 -1418 -4259
1589 -4259 5 2075 -1293 16 2218 -551 807 4720 2269 -1367 612 3155 1194 -697 155
1604 155 -1883 -3184 1286 491 -5678 -4116 703 -306 -1241 -507 -1378 -472 3825 4892 -331 -1709
1620 -1709 4340 5222 1161 832 -392 -1959 1962 2528 -4192 -6570 -1803 964 -1981 -3917 -3044 -2540
1636 -2540 680 4546 198 -3766 2555 6733 3499 1470 1185 1006 2932 4315 188 -5357 -2815
1651 -2815 2409 -854 -5274 -3941 -3540 -2301 1454 -618 -4861 -1371 4433 3944 478 924 2962 3088
1667 3088 4450 4219 -1454 -2005 3406 1950 -2819 -2929 -2614 -3076 -1498 -905 -3807 -5168 -599 2246
1683 2246 -857 -849 1921 834 2203 5426 2389 -676 2136 4019 1877 -132 -144 -1408 -2336 543
1699 543 70 -5325 -4467 -49 -1009 -1823 -787 -2265 -1597 2847 3834 -203 -1641 2835 4914 2359 1621
1716 1621 254 -1611 2488 4503 -2007 -5280 -1468 1157 -107 -2480 -4053 -4061 -396 3596 -289 -5602
1732 -5602 -1067 4499 3251 1320 -175 -1225 2747 6465 2423 -3586 -2213 3511 3195 -1400 -3099
1747 -3099 -3705 -2051 2805 553 -6365 -4633 1659 2721 -159 -1964 -1545 902 4336 4326 -1477 -2800
1763 -2800 3667 4969 578 -1056 -1505 -1360 1791 1869 -2995 -5010 -1091 2040 -544 -2535 -1322 -1433
1779 -1433 198 3589 716 -2655 672 3414 1921 887 455 -697 -366 2245 2022 -2650 -3059 796
1795 796 366 -682 97 -2359 -2912 1698 2968 -833 -2653 -84 2175 1652 937 -831 -3033 677
1811 677 4704 134 -3947 -1364 1145 1888 1412 -1609 -3420 40 4637 2410 -3560 -2510 2209 2414
1827 2414 1297 -875 -4256 -1438 4091 1795 -3872 -4039 280 2597 1009 -936 -2580 -1442 4253
1842 4253 4636 -1800 -2659 1918 3218 2124 154 -2561 -2023 1634 2587 -2070 -5189 -1375 1328 -601
1858 -601 -936 -1753 -2735 1272 3987 549 -1585 853 3083 2546 1354 909 -661 -418 2721 963 -3335
1875 -3335 -2063 -409 -1565 -934 -954 -2908 -2422 748 1894 -514 -1252 1325 1789 1634 3155 847 -1593
1892 -1593 1825 3392 241 -1475 -1254 -825 -286 167 -1408 -4058 -2089 2249 503 -2608 -1039 102
1908 102 984 2905 1177 -1843 -56 3490 3001 -683 -1558 354 569 947 679 -3005 -2891 1794 1569
1925 1569 -1937 -2179 -771 513 1215 790 -1088 -1848 1515 3427 -326 -1841 576 559 566 1234 -1082
1942 -1082 -2195 480 1958 -35 -1992 -615 798 33 619 486 -1959 -302 2530 299 -1416 -165
1958 -165 154 -54 433 289 -1177 -1391 1106 1211 -1526 -615 760 -532 483 1576 -587 -938 1229
1975 1229 1482 19 -502 332 119 -420 1035 32 -2483 -444 1205 -940 -1254 -438 -1069 -428 989
1992 989 411 -1177 -543 2070 1605 -326 853 991 168 2084 1708 -1409 -928 1072 458 -1296 -1789
2009 -1789 -1447 -1506 -929 152 -2010 -2890 723 1554 -477 209 1030 1072 2602 2956 1176 29 1549 3009
2027 3009 535 -1559 -676 -1317 -1718 -421 -2472 -4433 -2037 -299 -1215 -1746 -848 642 1381 2466 2903
2044 2903 975 1779 4630 3062 809 1423 549 -460 136 -1042 -3271 -3935 -2458 -1900 -3501 -3198 -1462
2061 -1462 -1666 -52 2336 873 668 3447 4126 3379 3076 2526 1808 1429 1872 313 -3101 -2854 -1263
2078 -1263 -2969 -3597 -3202 -4240 -2874 90 -12 -1346 -470 2462 3917 3039 2973 2481 1925 4114 3975
2095 3975 -550 -1912 -113 -409 -1490 -3048 -4491 -3999 -1864 -344 -2184 -3948 -624 2438 1872 1923
2111 1923 1654 1002 3605 5092 2140 -350 230 1819 1122 -1271 -2334 -3137 -2731 -94 -1145 -4315
2127 -4315 -2704 38 421 761 427 -144 1091 3170 3503 908 -498 1627 1885 472 351 -1577 -2836
2144 -2836 -303 651 -1593 -2853 -2047 -359 697 645 -3 -1494 16 3541 2335 -733 -339 445 1342
2161 1342 2229 44 -2723 -1790 1233 1830 -1472 -3156 -1034 599 1676 1210 -2264 -2225 2310 3402
2177 3402 327 -1824 -1299 1128 2396 943 -1929 -3336 114 3305 198 -2939 -1825 85 2025
2192 2025 2178 -1164 -2736 295 3229 2182 -1535 -2126 259 1365 1660 28 -3315 -1712 2160 1469
2208 1469 -1031 -1894 -1113 951 2014 1045 -1227 -2010 1073 2901 230 -1194 -1022 -843 1287 1925 -1286
2225 -1286 -2837 -761 1642 1640 -683 -1621 -827 885 3046 1237 -2751 -1443 2042 2173 461 -1810
2241 -1810 -2637 26 2438 1176 -2674 -3667 515 3021 869 -1212 -2136 -513 3619 3350 -1398 -2740
2257 -2740 270 3136 2250 -1366 -2921 -1554 1273 2597 -1385 -4726 -1498 2002 1651 -232 -2255
2272 -2255 -1579 2096 3636 1280 -1875 -1195 2588 2958 424 -1038 -2012 -566 2315 578 -3064 -2903
2288 -2903 -583 1108 619 -1237 -1833 -956 1638 2973 -59 -1794 600 1996 2072 1393 -1143 -1792 810
2305 810 2130 399 -2502 -2614 80 879 380 -1083 -3090 -1080 2777 1659 -1235 -1675 -116 2322
2321 2322 2667 214 -1849 -1242 2205 3218 -798 -2785 -854 841 1834 447 -2937 -2562 1103 2465
2337 2465 149 -2549 -1741 1121 1906 1090 -1129 -2544 524 3243 799 -1574 -1324 149 1911 1501
2353 1501 -750 -1994 -783 1956 1689 -1488 -1708 -225 401 1385 168 -2318 -1366 1018 1419 54
2369 54 -1387 -796 567 1250 1474 -432 -1841 604 2209 638 -320 -952 -795 1075 1367 -472 -2080
2386 -2080 -1396 1138 1158 -918 -1237 -1143 -67 2075 775 -1960 -1089 1102 1816 800 -963 -953 341
2403 341 1609 1597 -1154 -2178 570 1620 229 -606 -1574 -961 1336 1124 -979 -2015 -653 1549 909
2420 909 -781 -747 -665 647 2079 57 -1529 -3 1273 1258 357 -696 -540 229 1109 648 -1518 -1538
2438 -1538 504 224 -496 -536 -1544 -836 816 600 -541 -941 124 1442 1037 555 444 -270 1021 2217
2456 2217 98 -1018 -192 19 151 -173 -1475 -1700 -995 247 -48 -1793 -1185 539 517 922 668 -448
2474 -448 655 2310 1610 264 -225 531 1106 328 -508 -1290 -1849 -124 249 -1946 -1972 -753 -272 456
2492 456 179 -664 5 1261 2183 1164 -293 804 1627 892 667 -348 -1443 -44 475 -998 -1913
2509 -1913 -1591 -474 -16 -587 -642 -834 -109 1817 1204 -428 499 1456 1246 1229 174 -599 68 640 344
2528 344 -1273 -1860 -329 -13 -621 -440 -1170 -924 1087 1142 -151 -224 445 1326 1242 335 -60 -501 302 1266
2548 1266 -501 -1707 -576 -189 -66 -13 -1075 -1249 216 1208 800 -647 -508 1101 1218 795 244 -1193
2566 -1193 -440 1566 559 -1250 -1522 -759 549 535 -704 -1382 -1085 1094 2104 -156 -1171 280 1226
2583 1226 1835 936 -1289 -1125 912 1653 12 -2245 -1852 273 712 -19 -1467 -2451 59 2401 744
2600 744 -1128 -994 769 2542 1746 -405 -1276 -132 2276 1797 -1660 -2291 -493 640 962 -1000 -3064
2617 -3064 -1364 1358 1624 -379 -2040 -504 1907 2181 1088 -975 -1217 1750 2943 400 -1475 -1400
2633 -1400 165 1593 311 -1944 -2674 -958 1630 794 -1996 -2062 -393 1365 2279 119 -2007 -141
2649 -141 2538 2761 490 -1702 -707 1453 2070 652 -2547 -2803 729 1901 -435 -2537 -2876 -373
2665 -373 2331 1190 -1781 -2449 471 3731 2389 -967 -1480 456 3016 3203 -798 -3213 -674 2203
2681 2203 1799 -1588 -3958 -2151 938 1672 -669 -3893 -2415 2186 3027 448 -1590 -1125 2212 4344
2697 4344 1972 -1363 -1707 1412 3451 758 -2608 -2940 -1163 1315 717 -3165 -4129 -966 1678 1498
2713 1498 -998 -2280 41 3005 3712 1378 -1438 91 3342 3109 610 -1887 -2428 285 1727 -785
2729 -785 -3816 -4013 -967 1368 -246 -2479 -2573 -310 3382 3292 -287 -1182 1583 4097 3904 566 -1987
2746 -1987 -634 1894 2197 -1294 -4742 -3068 128 500 -1470 -3946 -3435 765 3087 984 -1570 -1005
2762 -1005 2802 4814 2739 -111 -867 1289 4000 1860 -2647 -3269 -1085 806 -22 -3266 -4537 -2124
2778 -2124 965 1323 -1401 -2774 187 3033 3163 1607 -537 244 3452 3756 977 -1513 -1512 760 1300
2795 1300 -818 -2989 -3521 -1442 978 -491 -2863 -2304 -227 1860 2090 30 -843 945 3082 3263
2811 3263 550 -1118 238 1593 1629 13 -2716 -2358 268 719 -1038 -2804 -2519 13 1317 434
2827 434 -1123 -1531 883 3077 1568 -439 -472 619 2344 2024 -654 -1661 -382 1348 1129 -1371
2843 -1371 -2362 -966 272 811 -464 -2374 -1190 1083 1202 81 -1062 -772 1074 1790 875 -516
2859 -516 -1013 848 1923 424 -610 -657 -309 1070 751 -1060 -1459 -588 581 550 -1008 -1383 -642 77
2877 77 1010 160 -1307 -280 1011 1065 745 -131 -250 871 1379 952 -280 -1022 202 715 -252 -626 -1311
2896 -1311 -1225 222 108 -1024 -1188 -651 441 779 50 -65 124 742 1797 963 -205 342 690 679 573
2915 573 -600 -1085 -396 -63 -204 -1171 -1531 -504 -162 -103 90 -556 -279 1144 1118 606 419 367 893 1049
2935 1049 551 54 -617 -323 466 -429 -1036 -745 -948 -431 180 -652 -824 -290 405 809 281 -32 499 622
2955 622 943 1012 -266 -272 560 254 28 -491 -968 -441 -52 -127 -442 -1052 -286 702 124 -28 63 -179 661
2976 661 1051 43 -283 -42 297 543 -155 -561 -320 -328 302 209 -861 -339 375 216 378 -44 -292 295
2996 295 572 411 -39 -592 129 411 -265 -158 -377 -736 273 359 -445 -351 -145 260 519 59 90 142 226
3017 226 761 292 -565 -45 139 -255 -33 -522 -767 -128 -58 -205 -463 -510 426 502 36 365 190 194 1034 510
3039 510 -235 114 146 229 -67 -695 -448 -336 -292 -40 -796 -893 244 220 -125 103 -52 374 973 574 169
3060 169 10 363 893 111 -557 -287 -411 -89 153 -1033 -1224 -245 152 209 -436 -650 208 792 859 444
3080 444 -444 189 1377 667 -119 -390 -503 386 650 -569 -1207 -964 139 709 -474 -1036 -350 331 1161
3099 1161 784 -781 -375 1018 1261 703 -651 -903 385 861 298 -1018 -1802 -247 1028 20 -923
3116 -923 -1160 -447 1279 1254 -399 -947 -57 1518 1615 -321 -1081 -352 661 1418 -124 -2044 -1062 560
3134 560 994 29 -1624 -1267 673 1465 750 -956 -1294 937 2109 789 -653 -1309 -98 1788 986
3151 986 -1295 -2019 -734 1273 1041 -1212 -1893 -832 1155 2027 -104 -1948 -382 1698 2154 580
3167 580 -1647 -1107 1240 1978 436 -2041 -2139 689 1747 62 -1723 -2308 -45 2349 1047 -1444
3183 -1444 -1825 231 2609 1948 -850 -1676 -211 2095 2173 -914 -2697 -765 1340 1566 -662 -2881
3199 -2881 -1564 1219 1880 48 -2325 -1471 1723 2538 752 -1332 -1625 1107 2970 935 -1643 -2030
3215 -2030 172 2203 912 -1968 -2590 -789 1804 1519 -1666 -2565 -304 1934 2176 -176 -2243 -443
3231 -443 2286 2587 275 -2260 -1244 1751 2004 75 -2347 -2474 651 2196 -66 -2393 -2262 265
3247 265 2467 1029 -1534 -1840 372 3029 2116 -1179 -1740 409 2280 2115 -836 -2724 -810 1597
3263 1597 1529 -1000 -3215 -1496 1308 1523 -308 -2422 -1673 1767 2715 454 -1465 -1152 1560 3133
3279 3133 1065 -1442 -1672 430 2469 831 -2301 -2470 -488 1245 906 -1919 -2884 -431 1648 1633
3295 1633 -600 -2009 85 2374 2343 548 -1386 -410 2225 2142 -144 -1800 -1592 568 1360 -666 -2524
3312 -2524 -2310 -132 1518 -31 -1971 -1305 523 2088 1760 -589 -902 1064 2532 1975 -242 -1455
3328 -1455 46 1276 828 -967 -2621 -1555 643 307 -1220 -2102 -1554 764 1569 83 -862 -309 1675
3345 1675 2658 1042 -349 -6 933 1860 822 -1446 -1515 -201 373 -244 -1969 -2329 -711 281 175 -765
3363 -765 -1451 269 1823 1304 499 -29 554 1993 1745 238 -517 -398 626 640 -1006 -1737 -1303 -774
3381 -774 -25 -783 -1851 -975 275 744 539 -213 141 1339 1612 1360 481 -46 929 1214 133 -420 -992
3400 -992 -790 -6 -681 -1492 -1455 -1012 -93 -43 -770 -310 243 807 1282 696 224 1062 1190 976 487 -233 44
3421 44 179 -314 -619 -1143 -1169 -342 -668 -1072 -667 -533 19 536 97 220 724 983 1238 702 273 699 660
3442 660 292 140 -716 -620 -152 -590 -909 -1049 -1072 -321 -233 -471 -187 -72 520 1165 454 321 861 789 1012
3463 1012 683 -202 -45 223 10 -347 -1045 -1014 -242 -415 -533 -691 -889 77 741 192 36 287 678 1260
3483 1260 808 148 185 210 628 389 -804 -793 -355 -348 -201 -770 -1216 -396 153 161 5 -418 216 1043 762 603
3505 603 192 55 871 835 -124 -364 -498 -122 225 -544 -979 -799 -363 266 21 -711 -198 437 649 854
3525 854 132 -150 620 819 488 26 -634 -94 206 -196 -445 -932 -831 152 -66 -541 -353 -272 361 733
3545 733 244 129 228 482 921 368 -322 67 15 -3 47 -619 -764 -230 -246 -180 -320 -576 -2 326 260 415
3567 415 54 162 776 468 201 177 -183 53 239 -260 -238 -492 -474 -151 -321 -472 -153 -253 82 412 66
3588 66 182 354 218 537 426 144 215 -13 6 235 -281 -392 -216 -502 -94 10 -549 -331 -47 40 400
3609 400 1 -136 290 345 581 416 -319 -27 419 224 114 -401 -676 35 204 -111 -481 -748 -30 584
3629 584 95 -239 -269 -141 831 801 -155 -281 12 572 791 -179 -655 -227 251 659 -6 -1103 -524 287
3649 287 419 140 -820 -839 374 835 324 -458 -871 356 1067 445 -306 -789 -192 1151 708 -660 -951
3668 -951 -364 691 811 -643 -1169 -557 451 1115 -189 -1289 -424 717 1124 500 -937 -684 921
3685 921 1341 489 -850 -1202 430 1162 271 -982 -1548 -242 1275 468 -1003 -1281 -316 1238 1172 -536
3703 -536 -1131 -66 1360 1663 -170 -1364 -345 1002 1325 -66 -1801 -1167 676 1036 -141 -1649
3719 -1649 -1401 650 1438 433 -894 -1239 707 2140 960 -709 -1066 169 1779 1052 -1077 -1660
3735 -1660 -554 1048 892 -1183 -2052 -652 903 1318 -289 -1694 -463 1537 1818 457 -1152 -638
3751 -638 1385 1813 361 -1456 -1592 429 1394 -150 -1730 -1890 -243 1500 622 -1318 -1382 215 2099
3768 2099 1595 -586 -1055 424 1864 1760 -414 -1811 -445 1113 983 -843 -2462 -1417 740 975
3784 975 -382 -1827 -1219 1294 2019 476 -875 -655 1222 2508 946 -1126 -1126 315 1540 373 -1877
3801 -1877 -2001 -564 787 521 -1579 -2101 -184 1501 1343 -163 -1177 290 2212 1949 313 -1194
3817 -1194 -336 1585 1277 -616 -1908 -1566 179 869 -810 -2152 -1541 224 1507 348 -1133 -577
3833 -577 1035 2149 1557 -544 -643 1054 1733 895 -1007 -1764 -377 765 75 -1462 -2278 -942 816
3850 816 480 -749 -1200 -267 1672 1947 211 -489 239 1613 1957 152 -1204 -653 439 790 -458
3867 -458 -2143 -1647 -101 392 -236 -1413 -1327 493 1507 852 -222 -480 1030 2133 1145 -170 -656
3884 -656 117 1246 533 -1234 -1572 -817 320 193 -1314 -1746 -548 606 963 -136 -947 236 1581
3901 1581 1530 622 -519 -60 1280 1207 -41 -1101 -1055 252 533 -660 -1529 -1366 -207 767 -78 -1076
3919 -1076 -611 542 1371 954 -381 -189 816 1410 1029 -423 -943 194 769 127 -827 -1503 -598 471
3937 471 110 -816 -1220 -390 978 898 -209 -455 33 1259 1442 44 -643 -44 696 858 -155 -1274
3955 -1274 -709 151 366 -298 -1401 -1028 363 625 106 -607 -670 630 1280 523 -252 -467 439 1305 446
3974 446 -619 -692 -169 739 358 -1042 -1147 -265 469 524 -571 -1071 -104 830 838 69 -828 -73 1099 938
3994 938 78 -760 -560 644 744 -320 -969 -860 193 752 -206 -1002 -664 211 993 407 -762 -426 470
4013 470 1035 680 -489 -714 302 802 512 -516 -1077 -101 685 248 -443 -984 -413 738 668 -309 -664
4032 -664 -286 764 1001 -120 -609 -248 508 975 4 -927 -516 185 596 105 -932 -777 188 557 241
4051 241 -633 -772 315 829 447 -189 -618 54 1024 495 -289 -643 -275 597 537 -416 -761 -390 251 604
4071 604 -279 -796 -277 312 599 268 -587 -221 462 643 422 -362 -526 325 502 169 -339 -735 -99 537
4091 537 95 -419 -581 -272 438 344 -241 -269 -156 457 800 -8 -267 69 311 641 213 -492 -216 119 279
4112 279 101 -551 -583 1 35 19 -281 -618 -85 457 213 76 -234 -22 620 468 183 -27 -103 310 440
4133 440 -143 -308 -338 -249 148 -65 -498 -484 -282 70 309 -187 -219 82 316 617 415 -136 173 431 386 345
4155 345 -286 -367 5 -29 -109 -463 -818 -320 108 -95 -145 -458 -314 564 535 243 117 11 594 808 305 -50
4177 -50 -237 -68 441 -96 -780 -680 -441 -37 120 -606 -669 -184 335 629 114 -253 295 864 855 575 -258
4198 -258 -192 531 489 0 -662 -963 -152 199 -393 -768 -929 -234 692 326 -297 -236 216 1025 1127 64 -213
4219 -213 195 796 822 -288 -991 -457 123 201 -421 -1357 -905 223 407 69 -603 -546 799 1228 628 -95
4239 -95 -304 606 1350 543 -554 -819 -305 578 231 -1124 -1371 -605 320 484 -679 -1080 -23 922 1223
4258 1223 354 -626 130 1228 1143 338 -781 -664 513 632 -327 -1303 -1372 -52 675 -275 -1054 -896 158
4277 158 1314 792 -348 -315 547 1514 1213 -304 -808 25 827 709 -731 -1723 -705 358 262 -707 -1538
4296 -1538 -746 868 1020 140 -621 -308 1254 1713 508 -465 -460 600 1391 180 -1271 -1200 -256 697 -21
4315 -21 -1493 -1433 -104 805 744 -667 -1030 492 1509 1241 54 -768 243 1494 1028 -318 -1300 -769
4333 -769 669 485 -873 -1586 -1221 237 914 -349 -1211 -546 765 1596 688 -579 -192 1025 1620 848
4351 848 -870 -983 303 851 220 -1234 -1738 -427 694 120 -917 -1404 -238 1344 1025 -142 -588
4368 -588 156 1600 1570 -28 -749 -186 845 1068 -413 -1595 -1013 110 632 -369 -1724 -1169 431
4385 431 1006 396 -782 -713 929 1762 924 -319 -649 612 1566 610 -839 -1267 -485 828 328 -1335
4403 -1335 -1611 -634 607 768 -686 -1289 -54 1178 1444 176 -882 90 1375 1370 234 -1077 -821
4420 -821 703 835 -376 -1519 -1418 30 777 -236 -1336 -1174 218 1444 661 -617 -477 678 1680
4437 1680 1198 -414 -852 322 1039 727 -862 -1643 -525 489 237 -843 -1725 -805 859 786 -241
4454 -241 -929 -307 1299 1597 330 -502 -265 951 1547 106 -1133 -938 72 854 -127 -1581 -1421 -99
4472 -99 726 274 -1022 -1101 390 1361 899 -103 -672 427 1637 1089 -168 -924 -314 893 589 -785
4490 -785 -1420 -936 373 649 -633 -1366 -681 581 1211 213 -798 -206 1035 1501 760 -689 -531 683
4508 683 996 321 -969 -1351 -89 658 -58 -1050 -1390 -318 963 594 -550 -753 145 1383 1280 -132
4526 -132 -497 117 1035 1154 -227 -1165 -444 369 517 -441 -1417 -894 254 567 22 -935 -798 702 1174
4545 1174 399 -348 -441 607 1365 501 -505 -698 -61 817 213 -1031 -1072 -463 393 461 -661 -1077 -183
4564 -183 645 819 59 -648 36 1041 981 386 -580 -345 738 691 -128 -848 -961 63 549 -236 -854 -803
4584 -803 33 846 300 -472 -331 242 977 801 -304 -476 248 673 579 -320 -942 -269 282 237 -380 -1056
4604 -1056 -561 439 343 -91 -520 -368 598 862 178 -157 -178 480 860 213 -480 -465 -74 414 117 -724
4624 -724 -678 -187 166 228 -396 -682 47 481 499 106 -439 134 766 537 203 -325 -295 384 305 -162 -544 -564
4646 -564 -33 304 -222 -445 -398 -47 524 269 -221 -71 255 583 636 16 -249 107 313 357 -170 -581 -222
4667 -222 11 21 -203 -584 -463 155 170 19 -173 -226 382 663 243 87 -74 190 598 261 -154 -280 -243
4688 -243 70 70 -456 -568 -269 -68 240 -121 -409 -42 211 370 414 -38 43 514 384 318 -74 -339 55 138
4710 138 -92 -322 -608 -446 119 -73 -300 -386 -312 300 487 71 -35 84 347 727 332 -154 16 99 306
4731 306 165 -492 -531 -146 -83 62 -436 -689 -61 264 262 33 -312 40 724 516 236 -86 -56 523 582 -25
4753 -25 -417 -461 -133 276 -292 -732 -586 -200 309 109 -458 -349 243 567 629 -38 -248 342 625 605 21
4774 21 -534 -199 382 189 -225 -749 -679 179 206 -322 -562 -532 321 747 177 -251 -101 412 907 491 -383
4795 -383 -204 134 635 371 -606 -753 -135 286 155 -590 -944 -171 399 335 -82 -582 -140 883 767 155
4815 155 -315 -239 673 938 2 -556 -501 188 604 -139 -959 -736 -6 591 152 -809 -641 225 769 607 -314
4836 -314 -545 388 985 686 -97 -737 -74 771 440 -424 -992 -550 464 444 -469 -966 -624 441 854 -54
4856 -54 -743 -315 601 1113 445 -631 -334 541 948 438 -736 -819 193 668 215 -774 -1166 -153 701
4875 701 287 -528 -964 -243 999 765 -279 -689 -164 1016 1012 -162 -820 -373 510 938 -112 -1190 -701
4894 -701 351 745 21 -1111 -918 371 910 396 -710 -754 466 1214 565 -448 -840 170 1246 574
4912 574 -581 -961 -279 869 625 -722 -1172 -417 606 796 -309 -1046 -314 762 1084 131 -969 -490
4930 -490 825 1110 290 -925 -835 457 921 85 -967 -1075 107 978 243 -779 -958 35 1203 707
4948 707 -545 -802 54 1136 1019 -368 -1006 -130 778 838 -385 -1334 -594 583 684 -154 -1219 -722
4966 -722 696 972 178 -786 -637 613 1259 368 -707 -709 277 1102 353 -892 -1002 -179 859 489 -887
4985 -887 -1177 -100 852 805 -372 -1006 15 1112 1017 26 -920 -175 1014 893 -114 -1009 -787 462
5003 462 838 -247 -1177 -972 246 927 57 -942 -663 329 1219 679 -599 -553 423 1108 730 -550 -944
5022 -944 12 745 463 -572 -1375 -499 536 389 -390 -1059 -505 809 944 11 -561 -239 876 1291 258
5041 258 -614 -420 353 928 124 -1080 -907 -43 513 66 -1023 -1016 -4 664 483 -449 -733 280 1042
5060 1042 825 4 -600 -29 916 659 -251 -871 -554 383 434 -539 -978 -745 139 691 -107 -787 -391 399
5080 399 954 478 -411 -277 568 910 558 -417 -668 141 514 117 -576 -1013 -332 422 86 -508 -713 -281
5100 -281 706 649 -94 -327 16 698 889 58 -442 -157 333 519 -79 -860 -569 44 286 -34 -739 -575
5120 -575 144 486 243 -268 -389 392 864 452 -19 -290 65 649 322 -373 -546 -422 181 183 -474 -661 -294
5141 -294 129 407 -22 -450 -47 483 643 388 -239 -147 536 456 133 -387 -507 31 258 -158 -484 -586 -207
5162 -207 341 23 -262 -295 68 622 516 -23 -70 95 437 549 -63 -406 -136 97 159 -309 -732 -488 -24
5183 -24 -39 -84 -430 -350 281 392 228 75 3 473 674 322 37 -131 -35 342 53 -442 -458 -313 -88 49
5205 49 -491 -486 -138 76 339 60 -110 162 484 511 393 -49 -4 383 265 25 -229 -450 -105 52 -318 -505
5227 -505 -538 -246 180 34 -212 -102 26 455 510 49 91 222 346 464 100 -262 -29 28 82 -142 -525 -423
5249 -423 -44 -125 -94 -331 -346 156 314 149 32 -60 209 558 244 45 -75 7 331 183 -355 -381 -278 -25
5271 -25 133 -295 -510 -211 -8 177 62 -355 -63 281 367 292 -66 -75 316 360 136 -78 -314 59 226 21
5293 21 -249 -368 -257 233 158 -265 -305 -186 260 446 -79 -250 -51 287 446 93 -363 -25 222 267 159
5314 159 -425 -350 84 208 77 -328 -473 68 400 142 -116 -351 -56 510 348 -128 -303 -119 424 406 -182
5335 -182 -407 -207 235 404 -93 -581 -167 136 460 179 -437 -374 256 448 271 -294 -458 219 462 241
5355 241 -262 -574 -77 527 211 -297 -552 -242 449 468 -188 -406 -155 475 713 -15 -473 -94 307 592
5375 592 121 -622 -394 220 437 143 -593 -672 139 435 197 -476 -705 117 751 422 -204 -428 54 772
5395 772 598 -197 -519 -217 448 532 -331 -740 -365 173 460 -186 -859 -448 356 695 262 -525 -383 562
5415 562 845 470 -259 -503 300 833 353 -427 -732 -213 611 186 -608 -905 -396 450 477 -399 -757 -169
5435 -169 586 891 78 -579 -108 668 932 245 -659 -407 381 582 71 -806 -890 84 519 41 -665 -861
5455 -861 4 836 460 -278 -535 67 1035 813 -144 -511 -68 754 764 -305 -922 -382 297 496 -257 -1055
5475 -1055 -699 210 565 65 -766 -585 554 894 365 -363 -509 442 1011 427 -374 -656 -38 821 355
5494 355 -610 -867 -349 508 451 -520 -829 -271 516 754 -46 -744 -154 678 836 226 -647 -437 547 687
5514 687 157 -695 -789 192 640 5 -627 -786 -39 751 257 -462 -589 44 821 647 -342 -582 -67 626
5534 626 631 -212 -779 -237 452 515 -133 -835 -427 463 610 99 -532 -485 431 740 177 -462 -587 131 705
5555 705 170 -581 -635 -114 610 212 -611 -606 -86 526 589 -276 -548 57 553 636 -11 -588 -104 521 461 -64
5577 -64 -718 -507 256 334 -99 -638 -566 141 607 94 -323 -334 296 842 393 -176 -227 166 616 436 -373 -560
5599 -560 -163 199 115 -486 -880 -318 194 193 -196 -614 -208 578 650 230 -145 -16 580 735 218 -161 -278
5620 -278 137 473 -162 -669 -537 -224 156 -8 -639 -565 -53 384 345 -98 -244 350 600 561 150 -242 58
5641 58 491 245 -192 -479 -450 28 -8 -397 -552 -425 19 210 -110 -298 -104 246 607 320 -54 92 309
5662 309 475 395 -189 -280 82 70 52 -360 -570 -134 121 -58 -210 -351 -127 322 189 -6 6 51 401 433
5684 433 -6 -74 -21 147 257 -110 -433 -162 4 41 -47 -391 -233 75 160 96 -224 -196 172 267 101 -1 -171
5707 -171 65 326 62 -132 -173 -71 225 88 -266 -156 -76 134 234 -181 -235 -23 126 213 -4 -287 -27
5728 -27 175 127 -10 -271 -226 145 158 -35 -131 -231 131 325 -37 -86 -76 61 403 42 -187 -96 -46 121 86
5751 86 -262 -207 14 66 98 -146 -304 14 194 136 23 -191 -16 291 181 46 -149 -177 167 112 -150 -208 -264
5774 -264 -102 204 -100 -274 -150 -24 285 188 -200 -107 88 271 341 -23 -196 153 237 173 26 -286 -65 151
5796 151 80 -60 -280 -292 120 151 -59 -219 -164 115 269 19 -160 -68 78 404 120 -223 -161 -7 213 165
5818 165 -276 -253 -7 164 203 -152 -439 -55 204 137 -13 -322 -130 291 255 28 -186 -173 284 333 47 -174
5840 -174 -170 53 340 51 -269 -230 -50 279 163 -288 -372 -40 183 222 -141 -331 -22 213 231 35 -365 -184
5862 -184 344 268 49 -245 -306 213 357 60 -236 -301 71 379 80 -257 -319 -60 311 226 -283 -293 -60 207
5884 207 376 -152 -364 -63 264 274 4 -414 -173 316 257 93 -389 -243 231 332 -40 -307 -401 88 403
5905 403 34 -324 -376 -80 418 190 -286 -292 -43 377 393 -172 -328 28 293 462 -24 -526 -117 268 380
5926 380 15 -448 -313 219 294 25 -366 -408 88 440 65 -207 -365 43 483 298 -245 -276 -76 412 362
5947 362 -238 -425 -120 284 358 -171 -501 -255 208 326 9 -499 -306 273 412 128 -273 -319 239 542 224
5968 224 -215 -406 83 513 195 -326 -429 -142 380 209 -375 -467 -240 301 341 -187 -507 -71 324 443 163
5989 163 -423 -162 370 443 117 -297 -327 235 430 79 -292 -427 58 434 48 -346 -480 -170 418 272 -236
6010 -236 -368 -41 382 454 -158 -328 8 374 497 27 -423 -160 207 376 109 -519 -447 99 292 -11 -337
6031 -337 -643 78 591 -181 -316 -43 94 445 400 -116 -497 -69 278 321 -273 -449 -234 105 341 -44 -362
6052 -362 -328 263 533 -223 -345 -345 202 421 54 -265 -319 243 591 125 -290 -179 47 501 80 -89 -226
6073 -226 -103 172 176 -323 -331 -267 234 159 -136 -260 -272 270 373 124 24 -36 442 498 141 -195 -273 277 153
6096 153 17 -202 -664 -81 362 -37 -404 -289 -182 144 251 -49 -23 -75 212 341 46 74 314 125 282
6117 282 -24 -352 -96 265 179 16 -157 -349 269 -18 -26 -82 -70 226 284 58 -22 -23 368 415 353 -42 -169 70
6141 70 158 170 -161 -275 7 -45 -138 -352 -360 -87 19 66 8 -284 -24 212 261 195 20 -4 377 476 48 27 111
6166 111 33 242 -95 -204 -229 -332 88 -196 -136 -206 -213 -51 253 -245 53 106 153 229 203 -107 36 228 -82
6189 -82 -75 -64 -289 127 -44 -84 -50 -193 65 -122 -344 -37 -84 69 129 105 -132 14 90 242 111 -98 -45 193
6213 193 64 47 -122 -158 98 106 -64 -65 -152 21 58 9 -173 -27 -185 172 101 -36 93 151 148 34 16 -140 102
6238 102 102 93 -17 -200 -12 -120 74 -208 -239 -145 101 67 -104 -48 -131 93 182 51 -79 -91 120 287 91 -63
6262 -63 2 97 179 114 -166 -218 -39 2 -18 -188 -296 -100 71 4 -101 -212 -64 236 218 3 12 -63 257 236 30
6287 30 -86 -117 93 212 12 -292 -240 -91 151 16 -248 -218 27 209 210 -96 -103 172 265 279 73 -150 3
6310 3 214 95 -62 -290 -271 29 76 -269 -350 -224 32 217 -76 -202 13 212 371 232 -119 11 146 237
6332 237 139 -179 -206 39 112 41 -182 -422 -113 115 -14 -79 -255 -45 335 311 10 -40 -10 330 403 133 -118
6355 -118 -89 30 257 -56 -396 -250 -92 64 -15 -358 -274 17 203 159 -116 -218 76 341 286 70 -177 4
6377 4 320 237 -50 -249 -187 177 112 -173 -275 -293 6 213 -56 -212 -169 97 285 196 -207 -126 125 308 229
6400 229 -174 -267 40 160 127 -180 -427 -123 123 116 -173 -314 -196 197 266 -54 -146 -151 176 391 45 -127 -95
6423 -95 72 345 108 -257 -204 40 195 150 -319 -320 1 166 156 -140 -349 -4 265 223 -1 -241 -140 307
6445 307 297 -11 -145 -154 220 337 -57 -293 -241 -35 236 -16 -305 -292 -73 175 102 -203 -216 117 289 261 55
6468 55 -258 82 281 209 82 -239 -163 284 189 -80 -311 -280 95 122 -125 -284 -282 -2 287 19 -207 -145 78
6491 78 301 192 -159 -65 76 289 255 -123 -241 -59 133 49 -83 -402 -117 117 41 -54 -180 -136 210 221 30
6514 30 -136 -138 148 424 106 -90 -86 59 277 129 -203 -194 -38 66 61 -241 -303 -72 88 48 -111 -252 28 158
6538 158 186 111 -123 -57 210 182 89 -84 -120 107 210 -68 -215 -144 -77 155 -3 -232 -123 -1 202 173 -133
6561 -133 -115 53 137 175 -12 -136 83 168 141 19 -207 -119 117 18 -92 -195 -238 80 46 -128 -123 -184 -16 224
6585 224 26 -11 13 51 209 178 -115 -14 57 119 166 -140 -177 33 -21 11 -86 -217 -78 86 -34 -13 -147 -75
6609 -75 113 105 -14 7 -80 75 212 -21 -17 -28 23 140 44 -180 -127 -39 -40 -20 -124 -74 -35 -2 40 -50 -108 50 154
6636 154 95 118 -40 41 166 115 12 30 -84 94 67 -98 -139 -103 -38 5 -91 -206 -42 -26 -5 38 -67 27 103
6661 103 103 114 -32 0 95 108 -10 46 -90 -4 83 -113 -125 -77 -118 81 21 -146 -48 12 47 111 10 -25 119 51
6687 51 121 101 -58 33 60 3 -15 -102 -84 -11 -94 -111 -72 -160 -5 73 -48 7 11 31 193 46 -20 30 -5 37 126 -85
6715 -85 -15 28 -22 29 -72 -171 -60 29 -29 -2 -178 -88 183 86 5 -2 -89 162 138 -65 10 -55 13 114 -90 -155 -120
6742 -120 -46 57 -4 -113 -73 -21 30 56 -144 -100 87 85 88 22 -111 54 158 55 -1 -62 -102 125 53 -54 -107 -105
6768 -105 106 149 -47 -125 -5 68 172 28 -120 4 43 63 59 -191 -103 32 25 -16 -62 -198 -46 121 13 -60
6792 -60 -137 -118 174 99 -35 -105 -79 138 172 -17 -105 3 46 143 -17 -145 -121 -13 67 89 -165 -101 43 113 55
6817 55 -123 -179 118 142 93 -54 -168 23 187 132 -50 -127 -120 173 80 -142 -159 -98 41 176 -40 -229 -126 15
6841 15 139 39 -194 -50 86 225 140 -45 -125 186 157 99 -17 -151 46 158 34 -97 -265 -187 63 32
6863 32 -150 -199 -156 39 223 -5 -108 -18 128 315 126 -77 -78 76 221 106 -231 -190 -4 90 28 -220 -357
6886 -357 -87 152 102 -74 -235 19 368 223 59 -72 -25 263 303 -2 -208 -136 69 201 -111 -310 -200
6907 -200 -35 128 11 -311 -229 79 157 156 -153 -191 205 306 200 13 -122 54 296 123 -38 -209 -156 159
6929 159 117 -197 -244 -200 80 201 -51 -239 -75 87 252 148 -132 -17 130 258 208 -134 -197 5 120 46
6951 46 -159 -305 -119 130 -28 -144 -300 -213 157 70 -111 -149 -128 217 290 11 -65 -63 154 274 56 -213 -84
6974 -84 147 228 49 -306 -227 44 193 16 -207 -275 6 210 37 -97 -205 9 259 158 -108 -224 -1
6995 -1 320 268 -119 -173 -55 98 210 -53 -268 -85 29 146 12 -326 -174 103 89 113 -145 -111 195 291 156
7018 156 -27 -94 106 339 135 -85 -91 -10 177 60 -162 -210 -130 28 72 -211 -199 -84 60 142 -19 -168 -15
7041 -15 137 216 179 -73 -31 139 151 40 -129 -157 9 117 -50 -233 -240 -66 142 7 -135 -156 -28 208 231
7064 231 -54 -67 125 253 278 83 -183 59 78 118 -73 -234 -146 7 -16 -127 -214 -209 60 111 -77 -150 -112 103
7088 103 257 89 -56 -28 70 255 95 -102 -66 4 83 53 -210 -204 -61 7 53 -95 -222 24 126 101 65 -72
7112 -72 67 225 186 9 -18 -39 69 191 -49 -182 -122 -45 93 -65 -184 -108 -17 35 64 -120 -50 105 89 95 -8
7137 -8 -54 95 176 84 7 -102 -43 153 -6 -69 -100 -114 116 24 -80 -55 -28 111 116 -16 -85 9 78 119 31 -147 -74
7164 -74 134 50 47 -154 -121 49 84 -54 -121 -155 -8 133 11 8 -104 67 121 91 -103 -113 -1 107 150 -56 -91
7189 -91 26 88 130 -25 -132 -8 111 60 7 -73 -80 159 69 -8 -9 -107 40 126 -10 -43 -65 2 102 -9 -138 -50
7215 -50 -57 77 68 -56 -40 37 47 150 4 -108 45 110 116 -14 -149 -76 87 43 3 -112 -122 75 109 -52 -56 -94
7241 -94 13 147 27 -110 -45 -56 94 58 -50 -42 22 64 114 -46 -44 -17 50 50 -27 -138 -29 71 35 -16 -63 -69 62
7268 62 91 -21 -3 -34 93 103 29 12 32 66 78 47 -115 -164 -47 41 67 -83 -176 -108 -26 21 -5 -101 -48 107 66
7295 66 61 -71 -43 72 93 46 -13 -95 68 103 -42 -14 -124 -18 66 -14 -99 -93 -43 104 84 -21 -48 -8 59 199 -16
7322 -16 -54 -20 75 109 93 -141 -102 -10 6 -29 -113 -143 -57 51 9 -77 -150 -4 115 48 -30 -88 -46 161 46 27 -41
7349 -41 -59 85 174 34 -87 3 17 65 42 -170 -110 -21 125 57 -85 -139 62 114 51 18 -103 44 157 99 34
7374 34 -66 -23 140 107 -74 -130 -112 21 154 -47 -173 -136 36 70 -26 -137 -26 11 173 192 -74 -26 106 193
7398 193 117 -39 -129 46 121 57 6 -218 -92 109 7 -125 -153 -132 99 60 -45 -186 -33 70 136 79 -129
7421 -129 -27 59 214 91 -161 -139 95 115 48 -146 -200 -40 117 -17 -96 -239 -46 167 124 -34 -48 45 233
7444 233 268 82 -43 9 181 249 -33 -132 -63 2 90 -49 -193 -219 -62 97 -25 -180 -236 43 136 106 -15 -130
7468 -130 35 218 110 -10 -107 35 243 136 -145 -155 -171 88 96 -84 -196 -48 1 123 -19 -190 -37 151
7490 151 217 88 -98 -135 159 240 91 -129 -192 50 126 -4 -167 -267 -129 147 -51 -154 -188 -107 133 138 -134
7513 -134 -81 28 209 290 -57 -108 44 136 192 54 -193 -135 120 97 -29 -157 -192 100 73 -18 -220 -166 11 232
7537 232 49 -154 -102 69 236 189 -72 -65 26 207 66 -188 -293 -45 82 91 -140 -289 -141 67 116 -60 -225
7560 -225 -128 174 168 43 -28 -128 199 257 112 -23 -59 104 208 73 -194 -96 19 144 59 -213 -229 -23 136
7583 136 86 -145 -255 86 143 99 -30 -168 -11 201 151 -18 -170 -90 170 162 -55 -160 -110 80 202 3 -185
7606 -185 -104 61 166 32 -199 -147 167 170 112 -107 -91 125 184 117 -121 -198 -5 184 92 -77 -180 -77 119
7629 119 21 -123 -103 -149 117 119 -30 -196 -27 93 222 53 -125 -1 119 201 81 -193 -119 100 114 66 -124
7652 -124 -219 28 167 55 -106 -208 -80 229 72 -104 -114 -33 159 175 -53 -168 -30 132 154 -81 -151 -44
7674 -44 9 138 -51 -206 -132 73 117 11 -115 -166 55 147 52 -104 -139 65 239 56 -29 -76 10 188 71 -72
7698 -72 -59 3 94 121 -101 -92 -16 75 87 -89 -252 -80 13 61 32 -177 -87 109 103 16 -49 -111 58 206 9 -21 -75
7725 -75 31 175 -20 -185 -125 -89 111 90 -132 -136 -28 101 78 1 -124 37 131 101 68 -102 26 168 42 4
7749 4 -136 -119 20 53 -57 -72 -211 -85 127 -69 -134 -36 59 83 88 -57 14 80 114 62 -32 -59 14 75 44 -40 -180
7776 -180 35 78 45 49 -96 -109 -2 36 -6 9 -76 78 153 0 -25 -35 20 95 26 -74 -95 -58 14 7 -114 -86 24
7803 24 3 -24 51 -113 -7 52 23 32 -75 -18 77 62 -2 -4 -63 -1 109 -26 19 -35 42 117 60 -10 28 -22 78 68
7831 68 -45 -71 -29 -22 15 -26 -115 -34 -29 -12 40 -7 -25 49 0 -1 -26 -72 35 74 0 -64 -75 -50 47 -26 -108 -38 -87 3 35
7862 35 -68 -29 -4 35 112 57 6 5 85 73 61 -49 -17 42 -3 24 -61 -96 -3 -5 -94 -127 -105 -89 -7 22 -17 16 21 90 134
7893 134 10 80 -3 37 171 -24 -46 3 -36 23 -33 -160 -58 -22 -65 13 -81 -110 49 93 71 49 -57 109 140 28
7919 28 64 -28 21 88 68 -70 -138 -102 -18 -28 -111 -129 -62 -25 50 21 -66 5 36 107 124 -41 33 153 152 106 19 -118 69
7948 69 57 -1 -14 -132 -73 30 -22 -88 -87 -111 70 48 -55 -14 1 57 144 26 -45 16 37 74 65 -89 -84 -21 -17 14 -168
7977 -168 -168 12 15 6 -82 -143 42 173 60 24 -14 -5 169 125 -58 -4 -20 41 103 -64 -170 -26 45 25 -66 -150 -86
8004 -86 44 91 67 -153 -115 89 147 94 -95 -108 16 150 38 -67 -137 -39 118 27 -188 -136 -87 141 73 -95
8028 -95 -155 -16 79 129 14 -178 -39 146 117 14 -152 -71 134 133 -32 -69 -83 81 192 9 -73 -100 -59 151
8052 151 26 -207 -151 -21 77 85 -104 -131 0 81 117 -70 -129 34 151 152 28 -200 11 155 95 43 -141 -190
8076 -190 82 131 -24 -162 -165 103 172 -32 -120 -89 -28 235 44 -151 -82 78 152 143 -111 -155 14 117 60 -124
8100 -124 -174 -40 64 30 -126 -277 -105 146 117 -24 -93 16 145 228 9 -60 -81 128 298 34 -98 -117 -26
8123 -26 171 58 -218 -190 17 32 56 -112 -226 -18 188 133 -26 -143 69 206 128 -45 -154 -14 190 100
8145 100 -42 -184 -154 3 144 -54 -212 -144 39 179 -9 -153 -83 129 192 120 -41 -112 139 125 95 -36 -190
8168 -190 31 208 37 -102 -228 -98 78 54 -115 -166 -71 149 164 -46 -147 -21 132 170 39 -154 -70 51
8190 51 184
8191A84
$$ Imaginary data points
##PAGE= N=2
##DATA TABLE= (X++(I..I)), XYDATA
0 0 0 0 0 0 0 0 0 0 0 0 0 0 -8 8 -8 8 -9 16 -16 24 -24 32 -40 41 -49 57 -72 80 -90 105 -121 137 -154 177
34 177 -196 221 -251 282 -314 348 -388 430 -479 527 -584 648 -712 786 -866 955 -1052 1159
52 1159 -1278 1409 -1558 1725 -1916 2136 -2391 2691 -3055 3501 -4063 4803 -5818 7305 -9702
67 -9702 14209 -25652 118730 181722 -36839 4258 58166 48122 2766 -63879 -184985 -135319
79 -135319 4950 -39891 -204395 -158547 -19876 3744 -4188 16290 -20183 25015 169346
90 169346 165813 23473 32350 136529 113415 37301 28524 -17454 -65868 -9270 -4042 -128473
102 -128473 -145169 -46820 -55475 -105703 -50767 -17057 -46857 2740 76283 40477 24265 100285
114 100285 95568 29691 74659 110383 16824 -24071 30724 9909 -46958 -34599 -52301 -107143
126 -107143 -55231 15273 -58693 -118467 -23868 41374 4625 6306 18045 -6969 49674 127040
138 127040 49623 -48368 19672 99706 43438 -18231 -22061 -41124 -17108 48091 -14273 -126439
150 -126439 -65288 47155 10717 -56932 -41833 -21899 4141 63338 36354 -61586 -25099 94958
162 94958 70267 -22486 -12103 17748 14821 45150 32345 -56810 -51787 49125 40466 -53027
174 -53027 -49044 506 -10954 -5402 14484 -39483 -56018 31227 45023 -33690 -27898 30000 15007
187 15007 627 34328 15244 -23220 24577 54600 -9933 -21300 33096 8358 -32873 6560
199 6560 12605 -40132 -26684 11774 -23186 -40207 8554 803 -44569 -1413 42893 -6594 -19740
212 -19740 33007 25458 943 35703 30797 -21345 4327 54325 6261 -43135 -3203 11530
224 11530 -25727 -12800 -2681 -49819 -34509 31191 2769 -52034 -10780 31542 5701 5123
236 5123 27905 -541 -4985 54024 43136 -27690 -8579 40318 6448 -18721 3435 -16802
248 -16802 -37818 5579 12557 -47688 -42787 18060 5190 -28496 3555 12506 -14651 18570 46045
261 46045 -4314 -14978 39633 33307 -12132 4119 20977 -14323 -11649 21062 -14465 -46034
273 -46034 1324 12091 -35475 -22440 12822 -12761 -18557 22248 11989 -21358 12757 40406
285 40406 -716 -6853 33646 14273 -15836 17208 18727 -26309 -11637 19498 -15792 -34932
297 -34932 3457 1917 -32100 -8124 16851 -18083 -17092 28199 11074 -18117 18953 31109 -7027
310 -7027 2990 31846 1865 -16729 17822 12395 -28830 -10028 15752 -20919 -28454 9739 -5889
323 -5889 -32002 3885 17010 -18568 -7036 29244 7811 -11038 23457 25018 -11081 7216
335 7216 30512 -7987 -17737 18934 2634 -30350 -4784 6751 -27094 -20366 11966 -9526 -28085
348 -28085 10285 17858 -16688 1529 30970 2069 -4285 30580 16456 -13627 12485 25525
360 25525 -12522 -15954 13434 -6104 -29659 -455 1605 -33814 -14505 15992 -13604 -23311 14456
373 14456 12512 -11132 12195 27533 -2189 1660 35752 14236 -16040 12678 20536 -15425 -8881
386 -8881 10171 -19416 -27508 6107 -3495 -36357 -14176 11949 -12553 -15459 16040 5128 -10950
399 -10950 23970 30143 -7047 4729 35561 11931 -6739 15813 9805 -18267 -2174 11567
411 11567 -24292 -31047 3504 -8609 -34537 -7334 4596 -21620 -8212 21008 2559 -7887
423 -7887 24128 26197 -770 16037 35831 3552 -6559 23984 10720 -19857 -4271 -569 -28554
436 -28554 -18578 4003 -23430 -41502 -4383 10145 -17110 -10343 12075 460 9402 39918 16503
449 16503 -12802 22735 46772 11338 -8163 5005 -844 -5199 10966 -11517 -52535 -24547
461 -24547 18117 -11740 -42593 -19714 -3781 208 19658 9838 -22135 4141 56440 36661
473 36661 -11063 1456 27009 19357 17859 6077 -33353 -24826 22973 6422 -47612 -40886 -4431
486 -4431 -3376 -8472 -5636 -22727 -17685 32224 37090 -11674 -8797 32399 29601 13153 16178 1508
500 1508 -11342 14505 21652 -20842 -33246 -15 -1757 -24747 -10954 -5293 -24810 -8989 15845
513 15845 -2691 -11277 15508 15806 -3806 14093 31289 2080 -10812 16349 15505 -5041 1710
526 1710 -4202 -25515 -2397 23117 -12028 -40855 -8623 18558 4312 -5797 -8804 -17611 8436
539 8436 42862 6777 -40628 -8075 36642 20892 -7807 -17738 -18473 8544 39582 6544 -49137
552 -49137 -23436 38816 29976 -13909 -23318 -14497 9466 38736 10160 -47905 -30215 33874 32105
565 32105 -19185 -33024 -12974 7342 27804 13000 -37003 -28876 36040 41925 -8329 -20236
577 -20236 2848 16165 24354 15908 -21399 -28543 17073 27683 -19442 -33430 -7211 -3530 -5532
590 -5532 2139 -14774 -26319 6005 25151 -285 -7640 16802 16519 3891 19956 22539 -4097
603 -4097 -1636 15383 -278 -9703 2663 -12292 -33312 -10713 9919 -15928 -33515 -11416 2639
616 2639 3442 14091 2565 -18472 13197 51793 23669 -14538 -338 23967 24177 14699 -9429
629 -9429 -35883 -13366 28432 2244 -52869 -41318 1563 8968 -1683 -18084 -32581 -2500
641 -2500 46970 32508 -21254 -15599 35151 45308 19245 -941 -15177 -2695 34344 20244
653 20244 -39485 -44477 1671 11996 -14840 -29683 -29871 -16882 15262 20744 -19045 -25358 22755
666 22755 39364 13013 4823 9035 8609 23059 28049 -4383 -23463 2342 13529 -13865 -23545
679 -23545 -12197 -18576 -17550 471 -8874 -24149 -2613 14282 799 1888 19349 12693 2208
692 2208 19475 25788 4225 1710 11986 -1491 -6127 7665 -7506 -30909 -14196 4687 -11411
705 -11411 -23293 -11842 -6986 -3798 13050 7994 -15518 1552 34869 21915 -2109 4584 11637
718 11637 10845 17422 6347 -22304 -17246 13957 6151 -27111 -25058 -6973 -6036 -512 -225 -20717
732 -20717 -14664 22028 24083 -5481 -5881 15998 19069 14311 13034 -3551 -11022 14536 18812 -15839
746 -15839 -24136 -2588 -1434 -9977 -7715 -14243 -19585 1419 15774 -5289 -14699 10413 18702 5703
760 5703 9497 10824 -1281 8046 20826 1331 -14721 19 6114 -9812 -11717 -4055 -13568 -14149
774 -14149 3773 -1665 -16795 -936 12404 -67 367 13480 7383 860 13526 14358 -3033
787 -3033 -722 11361 -1948 -11308 1737 -2723 -17357 -6516 1529 -11936 -11187 3468 -484 -7535
801 -7535 5875 11245 -2381 2733 17827 6718 -2295 10523 7577 -5806 1939 6021 -10012
814 -10012 -11809 2210 -2743 -15085 -5609 1312 -9553 -4544 8750 -1800 -6393 11805 12126 -2105
828 -2105 3996 12286 2529 -99 9098 1434 -10896 597 6461 -10880 -11714 1736 -5205 -10508
842 -10508 1758 193 -9929 883 11886 410 -4732 9215 9441 -1330 5860 9176 -5339
855 -5339 -1752 10954 -1383 -12196 -497 2190 -8564 -5462 1600 -6959 -8031 6971 3731 -9930
869 -9930 1022 11232 -524 -823 9015 1528 -3338 8150 7053 -7480 -4065 7632 -1093 -8857
883 -8857 1689 325 -9622 628 6043 -7984 -6364 7639 2372 -6276 2498 5912 -3483 24
897 24 9205 -1355 -7496 6716 5842 -7526 -613 6094 -4174 -3652 6110 -304 -8048 2301 6729
912 6729 -5754 -5020 6517 -369 -6408 4724 2148 -8892 412 7839 -3881 -6131 5132 3400
926 3400 -4202 2776 5986 -4750 -823 11069 546 -8327 4209 5833 -4626 -1184 2138 -7018
940 -7018 -5681 5699 -92 -12372 -3094 7210 -2065 -3672 4456 -1219 -2079 11393 7582 -6812
954 -6812 -160 12047 5004 -3351 871 -636 -5564 3205 3702 -13594 -11761 5389 905 -9716
968 -9716 -4134 -1183 -3206 4886 8710 -3278 -4828 12328 14020 -928 453 6892 645 2518
982 2518 7270 -5663 -12451 687 3361 -9798 -11253 -2801 -5134 -6706 2707 309 -8388 2910
996 2910 12376 2221 1388 10775 6277 1138 9046 9334 -2706 -3478 4159 -1893 -8121 -1555 -6119
1011 -6119 -16231 -5250 3917 -7822 -11655 -1058 2331 2195 7465 4818 -3512 6146 21484 10275
1025 10275 -5759 1802 9166 4969 3757 -4245 -16872 -8011 8585 -1092 -21572 -17287 156
1038 156 3200 -413 -3849 -10976 -1465 21973 17093 -6803 -4299 15052 18600 9613 -122 -8136
1052 -8136 -3883 12188 8979 -18082 -23513 -1892 3970 -7026 -12039 -14702 -9237 9020 12345 -6254
1066 -6254 -10527 10173 20870 9862 3152 4116 3274 11020 15550 -2864 -14670 -1264 4774 -6568
1080 -6568 -12265 -10405 -11675 -8334 537 -3202 -12414 -2652 9172 3560 3467 11476 6595 3135 13245
1095 13245 14501 3329 116 3250 -490 -2633 1578 -6881 -19811 -9866 3074 -6203 -14325 -9448
1109 -9448 -5261 1883 10696 3508 -8370 2344 22581 18145 98 -1033 6151 9815 13074 1668
1123 1668 -18584 -12252 9170 4839 -16893 -22062 -9996 741 4277 -2572 -16255 -9962 17507
1136 17507 21540 -1448 -7215 7253 16744 17246 7560 -8569 -7895 11385 14558 -9214 -22236 -8620
1150 -8620 1555 -1507 -6248 -15370 -15772 4202 13681 -2190 -10645 2615 13907 11694 7265 3276
1164 3276 -739 7093 15830 2614 -11231 -3374 2574 -3767 -5604 -6565 -11698 -8331 1364 -459 -8659
1179 -8659 -3713 4955 1875 2785 9733 4107 -818 8358 10545 2082 517 1664 -2525 -2138 3700
1194 3700 -1924 -13607 -8223 3069 -1322 -6650 -4294 -5519 -1286 10081 5992 -7149 -3161 11243
1208 11243 11611 1438 -1949 -1057 1145 9057 6283 -11520 -12042 5217 6858 -4945 -9330 -6895
1222 -6895 -1395 6492 5547 -7832 -10663 6697 13889 223 -6107 -814 2462 7484 7411 -6058 -10787
1237 -10787 3406 10912 -794 -9800 -4288 1566 3004 4246 -3288 -10582 1340 11558 924
1250 924 -7544 -1901 2681 2928 3210 -1055 -7286 -1847 8338 2343 -7928 -2212 3692 602 2173
1265 2173 2245 -4275 -1649 6883 4039 -4323 -2240 3223 -58 -1777 1788 -2809 -6408 1643 2653
1280 2653 -5232 -3087 2107 -780 -914 3962 2385 -2636 1619 7032 1676 -1069 3773 652 -2798
1295 -2798 3399 2148 -6611 -4729 1201 -1419 -4743 -2395 -2263 -4305 1343 5042 -2852 -3919 6195
1310 6195 6549 1171 2967 2664 78 4501 6478 -1967 -6993 -16 3486 -3855 -6171 -3515 -5526
1325 -5526 -2482 3295 -3333 -8412 915 7246 2495 -344 2376 3500 4472 8066 3914 -4806 5
1340 5 7753 561 -6171 -3529 -3420 -3575 -462 -3262 -9442 -5366 3943 2317 -4597 -948 4324 3122
1356 3122 5712 6440 -731 481 8826 5879 -2463 -2180 921 -1102 -2626 -1845 -6138 -8557 -828 1140
1372 1140 -6537 -4903 1816 809 837 4362 2369 403 5421 8294 2358 -600 4204 2969 -2070
1387 -2070 356 -397 -6561 -3933 70 -4700 -6612 -1996 -1112 -3413 -528 3058 -210 -262 6368 5225
1403 5225 525 4454 5183 126 1736 4005 -1334 -4316 -675 -208 -4810 -4443 -1441 -4549 -4481 1597
1419 1597 -560 -4555 1516 4891 1111 1622 4358 2429 1579 4816 3761 -2368 -1096 3588 -945
1434 -945 -4500 -873 -2531 -5144 -683 -287 -4966 -3060 2374 1438 -1591 1243 3418 539 2427 5423
1450 5423 222 -1335 4294 2487 -2572 -652 464 -2696 -2579 43 -2190 -4854 -442 1775 -3118
1465 -3118 -1775 3071 23 -820 3697 2084 -914 2246 3914 90 -1227 2101 929 -3057 -158
1480 -158 1086 -3719 -2087 1891 -2129 -3424 1108 764 -2030 97 2381 -210 -647 3365 1927 -2305
1496 -2305 1325 3364 -1510 -967 2018 -1273 -2110 1468 202 -3407 -1474 2087 -485 -2695 972
1511 972 859 -1687 2152 2679 -2603 -765 3837 1212 -1611 167 801 -833 410 1841 -2461 -3554
1527 -3554 2553 2172 -3294 -1254 1081 -785 1036 2326 -1651 -2645 2269 3753 -1238 -2534 1383
1542 1383 545 -569 1979 -1095 -4274 1099 3330 -1818 -3061 401 1131 170 1142 569 -2452 281
1558 281 4834 516 -3231 1131 1785 -752 808 157 -3159 -1507 2173 118 -3733 -1452 1600 -738
1574 -738 -406 2247 -1114 -1679 3634 2871 -1161 462 2147 396 140 1799 -300 -3621 -612 1755
1590 1755 -2595 -3141 -72 -2128 -2104 1919 310 -2949 35 3716 2296 247 1845 1923 600 3497
1606 3497 3321 -2954 -2415 2710 509 -2959 -2573 -2915 -2837 -22 370 -4068 -4676 2046 4201 -386 -342
1623 -342 1931 1601 4529 5547 -464 -2373 2899 4761 -23 -3663 -2536 -1847 -1275 172 -3781 -7810
1639 -7810 -1667 3330 -865 -3121 -633 1327 3447 4820 2013 -1211 1987 7361 3851 -2210 -764
1654 -764 977 -248 644 -1990 -6759 -4078 1096 -771 -5033 -4001 -211 674 1226 2069 -885 -352
1670 -352 6074 5823 361 781 2867 1986 1890 1352 -2020 -3887 -757 1017 -3481 -5212 -1911 -2154 -2410
1687 -2410 709 -896 -3319 785 4106 2210 714 1964 2464 1948 3679 3425 -1627 -1656 2802 995
1703 995 -2506 -1991 -2897 -3246 -144 40 -4027 -4780 201 2736 -204 -1159 253 188 3413 5787 186
1720 186 -2613 2616 5293 2146 -1040 -2061 -1302 892 2381 -1954 -7153 -2860 3053 72 -3601
1735 -3601 -3152 -2247 1312 4404 734 -3853 -572 5846 5209 -315 -1296 640 1962 4270 1617 -5172
1751 -5172 -3579 2880 2038 -2934 -4633 -3009 -386 1449 493 -3674 -3957 3051 4996 -343 -1519 775
1767 775 1703 3722 3369 -1169 -2576 1521 3703 -33 -3317 -1682 -949 -852 1098 -1262 -4694 -1003
1783 -1003 2576 367 -1158 -424 -33 748 2790 2512 -1312 -1661 2713 2451 -547 -137 -1204 -2151 1513
1800 1513 2232 -2147 -3597 -228 2097 752 -867 -1232 -1819 1033 4521 106 -4298 -500 2761 1662
1816 1662 33 -2143 -2812 673 3885 1017 -4346 -2592 3355 3003 19 -1035 -2263 385 5027
1831 5027 2006 -3980 -3145 1745 2919 -483 -3003 -3104 -1391 2453 2450 -3758 -4176 2098 3523 1039
1847 1039 -412 -1117 527 3931 3864 -652 -3148 751 3510 -69 -2193 -1960 -2680 -253 1630 -2226
1863 -2226 -4484 -1131 1661 797 -523 -165 286 1022 3755 2854 -1241 109 3026 1237 155 82 -1801
1880 -1801 -1953 285 351 -2627 -3664 -928 125 -927 167 -454 -2059 1617 4030 857 -700 1054
1896 1054 2081 2125 1676 89 -1896 -645 2582 334 -3960 -2305 -156 -523 189 -991 -3296 -963
1912 -963 2773 2009 -1463 -1561 1632 2402 1415 1188 -1173 -1339 2964 2413 -2187 -2378 -10 677 344 -647
1930 -647 -2005 -1890 954 2564 -975 -2716 724 1574 353 966 -565 -1486 1135 2256 -202 -2064
1946 -2064 -509 1307 170 -393 106 -1559 -532 2332 315 -1987 -43 928 216 423 305 -757
1962 -757 -817 1083 1233 -1568 -1338 851 -322 -602 854 -852 -1455 922 1274 -400 -700 528 902
1979 902 224 1116 879 -1288 254 2356 -155 -1308 76 -371 -506 333 -562 -2097 -1552 702 341
1996 341 -1996 -909 629 -146 1106 1694 -751 58 2726 2108 192 9 843 928 408 517 -1249 -2857
2014 -2857 -142 424 -2762 -2714 -1175 -1153 -309 330 -841 -854 1472 3353 1782 136 2159 2880 1780
2031 1780 2372 933 -1655 -27 991 -1528 -3322 -2874 -2034 -2090 -2121 -1809 -2729 -1766 1794 1580 -281 1730
2049 1730 3109 2726 3705 3232 1416 1126 2131 1769 -1029 -2282 -1447 -2471 -3199 -2045 -3628 -4615 -1691
2066 -1691 -376 -1181 -505 787 1713 2774 3963 3789 1767 2350 4519 2518 219 251 -1259 -1904 -722
2083 -722 -2395 -4998 -4504 -2264 -1293 -2486 -2401 -967 9 2487 3883 1002 890 4407 4767 2958 1531
2100 1531 312 383 1232 559 -2407 -4872 -2762 -359 -2468 -3724 -2861 -2469 176 2234 208 -952
2116 -952 1535 4171 3857 1794 1193 1538 1533 2534 862 -3050 -2392 156 -978 -2370 -2803 -3032 -1548
2133 -1548 332 479 -1263 -1563 1632 3100 1468 1382 984 142 2249 2896 -300 -1897 -837 309 170
2150 170 -1067 -2037 -2632 -1339 1666 662 -2526 -1238 1274 1735 2028 422 -1531 157 2835 2413
2166 2413 -1156 -2785 -115 1561 685 -481 -2811 -2619 1883 2551 -1221 -2621 -653 1998 2651 500
2182 500 -1680 -1725 1349 3769 88 -3472 -1356 1135 1495 680 -2209 -3036 499 2970 1092 -2303
2198 -2303 -1965 1441 2344 1294 -318 -2341 -698 3078 1590 -1928 -2114 -572 1100 1238 -440 -2005
2214 -2005 -1821 1170 2794 -232 -1869 -251 576 1621 1802 -1258 -2429 236 2095 966 -1655 -2225
2230 -2225 -494 933 1761 108 -3125 -1285 2932 2300 -185 -1475 -1156 1534 3038 671 -2673 -2802
2246 -2802 1226 2989 -616 -3043 -2246 -347 2548 1712 -2827 -3047 1260 3670 1913 -1434 -1798 874
2262 874 2957 2731 -1043 -3905 -317 3103 832 -2065 -3095 -1885 1280 1884 -1042 -3209 -1397 2644
2278 2644 2880 -298 -1078 -112 1385 3432 1554 -2232 -1383 1316 1780 95 -2162 -2353 -920 667
2294 667 1011 -1840 -3362 -114 1880 951 219 -1014 -802 2193 3095 739 -1554 -916 1889 2146 82
2311 82 -1374 -2415 -737 2400 565 -3023 -2519 -65 1704 1245 -1185 -2282 -468 2571 2973 -969
2327 -969 -2580 620 2421 1793 125 -2396 -1623 2098 2402 -778 -2953 -1523 1629 1555 -425 -1807
2343 -1807 -2209 701 3010 24 -2559 -1093 899 1857 951 -1247 -1629 203 2308 1582 -1598 -1586 866
2360 866 1264 949 42 -2013 -924 1701 1258 -777 -1859 -890 679 751 149 -1031 -1904 500 2308
2377 2308 154 -1051 -382 152 1571 1540 -414 -1372 -264 1764 1451 -1170 -1508 -420 221 1285 33
2394 33 -2580 -1347 1284 1258 -281 -1570 -952 868 1605 922 -1111 -1734 1357 2403 92 -860 -773 12
2412 12 1668 1112 -1341 -1807 -86 1639 575 -1521 -1274 -292 330 1205 -559 -2179 -154 1447 759
2429 759 -198 -825 -130 1022 1344 818 -788 -737 1580 1323 -364 -353 -739 -489 869 89 -1514 -1596 -463
2448 -463 518 -206 -1073 -592 -467 506 1778 204 -813 895 1588 1237 930 -196 -272 515 885 159 -1806
2467 -1806 -1620 121 -417 -1122 -998 -1795 -790 1138 406 -719 -293 1075 1996 1264 557 540 401 1523
2485 1523 1692 -859 -1463 60 -74 -586 -1148 -2031 -1439 -188 148 -641 -1546 -40 1659 813 696 680
2503 680 193 1541 2210 364 -647 -72 596 387 -904 -1387 -1251 -1009 95 -409 -2085 -998 729
2520 729 489 389 139 -58 1032 1777 1266 23 -457 952 1143 -346 -546 -966 -1175 319 186 -1546
2538 -1546 -1413 -216 577 482 -334 -305 217 882 1773 419 -1039 433 1157 301 -51 -1024 -1289 128 495
2557 495 -394 -1513 -1248 629 873 -89 -143 -568 278 2074 1172 -864 -589 509 1197 657 -980 -1539
2575 -1539 -847 602 1023 -1334 -2343 -63 1135 880 96 -1210 -409 1943 2200 339 -1372 -482 1705
2592 1705 1485 -352 -1457 -1897 79 1782 -572 -2713 -1620 362 1521 400 -1495 -1201 811 2692
2608 2692 1955 -1211 -1247 1491 2176 1170 -701 -2247 -502 1778 801 -1789 -2866 -1027 1287 761
2624 761 -996 -1909 -1230 1739 2734 -89 -1536 -82 1743 2548 909 -1274 -1171 774 2209 643
2640 643 -2528 -2239 49 838 478 -1597 -3073 -697 2021 1427 -875 -1997 -93 2568 2371 581
2656 581 -1365 -938 2562 3099 -377 -2308 -1548 648 2070 -173 -3201 -2927 24 2341 276 -3144
2672 -3144 -2342 747 2649 2206 -1136 -2379 1287 4076 2547 -897 -2315 279 2874 1852 -1352
2687 -1352 -3808 -2098 1959 1430 -2435 -3795 -1985 1264 2574 -155 -2651 -981 2604 4203 1309
2702 1309 -1590 -370 2180 3350 1714 -2202 -2923 416 1839 -284 -3156 -3976 -1274 1172 598 -1739
2718 -1739 -3205 -578 3319 2784 133 -678 496 3261 4114 964 -1785 -1093 1453 2286 -804 -3736
2734 -3736 -3177 -1079 859 -218 -3794 -3640 180 2521 1714 -756 -1462 1502 4411 3919 653 -1722
2750 -1722 618 3688 2230 -1226 -3304 -2692 520 1093 -2514 -4878 -3270 499 1928 -634 -2554
2765 -2554 -1096 2144 4463 2664 -1045 -235 3119 4019 2080 -1346 -2373 90 1695 53 -3330
2780 -3330 -4585 -1680 836 -371 -2259 -2917 -1100 2447 2893 161 -854 883 3458 3716 1136 -706
2796 -706 -368 1233 2344 -87 -3208 -2588 -546 136 -715 -2896 -3174 -608 1416 1081 -976 -1598 1086
2813 1086 2986 2381 935 -673 141 2798 2424 -428 -1949 -1287 608 987 -1164 -2645 -2450 -223
2829 -223 1486 -482 -2396 -1207 696 1888 1477 -740 -972 1261 2547 1698 -659 -1237 629 1562
2845 1562 883 -597 -2136 -975 1297 543 -1257 -1862 -1074 680 970 -396 -1288 -1010 822 1907 128
2862 128 -999 -123 679 1531 1096 -724 -770 556 1339 775 -791 -1211 -80 365 349 -563 -1911 -888
2880 -888 641 151 -582 -964 -718 589 1101 387 -254 -334 1046 1729 506 32 6 61 995 618 -942
2899 -942 -1141 -541 -45 -119 -1153 -1340 -685 -199 531 -46 -958 105 1170 980 949 377 68 1016 1220 667
2919 667 -255 -774 100 232 -617 -775 -1213 -1218 23 -133 -1012 -689 -311 335 809 424 273 411 707 1469
2939 1469 758 -237 232 294 170 326 -599 -1122 -528 -225 -281 -669 -1132 -278 106 181 504 -253 -225 1160 986
2960 986 366 193 -72 367 741 129 -393 -799 -404 449 -332 -922 -422 -457 61 569 -334 -572 251 583
2980 583 733 45 -251 277 301 405 247 -779 -520 454 -9 -284 -345 -482 79 507 144 -61 -321 291
3000 291 802 50 -153 106 -280 345 449 -594 -607 -117 -31 12 -388 -511 -33 112 504 345 -438 264 780
3021 780 275 238 129 -179 349 275 -250 -484 -575 -84 28 -710 -455 -193 -255 441 288 -454 214 717 588
3042 588 474 22 208 604 273 200 -360 -775 158 11 -820 -617 -546 -407 282 -184 -492 -52 299 954 523
3063 523 -131 444 733 572 641 -297 -729 269 385 -309 -796 -1029 -274 201 -175 -525 -913 -142 1147 568
3083 568 -262 45 303 1066 1196 -121 -683 -27 665 695 -608 -1396 -429 189 233 -244 -1462 -865 910
3102 910 889 22 -706 -448 1139 1534 520 -504 -802 510 1552 46 -1296 -1006 -232 887 473 -1389
3120 -1389 -1419 -65 1182 1036 -763 -1129 373 1374 1409 39 -1449 -226 1546 1080 -425 -1615 -1100
3137 -1100 796 1026 -488 -1735 -1512 669 1768 -86 -1321 -776 662 2154 1058 -1236 -1109 598
3153 598 1874 987 -1433 -1864 -69 1178 1013 -1230 -2621 -501 1642 1213 -541 -1839 -621 2013
3169 2013 2107 77 -1619 -930 1882 2340 -202 -1921 -1507 537 2039 -19 -2557 -1974 351 1969
3185 1969 659 -1971 -1864 610 2323 1761 -1142 -2049 661 2634 1583 -787 -2347 -601 1979 1443
3201 1443 -1168 -2769 -1452 1619 1697 -934 -2235 -1346 1377 2730 248 -2027 -944 1548 2795 906
3217 906 -1870 -1572 703 2238 986 -2266 -2791 223 1749 690 -1685 -2848 -477 2231 1679 -829
3233 -829 -2189 -347 2753 2346 -285 -1738 -899 1972 2722 -389 -2513 -1517 939 2039 -176 -2804
3249 -2804 -2108 418 2104 696 -2344 -1996 1093 2549 1515 -1033 -1911 752 2939 1826 -990 -2297
3265 -2297 -289 2240 1259 -1422 -2812 -1544 1436 1669 -1339 -2817 -1248 1366 2349 35 -1960 -765
3281 -765 1781 3043 1081 -1739 -991 1474 2228 844 -1928 -2400 183 1681 183 -2167 -2751 -482
3297 -482 1624 678 -1211 -1940 -329 2537 2170 -373 -1096 239 2215 2496 15 -1720 -716 1050
3313 1050 1578 -589 -2776 -1811 132 734 -274 -2285 -2027 646 1768 793 -797 -961 1272 2693
3329 2693 1588 -2 -916 473 2192 1103 -1238 -1797 -972 459 427 -1656 -2460 -1372 314 1026 -639
3346 -639 -1638 -180 1451 1974 1139 -525 48 1935 2043 776 -702 -1024 374 783 -510 -1726 -2201
3363 -2201 -897 491 -609 -1597 -1322 -308 1148 1119 -245 -103 957 1904 1905 376 -192 656 957 786
3381 786 -274 -1675 -1042 -72 -431 -1119 -1822 -1403 -74 185 -242 -434 -326 1072 1736 656 417 691
3399 691 878 1509 813 -450 -318 -39 70 -402 -1455 -1380 -674 -675 -452 -879 -1099 63 669 423 406 323 830
3420 830 1491 975 606 405 252 735 290 -765 -679 -608 -711 -516 -1116 -1249 -522 -295 -111 -187 -379 526 911
3441 911 633 818 559 562 1198 659 39 46 -189 -8 -181 -917 -955 -784 -594 -243 -753 -940 -82 263 374 472
3463 472 74 523 1199 971 599 199 54 697 348 -468 -602 -802 -499 -45 -877 -1174 -650 -308 294 123
3483 123 -454 138 705 909 870 78 107 901 779 349 -149 -684 -123 198 -353 -820 -1050 -572 202 -242 -523
3504 -523 -347 -168 741 979 66 77 493 749 901 181 -476 -122 153 135 -306 -1143 -797 -70 -195 -272 -543
3525 -543 -666 339 686 332 132 8 599 1107 415 46 -41 -101 524 164 -735 -713 -405 -225 -35 -576 -762
3546 -762 -163 137 437 239 -257 357 733 491 605 88 -177 433 232 -202 -311 -630 -364 -115 -491 -413
3566 -413 -419 -487 280 193 -218 241 221 420 775 286 191 235 187 367 8 -437 -194 -326 -389 2 -482 -543 -96
3589 -96 -226 -25 192 -37 204 294 295 646 319 -56 368 117 98 256 -413 -418 -120 -163 -139 -420 -631 -122 132
3612 132 100 146 -417 -117 711 418 189 96 -127 478 637 -39 -341 -437 43 510 -209 -679 -477 -260 377
3633 377 307 -662 -539 120 545 593 -206 -554 182 671 683 -68 -846 -189 741 414 -170 -736 -678 466 716
3654 716 -268 -868 -782 257 1012 24 -676 -571 218 1224 676 -729 -653 270 1027 824 -536 -1014 -43
3673 -43 802 756 -513 -1502 -406 828 529 -337 -1286 -747 1007 1080 -68 -971 -563 937 1503 171 -905
3692 -905 -739 445 1504 299 -1452 -1143 99 1031 427 -1304 -1509 31 1157 969 -785 -1436 175
3709 175 1609 1242 -102 -1274 -283 1613 1267 -355 -1516 -1007 893 1136 -558 -1733 -1287 444 1622
3726 1622 -7 -1558 -829 774 1915 934 -1064 -945 760 1765 1012 -1078 -1610 110 1294 546
3742 546 -1169 -2127 -626 1261 813 -821 -1694 -456 1678 1702 -69 -1035 -406 1613 2151 44 -1458
3759 -1458 -877 639 1415 -82 -2147 -1735 103 1141 229 -1827 -1614 519 1705 1155 -639 -1220 754
3776 754 2310 1420 -395 -1395 -123 1617 971 -1105 -2135 -1196 774 943 -1188 -2041 -978 995
3792 995 1794 166 -1331 -284 1589 2324 898 -1115 -673 1107 1601 453 -1660 -2025 -10 967 -174
3809 -174 -1845 -2165 -314 1464 714 -826 -1201 283 2269 1882 -209 -732 245 1711 1683 -492 -1815
3826 -1815 -847 581 668 -963 -2416 -1434 379 838 -118 -1530 -926 1375 1918 834 -404 -383 1317
3843 1317 2200 816 -794 -1141 28 1192 7 -1793 -1911 -813 531 237 -1412 -1683 -66 1309
3859 1309 1392 -17 -717 635 1876 1802 395 -921 -280 1195 820 -517 -1736 -1497 139 460 -875
3876 -875 -1753 -1404 290 1282 179 -778 -245 972 1932 1245 -472 -334 835 1400 673 -949 -1437 -208
3894 -208 432 -99 -1317 -1998 -644 710 226 -699 -1000 20 1452 1342 212 -348 233 1486 1506 -55
3912 -55 -891 -346 423 653 -513 -1756 -1094 80 325 -361 -1422 -867 692 1067 476 -395 -401 1052 1619
3931 1619 645 -278 -502 337 1116 240 -1039 -1157 -327 584 37 -1307 -1258 -241 552 637 -531 -849 317
3950 317 1208 1025 161 -617 188 1193 794 -80 -984 -605 650 457 -666 -1186 -923 205 680 -382
3968 -382 -925 -416 480 1186 403 -644 -187 701 1182 642 -653 -734 386 791 213 -826 -1234 -108 593
3987 593 102 -741 -1161 -240 1044 559 -374 -625 -86 1094 1043 -179 -656 -141 765 905 -295 -1111 -389
4006 -389 312 624 -138 -1257 -666 551 670 82 -702 -643 654 1010 408 -404 -571 351 1109 229 -620
4025 -620 -740 -198 748 307 -840 -874 -238 613 575 -591 -845 24 685 803 -12 -882 -81 862 729 102
4045 102 -752 -483 606 562 -176 -750 -743 236 716 -83 -632 -595 87 951 348 -545 -378 191 825 594 -464
4066 -464 -579 98 451 528 -367 -975 -119 380 324 -200 -889 -395 500 453 69 -433 -388 484 740 87 -233
4087 -233 -351 288 794 108 -454 -395 -124 414 160 -648 -555 -183 194 348 -365 -617 23 380 429 82 -395
4108 -395 -17 598 439 165 -289 -246 367 318 -31 -284 -552 -162 327 -133 -412 -466 -229 262 188 -206 -146 37
4130 37 343 679 84 -86 218 202 508 261 -359 -264 -21 12 11 -539 -621 -260 -128 -16 -100 -481 -63 425 366
4153 366 310 87 -21 575 623 302 59 -264 36 303 -169 -438 -615 -529 41 -46 -572 -499 -263 212 560 14
4175 14 -133 264 488 844 550 -142 20 397 353 155 -568 -850 -219 -31 -172 -669 -1036 -287 370 188 -60
4196 -60 -332 7 973 946 270 -101 -3 618 847 -83 -643 -589 -190 344 -297 -1173 -873 -214 292 194 -639 -489
4218 -489 407 996 872 125 -337 469 1120 733 -23 -783 -396 492 199 -726 -1250 -966 115 437 -439 -852
4238 -852 -518 545 1250 403 -385 -19 819 1365 727 -570 -689 270 644 220 -1026 -1453 -335 278 109
4257 109 -754 -1278 -224 1059 781 -42 -498 157 1392 1375 111 -523 -287 742 931 -410 -1289 -963
4275 -963 -97 557 -282 -1499 -1045 253 897 467 -619 -567 867 1515 989 -125 -695 392 1293 531
4293 531 -699 -1347 -663 612 245 -1021 -1515 -803 649 864 -405 -925 -105 1128 1628 471 -719
4310 -719 -46 1029 1390 350 -1168 -985 333 600 -205 -1463 -1653 -18 760 20 -937 -1053 291 1638
4328 1638 1007 -240 -446 423 1648 1282 -479 -927 -274 727 708 -925 -1868 -790 321 521 -546
4345 -546 -1507 -692 885 1192 360 -704 -316 1377 1680 653 -586 -658 610 1265 20 -1334 -1353 -370
4363 -370 726 -62 -1511 -1402 -250 990 792 -646 -831 466 1539 1436 14 -815 222 1318 1043
4380 1043 -259 -1450 -797 676 481 -721 -1627 -1182 418 889 -258 -1087 -636 794 1729 644 -623
4397 -623 -264 843 1710 854 -929 -960 192 856 278 -1356 -1788 -382 612 185 -1025 -1527 -215 1325
4415 1325 993 -138 -692 119 1659 1551 -31 -828 -298 934 1140 -453 -1552 -942 154 693 -496
4432 -496 -1787 -1068 369 921 336 -890 -667 898 1642 904 -349 -663 678 1482 571 -670 -1243 -318
4450 -318 883 200 -1279 -1559 -668 616 647 -785 -1136 -154 1071 1458 189 -806 204 1273 1458 375
4468 375 -1044 -629 669 779 -235 -1415 -1388 87 659 -303 -1179 -1201 204 1291 607 -576 -489 558
4486 558 1622 1149 -371 -602 192 1031 782 -767 -1503 -448 402 389 -796 -1661 -676 688 721 -154 -909
4505 -909 -359 1190 1379 422 -471 -356 962 1461 175 -898 -875 78 827 -56 -1378 -1272 -196 650
4523 650 316 -959 -978 255 1113 973 -146 -683 418 1349 854 -47 -938 -287 793 488 -509 -1225 -895
4542 -895 352 549 -529 -1068 -676 486 1105 201 -598 -254 678 1281 663 -599 -469 462 768 352 -771
4561 -771 -1173 -159 428 67 -742 -1192 -228 695 457 -236 -593 -106 1036 985 -17 -410 -126 741 955
4580 955 -151 -926 -508 84 524 -266 -1181 -692 31 486 199 -723 -509 542 949 583 -181 -444 427
4599 427 944 375 -261 -691 -242 611 185 -675 -811 -540 277 415 -436 -727 -171 406 754 124 -365 9
4619 9 575 817 386 -477 -343 314 364 115 -633 -811 -58 240 -117 -454 -665 -60 609 299 -142 -154 92
4640 92 682 729 -26 -159 21 362 550 -162 -634 -302 -112 169 -117 -759 -480 44 212 182 -266 -294 368
4661 368 564 404 100 -192 204 581 257 -72 -314 -351 231 95 -392 -520 -475 -27 227 -202 -321 -140 120
4682 120 536 330 -160 101 323 418 403 -173 -271 87 110 58 -331 -662 -252 -11 -121 -162 -483 -301 300 303 107
4705 107 -17 14 426 654 259 11 -79 38 413 39 -405 -378 -325 19 52 -532 -556 -178 110 312 78 -304
4727 -304 167 449 546 436 -118 -82 450 403 108 -279 -512 -21 153 -205 -517 -634 -346 219 78 -327 -234
4748 -234 -39 535 628 47 -125 153 456 682 91 -432 -169 174 179 -31 -762 -614 -25 70 -50 -480 -618
4769 -618 195 579 327 28 -247 277 927 520 -24 -344 -49 558 350 -414 -730 -463 39 267 -441 -853
4789 -853 -428 137 540 118 -535 -165 598 768 514 -198 -275 558 772 272 -389 -720 -14 531 -28 -671
4809 -671 -868 -410 491 217 -512 -611 -114 680 779 -121 -455 97 706 883 98 -686 -234 422 557 -102 -981
4830 -981 -733 242 383 -122 -832 -866 271 807 189 -431 -560 232 1169 599 -339 -446 158 915 655 -575
4850 -575 -802 -191 488 436 -602 -1170 -447 440 522 -143 -972 -373 754 900 249 -547 -429 741 1092 173
4870 173 -660 -628 322 929 81 -959 -956 -69 772 232 -919 -952 -58 840 722 -488 -826 92 984 917 -125
4891 -125 -852 -114 877 787 -189 -1037 -610 623 705 -298 -1077 -852 398 937 -110 -926 -675 425 1229
4910 1229 400 -703 -583 355 1107 653 -815 -951 111 837 516 -769 -1296 -224 750 527 -466 -1206
4928 -1206 -286 971 871 -132 -897 -398 1013 1146 -4 -852 -540 594 1133 -69 -1127 -816 228
4945 228 949 151 -1098 -897 243 936 564 -733 -888 327 1118 725 -446 -1003 26 1096 608 -435
4963 -435 -1121 -552 813 631 -572 -1099 -583 658 1019 -150 -1005 -445 623 1240 269 -860 -455 543
4981 543 1039 356 -982 -922 187 748 240 -909 -1248 -3 939 438 -563 -1043 -24 1183 876 -292
4999 -292 -726 -142 1089 1132 -328 -941 -369 544 772 -422 -1285 -763 301 686 -49 -1137 -714 543
5017 543 1034 400 -597 -651 653 1261 597 -407 -770 156 1017 388 -708 -1063 -401 624 351 -819 -1107
5036 -1107 -399 563 757 -200 -767 -49 869 1120 318 -660 -184 732 891 101 -922 -791 219 508 -163
5055 -163 -984 -1085 -53 678 71 -565 -746 128 1093 659 -236 -364 248 938 843 -302 -738 -161 412 492
5075 492 -483 -1142 -491 168 339 -259 -964 -538 502 780 229 -401 -283 696 1027 367 -294 -398 253 776
5095 776 169 -659 -767 -216 393 64 -765 -752 -166 378 503 -259 -529 236 715 703 95 -434 45 627 533
5116 533 -100 -660 -545 246 233 -251 -727 -667 20 536 -29 -475 -300 179 828 456 -212 -100 222 608 422
5137 422 -301 -548 -29 190 145 -403 -799 -288 231 134 -161 -463 -176 514 514 150 -113 -64 555 668 31 -314
5159 -314 -279 68 379 -162 -680 -521 -167 149 82 -571 -405 142 417 432 -25 -178 363 600 399 116 -281
5180 -281 -54 369 86 -266 -521 -443 56 40 -413 -446 -347 51 435 74 -161 137 354 624 401 -43 74
5201 74 249 312 178 -298 -446 -117 -40 -180 -399 -662 -258 51 -16 -84 -201 -16 535 482 203 94 103 453 510
5224 510 44 -193 -150 11 189 -188 -598 -414 -211 -119 -44 -424 -346 116 233 288 75 -19 313 525 304 222
5246 222 -163 26 336 115 -178 -379 -377 -77 65 -310 -397 -328 -26 202 41 -228 2 168 494 369 -70
5267 -70 -19 288 351 344 -87 -312 -67 126 -44 -163 -510 -296 126 28 -49 -267 -259 287 384 53 -89 -66 233 473
5291 473 138 -146 -154 -7 269 159 -392 -361 -147 98 184 -314 -442 -83 264 296 -18 -375 8 436 307 68
5313 68 -257 -167 326 446 -47 -296 -373 141 420 -57 -337 -364 -45 412 141 -416 -332 3 432 365 -270 -367
5335 -367 87 324 382 -130 -576 -78 285 284 -56 -489 -298 371 356 7 -376 -307 270 653 70 -298 -301 148
5357 148 633 181 -436 -436 -42 462 269 -530 -604 -77 404 397 -235 -649 -86 540 534 24 -529 -197 603 533 30
5380 30 -460 -481 369 528 -124 -691 -620 52 551 23 -639 -491 90 734 441 -470 -398 224 780 656 -261
5401 -261 -545 107 569 536 -213 -830 -372 451 316 -282 -873 -567 431 499 -87 -567 -412 490 974 194 -384
5422 -384 -324 331 929 431 -583 -549 6 559 321 -731 -948 -174 430 261 -519 -923 -157 653 591 5
5442 5 -611 -104 878 906 161 -532 -362 612 843 -45 -736 -675 80 610 -123 -942 -807 -36 610 265 -657
5463 -657 -598 272 880 729 -230 -609 272 937 690 -149 -834 -227 623 421 -388 -1008 -580 373 529 -356
5483 -356 -827 -576 384 929 137 -532 -305 498 1066 447 -533 -451 267 758 435 -651 -905 -115 510 271
5503 271 -467 -1017 -303 635 452 -246 -705 -277 772 824 -27 -553 -298 618 837 -16 -693 -501 191 744
5523 744 17 -803 -650 81 622 246 -644 -603 228 755 487 -351 -637 125 767 471 -241 -758 -229 601
5543 601 459 -247 -717 -391 479 613 -190 -608 -324 448 817 42 -546 -287 309 694 188 -689 -536 182
5563 182 452 217 -627 -730 48 509 305 -251 -631 154 812 458 -55 -391 -67 711 570 -259 -617 -397
5583 -397 237 410 -343 -786 -436 35 447 -59 -584 -251 374 622 334 -249 -189 474 683 383 -195 -444
5603 -444 68 426 32 -426 -758 -367 220 71 -423 -565 -251 447 523 -87 -225 103 550 756 264 -254
5623 -254 4 315 409 62 -643 -520 -2 3 -137 -579 -676 12 258 60 -191 -277 222 671 409 33 6 210
5645 210 603 465 -152 -357 -157 89 86 -387 -623 -315 -38 55 -127 -508 -155 251 345 254 -89 -62 514 443
5667 443 214 -61 -191 216 300 -83 -351 -364 -274 165 -97 -408 -341 -129 174 191 -192 -205 140 300 322 83
5689 83 -216 126 239 188 3 -301 -154 156 48 -123 -277 -273 117 196 -56 -173 -138 75 348 28 -160 -50
5711 -50 70 290 139 -251 -187 36 130 121 -176 -275 50 203 83 -104 -243 -4 271 81 -2 -177 -122 218 130
5734 130 -196 -132 -167 63 271 -119 -208 -46 25 242 78 -218 24 112 274 184 -222 -114 146 124 30 -188 -342
5757 -342 4 150 -68 -171 -243 -117 210 102 -70 -85 -3 276 311 -83 -76 4 120 311 -53 -297 -52 19 129
5780 129 -73 -366 -298 75 72 59 -159 -273 107 280 139 -35 -201 69 335 101 -54 -141 -98 283 124 -233
5802 -233 -305 -162 40 259 -146 -363 -120 40 255 109 -289 -82 232 259 189 -139 -218 234 283 60 -83 -302
5824 -302 4 306 112 -185 -264 -162 263 168 -153 -247 -169 182 284 -98 -223 -95 133 335 91 -311 -147
5845 -147 176 260 158 -221 -272 92 240 98 -198 -369 22 314 91 -26 -338 -151 368 177 -147 -271 -129
5866 -129 294 362 -107 -232 -134 128 419 76 -359 -180 87 322 108 -365 -339 128 261 183 -264 -406 67
5887 67 305 137 -139 -405 -68 418 265 -114 -353 -184 359 358 -123 -288 -174 229 433 41 -390 -222 83
5908 83 444 130 -427 -372 14 273 222 -317 -402 52 359 244 -207 -369 -59 429 281 -47 -364 -186 357
5929 357 351 -57 -344 -299 203 418 -79 -403 -318 63 446 62 -467 -279 127 442 274 -276 -312 158 446 344
5951 344 -118 -460 -79 396 245 -157 -491 -252 326 244 -182 -466 -330 275 436 -63 -372 -203 230 541
5971 541 109 -362 -177 146 491 211 -327 -371 122 401 212 -325 -566 -105 313 154 -209 -535 -142 385
5991 385 301 -95 -354 -179 403 519 -14 -295 -284 280 574 62 -394 -328 101 388 110 -503 -459 -6 271
6012 271 203 -338 -483 20 354 347 -85 -429 39 521 419 20 -316 -137 381 441 -74 -203 -119 204 147 -106
6034 -106 -560 -534 73 533 -8 -383 -282 143 560 194 -140 -237 308 248 353 101 -667 -8 488 606 -95
6055 -95 -737 -392 173 -20 -60 -423 -110 -47 402 -152 -594 -331 337 755 207 -216 -12 102 538 173 -427
6076 -427 -287 182 103 201 -356 -684 -19 159 98 -93 -570 -365 455 259 -10 -149 -96 593 388 25 -226
6097 -226 -15 105 182 -142 -402 -412 -20 -19 -5 -460 -398 -314 59 317 -207 -140 -138 122 303 -39 -115 45 308 449
6121 449 -12 -49 -250 201 112 -73 -300 -117 -18 261 75 -288 -298 -75 245 -56 -248 -90 8 142 342 -206
6143 -206 -197 301 196 -26 -130 -204 -59 106 -92 -274 -342 -211 152 11 -221 -127 -181 152 306 -96 -18 -111 372
6166 372 162 -10 -457 50 -63 237 135 -385 -328 -20 -57 -150 -192 -419 -37 107 -199 -94 -273 52 251
6187 251 -127 52 35 -179 268 166 -193 211 50 88 103 -245 -206 10 -20 49 -72 -221 -5 76 14 -9 -92
6210 -92 -36 170 158 58 -35 -57 155 247 4 -154 -74 22 112 -15 -256 -159 -149 123 -33 -252 -198 49 0 51 -34
6235 -34 -226 163 197 -1 39 -133 169 258 140 61 -254 4 66 121 -71 -183 -117 20 98 -131 -234 -94 9
6258 9 145 17 -197 -4 164 160 104 -74 -93 222 216 99 -66 -188 15 102 -113 -221 -266 -135 81 16 -223 -198
6282 -198 -48 205 236 -69 -63 80 202 350 64 -125 10 141 183 37 -353 -240 53 -42 -125 -333 -358 60
6304 60 98 -35 -86 -122 88 381 183 -8 8 114 332 256 -217 -172 -142 40 153 -256 -408 -168 11 82 -35
6327 -35 -339 -89 199 234 129 -72 -35 358 324 143 -73 -185 29 195 -38 -228 -320 -247 102 -23 -288 -267
6349 -267 -83 220 225 -80 -166 61 229 356 89 -184 3 245 208 58 -298 -299 84 65 -69 -325 -342 17 204
6372 204 34 -159 -178 6 368 246 -85 -150 31 327 319 -134 -219 -136 118 205 -140 -415 -202 15 155 -48
6394 -48 -334 -150 150 233 138 -152 -224 224 395 154 -125 -142 54 348 84 -224 -303 -99 162 178 -273 -280 -139
6417 -139 72 211 -88 -318 -8 193 269 62 -263 -116 238 227 92 -234 -238 150 252 -17 -223 -345 -57
6438 -57 237 -27 -241 -273 -166 216 190 -192 -175 -74 319 359 -51 -199 4 269 301 99 -321 -132 140 216
6460 216 35 -357 -306 47 164 63 -217 -368 28 229 111 -57 -247 29 440 273 -70 -130 -60 268 314
6481 314 -168 -254 -151 77 240 -143 -354 -161 48 113 5 -241 -168 167 205 100 -31 -194 255 343 132 -39
6503 -39 -151 6 328 56 -153 -226 -128 153 113 -185 -238 -166 89 182 -41 -219 2 147 298 134 -143 -39
6525 -39 166 199 126 -156 -226 53 113 -52 -167 -280 -62 176 3 -69 -165 -73 200 173 -59 -77 -17 265 338 14
6549 14 -144 -5 66 163 -30 -204 -175 18 10 -28 -301 -170 52 85 25 -106 -208 78 207 32 -8 -132 39
6572 39 221 160 -112 -35 -61 160 219 -87 -152 -126 0 164 -95 -228 -54 52 113 -3 -155 -60 145 115 117 24
6596 24 -71 114 209 30 11 -121 -17 66 -17 -113 -118 -159 79 33 -198 -108 -104 14 145 -36 -119 44 104 130 126 -115
6622 -115 41 126 87 126 -70 -116 47 -35 -78 -56 -233 -2 18 -44 -104 -95 -30 141 25 -52 7 -11 128 193 -27 -33
6648 -33 71 27 62 -20 -165 -65 -58 -35 -6 -124 -154 19 -64 -19 -51 -50 89 115 -7 66 55 -7 222 104 0 41
6674 41 -7 44 49 -190 -87 4 -128 7 -129 -128 5 -15 18 52 -93 93 145 106 23 76 -49 121 95 -83 -26 -60
6700 -60 -57 47 -130 -104 -10 -90 66 -9 -110 32 65 66 105 -34 15 123 107 87 -10 -53 38 5 -39 -79 -158 -81 112
6727 112 -53 -65 -87 -82 46 97 -10 -45 46 74 153 -1 -73 4 10 84 -6 -147 -111 69 14 -24 -96 -129 68 61 -50
6754 -50 -17 -49 45 211 1 -39 34 12 141 66 -95 -130 -51 27 113 -106 -179 -7 53 86 -21 -178 -57 122 29
6779 29 67 -139 -68 96 83 15 -74 -81 14 201 42 -95 -96 -58 203 39 -87 -131 -39 137 124 -74 -110 33 86 181
6805 181 -54 -190 -46 89 155 52 -174 -98 132 131 -39 -147 -209 47 139 -58 -157 -157 -30 227 93 -158 -132
6828 -132 -36 268 181 -110 -144 106 124 238 -46 -247 2 82 156 -36 -247 -148 106 99 3 -117 -220 126 214 71
6852 71 -61 -121 110 288 93 -24 -89 -38 199 93 -179 -190 -78 55 125 -192 -349 -130 68 212 10 -200
6874 -200 -63 196 224 171 -119 -33 264 256 100 -164 -231 69 122 -31 -161 -248 -89 184 53 -281 -194 10 179
6897 179 240 -94 -152 47 261 359 44 -220 23 149 166 21 -348 -162 70 96 -90 -239 -279 3 215 45
6919 45 -173 -134 113 319 161 -53 -65 137 302 259 -97 -163 -62 140 159 -165 -351 -111 40 91 -135 -337
6941 -337 -131 118 167 49 -139 -116 198 266 57 -35 -118 143 294 60 -131 -228 -53 162 10 -211 -238 -112
6963 -112 83 149 -162 -273 5 159 180 -99 -166 -40 208 200 96 -205 -99 228 194 18 -205 -214 55 241 -62
6986 -62 -275 -239 -98 216 4 -206 -157 -11 233 178 -134 -117 87 249 230 -17 -181 74 177 165 19 -247
7008 -247 -124 176 55 -149 -244 -252 69 167 -95 -171 -141 47 289 17 -114 -78 55 290 195 -125 -99 44 184
7031 184 111 -201 -240 -83 53 41 -121 -325 -110 129 55 -90 -191 -119 193 250 29 -39 -55 176 280 40 -105
7054 -105 -104 61 155 -14 -289 -183 -10 -6 -10 -245 -226 32 89 76 -61 -129 72 267 141 42 -116 56 242 131
7078 131 -80 -141 -86 78 38 -177 -244 -183 -46 45 -74 -176 -72 87 187 79 -47 30 187 215 127 -98 -89 87
7102 87 117 27 -126 -217 -58 97 -39 -165 -174 -99 70 91 -167 -64 -12 153 234 -22 -104 91 139 144 52 -154 -74
7127 -74 51 -36 -53 -209 -204 43 38 -66 -134 -175 83 135 -5 -24 -25 75 150 94 -85 -40 -2 90 122 -133 -83 -20 -1
7154 -1 37 -129 -187 -30 42 22 -22 -115 -45 158 100 1 -114 -65 135 92 -5 -44 -102 -8 142 -49 -129 -38 33 161 21
7181 21 -127 -45 15 122 117 -101 -70 113 90 41 -33 -133 4 83 19 -58 -92 -14 124 87 -99 -122 -25 63 89 -44
7207 -44 -49 -11 78 139 -36 -155 -14 67 105 50 -128 -92 5 86 24 -79 -127 25 93 23 47 -93 -53 111 44 -55 -36
7234 -36 -67 52 122 -36 -51 -35 38 71 -43 -95 -36 -16 48 25 -136 -54 42 86 69 7 -123 61 109 73 -10 -106 -17
7261 -17 181 40 -37 -52 -64 57 53 -100 -96 -82 -17 96 -39 -63 -32 9 96 -23 -50 -6 30 70 111 -22 -33 33 30 30
7289 30 -75 -155 -31 89 40 -84 -125 -48 90 7 -12 -61 -77 67 134 58 -88 8 38 92 9 -120 -56 -28 53 45 -143
7316 -143 -161 -10 33 76 -75 -172 0 126 73 65 -115 17 113 63 -22 -124 -119 21 89 39 -108 -127 -62 79 1 -102
7342 -102 -71 -67 53 70 -137 -108 4 77 100 -25 -113 -1 57 97 17 -144 -66 87 40 7 -97 -101 67 100 -42 -139
7368 -139 -113 9 106 35 -79 -93 -34 123 167 -49 -62 29 101 212 -1 -163 48 49 90 -17 -159 -152 58 44 -45
7393 -45 -220 -144 57 82 26 -88 -100 99 207 65 -29 -46 35 219 100 -105 -107 -89 61 132 -145 -242 -55 -13 107
7418 107 -22 -253 -60 103 87 53 -110 -91 185 184 5 -33 -94 134 185 -29 -165 -207 -40 103 -75 -193 -158
7441 -158 -50 119 77 -120 -176 -7 173 197 23 -134 95 201 218 63 -169 -36 118 106 -48 -251 -140 25
7463 25 44 -80 -192 -226 -4 186 -38 -136 -84 82 253 159 -106 -49 91 183 213 -83 -196 27 67 60 -129 -292
7487 -292 -157 61 27 -106 -310 -179 165 118 21 -65 -54 181 250 70 -126 -122 65 262 47 -163 -119 -50 154
7510 154 6 -232 -238 2 117 100 -74 -185 111 228 113 -5 -142 13 285 165 -55 -144 -92 146 117 -49
7532 -49 -177 -164 40 79 -63 -272 -155 39 155 70 -168 -80 100 177 142 -38 -113 102 212 96 -68 -230 12
7555 12 178 29 -100 -192 -70 65 80 -179 -202 -112 123 199 -67 -192 6 129 258 142 -129 -86 109 205 35
7578 35 -163 -191 96 127 -38 -188 -274 39 112 -26 -105 -177 -24 231 140 -145 -145 -44 189 191 -79 -126 6 177
7602 177 210 -35 -157 -51 78 138 -3 -186 -109 61 135 -16 -166 -180 75 193 -13 -38 -147 81 234 19
7624 19 -99 -118 23 204 68 -141 -171 -31 103 133 -72 -230 -16 55 123 -119 -214 -29 178 147 41 -155 -168
7647 -168 184 164 38 -28 -129 97 207 29 -156 -154 41 142 -20 -212 -152 -35 152 122 -151 -182 93 105 124
7670 124 -7 -112 -25 152 147 -72 -151 11 184 117 -38 -126 -61 81 121 -93 -220 -159 96 191 -5 -133 -80 64
7694 64 150 63 -154 -124 35 137 85 -94 -138 32 103 76 -64 -172 -19 94 14 -83 -159 -104 167 89 -56 -146 -76
7719 -76 86 154 16 -86 31 61 113 62 -108 -36 19 95 73 -135 -133 1 12 -25 -95 -172 -38 87 27 -69 -164 -54
7745 -54 178 108 33 -43 -18 146 108 -64 -62 -89 13 136 -58 -149 -53 24 7 -30 -190 -108 59 111 11 -38 -123 99
7771 99 139 42 29 -56 8 108 -13 -56 -47 -72 76 88 -161 -80 -55 -40 55 -63 -96 43 22 74 54 -98 11 43 79
7798 79 120 -80 -91 5 77 16 13 -121 3 44 20 -22 -49 -29 32 -19 -72 -58 -39 31 74 -60 -77 -10 -48 9 -6 -59 -15
7827 -15 -41 84 86 -57 -24 97 54 21 12 -132 -17 124 15 -9 -60 -73 94 30 -29 -26 -47 102 94 33 11 7 96 68
7855 68 59 -50 30 -32 21 57 -127 -57 -24 -22 -17 -113 -147 -6 20 6 57 -4 -23 91 57 126 34 21 88 92 20 21 -38 -42 64
7886 64 -92 -145 -103 -90 -8 -5 -72 -97 -17 6 100 57 -50 93 66 55 66 -31 -65 67 16 -11 -81 -162 -20 -18 -91 -78 -103
7915 -103 -54 41 -30 33 -24 34 129 122 -7 39 23 82 104 -30 -84 -64 -11 51 -54 -136 -73 -4 26 -7 -63 -138 29 91
7943 91 47 18 -49 84 145 33 -15 -16 -33 113 -5 -82 -72 -134 2 82 -148 -116 -70 -1 69 -52 -138 42 73 83 51
7970 51 -110 17 74 110 33 -77 -91 23 81 -20 -107 -158 -38 60 -33 -69 -72 -6 118 90 -92 -24 67 93 126 -1
7996 -1 -78 85 99 87 -59 -187 -29 92 21 -23 -122 -164 100 112 -82 -130 -84 48 174 22 -90 -69 87 173 94
8021 94 -131 -58 14 101 68 -136 -179 91 72 -56 -110 -153 -14 95 3 -50 -147 -39 146 46 -31 -164 -84 135 156
8046 156 -6 -97 -16 50 130 2 -120 -60 60 78 16 -174 -89 76 153 71 -144 -151 10 117 94 -69 -118 -56 187
8071 187 84 -38 -123 -17 115 181 -69 -127 -69 69 220 -44 -220 -94 17 107 0 -202 -128 122 102 106 -153
8094 -153 -109 124 153 110 -76 -154 46 203 6 -126 -195 -83 179 78 -173 -151 -79 151 134 -116 -198 -67 86
8117 86 212 -19 -169 -12 140 247 74 -114 -96 62 120 51 -167 -214 34 106 -51 -131 -158 14 162 47 -104
8140 -104 -78 -14 179 219 -56 -105 -1 56 169 -104 -206 -77 80 68 -83 -264 -138 45 82 9 -160 -144 87
8163 87 161 35 -56 -101 102 211 109 -79 -38 65 136 49 -226 -172 -66 15 88 -138 -221 5 88 116 -33 -172
8187 -172 24 183 146 49
8191D9
##END NTUPLES=NMR FID
##END=
