##TITLE=1H_Pr 5340
 200.13MHz,DMSO+CD3OD,
 8 sc
 
 4.12.2025
##JCAMPDX= 6.0         $$ Bruker NMR JCAMP-DX V2.0
##DATA TYPE= NMR FID
##DATA CLASS= NTUPLES
##ORIGIN= UXNMR, Bruker Analytische Messtechnik GmbH
##OWNER= pz
$$ XWIN-NMR		Version 3.5
$$ Thu Dec  4 13:56:42 2025 Russian Standard Time (UT+4h)  she@DPX200
##.OBSERVE FREQUENCY= 200.1313
##.OBSERVE NUCLEUS= ^1H
##.DELAY= (6, 6)
##.ACQUISITION MODE= SIMULTANEOUS
##.ACQUISITION SCHEME= undefined
##.AVERAGES= 8
##.DIGITISER RES= 18
##SPECTROMETER/DATA SYSTEM= spect
##.PULSE SEQUENCE= zg30
##.SOLVENT NAME= MeOD
##.SHIFT REFERENCE= (INTERNAL, MeOD, 0, 14.3821)
##AUDIT TRAIL= $$ (NUMBER, WHEN, WHO, WHERE, WHAT)
$$ ##TITLE= Audit trail, XWIN-NMR		Version 3.5
$$ ##JCAMPDX= 5.01
$$ ##ORIGIN= Bruker BioSpin GmbH
$$ ##OWNER= she
$$ F:/spectra/data/she/nmr/H-C/1/audita.txt
$$ ##AUDIT TRAIL=  $$ (NUMBER, WHEN, WHO, WHERE, WHAT)
(   1,<2025-12-04 13:54:54.39 +0400>,<she>,<DPX200>,
      <created by zg, POWCHK disabled, PULCHK disabled
       configuration hash MD5:
       00 E9 B6 7A A2 85 ED C7 34 08 36 98 17 FE 4E 26
       data hash MD5: 16K
       3E 64 7A 55 45 38 E1 33 9F 35 3F C2 0A BC 10 B1>)
$$ ##END=
$$ 
$$ hash MD5
$$ 93 65 B4 C7 58 8F 22 E5 65 97 64 4A 15 46 FA C6
##$RELAX= 
##$RELAX= 
##$RELAX= 
##$RELAX= 
##$RELAX= 
##$RELAX= 
$$ Bruker specific parameters
$$ --------------------------
##$DU= <F:/spectra>
##$EXPNO= 1
##$NAME= <H-C>
##$PROCNO= 1
##$TYPE= <nmr>
##$USER= <she>
##$AMP= (0..31)
100 100 100 100 100 100 100 100 100 100 100 100 100 100 100 100 100 100 
100 100 100 100 100 100 100 100 100 100 100 100 100 100 
##$AQSEQ= 0
##$AQ_mod= 1
##$AUNM= <au_zg>
##$AUTOPOS= <>
##$BF1= 200.13
##$BF2= 200.13
##$BF3= 200.13
##$BF4= 200.13
##$BF5= 200.13
##$BF6= 200.13
##$BF7= 200.13
##$BF8= 200.13
##$BYTORDA= 1
##$CFDGTYP= 0
##$CFRGTYP= 5
##$CHEMSTR= <none>
##$CNST= (0..31)
1 1 145 1 1 1 1 1 1 1 1 1 1 1 1 1 1 1 1 1 1 1 1 1 1 1 1 1 1 1 1 1 
##$CPDPRG= <>
##$CPDPRG1= <>
##$CPDPRG2= <>
##$CPDPRG3= <>
##$CPDPRG4= <mlev>
##$CPDPRG5= <mlev>
##$CPDPRG6= <mlev>
##$CPDPRG7= <mlev>
##$CPDPRG8= <mlev>
##$CPDPRGB= <>
##$CPDPRGT= <>
##$D= (0..31)
0 0.7 0 0 0 0 0 0 0 0 0 0.03 0 0 0 0 0 0 0 0 0 0 0 0 0 0 0 0 0 0 0 0 
##$DATE= 1764842093
##$DBL= (0..7)
120 120 120 120 120 120 120 120 
##$DBP= (0..7)
150 150 150 150 150 150 150 150 
##$DBP07= 0
##$DBPNAM0= <>
##$DBPNAM1= <>
##$DBPNAM2= <>
##$DBPNAM3= <>
##$DBPNAM4= <>
##$DBPNAM5= <>
##$DBPNAM6= <>
##$DBPNAM7= <>
##$DBPOAL= (0..7)
0.5 0.5 0.5 0.5 0.5 0.5 0.5 0.5 
##$DBPOFFS= (0..7)
0 0 0 0 0 0 0 0 
##$DE= 6
##$DECBNUC= <off>
##$DECIM= 32
##$DECNUC= <off>
##$DECSTAT= 4
##$DIGMOD= 1
##$DIGTYP= 9
##$DL= (0..7)
0 120 120 120 120 120 120 120 
##$DP= (0..7)
150 150 150 150 150 150 150 150 
##$DP07= 0
##$DPNAME0= <>
##$DPNAME1= <>
##$DPNAME2= <>
##$DPNAME3= <>
##$DPNAME4= <>
##$DPNAME5= <>
##$DPNAME6= <>
##$DPNAME7= <>
##$DPOAL= (0..7)
0.5 0.5 0.5 0.5 0.5 0.5 0.5 0.5 
##$DPOFFS= (0..7)
0 0 0 0 0 0 0 0 
##$DQDMODE= 0
##$DR= 18
##$DS= 0
##$DSLIST= <SSSSSSSSSSSSSSS>
$$ [...]
##$SUBNAM0= <"">
##$SUBNAM1= <"">
##$SUBNAM2= <"">
##$SUBNAM3= <"">
##$SUBNAM4= <"">
##$SUBNAM5= <"">
##$SUBNAM6= <"">
##$SUBNAM7= <"">
##$SUBNAM8= <"">
##$SUBNAM9= <"">
##$SW= 18.0517328524113
##$SWIBOX= (0..15)
0 0 2 0 0 0 0 0 0 0 0 0 0 0 0 0 
##$SW_h= 3612.71676300578
##$TD= 16384
##$TD0= 1
##$TE= 0
##$TE2= 300
##$TE3= 300
##$TEG= 300
##$TL= (0..7)
0 120 120 120 120 120 120 120 
##$TP= (0..7)
150 150 150 150 150 150 150 150 
##$TP07= 0
##$TPNAME0= <>
##$TPNAME1= <>
##$TPNAME2= <>
##$TPNAME3= <>
##$TPNAME4= <>
##$TPNAME5= <>
##$TPNAME6= <>
##$TPNAME7= <>
##$TPOAL= (0..7)
0.5 0.5 0.5 0.5 0.5 0.5 0.5 0.5 
##$TPOFFS= (0..7)
0 0 0 0 0 0 0 0 
##$TUNHIN= 0
##$TUNHOUT= 0
##$TUNXOUT= 0
##$USERA1= <user>
##$USERA2= <user>
##$USERA3= <user>
##$USERA4= <user>
##$USERA5= <user>
##$V9= 5
##$VALIST= <valist>
##$VCLIST= <CCCCCCCCCCCCCCC>
##$VD= 0
##$VDLIST= <DDDDDDDDDDDDDDD>
##$VPLIST= <PPPPPPPPPPPPPPP>
##$VTLIST= <TTTTTTTTTTTTTTT>
##$WBST= 1024
##$WBSW= 4
##$XGAIN= (0..3)
0 0 0 0 
##$XL= 0
##$YL= 0
##$YMAX_a= 375001
##$YMIN_a= -480907
##$ZGOPTNS= <>
##$ZL1= 120
##$ZL2= 120
##$ZL3= 120
##$ZL4= 120
##$ABSF1= 10
##$ABSF2= 0
##$ABSG= 5
##$ABSL= 3
##$ALPHA= 0
##$AQORDER= 0
##$ASSFAC= 0
##$ASSFACI= 0
##$ASSFACX= 0
##$ASSWID= 0
##$AUNMP= <proc_1d>
##$AZFE= 0.1
##$AZFW= 0.1
##$BCFW= 1
##$BC_mod= 2
##$BYTORDP= 1
##$COROFFS= 0
##$CY= -3
##$DATMOD= 1
##$DC= 2
##$DFILT= <>
##$DTYPP= 0
##$F1P= 0
##$F2P= 0
##$FCOR= 0.5
##$FTSIZE= 0
##$FT_mod= 4
##$GAMMA= 1
##$GB= 0.15
##$INTBC= 1
##$INTSCL= 1
##$ISEN= 128
##$LB= 0.25
##$LEV0= 0
##$LPBIN= 0
##$MAXI= 10000
##$MC2= 0
##$MEAN= 0
##$ME_mod= 0
##$MI= 1.114404
##$NCOEF= 0
##$NC_proc= 0
##$NLEV= 6
##$NOISF1= 3.799351
##$NOISF2= 2.8
##$NSP= 1
##$NTH_PI= 0
##$NZP= 0
##$OFFSET= 14.38212
##$PC= 1
##$PHC0= -3344.598
##$PHC1= 4.992341
##$PH_mod= 1
##$PKNL= yes
##$PPARMOD= 0
##$PSCAL= 0
##$PSIGN= 0
##$REVERSE= no
##$SF= 200.129724274929
##$SI= 16384
##$SIGF1= 3
##$SIGF2= 2
##$SINO= 400
##$SIOLD= 16384
##$SREGLST= <1H.CDCl3>
##$SSB= 0
##$STSI= 0
##$STSR= 0
##$SW_p= 3205.1282051282
##$SYMM= 0
##$S_DEV= 0
##$TDeff= 0
##$TDoff= 0
##$TI= <>
##$TILT= no
##$TM1= 0
##$TM2= 0
##$TOPLEV= 0
##$USERP1= <user>
##$USERP2= <user>
##$USERP3= <user>
##$USERP4= <user>
##$USERP5= <user>
##$WDW= 1
##$XDIM= 8192
##$YMAX_p= 0
##$YMIN_p= 0
$$ End of Bruker specific parameters
$$ ---------------------------------
##NTUPLES= NMR FID
##VAR_NAME=  TIME,          FID/REAL,        FID/IMAG
##SYMBOL=    X,             R,               I
##VAR_TYPE=  INDEPENDENT,   DEPENDENT,       DEPENDENT
##VAR_FORM=  AFFN,          ASDF,            ASDF
##VAR_DIM=   8192,          8192,            8192
##UNITS=     SECONDS,       ARBITRARY UNITS, ARBITRARY UNITS
##FACTOR=    0.0002768,     1,               1
##FIRST=     0,             0,               0
##LAST=      2.2672688,     0,               0
##MIN=       0,             -480907,         0
##MAX=       2.2672688,     375001,          0
$$ Real data points
##PAGE= N=1
##DATA TABLE= (X++(R..R)), XYDATA
0@%%%%%%%%%%%%%%%lLqJ6j6J6j6K1k6K9l2L7m5N3o1O9p9Q7r8J14j29J43j58J76
39I3j97K19k44K73l03L34l68M05m47M92n40N96o57P26q02Q85r79J087j213J357
59G17j529J734j986K308k727L306m156N533q149J4913o7763k10133r4292p871
73c70095Q2746J15332J29308J24849J23768R3712M7603k5891j02595j55808j49196
84h6267j10894n7966k521M7336P1495Q7112R7154R4539P0839L5511q809n5835
96A81694r0131r3411p3890m5467k6236j3147q160R285M6111R0891J09076R3983
108A80598N6317O843l5390n5877o9325r6180j16514j03128n7010J2177Q4726J29864
120f2899J31740J07966P7743M2125l868n8462j12510j48582j50672j09941l9433
$$ plain form
0 0 0 0 0 0 0 0 0 0 0 0 0 0 0 0 0 -3 0 -8 8 -8 8 -8 13 -13 16 -16 21 -24 29 -32 37 -42 45 -53 61 -68 75 -83 93
39 93 -104 115 -129 144 -159 175 -193 212 -235 257 -283 313 -344 382 -420 465 -514 573 -640 717
59 717 -812 922 -1064 1244 -1483 1823 -2333 3200 -4949 9964 -57799 -267932 -362224 -370095
73 -370095 -287349 -172017 -42709 82140 205908 299620 347223 321332 218737 62929 -86267
84 -86267 -197161 -255127 -257648 -210312 -138817 -51705 45449 139988 210827 246338 237529 181694
96 181694 91563 -1848 -75738 -121205 -147441 -160588 -168748 -159463 -113352 -22461 86615 180598
108 180598 236915 243758 208368 152491 83166 -13014 -129528 -232656 -289666 -277489 -192763 -62899
120 -62899 68841 176807 254550 296675 292807 234345 121835 -26747 -177419 -287360 -326793
131c26793L2869R0460J27512J32521J07577P1555K9915k1638o7162j00502j22863
142d6549j23295q5472k3509L4437P6925R4632Q5857O9566N8941M3683J3826l1987
154A67055p6130r7625q7821n3730j5591N362J0210K1000M2784O5710Q1595P7922
166A40741M5177J186k9179n0320o8655p7616p7079p0024m3586L278N2926R0130
178h3021J11190J07503P9201L1614j9020o1896r3079j06331j02129q1122m4499
189b61589J1868P4839J16112J23323J00675N4144N844k5017m4784p1661r3092
200i338r6574p6823l1971K8587P4304Q7060P5075N6376M0688K5333O517k3257
212A55977n5759q0829q0017n7838k7404K528K5625L9336M4740N1650N6416M8532
$$ plain form
131 -326793 -293924 -203464 -75952 56569 164146 235701 265616 243978 176816 76314 -46549
142 -46549 -169844 -255316 -278825 -244388 -167463 -72831 13026 82592 141533 185216 199042 167055
154 167055 90925 -6700 -94521 -148251 -163842 -158480 -148270 -127270 -84486 -18776 62819 140741
166 140741 185918 187104 157925 107605 38950 -38666 -115745 -185769 -229355 -226077 -173151 -83021
178 -83021 28169 135672 214873 246487 227467 165571 72492 -33839 -135968 -217090 -261589
189 -261589 -249721 -174882 -58770 64553 165228 219372 225216 200199 155415 83754 -9338
200 -9338 -105912 -182735 -214706 -186119 -111815 -24755 50320 106696 147384 172717 179234 155977
212 155977 100218 19389 -60628 -118466 -145870 -143342 -117717 -78381 -33641 18009 74425 122957
224A22957L1148O898k8655o2811p5376o8977n0945k4036j88J5775L1499N2887
236d9824P5466Q5252O8081K6570k4539o4810q1747p9115o9324n7268l4651M383
248b01526M9092R1346J11584R4456N0201N259l1572o0736p5247p9390p9126o2173
260a87832k3884K0327N7424Q1722Q5040O7731L7967Q298j7125l6760n0435n7184
272a4711n8188n2320l1538J210L1636N0639N7021M8337L5360L0875L0561J5076
284A43958j4840m9080p5953q0535n4311j6466J1627K7076L6979M7630O0577O8923
296A05585N8615K4091k2028o0985p8707p5918o0287l6657j4163Q460L6703O5632
308d9659Q1106P9787O1381K1821k4829n8358p3464p3442n7427l5522j6865K582
$$ plain form
224 122957 154105 161003 132348 69537 -5839 -74816 -125761 -149797 -149985 -134210 -102711 -49824
236 -49824 25642 110894 178975 205545 181006 116196 34449 -44666 -113990 -171258 -205909 -201526
248 -201526 -152434 -61088 50496 144952 195153 200412 168840 108104 32857 -46533 -125659 -187832
260 -187832 -211716 -191389 -133965 -52243 32797 100528 138495 146793 129668 92908 42473 -14711
272 -14711 -72899 -125219 -156757 -155547 -123911 -73272 -16251 32086 67446 98321 128882 143958
284 143958 129118 80038 4085 -76450 -130761 -147227 -135600 -108524 -71545 -23915 36662 105585
296 105585 164200 188291 166263 105278 26571 -49347 -109634 -146291 -160454 -151994 -115291 -49659
308 -49659 31447 111234 172615 194436 169607 111249 37785 -35657 -93084 -128606 -145471 -142889
320a42889L0292N8795P9435P9939N6033J3454k5927m8108n3014m7367m4911m2781
332h7049l2899j3495K1299N2919O4792N3212L3387J4011K34n372j4118l3064n3524
345C33o1277n2633l0033K116L0325M5396N0390M9887M4769L5739J9375m640l4916
358I4831o3961p8500o8352m1968o486K7177M6795N2816N6514N9993N1848K9465
370A60172m721m6811p7828p9641n8413k9392l071J5405K6891M0823N5263O3111
382F1788N2332K3478j2243m1042n3945n2866m1413k9196j8856m429J5734L3292
394f7366M7824N3659M4188K2513J018j6016k8746l2725l1508l3185l2520k2350
406i5214l328K0317M1621N0544M4791K8141J2960K521o939k0564l8379n2300n5150
$$ plain form
320 -142889 -112597 -53802 25633 105572 161605 175059 149132 101024 48010 643 -44268 -87049
332 -87049 -119948 -133443 -112144 -59225 5567 58779 92166 106177 106411 101039 86921 53857 333
345 333 -60944 -113577 -143610 -141494 -111169 -65773 -15383 34504 79273 115012 134387 129747 94831
358 94831 30870 -47630 -115982 -157950 -164436 -137259 -90464 -37648 18866 78859 130707 160172
370 160172 155451 108640 30812 -48829 -107242 -136634 -139705 -124300 -97409 -56586 -1323 61788
382 61788 114120 137598 125355 84313 30368 -22498 -63911 -93107 -111963 -116392 -100658 -67366
394 -67366 -19542 34117 78305 100818 101836 85820 57074 24349 -7159 -40344 -72864 -95214
406 -95214 -98542 -78225 -36604 13940 58731 86872 99832 102353 95414 74850 36471 -15829 -70979
419g0979l8375o162K4249M0540M6489M2844L4472K9257K0138k525l2006n4866
431C3076o5191n7208l0689o82K2079L5986M2697M5460M4142L6849K0425n307l4180
444H7457n5813n9443m7782k6346j257J5453K1908K9484L9060M2781M0372K6545
456A12419m45l0051m4441m3169l3911k2713j5099j1533l919J3215L3963M8409
468B725M6995L0645R111j0042k1041k5407k9912l8032m0610l2303j4877J2183
480a10565L9735N3084M9478L8512K1699L596r907k1958l6780m8533m9418l7182
492a08239j2410J7938M0465M9419M3326L1722K0988J1642p79j8144l6418n1218
504a1708n0422l2446o644J4305K7883L1591K9281L0205L2107K4142P007j4071
$$ plain form
419 -70979 -109354 -115516 -91267 -50727 -4238 38606 73078 102335 122473 119948 87942 33076
431 33076 -32115 -89323 -120012 -120694 -98615 -62629 -19932 25528 69670 106519 126944 121637 87457
444 87457 31644 -27799 -75581 -101927 -103184 -87731 -65823 -36339 2721 45502 85874 112419
456 112419 111974 81923 37482 -5687 -39598 -62311 -77410 -88943 -92862 -79647 -45684 2725
468 2725 49720 80365 89476 79434 58393 32986 3074 -34958 -75568 -107871 -122748 -110565
480 -110565 -70830 -17746 31732 70244 91943 95539 85632 63674 26894 -21639 -71057 -108239
492 -108239 -120649 -102711 -62246 -12827 30499 62221 83209 94851 94072 75928 39510 -11708
504 -11708 -62130 -94576 -101220 -86915 -59032 -27441 1840 32045 64152 88294 95301 81230
516H1230l5386m5655l9527k4102q309K336R416J4897K2432L0891L6284L0802J5446
529I0755n249k0505k8664k8780k3968k0115j9268j3755R0J7131L4176M4396L8430
542F4674K0404K570j0412k0272k5708l0362l6589l5331k2072K322K6919M2713
554b1144M2929L2281J5453J099p350j4215k4469l3060l4573k8401j1361J1414
566g1397K6704L0414K6825J9400J1167P973N176m760j8267k9502l3964k6567j0631
579f7429O469J5776J8697J6828J7297K0825K1031J4344J60k0300l4165l5055k6154
592e1676j3921j884M849P390J5619K8141L3971L2776K0513p70k1888l0872l0783
605h535k5869j9884j4073q267L302J9925L5989M4694L8654K0607j41j7545k7338
$$ plain form
516 81230 45844 189 -39338 -63440 -71749 -69413 -59997 -45100 -22668 8223 44507 75309 90755
529 90755 85506 65001 36337 7557 -16411 -36526 -55794 -69549 -69459 -52328 -18152 26244 64674
542 64674 85078 87648 77236 56964 31256 894 -35695 -71026 -93098 -90776 -63857 -21144
554 -21144 21785 54066 69519 70618 63268 49053 24584 -8476 -43049 -71450 -82811 -71397
566 -71397 -44693 -14279 12546 31946 43113 51086 56262 51502 33235 3733 -30231 -56798 -67429
579 -67429 -60960 -45184 -26487 -9659 7638 28463 49494 63838 63998 43698 9533 -25522 -51676
592 -51676 -65597 -67481 -62632 -55242 -39623 -11482 22489 55265 75778 75008 53120 22248 -8535
605 -8535 -34404 -54288 -68361 -76628 -73326 -53401 -17412 27282 65936 86543 86402 68857 41519
618D1519k8457k7476k7325k3071j1605M355K2830L8657L9607K8081J3205j353
630F8967j1031j4900j8111k2996k7641k4925j3934K703J8280K5451K4119J8248
642B4230J1392R828Q988K188r365k1288l0861k9764j7895l516P437J4740J7556
655a6330J8288K2257K4397J9937N561j1892k7663l5286l0051j8692p031J740P782
668d6983J4749K2759K9316K8390J8781L25j8108k8134k7878k2107j3682p506n477
681e5555R7J1901K2282K8904K7725J5473j211j1743j6235j5761j3795j3794j6147
694c7859j2991m122R435K2580K5743J9957J0593J687k592j980l057j0397j8772
707a775k3164k0740r292P523J7738J9403J6221J1495Q096Q895P309j183j3559
$$ plain form
618 41519 13062 -14414 -41739 -64810 -76415 -72060 -49230 -10573 29034 57115 70320 68967
630 68967 57936 43036 24925 1929 -25712 -50637 -64571 -61868 -43588 -18137 5982 24230
642 24230 35622 45450 54438 56626 47261 25973 -4888 -34652 -52547 -56063 -48626 -33886 -16330
655 -16330 1958 24215 48612 68549 74110 62218 34555 -731 -30782 -49474 -56505 -54765 -46983
668 -46983 -32234 -9475 19841 48231 67012 67337 49229 21095 -6783 -28890 -42572 -50078 -55555
681 -55555 -55458 -43557 -21275 7629 35354 50827 49616 37873 21638 5877 -7918 -21712 -37859
694 -37859 -50850 -54972 -45537 -22957 2786 22743 33336 35023 32431 30451 27394 16997 -1775
707 -1775 -24939 -45679 -54971 -47448 -29710 -10307 5914 17409 25505 34400 41709 40526 26967
720B6967k4317k7037k0708o544M455J2521J4202J4174J6087K0344J7246R152o224
733E0318k1527k9560k5086j2902j399P411R460Q632J0813J6936J8961J5717N477
746E3251q752j9690k1665j5557q714l304k125j565L257J0831J8431K0702J4255
759C9355J953p284j2043j2467q387p880j1859j2915r200M7J2787K2853K3048J4828
773C2836N772j985o122p336r882j5368j8978j6877q546M641J5674J9786J7635
786A1250J2147O761M962K974l768j3134k0660k5073j9066n553O475J3797J5407
799a3481J2900R573R590J0482O066k490j2910k0032k0662j3403m508K399O261
812c0215O180Q533J3245J6362J5069Q625k740j3578j5817j3349r003m061l071
$$ plain form
720 26967 2650 -24387 -45095 -51639 -47184 -34663 -20461 -6287 9800 30144 47390 56542 50318
733 50318 28791 -769 -25855 -38757 -40156 -32745 -23285 -14653 -3840 13096 32057 47774 53251
746 53251 44499 24809 3144 -12413 -21127 -24431 -26556 -28121 -24864 -14033 4398 25100 39355
759 39355 41308 34024 21981 9514 1127 -6753 -18612 -31527 -40727 -40680 -27893 -5040 18008 32836
773 32836 38608 36623 30501 23165 13283 -2085 -21063 -37940 -46486 -41845 -26171 -6385 11250
786 11250 23397 30158 35120 38094 34326 21192 532 -24541 -43607 -49160 -42685 -28888 -13481
799 -13481 -581 8992 18582 29064 35130 32640 19730 -302 -20964 -34367 -38875 -36476 -30215
812 -30215 -24035 -15502 -2257 14105 29174 37799 35059 21481 5664 -7685 -16688 -20749 -23820
825b3820l616q46O841J4041J8267J6908Q332k289q592r706r402p656j0193j1888
839b3619r848l023Q094J7036J9713J4021P194O90l231l828n556j1307j6547j6351
853b6562j0759j84J2221J7331J5628J0994O102K019K965K94n365j2492j6994j5211
867b0013p664J609P204R076P728N511P126R835Q764M204m386j2974j7323j3154
881a4457o975k104J168K249K055O871J2311J4116J1177L125o905j3085j2142p616
895a0212l364j664l181l526N16O406J2762J3864R317L73m516o044n241m198n100
910c808q458r454m052K575J0346J4170J1315M857m00k855l390k834n628r840j1526
925a8982q770k042Q415J3560J2413P423K046j396n51M74j689o522r797j1384o798
$$ plain form
825 -23820 -27436 -28282 -21441 -7400 10867 27775 36107 33818 25226 15520 6118 -1538 -11731 -23619
839 -23619 -33467 -36490 -28396 -11360 8353 22374 29568 30258 27027 23199 17643 6336 -10211 -26562
853 -26562 -37321 -37505 -25284 -7953 7675 18669 24771 26790 29755 30049 24684 12192 -4802 -20013
867 -20013 -27677 -26068 -18864 -9788 -2060 3451 10577 20412 29176 33380 28994 16020 -1303 -14457
881 -14457 -21432 -23536 -22368 -20119 -18064 -11193 1118 15234 26411 29536 22631 9546 -2596 -10212
895 -10212 -13576 -15240 -18421 -21947 -21431 -15025 -2263 11601 20918 21291 16775 10731 5490 1292 -3808
910 -3808 -12266 -21720 -25772 -23197 -12851 1319 12634 17491 17091 14236 10846 8012 2384 -7456 -18982
925 -18982 -27752 -29794 -21379 -7819 4594 12017 14063 12667 12116 12590 10901 4379 -5418 -16802 -23600
940b3600J397P149P663N949M367L592P358Q906N367k366j0830j5522j3199n753
954a9522R6M161M273J912M427Q323J1239J0352M970m381j1363j2079r104n251
968a1947k374k288k557J65O430J1523J3926J0673K148n061p889p168l924l059
982a402n715q475o599j106P927J4848J3889P731P14l809m907l264k605o058r579
997h410q754m932K094Q865R785O753L327P36R27K649J749l049q616j2354j0930
1012b0160l867L210O508O768M766K119L748P165O419K399l133j0473j2194p929
1026a4654l186J182K094J888J678N337R699J1027P280L33p210j0555q463m866
1040h416j673q29k330k093J494O799R971R707M547k322n432n685l798j554j678
$$ plain form
940 -23600 -22203 -15054 -7391 -1442 2925 6517 13875 22781 28148 25782 14952 -570 -13769 -19522
954 -19522 -19426 -15265 -10992 -9080 -4653 3670 14909 25261 30231 25850 14487 2408 -6696 -11947
968 -11947 -14321 -16609 -19166 -19001 -12571 -1048 12878 23551 25699 20638 12749 5581 1657 -1402
982 -1402 -7117 -15592 -22191 -23297 -15370 -522 13367 21098 21812 18003 13096 9832 7227 1169 -8410
997 -8410 -17164 -22096 -20002 -11137 -1352 5401 8728 9464 10391 13040 14789 11740 3124 -9230 -20160
1012 -20160 -24027 -20817 -14309 -7541 -2775 -656 3092 10257 16676 19075 15942 5469 -6725 -14654
1026 -14654 -17840 -16658 -14564 -12676 -10998 -5661 4038 15065 22345 22678 15468 4913 -3550 -8416
1040 -8416 -10089 -10918 -13248 -15341 -13847 -7048 2923 12630 17177 14855 9423 3738 -60 -1614 -3292
1055c292m016m582j993J590O785Q598N479J070j156j317l79J209n93n764p177
1070e538o759j433N042Q135O547K851M31j414J037J982n98m758p302p434l912
1085a3123K944M921N320K821L33M28L014M415J751k349o825r124o341j602J761
1100a1656L476K564R69K874N626O960N563P14o302r386q422m148M06K002J204
1115g556j19Q62M357O647P155L403k267o257n813l007m55M2k696m576l447J90
1131a3537M964Q291P211K437l59k050k282l74j219m788p171o002k892L083Q003
1146f685Q009N053J515j28j86J105K44k960n703p531n152K38M495M239L401J033
1162I87O40K770N029M222L6m575q262p704k961K65K381J988K26P54L333N697N767
$$ plain form
1055 -3292 -7308 -11890 -13883 -12293 -5508 3090 8569 9639 8483 7166 6787 7996 7403 1639 -5538
1070 -5538 -12297 -13730 -8688 -553 5994 8845 9276 7862 8899 10881 10283 5525 -1777 -9211 -13123
1085 -13123 -10179 -5258 62 2883 3216 3644 6658 11073 12824 10475 3650 -5474 -11815 -13417 -11656
1100 -11656 -8180 -5616 -4647 -1773 3853 10813 16376 17090 10788 1402 -7020 -11168 -10762 -8760 -7556
1115 -7556 -7675 -6813 -2456 4191 11346 14749 12482 6225 412 -2595 -3050 -3008 -5704 -10280 -13727 -13537
1131 -13537 -8573 -282 6929 9366 9007 6957 4675 4301 3082 -1706 -8877 -14879 -17771 -14688 -6685
1146 -6685 1324 6377 7892 7764 7578 8683 8927 5967 264 -7267 -12419 -12181 -7686 -3447 -46 987
1162 987 1627 4397 9426 13648 13684 9109 847 -6857 -9818 -9553 -7172 -5184 -4958 -4204 -871 4826 10593
1179A0593K922j855o074o058l776r30R93J01k063j370J276M136O307N908J587
1194A1697k800l319k629n09k4j504n049m848j975K047O766O917L577l57j258k006
1210D726J27M68k374m984n844l764J49N084N626L421P52r38m25K133J870k06l563
1227B258n643n542j599K995M045L431R69o55J26K260L602R71j540m699n598k032
1243f651J184K322J982N6j758k58K940M028L243J91l648n513k533r9R43J334p56
1260b993k803m24K685N055N346K390k711m510l410j873J002M20j444k386j178
1275f834J774M536O014L487o07k530k832j447P69k43k333m150l624m11L109N829
1291E07M415J636m46j341k97J167l73k513m779n081k432K047M082L558J920k66
$$ plain form
1179 10593 13515 11660 5586 -472 -4248 -5178 -4185 -4084 -6147 -7517 -6241 -2105 4202 10110 11697
1194 11697 8897 5578 2949 2440 2416 912 -4137 -8985 -10960 -8913 -2147 4770 8347 7990 6732 4726
1210 4726 4853 5321 2947 -2037 -7881 -11645 -11496 -6412 -786 2635 3387 2449 2024 4157 6027 5821 2258
1227 2258 -3385 -8927 -10526 -7531 -3486 -55 914 259 385 2645 6247 7218 5678 979 -4619 -6651
1243 -6651 -5467 -3145 -1163 -1107 -2865 -3123 -183 3845 7088 7279 3631 -1882 -4415 -4514 -3571 -2237 -2993
1260 -2993 -5796 -6220 -3535 1520 6866 9256 6545 2035 -1375 -3248 -2246 -1826 -3270 -5656 -6834
1275 -6834 -5060 -524 5490 8977 8370 5840 3008 1561 2330 2087 -246 -4396 -8020 -8431 -5322 507
1291 507 4922 6558 6112 4771 4474 5641 5268 2755 -2024 -7105 -9537 -7490 -3408 150 2070 1804
1307A804j115J035L175J986j9k948n059l494o30J558J224N37j270q51K123M448
1323B504M854K309j614m056m460k362j004M42k81j704j119K068L924M777L188
1338G466q28l635l084k067KJ024n87k609k470k78K612M817L827Q63j351j908j278
1355E16Q06R28j474l207l423j812P81M622M296J592M39j308n64J243J534r93k751
1372A225m631l494J68K592L288J471K74j074K0K499K580J196j166l944m019j442
1388d457Q46J168N75k70j506R75L455L711K519j10l410l816j586L01J083P59j159
1405i22k554k05J732L636L214R57k109k564k085qJ425Q07j283k430j442O36K531
1422f64L198R18j770j821j220O07K166R55j287l161k141m60K453L199J431k03
$$ plain form
1307 1804 689 1724 4899 6885 6866 3918 -1141 -4635 -5265 -3707 -2483 -1946 -3216 -4067 -1944 2504
1323 2504 7358 9667 8053 3997 -463 -2825 -3829 -3387 -3668 -5372 -6491 -4423 -499 4278 7466
1338 7466 6638 3003 -81 -2148 -2146 -1122 -1709 -4318 -6788 -7066 -4454 363 4190 5053 3702 1794 516
1355 516 1322 2250 776 -2431 -5854 -7666 -6885 -2263 2033 3625 4064 2756 2192 3435 4969 3976 1225
1372 1225 -3406 -6900 -6732 -4140 -852 619 893 -181 -161 2338 4918 6114 4948 1004 -3015 -4457
1388 -4457 -3611 -2443 -1868 -2138 -3644 -2669 786 4497 7016 6906 3496 -320 -1906 -1605 -522 237 -922
1405 -922 -3476 -3681 -1949 1687 4901 5858 3749 1185 -900 -908 517 1324 41 -2389 -3831 -3195 -664
1422 -664 2534 3452 1682 -139 -1359 -752 1414 2369 1082 -2079 -4220 -4680 -2227 972 2403 2200
1438B200j449j079K01K416L44r47k607k863j068K087K315K056J60j055j182Q84
1454D13J935J193n77k509l609j489J108K207J279M8j711j324J101K884K775R50
1470D674j235l478k169r20N74P84m3j975r7K142K862L049J713j425k742k490r07
1487a683P84J085n02k109j421L19K199L242K645k15j534j420q30J228O83j270
1503A201l130k565j666Q13L918K875J605j59k32N3J103P18j808k970m010k277
1519f531R26K977K785J273J28n86M29J965J362J02j626l315k578p04M30J494M01
1536a068o39r67R90K689K918J829l43l017l347j663J03Q47Q75j469j484j84J992
1553a938K980K715k77k243k025l03J012J557j0j875k251j089J50K163K424O79
$$ plain form
1438 2200 751 -328 -127 2289 2633 1686 -921 -3784 -4852 -2765 -450 1606 1766 711 -471 413
1454 413 2348 3541 2964 455 -3154 -4643 -3535 -1328 -49 -1 -1712 -3036 -1935 949 3724 4674
1470 4674 3439 -39 -2208 -3128 -2554 -1770 -1813 -3788 -3885 -1743 1119 4168 5881 4456 1714 -776 -1683
1487 -1683 -899 186 -316 -2425 -3846 -3527 -1328 1914 4559 4344 2810 1390 560 1788 2471 1201
1503 1201 -1929 -4494 -6160 -5347 -1429 1446 3051 2892 2660 2713 3816 4534 2726 -244 -4254 -6531
1519 -6531 -5605 -2628 157 1430 1558 972 1401 3366 4728 4830 3204 -111 -2689 -3393 -2963 -1469 -1068
1536 -1068 -1707 -2674 -1684 1005 3923 5752 5409 2392 -955 -2618 -2515 -1668 -793 -2262 -3746 -3930 -1938
1553 -1938 1042 3757 3480 1237 -788 -1091 -79 1478 1468 -407 -2658 -3747 -3597 -1434 990 1669
1569A669j004l62j86R58J506n78j668j963j802K62J902J975J267q05j329r07K65
1586h00J937N19q91j774k025J9K237K452J108j007k301j568R84J443J416J4j876
1603a13k324k5J762J649O98j07j328p91J591J132P06o73k076k088j11Q09R94J256
1621I61O4j386n30L16J609J855R34r19k436j443n96M42N89m50j818r64J065K771
1639F4L464J452j181j997j827m14O95J53j792k009j027N74K355L249J272m24j033
1656A574p47J59N49J16p85j520j851j063R41J005Q55R51J0l06M82J267J270l60
1674B547j686k600j984N80J925J620M53j400k013N04J637K213J264j121k298r11
1690a270N96R76N46q84j743j231O24J970K055J259n61j556p06m11K63M84p13o92
$$ plain form
1569 1669 665 303 117 1075 2581 2003 335 -1628 -3430 -3168 -1266 709 1976 1171 -158 -1065 -800
1586 -800 1137 1656 765 -1009 -3034 -3015 -778 1674 2782 1775 -526 -2094 -1110 333 1749 1763 -113
1603 -113 -2437 -2462 -700 949 1647 1540 212 -579 1012 2144 2850 2177 101 -1987 -2098 -1289 -295 961
1621 961 1025 -361 -891 -575 1034 2889 3823 2904 468 -975 -1571 -1129 -540 -990 -2808 -3772 -2707 64
1639 64 3528 4980 3799 1802 -25 -439 256 409 -1383 -3392 -4419 -3845 -1490 1759 3031 2607 1574
1656 1574 827 986 1535 1651 866 -654 -2505 -3568 -2627 -1622 -767 184 194 -112 370 1637 2907 2547
1674 2547 861 -1739 -3723 -3143 -1218 402 855 -545 -2558 -2054 -417 1796 3060 1939 -359 -1270
1690 -1270 -674 302 848 -36 -1779 -3010 -2386 -416 1639 2898 2337 781 75 -336 -73 411 -302 -994
1708i94q14L3J015J500J816k11j184j738j335O11J957Q67k36j705j455M47J599
1725A73J389k46j145j730J74K202K380Q1j779k547j546L08K185J116O1n07r56
1742c87J22J049P83N7r96o36j068J21L09N42O61k43q19p63P03P68J190P63j061
1761A095j706n26J96J154J53m78k053m87J346K370J938j54k254j866o02O49J588
1778C63M37j328j128k87J112J378J431j083p28q86n7N17P65N68j250n90j061j72
1796a999L13J494R05L46j34q83j67O84Q12l24j306k212q63J499K546J337j7j631
1814D00j233K26J394R10n28j251k004J5J952J489j39m52j315m81J208J062P5J43
1832A471q20j310p4p5L86N70K06m24l9J04J7J286Q31l03j607j606l06M95J643
$$ plain form
1708 -994 -1808 -1775 -760 740 2556 2345 1161 -577 -1912 -1301 656 1523 1287 -418 -1873 -1426 173
1725 173 1562 1316 171 -1559 -1385 817 3197 3278 1499 -1048 -2594 -2286 -101 1015 1076 569 -387
1742 -387 -265 784 1567 1624 628 -8 -1076 -955 -646 -104 557 314 -505 -1268 -565 203 1393 2156 1095
1761 1095 -611 -1137 -941 213 366 -112 -2165 -2652 -1306 1064 3002 2848 594 -1272 -1874 -1225 363
1778 363 800 -528 -1656 -1943 -831 547 1978 895 167 -719 -776 -259 506 1074 -176 -766 -1827 -1999
1796 -1999 -1686 -192 713 1059 925 42 -125 559 1371 1047 -259 -2471 -3334 -1835 711 2048 2031 400
1814 400 -833 -607 787 1697 1169 -82 -2086 -2071 -119 1370 1231 779 -536 -1017 191 1253 1328 1471
1832 1471 651 -659 -733 -808 -422 148 354 -70 -109 -5 12 1298 2129 1826 219 -1387 -1693 -1198 445
1851D45N69p91j198k41Q32K323R08j184j925j052K08J688J315j067k390j012L69
1868b203J447J749Q22q46n88n70K16O67j14q17n92l50o80K24R27N44N60J10o54
1887a48l21J89J016O22K85j358j683o72Q62J232J99p74j384l40J404K357Q91n44
1905A833j680r99P11R18M34r53j994r83O29J422J037M56m88k73L98R14L15j94
1923A503o32r60j317n90K9M42J356Q57K44o31j83J54J036J282j140j281j760j84
1941a775J135J733M2j007j435l71J485J714O82j133j051r89J21J700P42n88j051
1958d6o04o8R60P76n04p24k64o81J45O79J72O53P56n44k93q2Q1L67M2k75j779
1979a233j416N34J187J307L65r49p79Q69J443J728k04j590k025j111L40M92j2
$$ plain form
1851 445 1014 223 -975 -1216 -384 1939 2847 1663 -262 -1314 -1106 582 1897 830 -1560 -2572 -2203
1868 -2203 -756 993 1815 969 381 -189 27 694 580 -237 -829 -1179 -1859 -1635 -708 -164 396 506 -148
1887 -148 -469 -280 736 1358 1643 285 -1398 -2070 -1208 24 223 -551 -1935 -2275 -871 1486 2377 1833
1905 1833 153 -846 -135 783 1217 264 -1730 -2713 -2084 -662 375 831 343 70 468 1382 1697 1503
1923 1503 871 -89 -1406 -1996 -1967 -1525 -169 688 932 301 118 272 1308 2590 1450 169 -1591 -1775
1941 -1775 -640 1093 1135 128 -1307 -1678 -193 1521 2203 1070 19 -970 -849 851 1593 1005 -46
1958 -46 -650 -718 242 1018 514 -210 -474 -1155 -1010 -331 -159 494 1250 706 413 331 412 779 821 546 -1233
1979 -1233 -2649 -2115 -928 379 744 -205 -984 -115 1328 3056 2852 1262 -763 -1874 -1534 -1042 -1054
1996a054r43j168N66K153J914J225J71j438r89k66p69n3m48j252J3L86M89J128
2014c35J226Q33O2n12q67j021J23N45M46n38r54j347O86J908J248p4p83j238p7
2033f69J403Q29j82j116j391l67J155J073L14n84o19k42P05J092p22m28m23m31
2051f03M93M94K69q1J8o2l37l41j57J44O30K43p13o07kN07J483N97j244j111o55
2072a035O78M78Q32p07j331o40L78J635J594L6j298m33p59M01Q10j4j657o58k48
2091a938Q09R12Q67L3km21l2l11N1L42n38L79r38n61J77P39P63j76k84p68l1N27
2113d01J261Q25m69j434j075M24N21N94m50q61p72O04J548P17O3p54m06m01P03
2132B37M1N3n67k33J5L60J23J77l64j89k70N7N95J51L71M92l99J9m84o74P29L14
$$ plain form
1996 -1054 -1997 -3165 -2599 -446 1468 2693 2864 1426 437 171 -598 -651 -1099 -2351 -2338 -1952 -1463 -335
2014 -335 891 1724 1786 1274 407 -614 -491 54 500 -38 -992 -2339 -1653 255 1503 1429 646 -592 -669
2033 -669 734 1563 1381 265 -1126 -1493 -338 735 1049 465 -154 -396 309 1401 679 251 -172 -603
2051 -603 -110 384 653 572 590 528 191 -150 -307 -163 467 710 -3 -610 -612 -105 1378 1975 731 -380 -1035
2072 -1035 -357 121 953 246 -1085 -1725 -1347 288 1882 1918 620 187 -572 -171 639 625 -1032 -1690 -1938
2091 -1938 -1129 -217 650 683 681 260 228 -83 -32 310 -228 151 -787 -1348 -1171 -432 331 155 -129 -897 -928 -401
2113 -401 860 1685 1216 -218 -1293 -869 -348 246 -204 -1065 -1837 -1233 315 1032 1095 341 -65 -466 237
2132 237 278 331 -236 -469 -454 -94 29 206 -158 -347 -617 -560 35 186 557 1049 650 669 185 -489 240 554
2154E54l37q17m38K9N84J715N91r04p67o34M52R98M11o72j179p58M17P95O02J5
2174F57m11m27n09O86M88j3l36j04j99M46K80Q1l63K95n93r44j17L27K94O16L73
2195E27k74k73K10L68L2k33r23p76j62O05J124Q30o19r19j70L16N05J55l64j099
2215a140k39O71Q56P05j72n83o78J30L70K71K4k53n62k08M00j25P07L63n16L97
2235D18m67k23J63O28K88n58l85j070L69N99P44L09r82l62n97J533Q64L20o17
2254I74r75p00K51P03j25k73l83m37L87R70M98K37ml21o55L34k10l85p9k16R3
2275c16k4N49O6L73k88j72m37J90k1N09L57r4p43j31K34R0K35l61o32p47O29M96
2297b38R94K6k18o82o4O1P55L59o58q12m95M8J29N90N12o33R8l32M30P26k02K25
$$ plain form
2154 554 217 -600 -1038 -1009 -425 1290 1881 977 210 -424 28 1026 1437 765 -414 -1172 -755 40 642 657
2174 657 246 -181 -690 -4 484 471 135 31 -168 278 558 639 276 571 -22 -966 -1083 -756 -462 154 527
2195 527 253 -20 190 558 590 357 -566 -1342 -1504 -899 225 1055 436 -483 -653 -337 168 323 -41 -1140
2215 -1140 -1379 -708 148 853 681 98 -580 -450 -80 191 215 -38 -600 -808 -408 -533 174 537 21 418
2235 418 -49 -272 -109 519 807 249 -136 -1206 -837 -238 506 815 -167 -529 -1126 407 1271 1591 974
2254 974 -1 -701 -450 253 128 -145 -528 -965 -578 392 890 1127 1123 802 147 481 271 -114 -193 -409 -316
2275 -316 -340 209 275 648 360 188 -249 -59 -80 429 786 692 -51 -182 52 142 377 16 -616 -1363 -734 -238
2297 -238 756 782 564 -118 -182 -121 634 993 335 -477 -972 -924 -795 -205 307 -326 -228 -560 -130 596 394 619
2319F19k62n47o75J4M76M43j20k55n03k22O35M71M72R6l44k64p3N92k42j11r50
2340g50o35K17P58O95J95K81o60l01M25J29Pk96m66k07K73N15J19j49km02j06
2361c60j79M16K96Q1L98l19l7J2L52k38k41p00l04L7N52J024K88m22q5o48k28
2382c05P67L7L0o73p50K02L71Q22J59j07m12l98K53P46m5O8p36q1o55J68J82J02
2404b55O05m02k99N4K04M24J32L05m25l43L04k40J51r3l65o34J6J4O67M32K77
2425E29l17K14k00L65m8k78q80n93K88K28M54O11l40m08J36J53K67K45k0l26k37
2446a57K84k36L65K31p88m50k11RK91N70N22L3j40Kk85O00J91k22k51q42k74L32
2468d26J74o7J20l59R6L05O86N83Rk54m96k59j20J33k02k69P1o08J22O58K24K58
$$ plain form
2319 619 357 -190 -865 -851 -375 68 -52 -307 -810 -1032 -397 74 546 642 298 34 -39 553 311 200 -750
2340 -750 -1385 -1168 -410 285 480 761 101 -200 225 354 361 65 -401 -608 -335 180 299 150 148 -254 -360
2361 -360 -539 -123 173 254 652 333 296 308 660 422 181 -519 -823 -786 -234 790 1078 656 571 -77 -305
2382 -305 462 499 529 -144 -894 -692 -321 501 660 553 141 -257 -4 742 697 765 29 -52 -707 -539 -357 -255
2404 -255 350 -52 -351 -297 -93 331 463 768 343 0 304 64 215 122 -243 -877 -861 -847 -180 252 529
2425 529 212 426 226 591 543 265 -615 -1208 -920 -692 -238 373 33 -375 -239 -86 181 426 406 80 -157
2446 -157 127 -109 256 487 -301 -751 -962 -953 -662 -92 430 463 323 325 40 640 831 609 358 -484 -758 -426
2468 -426 -252 -319 -199 -558 -462 -157 529 1112 1121 867 371 112 -8 125 -77 -346 -275 -883 -761 -103 121 379
2490C79J79k27q8K17N3K12o9o21n77k27L11K1M92j06k11M4N42k55M48n5k58j70
2512C4l73J13L21L01k96M4m53J41O4K18n5k61R5P6K83J10K49m37k1o31J5M07P7
2535B1K61j80m36k31J54N51J55J3P2j58l39L10J26m71L12o83l27N67L30J33L62
2556E42l11l24O1L10j84p5K3o04l3M41K82J36L15l16j62L82P2l91L15k99m99m03
2578g22N7J51M36P8M19l05q0M35M23l46p2m51n77J31k53Q87j18j95k63o1M30N35
2600E39J32k22k39k56m50N27J54k3M4n00m12J83L64K81J98Q0n81J7l5O41j42J7
2622C17j45l97R7n5l3M66p0o11k14K66L73K11J96k39o4k4L4j12N18k18q38L8K53
2645b51K20K27o8R8n46J40L97j08K70j19o34K45K5K62k01M32k73l85L3r4J18L43
$$ plain form
2490 379 558 331 243 460 513 725 656 35 -542 -769 -458 -437 55 -51 -262 -218 324 69 517 462 204 34
2512 34 -339 -226 95 396 100 144 -309 -168 -104 114 59 -202 -107 -31 252 362 611 174 153 -478 -463 -56 21
2535 21 282 102 -334 -565 -411 140 295 308 380 222 -117 193 319 -152 160 -523 -850 -283 47 180 542
2556 542 231 -93 -32 278 94 19 42 -562 -595 -154 128 264 579 263 101 483 555 164 479 180 -319 -722
2578 -722 -665 -514 -78 0 419 114 34 469 892 546 474 23 -554 -423 -676 211 93 -102 -365 -426 4 539
2600 539 671 449 210 -46 -496 31 185 162 206 -294 -706 -523 -159 122 320 400 -181 -164 -199 442 300 317
2622 317 172 -225 -128 -183 -216 250 180 -431 -645 -379 -6 205 401 162 98 74 108 -4 514 296 -542 -504 -251
2645 -251 -31 196 128 226 -320 -180 217 109 379 260 -374 -129 -104 158 -43 389 116 -269 -236 -330 -212 131
2667A31K24m38k31q5N70J36j49K74l19m08q9M23L91n43R1k60J59L4L67rJ11j69
2689B11l32o47P69j33K11j03j70J07K76j61L39j74j39J3n73M47J76K56l11m21
2709c59L7J78j39L77J92j34j09K40m45J19Q1l66k7j98L09L11K63L77k8m26J99
2730D52k91q1J08k28m91o5o2L79L39L91j44L60k89M3J88n86Q5l44j55k64K10L85
2752f0J59nK06k16J92J43j41l7k90k36P5K55l6J64Nj63l34k1M09Q9Q2k02j52j01
2776b15K78L49j6m4k69n06J52r3K77m5J99R5k71J73Q0j24l2M7n8P7j78R2J45K1
2800A34n26k2J1M9M55L0j43J55J43K61k76j80O3m85j77m8JL5L34o3K27K09j34
2823E3J61L65k73m61K66o70J39%M6M04j81j52L34m0L60l29J35J3j74J3M24j07
$$ plain form
2667 131 355 -83 -314 -399 171 307 158 432 113 -295 -384 39 430 -113 -22 -282 -123 -89 278 269 380 211
2689 211 -121 -768 1 -132 79 -24 -194 -87 189 28 367 193 54 67 -506 -59 117 373 62 -359
2709 -359 -322 -144 -283 94 286 152 43 283 -162 -43 38 -328 -355 -553 -244 67 330 707 679 253 452
2730 452 161 80 188 -40 -531 -596 -658 -279 60 451 307 667 378 421 609 23 108 -236 -391 -655 -445 -60
2752 -60 99 94 300 84 276 419 278 241 -49 -285 -210 45 9 173 178 15 -319 -340 69 158 240 38 -114 -215
2776 -215 63 412 396 352 83 -423 -271 -364 -87 -132 67 162 -109 64 144 20 -12 35 -23 54 -124 -32 113 134
2800 134 -392 -414 -403 -354 101 131 -12 143 286 547 271 91 154 -331 -508 -556 -555 -520 -186 -249 -22 187 53
2823 53 214 579 306 -155 111 -559 -420 -420 -374 30 -151 -303 31 -9 351 22 157 170 -4 9 433 326
2845C26k11k08j94j01N14q3J78j69j7N1k6L04J53j70k87j94lkK12L95o03mJ66
2868B7j09K73j0j37k71J95J35j41J63L30j62l18O3k51J02J72k30J21j01L85j0
2889B26o1L73l60k21m9o7J58n8j83K46M1l06M91k51L91k52k6m10j72K38Q7L58
2911A93l73J13k56J93J68l6L16l24j38K2J28k0n2n9k94j9J03J26P4LK37r8Q8O6
2935A61l8K69l60j30j00k73P2q5N33r9O2R9J53J3L27Qm64k09k09M64j73P2m24
2958c31O9L84m00M26J83J28l74k8K36K9N1R3k1Q9m14j01m21L33J80l06Q2J87J28
2981B02L45q8J08k48K7l82J79l42J80p1k30J57K75n5P3r1mr0K90j56K19j43k20
3004f5lk66Q6P3%k45M0PP7J88l0K28K76l83j38n0j09j06M97l61J70k73J22J25
$$ plain form
2845 326 115 -93 -287 -388 126 43 221 52 35 86 60 364 517 347 60 -134 -137 -139 73 468 -135 -139 27
2868 27 -82 191 181 44 -227 -32 103 -38 125 455 293 -25 38 -213 -111 61 -169 -48 -149 236 226
2889 226 165 538 178 -43 -92 -159 -1 -59 -242 4 45 -261 230 -21 370 118 92 -318 -490 -252 -165 193
2911 193 -180 -67 -323 -130 38 2 318 -6 -144 -122 6 -14 -66 -125 -419 -438 -335 -209 -135 -132 105 7 95 161
2935 161 123 392 32 -98 -198 -471 -399 -484 49 -50 12 111 264 277 604 612 148 -61 -270 194 21 93 -331
2958 -331 -262 122 -278 148 331 459 85 57 293 322 373 466 445 534 120 19 -402 -69 111 -195 -113 74 202
2981 202 547 459 567 319 346 -36 143 -199 -19 -90 -320 -163 112 57 130 39 35 -55 235 79 298 155 -65
3004 -65 -68 -334 -248 -175 -175 -420 -380 -373 -296 -108 -138 90 366 -17 -155 -205 -314 -420 77 -284 -114 -387 -265 -140
3028a40K36M8l72K27l28rL22qj22jj01R1K86l19K32j12M3k41L26m5J3M3k05J33
3052cj64ML58pj44J03j77J44J28j30M1K74n42R9j79OL52j6K12j22J77k63K14M1
3076D06o1j95k69L14j72J81j30q4K54J3j27k7J06p7q2K62k8J69k27r0k69J38M
3099Il15r4O76l89k9K59k12J77K69k36J92j13k55j20L5J55n50J61J47J17m76P47
3121A55K30m0m81M28l76N2O1k66J13l01J18J02k29K99k89L33j45J90p7K98r0q1
3143Dl79K89j51o3q3R2P2j93N45j32l2O0rj75k5P7L30r4j35O7K22ql26j67K1M3
3169a50L75m38L33L7J62j85K01n11K26J6J29N0j75o4j3K29k26K14r0L5j93L92
3191C54O6k18j29j40m6j03K3J88L83p0l20L63m9r9j09j77J14J7Q1j19j07o8L81
$$ plain form
3028 -140 96 144 -228 -1 -329 -338 -16 -24 -146 -147 -248 -157 129 -190 42 -70 -27 -268 58 13 26 69 -136 -3
3052 -3 -167 -163 195 188 44 147 -30 114 242 112 153 427 -115 -16 -195 -189 163 147 359 237 414 151 365 406
3076 406 345 150 -119 195 23 204 74 -10 244 257 130 103 209 132 50 312 284 453 226 136 -133 5 9
3099 9 -306 -400 276 -113 -142 117 -95 82 351 115 307 194 -61 -181 -146 9 -541 -380 -233 -116 -592 155
3121 155 385 345 -136 292 -84 -32 29 -237 -124 -425 -307 -205 -434 -135 -424 -91 -236 -46 -123 175 85 4
3143 4 -375 -86 -237 -300 -383 -291 -219 -412 133 1 -31 29 20 -155 -180 -103 227 133 -2 65 287 279 -47 -214 -193 -150
3169 -150 225 -213 120 157 319 134 335 -176 50 66 195 245 70 6 -7 222 -4 210 120 155 -38 354
3191 354 420 202 73 -67 -113 -216 -193 -5 378 308 -12 351 302 203 94 -83 31 48 129 10 -97 -165 216
3214B16j00j53pL54J14j40k52j52j54J98Lj76J17K54k66j41K72j01J45Lj84PK8
3237a15l34K52L50j76l28m4J0L11N6j79Q8N2k69J10j43L28j79K83q7l59M70m7
3259E0k61L56k62o5j21L44J13j56j61K60k13K43K56m05K03k39J09j62M31k02j7
3280A01m4K2J34m5J60p0R9k38n9o2k05L43K0J5l15K99L20j10l1j1q2O8q8j60q3
3305b2J12r1k34N2L02K9L85k64P1j32J09j27n27L79k88J20J84k43L92j30lm10
3327c36J16J12M9o6J71n3o7P4o4lp1NP4P2o5PN8j4l91l8L22k17J37o8K01Q9jj91
3355a58k1J16j40J7J89k98K29J78N7l36O9K21j6J73j39o29L46J80l00K76J9j49
3377a16L11l5J3j21j18K40J2M7j38j17r2K13P2mj17L28r1k7k19M08j99k10K41
$$ plain form
3214 216 116 -37 -44 310 424 284 32 -120 -274 -76 -73 -249 -132 122 -144 -285 -13 -114 31 34 -150 -143 -115
3237 -115 -449 -197 153 -23 -351 -395 -385 -74 -18 -197 -109 -57 -326 -216 -359 -31 -210 73 -14 -373 97 50
3259 50 -211 145 -117 -182 -303 41 154 -2 -163 97 -116 127 383 -22 181 -58 51 -111 320 118 101
3280 101 57 79 213 168 328 258 357 119 60 -2 -207 136 156 171 -144 155 475 365 334 323 241 309 221 61 -22
3305 -22 90 -1 -235 -183 119 148 533 269 340 208 317 190 -337 42 -246 -126 58 -185 207 77 74 -336
3327 -336 -220 -108 -59 -125 46 -7 -74 0 -64 -67 -138 -133 -59 13 -52 -45 13 -1 -392 -430 -108 -325 -188 -256 -55 34 33 -158
3355 -158 -179 -63 -203 -186 3 -295 -66 112 169 -167 -98 123 107 280 141 -488 -142 38 -262 14 33 -116
3377 -116 195 160 173 52 -66 174 186 233 95 -22 -114 99 171 167 50 378 287 260 41 449 250 40 281
3400B81l03L60k11Q9q4P7l4N2L6j27J41j79r2J27j81jK92m30L51j47j59M13k94
3423b3L93l03J09l70K15l48L25l16L36L6m6o0l1K88k86Q6N7k44M1j6k36J45k9
3446b77q3K47l18L36J39k73M8K8O8j94K49K59M5n51J37m7L3L7N8j13k0Q6L4j6
3470h8J38n7N7m1K27M3j46N2m07K50k01j26N19m22M5MK96Q0j04j45K42J95l58
3493E3K39l60K58j97J18q2J09k15N6M58j52j47L47j41k0j39j80R8l5p8r3J72m7
3516B2K65l65K73k85J52j14J12K40k43K0k82K05PJ27l55N9M45k17J82j80j10K22
3538A80j30O4j79j35K68k34K6J99j6q8O5O2l38J64j59j95L51K5L3j70K4J15j18
3561a86J67p8K76j72k78M1K52k02P4j44j21M72k18R4l84L41L8J19j26J33J03k42
$$ plain form
3400 281 -22 338 127 216 132 209 175 227 263 136 277 98 6 133 -48 -49 243 -187 164 17 -142 271 -23
3423 -23 370 67 176 -194 21 -327 -2 -318 18 54 8 -52 -83 205 -81 5 62 -182 -141 -157 -393 -248 -277
3446 -277 -360 -113 -431 -95 44 -229 -181 -153 -85 -279 -30 229 274 -277 -140 -187 -154 -117 -59 -172 -192 -106 -72 -88
3470 -88 50 -7 50 9 236 279 133 185 -222 28 -173 -299 220 -202 -157 -153 143 223 119 -26 216 411 53
3493 53 292 -68 190 -7 111 29 138 -77 -21 437 285 138 485 344 324 185 5 103 68 -10 -103 69 22
3516 22 287 -78 195 -90 62 -52 60 300 57 77 -205 0 7 134 -221 -162 283 66 248 68 -42 180
3538 180 50 114 -65 -200 68 -166 -140 59 43 -45 20 82 -256 -92 -251 -446 -95 -70 -37 -207 -183 -68 -186
3561 -186 -19 -97 179 7 -271 -230 22 -180 -106 -250 -371 101 -117 -23 -407 -66 -28 91 -35 98 201 -41
3583d1l2K37r5k06K28l41J32R2Q3j08N8J68m35J09Q0j16N49m51K04K77k15k1N0
3606B06k15k1J65j16J01K0K6nR6J77l23Q3j13J48q3j77K14L1Nk31K95P7m08K63
3630B15j48m8J17n9j05K10k52K98l1o02O03j79O3l5l37L79R3r1k38J19L4j3l3
3653d0pk9k56J76l28L93n8k24L61k33K34J25j37OQ6j66k08K90n9J5p7P5J57l51
3677b55L4j25o0K15L7j43J44N5K74j71p9K9k6Q5k4mn1K01j26m9n0J0K00k68L37
3702A90k84K95j50M0K85k24k22K44J53m35J74l6P0j51o4L13j92K77j49l2J6k37
3724a19J4R4j42N54l29r7N6K97k62P1J8N1n5J45j62R7j41p5K50j24J07k77J59
3747A30k1j86j9k4j85J07j81J91N7Q4L19l46l6n0k16K04K87l2j50r4q0j46M88
$$ plain form
3583 -41 -73 164 69 -137 91 -250 -118 -26 57 -51 7 175 -260 -151 -71 -187 362 -89 115 392 177 156 206
3606 206 -9 -30 135 19 120 140 166 161 257 434 111 194 81 229 146 -31 183 214 219 -12 283 360 -48 215
3630 215 67 19 136 77 -28 182 -70 228 197 -405 198 19 82 47 -290 89 182 91 -147 -28 6 -7 -40
3653 -40 -47 -76 -332 -156 -484 -91 -149 -373 -12 -245 -11 114 -23 -17 69 -97 -305 -15 -74 -59 -136 -61 96 -255
3677 -255 -221 -346 -406 -191 -154 -297 -153 -98 176 5 -74 -45 -71 14 -10 -14 -65 136 10 -39 -89 -79 121 -147 190
3702 190 -94 201 51 91 376 152 -70 174 327 -108 66 30 100 -51 -115 198 6 283 134 102 118 -119
3724 -119 -105 -11 -153 401 72 -25 31 328 66 137 155 206 151 296 134 231 90 15 265 141 248 -29 130
3747 130 109 -77 -96 -120 -305 -198 -379 -188 -131 -47 272 -74 -110 -160 -376 -172 115 83 -67 -161 -241 -387 101
3770A01n70N39l55K22p2O3p4k24L01j19L07j02l2k94J02K38q3J56j06K01n3n16
3792c70K94N3J01j85N3k54M60k97M05l45K32l94J99J00P0j29m1J06k0J6l22K93
3814B5K28k56J33k60J80k8p4K18j02j25K59N8p0P2m36L3O4J93p1n3L75k43j57
3837c7K25p9j3K39j02k79K21l46O4n9N9j19L68k48N3K08K1j37q6J95%O6k21j22
3861a29L53l23m3J35l05K49p2QO2K84k05J02j44qJ45j61k12K53R8m27L26j08q0
3884b02m9K03J24k00j1k7j6K57j29o6K6n0j2jM61m97J12J67l77J15L17k40Q5J58
3908A48j24j8K51J15m96J98k44K32K3J71k61n2K11k15K36O9J03m69K96j30P4R4
3930B12o9K50l56q8J70K4m31N20l85J60l3P9M4N1j6%k58K43n9j60J20J16l3j39
$$ plain form
3770 101 -469 70 -285 -63 -135 -72 -146 -370 -69 -188 119 17 -15 -309 -207 31 -52 104 -2 199 146 -370
3792 -370 -76 -23 78 -107 -54 -308 152 -145 260 -85 147 -247 -48 52 122 -7 -48 58 38 54 -268 25
3814 25 253 -3 130 -130 50 22 -52 166 64 -61 198 256 186 258 -178 -145 -81 112 41 -12 363 120 -37
3837 -37 188 109 96 335 233 -46 175 -171 -107 -166 -107 -226 142 -106 -53 155 176 39 -47 148 148 214 -7 -129
3861 -129 224 -99 -142 -7 -312 -63 -135 -127 -65 219 14 116 -28 -36 109 -52 -264 -11 87 -340 -14 -122 -202
3884 -202 -251 -48 76 -124 -135 -162 -178 79 -50 -116 -90 -140 -152 -153 308 -189 -77 90 -287 -172 145 -95 -10 148
3908 148 24 6 257 372 -124 74 -170 62 85 256 -5 -57 154 -61 175 244 347 -122 174 44 118 212
3930 212 143 393 37 -51 119 143 -288 232 -153 7 -26 53 97 148 132 132 -126 117 58 -102 18 134 101 -38
3954c8j49M2M04k28pj58M7M08m00n8k13L20m0n0M3J54l42L23R9l32K74k9j67j0
3978a07j37O4J44m01K88j71K99j76p6k6ML34k56L18m08J12J22j56M64j76j67N8
4000e0j24P9J24j50j79K42K42k30j70L72j00j8J33o2k90J96n5R5n5N8nj47O6N3
4024B5Q6j17K06m15M25j28L11k85j12K50k69k24K54K81k48L6L25m23J1l2o0K83
4046A80l06Q5P6L14k80n4J76j43j4k8j26J27K31l01j12J17K22k25L7J86k50j4
4068a02o2J31qK45k84L87j77m19J35o5J63j32L09j00k79L13J46n3j98k17J81j57
4090b43K7Q0q8J07P2OJ25k77J43r9%L3K16j34N8n2J99j11l10Q8K40J57j50k93
4114b06K04M1o1K45j86J19r2KJ43m8k1J51l81K09l15L56O7l45L74k13K55j71j84
$$ plain form
3954 -38 -187 -145 259 31 24 -134 -87 321 -79 -137 -350 -30 -70 -120 -77 77 -265 58 157 -175 99 70 -97 -107
3978 -107 -244 -180 -36 -437 -149 -320 -21 -197 -273 -299 -295 39 -217 101 -307 -195 -73 -229 235 59 -108 -50
4000 -50 -174 -95 29 -121 -300 -58 184 -46 -216 156 56 38 171 109 -181 15 -40 55 0 58 53 -94 -28 25
4024 25 111 -6 200 -215 210 82 393 108 -4 246 -23 -247 7 288 40 76 401 -22 -11 -43 -103 180
4046 180 -126 -41 35 349 69 15 191 48 34 6 -120 7 238 -63 -175 -58 164 -61 -24 162 -88 -102
4068 -102 -164 -33 -41 204 -80 307 130 -289 -154 -219 -56 -188 121 21 -258 55 201 148 -50 -267 -86 -243
4090 -243 -216 -136 -224 -117 -45 -39 86 -191 -48 -147 -147 -114 102 -32 26 -26 173 62 -248 -160 80 237 87 -206
4114 -206 -2 39 -22 223 37 156 64 66 209 161 140 291 -90 119 -196 160 227 -118 256 43 298 127 -57
4137e7m3J99j44l7J67J40m55J03L53k44J03R3k06N0J69j31j63J88Mq8j32L94k6
4160B37k93O4pJ4q4L22l29L2j13k6R9%P2r4j4O7J1j20o9M45l57L05k44j43L41
4185A16j68j12P0k1j20J7J29j33K15n0P8R2r9k10j2J73p2K05k28K65j41l27L62
4208B9J5k09L09j01R7M8l25K3L0m0K30o1L3N0j92J65k01K10J04j84q8r1q8K94
4232E7K0J66n21L15K2k33R4Q2J11J82Q8l53P5M8O5n01K10J71j16L9O1J6J75p8
4256A95J52k47J58j96Q5k62J48k11M1L8J21J09l01K2Q3K52r6j25j01J72m8q6O0
4279c7M9q6J57l31K21K9k34L30j16k32L40k1j70l0O7k4R7l1l9J65j49k06L5L32
4303A16j15k8J13o8k36K25q9J87j6k89K42p6L13n67L75R6l20M21m01Q2K5K27l24
$$ plain form
4137 -57 -100 99 -45 -82 85 225 -230 -127 226 -18 85 178 -28 22 191 60 -103 85 89 1 -131 263 237
4160 237 -56 8 1 15 -69 253 -76 -44 -157 -183 -84 -84 -12 -106 -120 -53 -42 -162 -231 214 -143 162 -82 -225 116
4185 116 -52 -164 -94 -115 -235 -218 -89 -222 -7 -57 21 113 14 -196 -208 -35 -107 98 -130 135 -6 -333 29
4208 29 44 -165 144 43 140 188 -137 -114 -84 -124 106 45 78 128 -64 101 -100 110 214 30 -58 -149 -237 57
4232 57 77 243 -278 37 59 -174 -80 2 113 295 383 30 105 153 218 -283 -73 98 -18 21 82 98 273 195
4256 195 347 100 258 62 147 -115 33 -178 -137 -99 22 131 -170 -148 -65 187 91 -34 -135 37 -11 -97 -37
4279 -37 12 -74 83 -248 -27 2 -232 98 -18 -250 90 69 -101 -131 -64 -88 9 -22 -61 104 -45 -251 -216 116
4303 116 1 -27 86 18 -218 7 -82 105 89 -200 42 -34 279 -288 87 183 -137 284 -117 -35 -10 217 -107
4326a07R2j15J75K52l59j58K47N2oj88j5L72j91O5j06R6J23j27J13j40k10L41
4348B06l43K76j7J62j21K00j81k82M7j7N16k49J5k91L29m93M41j71J03l1J19l01
4370h3P5K1o8K20j79M7l7j95J31K43j35l44K47l7K94r4n0J11l95J51l6j96L25
4393A6R2J7J61l46j9j71J17J78k20J48M0P0j88m1n1M2N29m82L2J49P5q8r7J05
4417F8k70Q3K21r6j21J35r7j32K83M1k37J98j05P5K9l2j04K44j72J99m0L7l35
4440a28M7K7J79N5n8J19j24rJ08j88r3K80k04O2k25J94q2k05R6j1n6K02K2J71
4464A79k95J96J05r3k28Q1L4r4L66l25M7J01p9J3j33K65l78J79J43k28K47j59
4486e6O8Qk0m1J75j43N0k82L00k32J63j16L10j66J14j10P7r9J92o4K8j42j88j21
$$ plain form
4326 -107 -15 -130 45 297 -62 -220 27 79 73 -115 -130 242 51 116 10 106 229 102 215 75 -135 206
4348 206 -137 139 122 284 163 363 182 -100 -53 -70 446 197 212 -79 250 -243 198 27 130 99 218 -83
4370 -83 -8 13 -55 165 -14 33 -4 -199 -68 175 40 -304 -57 -94 200 106 56 167 -228 -77 -113 -309 16
4393 16 108 125 286 -60 -79 -250 -133 45 -175 -27 13 83 -105 -146 -197 -155 374 -108 -76 73 148 60 -37 68
4417 68 -202 -119 102 6 -115 20 -77 -209 74 115 -122 76 -29 46 75 43 -61 183 11 210 170 207 -128
4440 -128 -81 -54 125 180 122 241 117 108 216 28 -65 215 11 73 -152 42 -40 -245 -149 -160 -216 -14 8 179
4464 179 -116 80 185 92 -136 -55 -21 -115 251 -74 -27 74 -5 8 -125 140 -238 -59 84 -144 103 -56
4486 -56 12 20 0 -41 134 -9 41 -241 59 -173 -10 -126 184 18 132 22 99 0 192 128 156 14 -174 -295
4510b95M27m57PK57q5O2j7j20N3k5P8J28j47N3j13J15j08K98k94n1R5J13L0P5
4534G9j35L17j00k04P1j21J20J17n18N35k4J42k14m80M52l3R7l17O55n15k1J68
4556G1j23J17j53Q5K4j13j47L35J11j95Q2J43k2r7J07J12k47j06Q2p2K02k08L
4579in0N3o0k5K8j90J93K56J68j61j82k41J29K4l91M90M9P6j85j81R9J30r4j02
4603a76K78l3K31l38k12K63j96J24L35k45l25L56k34J93j80mJ24K34j69k3k32
4624b29K29J40j31J37M5J03m36K35j55J67l32j8L69Oq6J30j30j40J21k67J40J65
4646F3j58P3n4J15K3j0P5j65o3K26q2J55r6p4J20j96KK14j75nk49L27p3N6k89
4671b40M87k92J67j19J87k48M9J61m08K16L54k42L0J18m07R7O0j8N8n3P8Q8J59
$$ plain form
4510 -295 132 -325 -318 -61 -146 -84 -101 -221 -168 -193 -115 13 -134 -81 -194 -79 -187 111 -183 -234 -139 -26 4 79
4534 79 -56 261 161 -43 28 -93 27 144 -374 161 137 279 65 -415 37 4 101 -216 439 -76 -97 71
4556 71 -52 65 -88 -3 21 -92 -239 96 207 12 94 237 215 118 225 337 90 -16 66 -6 196 -12 -9
4579 -9 -59 -6 -66 -91 -63 -253 -60 196 364 203 21 -220 -91 -67 -458 32 81 157 -28 -209 -110 20 -74 -176
4603 -176 102 69 300 -38 -250 13 -183 -59 276 31 -294 62 -172 21 -159 -163 -39 195 26 3 -229
4624 -229 0 140 9 146 191 294 -142 93 -62 105 -227 -245 124 130 44 174 44 -96 25 -242 -102 63
4646 63 -95 -22 -76 39 62 52 127 -38 -101 125 43 198 102 28 148 -48 -46 168 -7 -12 -261 66 -7 49 -240
4671 -240 247 -45 122 3 190 -58 -9 152 -256 -40 314 72 102 220 -187 -90 -30 -48 10 -43 35 123 282
4694B82k41N6M7l20L35j43j05K61j77k95K56Q3j1j79J06%l0J02K4L6k59J35N0
4717A3o8K26j37j9K50n06Q3j78K59R0l9K4j51L22k64j40R5N6p8j07J82R9J02k37
4741a23p0R8k2J46l47K56J58o6L0Q5n0p9j1m8J36J05l03o9L44j87j78P9K20q4
4765B0J11l82O8l9L12r7K97j84K05J0Ok82q1k16Q6k9J29j52K40j1J03l70K89Q0
4789A13J14K10l86j33K04m81K58L28k08O4l25M28k53J75k64R8O7k04L62K2j9k98
4811a28J82j83L21m28R2K08k56J0K12Q6j56j9J13N7j46J6k2r7K62K33l24J60m01
4834b08O7L66j68j22n6j31J82j18K89k52Q9Pj1K05r8j92MR3R1r1J69j49Q5R9k44
4859i4P3m5J32J49k62r8J58k03K38l37K83O4q0j64J85OP2J62Oj48j36K79l71J80
$$ plain form
4694 282 41 97 144 -176 159 16 -89 172 -5 -300 -44 39 28 -151 -45 -45 -75 27 51 87 -172 -37 13
4717 13 -55 171 34 15 265 -241 -158 -336 -77 13 -26 -2 -153 169 -95 -235 -140 -84 -162 -269 -87 12 114 -123
4741 -123 -193 -95 -117 29 -318 -62 96 30 60 145 95 16 5 -43 93 198 -105 -174 170 -17 -195 -116 104 20
4765 20 131 -251 -183 -222 90 -7 290 106 311 321 327 45 -36 -252 -166 -195 -66 -218 22 11 114 -256 33 113
4789 113 227 437 51 -82 122 -359 -101 227 19 83 -242 186 -67 108 -156 -58 9 -195 167 189 170 -128
4811 -128 54 -129 192 -236 -144 64 -192 -182 30 116 -40 -59 54 111 -35 -19 -41 -138 124 357 33 193 -208
4834 -208 -141 225 57 -65 -121 -252 -70 -188 101 -151 -62 -55 -66 139 41 -151 -147 -54 37 -54 115 -34 51 150 -94
4859 -94 -21 -66 66 215 -47 -145 13 -190 48 -289 -6 58 -22 -186 -1 5 77 239 245 97 -39 240 -131 49
4883D9j74L7L4J04J39l46J08P7j12r8L71m79K62J58m0j38RJ64l55M73j39J14k93
4906g5O4J78j93K75k56M5k0j04J00ol32M58k0q9n3l9J28J8Mo1j73L21l34J13K21
4931A70k62K17k91J42K5K55l06J76k94N0K43l41L17k69J74J88k55J04j2j46J99
4952H4k74L51j05l65L99l79M89m56J97L5K52k99PJ55r9j83J07m9J02J94k63%K49
4975A49k37Q6k39K24P8n8J40K9k40j09R2K7J38j35m7R5J27k52K04j7k08L35k70
4998h8M41m87n6J20M7k9n7j21L92j82M1p4M6j76K37J06m75l6M68j92J51j57K74
5021A93j86m8J55j68J61j49l3k12K22j04J78L3J20k3n4q0q6q4K3P1Q9j04K1O6
5045Ao1j3j4Q2k00J27J79j83j64K36r6NJ34l2k76QL80Oj20j09n6J40J01j16M3
$$ plain form
4883 49 -125 -88 -54 50 189 -157 -49 28 -84 -182 189 -290 -28 130 90 -48 -39 125 -230 243 104 218 -75
4906 -75 -11 167 -26 249 -7 38 18 -86 14 8 -324 134 114 25 -28 -67 61 79 83 22 -151 170 -164 -51 170
4931 170 -92 125 -166 -24 1 256 -50 126 -168 -118 125 -216 101 -168 6 194 -61 43 31 -115 84
4952 84 -190 161 56 -309 90 -289 200 -256 -59 -24 228 -71 -64 91 -8 -191 -84 -133 -31 163 -100 -100 149
4975 149 -88 -2 -241 -17 61 3 143 172 -68 -177 -85 -58 80 -55 -102 -7 120 -132 72 55 -153 182 -88
4998 -88 353 -134 -190 -70 -23 -52 -109 -230 162 -20 21 -53 -7 -183 54 160 -315 -351 117 -75 76 -81 193
5021 193 7 -41 114 -54 107 -42 -75 -287 -65 -169 9 42 162 139 85 5 -81 -165 -142 -71 18 -86 -65 1
5045 1 -60 -73 -87 -5 -205 -78 101 -82 -246 -10 -106 -101 33 1 -275 -267 113 119 -1 -110 -166 -26 75 -41 2
5070Bk0l4m7L01k22k40K86j32L22j37L5l26N7L41o67K36J71N42l89L8k5J62j59
5093I5l2R3l24L86k44l1R0p2J10j26K32O3k8j95Q7p0M2j26J58k58L9K66k50j43
5117b38M27j95N8NJ41k32q3o8J97j89J16K4J03j63j98L29j83J32J04j56K78l00
5139i1N7nJ40j93P2L11m15o9L15N3j58q1j10K96j12K5j34J47j2J27l21J29J24
5162I5j89M6K39l22R6L8J01j07m3J32q0L47m88M0j66M6L80j28J37l5k2J38k50
5185EL52m12jm8R7lJ72k20J00j50k2N4R9l70K74K9M4j21Q3k85K81J21K3m3l5K90
5211C14n89N4K85Qk73J65L31J03k2l17P7n1j37j47J49j06K93r0j64J84L4p6J27
5234A52j24M1J97J12k69Ok06pJ91j72k78L21q0o3J95L9j80L0k4J70k05J49p1J3
$$ plain form
5070 2 -18 -52 -99 202 -20 -260 26 -106 216 79 114 -212 -155 186 -481 -245 -74 468 79 117 92 254 95
5093 95 63 156 -168 218 -26 -57 33 -39 71 -55 177 240 212 17 104 34 76 -50 108 -150 -111 155 -95 -238
5117 -238 189 -6 52 57 198 -34 -117 -185 12 -177 -61 -37 66 -97 -295 34 -149 -17 87 -69 209 -91
5139 -91 -34 -39 101 -92 -20 291 -124 -193 122 175 17 -64 -174 122 10 35 -99 48 36 163 -158 -29 95
5162 95 -94 -48 191 -131 -35 3 104 -3 -46 86 6 353 -135 -95 -261 -215 165 37 174 139 117 255 5
5185 5 357 -55 -56 -104 -7 -10 162 -58 42 -108 -130 -76 23 -347 -73 -44 0 -121 -38 -323 -42 79 102 59 24 314
5211 314 -275 -221 64 72 -201 -36 295 398 376 59 136 85 -52 -199 -50 -156 137 47 -117 67 101 25 152
5234 152 28 69 266 378 109 115 -91 -98 93 -79 -357 -36 -116 -179 16 55 -125 -95 -119 51 -154 -5 -76 -63
5258f3K78j37m0L6O0l6L1l35K76k7M6k29l9O5j81J86K43j93J04oo8J56m0l3lj13
5284f2k8M66n6k76L7k81N4J09K4L2J21j05j82L9N0J05M7k2L8J07p1j7l67K39K98
5309B99o3k99P0k39J67J62J65j53l12RJ44p0K55j96J49J14m93L27N1k25j12N58
5331C08j74j56k65J18J7Q7J50o4K5l73K58k84N46j76j22K34J6j56R9O1j22l7m
5354a4q2K31o4Jr7l14M42q6j08K55j83j69L40k31J34k48M4Q2J09L15n58K71j08
5377c8K08L1l15J41J47j46n5l49L62j88j38L28J98k99K34l69MJ72l0r2J89j40
5399a45K78l3K12l69K73K9j60J79l39K40k26J04Q4p8j08J4K31j21n2Q0k02K11
5421A02J08j81P9l26K89J80j18j88K02p7J30j2j86o1p0J17J95j91j29j5L40j72
$$ plain form
5258 -63 215 78 38 74 134 98 129 -206 70 43 89 -140 -179 -114 -295 -109 134 -59 45 39 -29 127 87 54 51 -62
5284 -62 -90 376 320 44 81 -200 -146 -37 -13 19 140 35 -147 -108 -58 47 94 72 110 217 146 129 -238 1 299
5309 299 236 -63 7 -232 -65 97 262 109 -203 -194 -50 -120 135 -61 88 202 -291 36 87 -138 -250 308
5331 308 134 -22 -287 -169 -152 -65 85 21 46 -327 -69 -353 193 17 -105 129 145 -11 88 149 27 -10 -14
5354 -14 -96 135 71 72 -25 -339 103 17 -91 164 -19 -188 152 -79 55 -193 -149 -67 42 357 -201 70 -38
5377 -38 170 201 -114 27 174 28 -27 -376 -14 -202 -340 -12 186 -113 121 -248 -244 -72 -102 -194 -5 -145
5399 -145 133 100 312 -57 216 245 85 264 -75 165 -61 43 127 49 -59 -45 186 65 13 93 -109 102
5421 102 210 29 108 -218 71 251 133 -55 147 70 200 188 2 -59 -129 -12 183 -8 -137 -152 188 16
5443A6M3j34J42k26P4L02l82J33K8J61m5m29K28J52q0k93KK21M6l9K99k67k99
5466c47L14J22k41K00j56J7J29j46K33n6j95J89q1k15K8K72k03OJ60k58o6J37
5488a57K28J00m01L10k51J77L8r4N6J6J88j04P6k63J49m6Q3j50q2jK04NJ03j34
5512E0l6J07p9r4J39k97J70j64N03j86q7J41l60J91l6J41k2l49K78o6k60N22m2
5535A64l57J47j38nK80J38k00l0J07J14k57Q6q9P9j60J04O7l69K45j56L28r6Q3
5558H5k11K43k80J51l2j56J24p8J64n6o7p2N1l5J59j42j4M11l61j2M7K30k17k4
5582i2k84L92l22J77Q5J70n5j54m5K28j41K07l42K46o5l28L76J46n38L4L38l22
5604b89J59J84J72l21k7K11o5K53l15q7J24j32N8j62M34n3k38J5J25J13J5j95
$$ plain form
5443 16 59 -75 67 -159 -85 217 -165 -32 -4 157 112 -317 -89 63 -17 -310 -308 -87 -41 -80 219 -48 -347
5466 -347 -33 89 -152 48 -108 -91 38 -108 125 69 -126 63 -18 -233 -205 67 -136 -130 30 -228 -294 -157
5488 -157 71 171 -230 80 -171 6 44 -50 6 22 210 106 182 -81 68 22 105 -45 -127 -128 76 81 184 50
5512 50 14 121 42 -52 87 -210 -40 -204 299 113 26 167 -193 -2 -38 103 81 -268 10 -56 -316 206 164
5535 164 -193 -46 -184 -189 91 229 29 -1 106 220 -37 49 -40 39 -121 -17 50 -319 -74 -230 98 2 85
5558 85 -126 117 -163 -12 -44 -200 -76 -154 10 -46 -113 -185 -134 -169 -10 -152 -166 245 -116 -128 -81 149 -68 -92
5582 -92 -376 16 -306 -129 -44 126 71 -83 -128 100 -41 166 -176 70 5 -323 53 199 -339 -305 33 -289
5604 -289 -130 54 226 -95 -122 89 24 277 -38 -125 -1 -133 -75 -237 197 144 -94 -79 46 159 174 -21
5626b1j03K92j89P2j94L2J04l8K20mj50k09K60k61K68Q7j54N3j29j26K61j93J78
5649E6K44l32j14L9p0J89J28J58l49R8J64k59O7K36k09j69L3J9J08M6k52K00r3
5672f2o1J47k85M92q5l90K12j34J54J4Q5q6N8l21K30J47m5O8m62Q4M28l51k7K05
5696A5J5J13l1k65J72k52N8PR1J6K28j09k22J4%J87j8j3j46K13R3R3m18K22J04
5721A67k61n7o0L0K53p9J08k52K03j07J34k96r3M32l08K74n1L0l12L50m2j81K81
5744A63n6q7mJ38k26K23J52l34N2j35K40L8j31J9J78j38k65L74j19O7j27rj08
5767i5J22R4l55L1Q9l3K55q5J19q6K56k97p9k4R3p7k9j50K43j4P2j5n29O22j40
5792a2N4p9N8j26K27L0kk44j23M22k52j15M9J0m6j4j98L80r7J22l58N82m04J19
$$ plain form
5626 -21 -124 168 -21 51 -143 -111 -7 -45 175 171 21 -188 72 -189 79 166 12 65 -64 -190 71 -122 56
5649 56 300 -32 -146 -107 -177 12 140 298 -51 47 211 -48 19 255 46 -123 -90 -71 37 83 -169 31 -62
5672 -62 -123 24 -261 231 146 -244 -32 -166 -12 2 87 1 59 -262 -32 115 70 138 -324 -240 188 -163 -190 15
5696 15 30 143 112 -153 19 -233 -175 -168 -77 -61 167 58 -164 -150 -150 37 19 6 -140 73 166 259 -159 63 167
5721 167 -94 -151 -211 -181 72 -7 101 -151 52 -55 79 -217 -310 122 -186 88 37 67 -245 105 63 -118 163
5744 163 107 20 16 154 -72 151 303 -31 21 -114 126 164 33 52 230 92 -173 201 82 149 22 13 -95
5767 -95 27 121 -234 -203 -114 -147 108 23 142 56 312 15 -64 -88 5 -72 -101 -251 -8 -22 50 35 -494 128 -12
5792 -12 42 -37 21 -105 122 152 150 -94 -217 205 -47 -162 -113 -103 -149 -163 -361 19 -78 44 -314 268 -136 -17
5816a7K31k58p3p5L34k37M36n43K08k7k8n5OJ96J51K3k11j77J36o4J71o3k91K05
5840b2R0j70M38l06Q5J06O0k21J66p2j73J19r1J43k18J21J47k14K37k79NL58k42
5863F7L8Q5k85J58Kq1j6Oj03K50k9q0m1L3K48k46l7N1J04j97p4P0J51k25N5l6
5889a32L50k83L42l50k0K68k11L64l92j6J59k13n0L11l06M6K57k62m4K25p4j17
5911a48o6N4J38O6k91J77j51J9k1M98k39N4j41K42k78j8L28K1k47P4j73j81K60
5934b3k49O2K47J13j5j01roR2M9l48K3J91j21Q4P7j44R3K40k44K60j74Q3j88p7
5959h5K26p0l9k8k52L42k07j0Q5J24j40k5K77k82O8M0K20k28K31k07Q3R7n42L32
5983A0j78J8J85nn1j25J23M2R5m8J36k32k2j81Q2J39Om8k57O03k48J06k57n1J81
$$ plain form
5816 -17 214 -44 -117 -192 142 -95 341 -202 6 -21 -49 -104 -98 98 249 272 61 -116 20 -44 127 64 -227 -22
5840 -22 68 -102 336 30 115 221 281 60 226 154 -19 100 9 152 -66 55 202 -12 225 -54 -49 309 67
5863 67 105 190 -95 63 65 -16 -32 -26 -129 121 92 12 -29 4 252 6 -31 20 124 -73 -147 -77 74 -151 -96 -132
5889 -132 218 -65 277 -73 -93 175 -36 328 -64 -80 79 -134 -184 127 -179 -133 124 -138 -182 43 -31 -148
5911 -148 -214 -160 -22 44 -247 -70 -221 -202 -223 275 36 90 -51 191 -87 -105 223 244 -3 71 -102 -283 -23
5934 -23 -272 -210 37 150 135 34 25 19 111 160 -188 -165 26 -95 -11 66 -78 15 255 11 271 97 180 -8 -85
5959 -85 141 71 32 4 -248 94 -113 -123 -38 86 -54 -79 198 -84 -16 24 244 16 247 40 123 220 -322 10
5983 10 -168 -150 35 30 -21 -146 -23 19 114 66 202 -30 -52 -233 -151 -12 -6 -54 -311 292 44 150 -107 -158 23
6008B3M7q3N2r9K46j54L10j80l38J65O3p9q4o1J55J23j9k62r2J42m7L79l31q4
6032b08L52j29l1j43K77j04j16K91p2k76K23j23J01R1j66J83N8l5j18l28L66M
6054I7J66m50J65l6J69p8J08l53M30m87J44J51j70L14ol00K80j7%k29K03l0m5
6077B6J6j7j94j52M46J5kr7n9L64j06k65J0K6o0j68K68k58L32m22K83J66j81j10
6101a39P2K74j84J09l68N2LLO9J6p2O6L4k8K71k67K67m08K60Q3o1J03k99m8K66
6126G4K3k60j2J22J8n8P6Q2j27j60K00j1n6K04j32J52j45R6o8R1j56k49N87j59
6150A32j88Q9K2j61J30J80j15Q4l67K38l95K10Q2J42n6J13m31K34q3M18k48p2
6172d2k4n1J06J1J27K44l49j02J21N6p5LJ80j91j18K0K62k12M6P1k4l47M60p6
$$ plain form
6008 23 70 -13 39 -60 186 32 342 162 -176 -11 52 -27 -111 -172 -17 106 87 -175 -267 -125 -172 207 -124 -208
6032 -208 144 15 -16 -159 118 14 -102 189 117 -159 64 -59 42 133 -33 150 208 173 55 -273 93 97
6054 97 263 -187 -22 -58 111 33 141 -212 218 -269 -125 26 -144 170 164 -136 144 127 127 -102 101 71 26
6077 26 42 25 -169 -321 125 140 138 41 -18 346 240 -25 -15 11 -49 -217 51 -207 125 -297 -14 152 -29 -139
6101 -139 -67 207 23 132 -236 -184 -181 -178 -109 -93 -165 -99 -65 -93 178 -89 178 -230 30 113 52 155 -144 -192 74
6126 74 97 -163 -175 -53 -35 -93 -17 65 -62 -222 -22 -33 -89 115 -17 135 -10 86 18 109 -47 -296 291 132
6150 132 -56 33 55 -106 24 204 89 173 -194 44 -351 -141 -59 83 27 140 -291 -57 -140 278 30 -42
6172 -42 -66 -117 -11 0 127 371 22 -80 41 97 22 25 205 14 -104 -84 178 -34 12 83 59 -288 172 96
6196I6j36q2l9J84l91M57o9K19k59P5Ll27K75M7O5j28p7M62m01K36l31K33k93
6219a81K82J36m00j22K16j47K38o6N1rk37N23n49K52j50J6l2J69p1J32r7m6mK86
6243A90m70L60J2j8k67q8L05q0O5M4k68J72J47m43K38j61L79j94N4K02k35k8Q9
6266Ek11J39j92K98J54k50R5J26j55j2j04p0J50L88n35J59j97L50O5j15o6K1R9
6289A42k85J33j56O2K71r7k51J67R2n4P3l5j46j3J77j66L06o7j17J36k32J70K71
6312C81n99J19k39M13j99K06k95L49k18K68p6k64J27j00L6l6J06j20O1J45K8l4
6334E9J7M2m3j04J50Rm1l09L89r7k84k7L43kk21L1n1J40J9j02j77L44k20J58L9
6359F2j07m0j05O5r8J53K4K08m09J45j15K72j70O8O9k65L54j10j22N0K29j57J46
$$ plain form
6196 96 -40 -122 -161 23 -368 89 20 239 -20 55 58 -269 6 53 118 -10 -87 375 -26 210 -121 112 -181
6219 -181 101 237 -163 -285 -69 -216 22 -44 7 -2 -239 284 -265 -13 -163 -147 -179 -10 -81 51 -46 -92 -96 190
6243 190 -280 80 92 74 -193 -281 24 -56 9 53 -215 -43 104 -339 -101 -262 117 -77 -23 179 -56 -84 5
6266 5 -206 -67 -259 39 193 -57 38 164 9 -3 -107 -177 -27 361 -174 -15 -212 138 203 88 22 43 142
6289 142 -143 -10 -166 -104 167 70 -181 -14 78 24 97 62 -84 -97 80 -86 220 153 36 172 -60 110 381
6312 381 -218 -99 -338 75 -124 82 -213 136 -82 186 110 -154 -27 -127 -91 -127 -21 -141 -80 65 93 59
6334 59 76 118 75 -29 121 130 89 -220 169 72 -212 -239 104 102 -119 -88 -139 1 20 -82 -259 85 -135 23 62
6359 62 -45 -85 -190 -125 -223 -70 -46 162 -247 -102 -217 55 -115 -47 22 -243 111 1 -121 -71 158 1 147
6382A47j3j63J82k6j35Q0o6J72j85K46k23p8M91n09K25l9j14M08l53Qn7n9N0J96
6406A85J1m12L71P4j35j61r2l2M16L5k47O6j45L0m5L15l15K56j98o6j3j38K76
6429C6M3n3k12K70j77J43J41k04k65K40q1P4O6Q3r5j53k3M28j86j42J25jn8k95
6453b96J82n3L06j78l2m9j12O2L51l92J63j81L66n8j86J05l01J74J64k72l3L60
6475I0j45j43L15j02J24o4N4o6J47K6l24Nr5J20j69L74J2n32K73j58L98o3N3k30
6499a00l3M0l2J55J10k85K60j50J67M4l04J41kR2j07o7j10J64J63m2pk25J14Q9
6523G5N6l2l02J20J65q6J90r9o8j20K6k1J03L4kp6p5J16k8J38pk80j2J09p3M6
6549a03l6L72o90N19j25J62P2om30K21J08J62k48j04j03K68L4j18J06q7k17J81
$$ plain form
6382 147 134 -29 153 127 -8 72 6 178 -7 239 16 -62 429 -80 145 106 -8 400 47 55 -2 -61 -11 185
6406 185 196 -216 155 229 94 -67 -159 -191 225 260 13 79 -66 -36 -81 234 -81 175 -23 -89 -102 -240 36
6429 36 79 26 -186 84 -93 50 191 -13 -278 -38 -119 -45 21 104 9 -144 -167 261 75 -67 58 57 -1 -296
6453 -296 -114 -167 139 -39 -71 -120 -232 -170 181 -211 -48 -229 137 79 -107 -2 -303 -129 35 -237 -270 90
6475 90 -55 -198 117 15 139 75 129 63 210 236 -88 -83 -178 -58 -227 147 159 -373 -100 -258 140 77 130 -100
6499 -100 -133 -93 -125 30 140 -145 115 -35 132 176 -128 13 11 103 -4 -71 -181 -17 146 104 97 -128 -14 75
6523 75 131 99 -203 -83 82 -4 186 87 19 -101 -75 -96 7 41 39 -37 -112 4 -24 114 107 -173 -185 -76 -149 -103
6549 -103 -139 233 -457 62 -63 99 171 165 -265 -44 64 226 -22 -126 -229 39 73 -45 61 -26 -243 -62
6571f2L73l90j08L13J19k07M4O1k17K28m19M14j84k1j01J4k4L34k45q4M38p8j17
6594H1j77K18m1k4q0k6L5K08o4m0k20N5Q8J29j24l1l8L15q3k02n7j91L01j73K37
6619I6N4j88K80k60k6m2k19K39J37j37M0J20j1r8M4k5n2J69j93K82k82M50l83
6642eJ24R1m72K91j77KR3j78L50j34R1k1k41K94j40j05L13R2o4L9m28j27M88o3
6666A13J5k46J64j92K29j29k40N53j00j48K3O1M5k76K03K9K82l35l93L60K7p9
6688c4M1N1j7K44j05P3j73l01N21l47j9J0O4J89n4p5j44L36l18K03l59J44J12
6711D2N3j39J1M61l89n1L2p3O8N9k18M1M1l9J67j72K26K5j74PJ3Q9j84J71q8J8
6737cK1k64J07K88j83L6q8K96l37M2J16qj49J09q3J47Q6k37J5J16J59m6k08k54
$$ plain form
6571 -62 311 -79 -187 126 245 38 82 143 -74 154 -265 149 -35 -56 -157 -143 -167 167 -78 -162 276 198 81
6594 81 -96 122 81 57 -23 -49 -14 194 130 90 -130 -75 13 142 18 -13 -51 264 181 -21 -78 -269 32 -141 96
6619 96 150 -38 242 -18 -44 -86 -305 -66 71 -66 -26 94 83 -15 29 4 -48 121 -72 210 -72 378 -5
6642 -5 119 210 -262 29 -148 -146 -53 -231 119 -15 76 55 -186 108 -32 -137 176 268 204 243 -185 -312 176 113
6666 113 128 -118 46 -146 83 -46 -286 267 167 19 42 103 148 -128 75 104 386 51 -342 18 45 -34
6688 -34 7 58 41 285 180 253 80 -221 300 -47 -66 -56 8 197 143 68 -76 260 -58 145 -214 -70 42
6711 42 95 -44 -33 428 39 -12 20 -53 15 74 -144 -103 -62 -101 66 -106 120 145 -29 -22 -9 80 -104 67 -21 -3
6737 -3 18 -246 -139 149 -34 2 -86 210 -127 -85 31 23 -126 -17 -100 47 133 -104 -89 27 186 140 -68 -322
6761c22L31R7J67l29l8n2J36J60j15Q7q5l7J50o4q2k0J17J43j02j05j89N8M0j62
6785b16K05J93n2j41R9j17j30L87j26m4K82j97l23J00n8K6k7O6j49J98k2NQ2J71
6809B12No8j39q7J89j60J65k08J24J22l1L4o2k50K76%M3m10N6K32j92M3j1J92
6833G5mL8p6j36O9j82K13K53j25j60J99k55j3j20K29j42J76k09Q5J62J6j58N7
6856hrk8OK03p6k15L60m12K40l08K45J36j78j68J92Q7kJ8n0P0j37N2l6O0j77M2
6882i3K14j40o2J55o6K28Qo07N62j11J02O1k61l0j65L34k01K14o9j01J40nj54
6905d7j66J36k04L85N5r1MR4Mp7N6q0k13L04k67j41J07K22l09J88p4j17J78J36
6929H3J00j30J02m36m2K41J8J56l6j49j15J79P5K2l06L12j68J05n2k71M32j5L7
$$ plain form
6761 -322 9 106 273 -56 -94 -146 -10 150 35 122 37 0 150 86 4 -16 101 244 142 37 -152 -94 -54 -216
6785 -216 -11 182 130 -11 88 -29 -159 228 102 58 340 143 -180 -80 -138 -112 -139 -73 -222 -24 -46 -41 41 212
6809 212 217 149 10 -77 112 -48 117 -91 33 155 124 158 96 -154 122 122 165 -245 -189 43 -149 -106 -117 75
6833 75 71 109 33 -103 -34 -216 -3 250 125 -35 164 -91 -104 -224 5 -137 39 -170 -85 77 93 -65 -8
6856 -8 -17 -45 -39 164 88 -127 233 -179 61 -247 -2 134 -44 -212 -20 67 65 83 33 103 -34 18 -18 42 -135 -93
6882 -93 121 -19 -81 74 8 236 244 -363 199 88 190 251 -10 -40 -205 129 -72 142 73 -28 112 107 -47
6905 -47 -213 -77 -281 104 159 68 72 166 170 93 149 69 -144 160 -107 -248 -141 81 -228 -40 -114 -231 -53 83
6929 83 183 53 155 -281 -323 -82 -64 92 56 -93 -208 -29 46 68 -238 74 -94 11 -41 -312 120 105 142
6952A42O9k83J23n0l1K70j46l25J03R7M2o2J50m8j88L70l82k7qNQ8J84m1k52K59
6977E9Nm13M84l1l2r7o0j43K33L0r1O4Q2J7Kk2j16K6K63qk24j70J18J22N6J20
7003B74l72J28J06q1o6l2K80p8M1j42k95M57m12J02Q8j42M4j4O0L78j34k37r9
7026a46J54k52L29j39k46L46j02J67l09J89q9k23L8M5L41l2k28K4L26o4k64K1
7048a14M4J26j2j66K56J1P3j90o6j60M14o8j28K59m88J81J39r3m0j82K03j4K11
7071A96m17J30J05m2J36l74K55J26j12l71K06J12J63n8k36K53K24j43l5k07J79
7092I0K34k52j18R0o9J23N4j63R4Nj02j66J78Q1j99k62L60l9R4K28j64j02k9L10
7116B76l83L98m31K09k0o7K5qq6K22k68J47J05q5j01J2RJ71j02p5K2j62L42l39
$$ plain form
6952 142 211 -72 51 1 -30 240 94 -231 -128 -31 11 -51 99 51 -137 233 -149 -176 -184 -179 -91 93 52 -200 59
6977 59 64 -349 135 104 72 -25 -85 -228 5 35 -56 8 90 107 109 87 -29 -3 260 252 28 -142 -24 98 154 274
7003 274 -98 30 136 55 -11 -43 237 159 200 58 -237 220 -192 -90 -2 -144 -100 -114 -54 324 190 -47 -146
7026 -146 8 -244 85 -54 -300 46 -56 111 -198 -9 -98 -321 -283 -238 103 71 -157 -133 193 129 -135 -114
7048 -114 -70 56 44 -122 134 145 218 28 -38 -198 216 148 20 279 -209 -28 111 18 -22 -204 -1 -15 196
7071 196 -221 -91 14 -28 108 -266 -11 115 3 -368 -162 -50 113 55 -181 72 296 153 118 -89 90
7092 90 324 72 -46 44 -25 98 152 -11 83 88 -14 -180 -2 79 -120 -382 -22 -61 33 261 97 -5 -34 276
7116 276 -107 291 -140 69 49 -18 7 -1 -87 135 -133 14 119 34 -67 -55 -46 125 23 -52 -30 -192 150 -189
7140a89O3j08L97l84K21m5n6J09n3lJ51p8k42M2R6J67j90J0K38l03l0K15j18K2
7164f8P1q1J37j44K16k13M30m72j54K08J03Q6l35L80L4k15j56Q6J19K0k37J64
7186b1l33K37M03l93K24k25J03L06O3l47p5K21l76K64J3J72o7l31m6O0Q5m3J78
7209G2n8J81j51L85j88j59R7q0j66M0M0o4j05M4K90k15N3R1k21J18o4L79l30k19
7233b30K87%j95OK3J67j0j0l1j13K09j9n0n2j99J74k09K42m8l0o9rJ04J26P4J40
7259B78m11J30k9J08l74n0K63qm8L8j35L01k08J5L26l25J5N00l93q0N8k5J74m07
7283b87M26k0j58n6J63O2k14J2j27J85K1j86P2L32m68J28L95l46Q1j25K13J83
7305B86j23P0l72n3Q4L68O9j86J20p2j69R5j00J44j78L22j33l9o2Q3j50l27L67
$$ plain form
7140 -189 -126 -234 163 -221 0 -45 -101 8 -45 -48 103 25 -217 -175 -79 88 -102 -92 146 -157 -187 28 -90 -68
7164 -68 3 -78 59 -85 131 -82 348 -124 -278 -70 33 119 -216 164 198 -17 -173 -87 32 52 -185 -21
7186 -21 -354 -117 286 -107 117 -108 -5 301 364 17 -58 163 -213 51 64 236 169 -162 -208 -148 -63 -106 72
7209 72 14 195 44 429 241 82 179 99 -67 -27 13 -51 -156 -112 178 -37 16 107 -114 4 -60 319 -11 -230
7233 -230 57 57 -138 -132 -109 58 48 38 7 -106 103 84 34 -18 -217 -43 -252 -10 -58 -88 -157 -166 -62 64 138 278
7259 278 -133 -3 -32 76 -298 -348 -85 -93 -141 -103 -238 63 -145 -130 196 -129 -114 386 -7 -87 -29 -54 120 -287
7283 -287 139 119 -39 -95 68 130 -84 -72 -199 -14 7 -179 -107 225 -243 -115 280 -66 15 -110 103 286
7305 286 163 233 -139 -192 -108 260 329 143 263 191 22 117 17 161 -17 305 172 133 71 154 4 -323 44
7328D4m5O1o4k76J78J04Q9r8r5R6M5l7J71k82j47K84LJ43k65j9K91m11K20J4J61
7353A65j51k7q1K32l4nr9m0O9K14j53k50L63k32J08Q2l4l57J18J84N2Lk28l1K20
7378H8K1k94J69j04K05j90J00J3j10M3l6K06j86Q7q9L4J29j1J47q8j97L15K7l42
7402f3M0J39l70M8M14m39K44L60k72r6L08n53K98o9j22K57j39j15K09l37N2K27
7424B1k0j49L07J6j55M4k82L37K5j68n8Mo7J8J95o4p7K70k42j17M29m69OL08J0
7449A22j52nO4Mj44k51K72J61k2%j27O36n07j28j66L21k87J83J70j30j7k65M54
7472A86k15K1j13K40n6j02k49K20k14M03j65J08K1j47J18k05Q4M5K79l65J02P0
7494F6k52J74N7O6j65J02j6p8K33k2J35k21l13K12J01j80L1J89l09J26M00m62
$$ plain form
7328 44 -1 60 -4 -280 -102 2 91 -7 -102 -6 39 2 173 -109 -256 28 31 174 -91 -110 181 -230 -10 4 165
7353 165 14 -13 -94 138 104 99 0 -40 29 243 90 -160 203 -29 79 161 127 -230 -112 72 124 127 -101 -132 88
7378 88 109 -185 -16 -120 85 -105 -5 8 -102 -59 -95 111 -75 12 -77 -43 86 75 222 134 -63 252 279 -63
7402 -63 -23 116 -254 -206 208 -231 13 373 101 5 313 -240 58 -11 -133 124 -15 -130 79 -258 -206 21
7424 21 1 -148 159 175 20 64 -218 119 144 -24 -82 -78 -145 -127 68 4 -73 197 -45 -162 267 -202 -196 112 122
7449 122 -30 -35 29 33 -111 -362 -90 71 49 49 -78 558 51 -77 -243 78 -209 -26 144 14 -3 -268 186
7472 186 -29 -8 -121 119 63 -39 -288 -68 -282 121 -44 64 85 -62 56 -149 -65 -20 259 -106 -4 66
7494 66 -186 -12 45 111 -54 48 32 -46 187 165 300 79 -234 -22 79 -101 -70 119 -190 -64 336 -126
7516a26J73N7K2j72p3L48m8K20l86m4q9K40r3j41K20j15j01J86q3J19Lj19R3j49
7540e8L19l26j38M00j70k23p4L26j53J72Q9q6K63k07n8j09K6rkp7J15j55J67k2
7564A0K8j12J67k00K07j47J94l4l72L81K98j83l35J04l58K91PJ10J4M5j42m4K13
7587A42P6j2m72J76j37PJ91n6K87k36J0K3j96J43J64m23K83O8l44M11k78r1J46
7610a18M6k10M04j56k07J47k4rK93k01j96K15j67R9K13p0R1j05j61L12k25K81
7632B52k25j29K35k0j41K14j56k34J29Jj03P4o2K60L1k54L51k36m4j61K91l4k03
7655a64J60k52J27K89J17k57O2P2k02q4K71k45P2J06J1K2j08J28k77J00K50j33
7677F5j20j6L3L1n0p4j6n3Q6MK14j35J76m17Q7L72k36P0k0l7J25k6j4K07p7j60
$$ plain form
7516 -126 47 104 126 -46 -119 229 181 401 15 -29 -118 122 29 -112 108 -7 -108 78 -5 114 117 -2 91 -58
7540 -58 261 -65 -203 197 27 -196 -270 56 -97 75 164 78 341 134 76 -33 -7 -16 -18 -95 20 -135 32 10
7564 10 38 -74 93 -107 100 -47 147 113 -259 122 420 237 -98 6 -352 -61 -54 56 70 115 -27 -71 142
7587 142 218 206 -266 -90 -227 -220 -29 -85 202 -34 -24 -1 -197 -54 110 -313 -30 38 -306 105 -173 -264 -118
7610 -118 -72 -282 122 -34 -241 -94 -118 -127 166 -35 -231 -16 -183 -84 129 59 150 45 -116 196 -29 252
7632 252 27 -102 133 113 -28 186 30 -204 -75 -74 -177 -103 -165 95 126 -128 223 -13 -57 -218 73 39 -164
7655 -164 -4 -256 -129 160 277 20 82 154 -48 -132 139 -106 -34 72 83 105 -3 125 -152 -52 198 65
7677 65 -55 -71 -38 -7 -57 -131 -147 -200 -114 -110 104 -31 145 -272 -185 187 -49 21 1 -36 89 63 49 256 179 19
7703A9k15K41j52K17j34m0J60k11qL32Nj00lj81N4%J59j28j96M18q0k35R3k32
7727b17J66J57J3j7j04j07K31j6k73J27L6j20n7L89j34Oj03n5L0K76n1n0n68L94
7751d7M4j20J94q5r6k26M14%q3oj18K75L12n11O0j79K30J85k07J25j05Q0j05J73
7775B04m64J97M9N6k35L4J11J5J14n26O36j15j35J27Q6l01L55k78o1J68K15m02
7797a50L18l46K94Q9j87j21O7J67k48J12k4J11l14K76J0k30j40K78n2m4qK99J21
7820B78l73O0k34L46K20l68m2K39q6mk1n1j13M49k45l56N10n1k35K54k48L43k29
7843D3k03j71J63J79J04l02L29o9J00l22J34j5n5rm4J94J12j63Qm4Mj8J31k75
7867a89J09P8q7J70k41J89K41k78j26K31j90l2J39j07K21j25k0L3J28L4j60o3
$$ plain form
7703 19 -196 45 -107 110 -24 -64 96 -115 -123 209 214 114 111 -70 -16 -16 143 15 -181 237 157 -78 15 -217
7727 -217 -51 106 119 102 -2 -109 122 106 -167 -40 -4 -124 -181 208 74 80 -23 -78 -48 228 177 127 -441 -47
7751 -47 -3 -123 71 -14 -110 -336 78 78 -5 -11 -129 146 458 -53 7 -172 58 243 36 161 56 136 31 204
7775 204 -260 -63 -14 42 -193 -159 -48 -33 81 -445 191 76 -59 68 154 -147 208 -70 -131 37 252 -150
7797 -150 168 -178 116 205 18 -103 -36 131 -117 -5 -29 82 -232 44 54 -176 -316 -38 -90 -134 -142 157 278
7820 278 -95 -35 -269 77 297 -71 -113 126 40 36 15 -36 -149 300 55 -301 209 158 -77 177 -71 272 43
7843 43 -160 -331 -168 11 115 -187 142 73 173 -149 -15 -30 -85 -94 -138 56 168 5 13 -31 -27 -45 86 -189
7867 -189 -80 -2 -89 81 -160 29 270 -8 -134 97 -93 -125 14 -93 128 3 -17 16 144 178 18 -45
7889d5J09j32K77k44Qj3m5K11j31k49M07j86l8o2K74m9K26l40L7j8k09j73N35
7912A50k66J67k8o1J48l02K62j20K42k42K48l22kN2J85j62j47J45K15p4m1j67
7934a20K47o2n4P3p8p2M0om03O02k16q6K94k37N8L15j88k24K61k94N3K42l43J81
7958a7J80k75l8o5K15K39J3j76k21q8L98p8o0l3J12l06L11j99J57N0l03J97j53
7981a40K73o7k01J74L10n13R0r3K41k16O8J95j67k69M77l2qj44QQ9k65J55J33
8004I8O9l81L19k28P5r7K1P4K76j99OJ79k31k26K26n8L3M3k77K77k0o9m6K56k58
8029a38J67j89K24Q0n5j59o8kL27k25k69K00J62j21J17l5P6J06r8j89R7l08J99
8052a01l2j04K50L7j48K6K6J63l04J59J06Jk6K8k90L51J2l84M87m56l8K39J23
$$ plain form
7889 -45 64 -68 209 -35 -27 -40 -85 126 -5 -254 153 -33 -71 -133 141 92 318 -22 15 -3 -212 -385 150
7912 150 -116 51 23 -38 110 -192 70 -50 192 -50 198 -124 -126 -74 111 -51 -198 -53 162 88 47 -120
7934 -120 127 65 11 84 6 -66 -26 -32 -435 167 -49 -135 159 -78 -20 295 107 -117 144 -150 -97 145 -198 -17
7958 -17 163 -112 -150 -215 0 239 252 76 -145 -233 165 87 27 -6 106 -200 111 -88 69 119 -184 13 -140
7981 -140 133 66 -135 39 349 -164 -74 -167 74 -142 -74 121 -46 -315 162 130 122 -22 -14 75 -190 -35 98
8004 98 167 -214 105 -123 -48 -145 -124 -50 226 27 33 212 -19 -245 -19 -77 -44 -1 -278 -1 -21 -90 -136 120 -138
8029 -138 29 -160 64 144 89 -70 -138 -140 187 -38 -307 -107 55 -66 51 16 92 198 100 -89 8 -300 -101
8052 -101 -133 -237 13 50 -98 -72 -46 117 -187 -28 78 79 53 81 -209 142 154 -230 257 -199 -237 2 125
8075A25q1j61M3J90P3Pj0j19j84j1J32R8j14J93l1r3r5m6J06j3J12n3n3j05L05
8100B15j42j15J22L4k58q4K13N5mj49K7n5J55q2Q6l02J2K03j5Q2K63k97J15j75
8124i6k9L09o56N48pJ69l69K30k75K47O3k5j6k64K52J52j92k03j27K11j9K74m87
8147c10L64l42L32l12J38K03j47j16O9J57j97o6K86J9j38q8l8J75N2M6J42m63
8169b34K45p2j0L91l77J3J01Rl4O1k31L84P2m41J37R8q2j55J59k08P9p1
$$ plain form
8075 125 44 -117 -74 116 189 196 186 67 -117 -128 4 102 -12 181 150 57 -38 -84 22 9 121 68 15 -90 215
8100 215 73 -42 80 114 -144 -228 -15 40 36 -113 -86 -141 14 -68 18 -284 -272 -69 -84 -2 261 -36 79 -96
8124 -96 -125 184 -472 76 69 238 -131 99 -176 71 134 109 93 -171 81 233 41 -162 -289 -78 -97 177 -310
8147 -310 54 -288 44 -268 -130 73 -74 -190 -121 36 -161 -227 59 78 -60 -148 -186 -11 41 87 229 -234
8169 -234 11 -61 -71 320 -57 -44 57 66 32 93 -138 246 318 -123 14 112 30 -125 34 -174 -95 -166
8191a66
$$ Imaginary data points
##PAGE= N=2
##DATA TABLE= (X++(I..I)), XYDATA
0@%%%%%%%%%lRj4J6j8K6l2M0m9N8p3Q9j06J23j46J72k00K32k70L12l59M11m68
32b50N35o06O85p72Q66r72J089j215J353j507J672j853K053k269K506k764L044
49A595l353L696m072M488m950N467o050O706p460Q335r357J0577j2062J3917j6308
64h831J9529k4130L1293m4125P4319k86445k42517K73503J74589K21876J06723
75B95784P9217j9709m3894j30352j59300j91864j33991p2075K7996Q5551J33404
86a29233J23429J12093P7839N3466P484k1930o2215r0491j09282q8107o0273j7556
98b04776K1219M6458M3347M9074O3688P9681P6517N3474J226n8195r6625r7996
110b2908q2288o1294m5838k1482J6830P0638J21501J40116J11307N5882j908n0711
$$ plain form
0 0 0 0 0 0 0 0 0 0 0 -3 6 -8 8 -10 16 -16 24 -25 33 -40 49 -57 66 -80 92 -108 124 -146 166 -193 218 -250
32 -250 285 -321 364 -408 458 -514 575 -640 713 -794 878 -975 1078 -1191 1315 -1449 1595
49 1595 -1758 1938 -2134 2354 -2596 2871 -3179 3527 -3933 4402 -4955 5622 -6440 7477 -8831
64 -8831 10698 -13432 17861 -26264 48055 -238390 -480907 -207404 -32815 189061 295784
75 295784 375001 355292 311398 181046 21746 -170118 -304109 -376184 -348188 -262637 -129233
86 -129233 -5804 106289 184128 237594 245078 223148 160933 70442 -38840 -126947 -187220 -204776
98 -204776 -183557 -137099 -93752 -44678 19010 98691 175208 228682 229908 171713 75088 -22908
110 -22908 -105196 -166490 -212328 -233810 -216980 -146342 -24841 115275 226582 282464 280556 229845
122B29845q4150j02062j15647j18847q7673k3770M9683J14353J54943J51087J06981
133B74743M7889j5862p4057j12456j24531j16524r2736n0522N746O4126J08214
144h5970J24956J06997N7900M718k7604m3609n5942o4327p2235p5277n2732m256
156a87381L7998N5536N5188M4052L3929L8586M6338L4894K95m0849p0439q1074
168c2927p1002n0670k7228m219K4049N8276Q5908R4976Q6440N5856N820m4739
180A80540q0791j03959j06177q2046m4137r284L4573P7696J07655J17150J02487
191A93707N3775j3498o9002r5656r6447q5671o7651m3229j1463L3563Q5554J16815
203G97J09022P0550K1225k2120m4200m8964n5501o6715o7619m8426j9079J9232
$$ plain form
122 229845 145695 43633 -72014 -190861 -278534 -302304 -252621 -138268 16675 167762 274743
133 274743 322632 306770 232713 120257 -4274 -120798 -213534 -264056 -258310 -194184 -85970
144 -85970 38986 145983 203883 208601 180997 137388 81446 17119 -55116 -130393 -183125 -187381
156 -187381 -149383 -93847 -38659 5393 39322 77908 124246 159140 159435 118586 48147 -32927
168 -32927 -103929 -154599 -181827 -186046 -161997 -103721 -17813 77163 163603 219459 225279 180540
180 180540 99749 -4210 -110387 -192433 -236570 -245854 -211281 -133585 -25930 91220 193707
191 193707 247482 233984 164982 69326 -27121 -112792 -180443 -223672 -235135 -201572 -116018 797
203 797 109819 180369 201594 179474 135274 86310 30809 -35906 -103525 -151951 -171030 -151798
215a51798N3830O6463O1787N2251M0659K5984J1220p946l2211n9883p7767p8465
227i5876n8941k5261J5962M8792O3531O4737O5063N9802M6731K1755k0412p1804
239A14079j03403r9720p1015l5014L284L4085N5028P8979R8925R3828N9546N546
251B34148m9094q5295r4661q2383o0517l7287q837K5365O0814Q3844Q8922P2779
263A47798L4575o964l8798o1152o9929o1721m6474l3553j4367J0925L3035N2417
275e4208O4043N6991L3486Q009p874j6861k2308l4043n2274o4802n9159k6102
287a75102J9314N2347O5978O1586M6706L5690L0045J4820j8669n5455q0688q6620
299i0048o4770k3466J4116L8785N6154O5713O6460O0412M3543J1247k9782o6533
$$ plain form
215 -151798 -97968 -31505 30282 82533 123192 149176 160396 152450 120239 60356 -17411 -95876
227 -95876 -154817 -180078 -164116 -115324 -51793 12944 78007 137809 184540 206295 185883 114079
239 114079 10676 -89044 -160059 -195073 -191789 -157704 -102676 -23697 75228 169056 228602 234148
251 234148 185054 99759 5098 -77285 -137802 -175089 -183926 -158561 -97747 -13903 75019 147798
263 147798 182373 175409 136611 75459 5530 -56191 -102665 -136218 -150585 -139660 -106625 -54208
275 -54208 9835 66826 100312 108321 100447 83586 61278 27235 -25039 -89841 -149000 -175102
287 -175102 -155788 -103441 -37463 24123 70829 106519 136564 151384 132715 77260 -3428 -90048
299 -90048 -154818 -178284 -164168 -125383 -69229 -3516 62944 123356 166899 178146 148364 81831
311H1831q6511q3843o1482k4973J2381L7338M9768N9610O3345O0342M6539J7294
323A71639k7050o4708p6258o7097m2450j4725N193J2420K6420M6346O1275O1108
335I2113M2820Q534k1888l8038l8948l3072l3245l6871l4354k0498M494L5122
347g3831N7335N9288M6996K9141Q437j0685k2525l6106n2307o0977n5543l7012
359a47789m192L5445O3260O9204N8971M0538J9790J317j7712m2159o7012p9398
371f9737o7095l0423J2309M7351O3824O0102M9095L9789K8809O784k1757n0186
383F8865p1753p0181m6099j5742R110K8105L8130M0840M3331M2183L2952J2458
395A12199j1540l4965m7966m9968m0471k5481j2302j947J1037K6760M0928N3608
$$ plain form
311 81831 -4680 -88523 -150005 -174978 -162597 -125259 -75491 -15881 47464 107806 154345 171639
323 171639 144589 79881 3623 -63474 -105924 -120649 -115456 -103036 -76616 -30270 31005 92113
335 92113 134933 143467 121579 83541 44593 11521 -21724 -58595 -92949 -113447 -108953 -73831
347 -73831 -16496 42792 89788 118929 127366 116681 94156 58050 5743 -55234 -110777 -147789
359 -147789 -151981 -116536 -53276 15928 74899 115437 135227 136544 118832 76673 9661 -69737
371 -69737 -136832 -167255 -154946 -107595 -43771 16331 65426 105215 134024 140808 119051 68865
383 68865 -2888 -73069 -119168 -134910 -125800 -97695 -59565 -18725 24606 66789 99741 112199
395 112199 100659 65694 17728 -32240 -72711 -98192 -110494 -112441 -101404 -74644 -33716 19892
407A9892N4000L5732P566j6912l4383m2200m0331l9615l9880l0291o419K4579
419a08262N2371O6841O0024L8530J5701j901j6390l1816m8918o1100n9959m1531
431a36410o567K9574N3114N9877N4893M0392K2187O931j1522l5370n3583o0364
443c6848n3822l0657L275L1418M4453M4994L6300K5694J7965J1007r46j8817l7435
456C6581m5741l7264j9877r87J1030J2529J1161J8531L0224L6967L4004J7648
468A04806r738l1563l8910l7745l2027k4351j7378p052J0602L3695N0038N3048
480E3425L9216J4880j1157l0451l9317l9300l6393l3086k3684o913J5657L9531
492e7592N5146N2572L4820J2505q480k3255k7733l1929l8832l9733k8909q397
$$ plain form
407 19892 73892 109624 117190 100278 65895 23695 -16636 -56251 -96131 -126422 -132841 -108262
419 -108262 -55891 10950 70974 109504 125205 123304 106914 75098 26180 -34920 -94879 -136410
431 -136410 -142977 -113403 -60289 -412 54481 94873 117060 123991 112469 77099 23516 -36848
443 -36848 -90670 -121327 -118052 -86634 -42181 2813 39113 64807 82772 93779 92833 74016 36581
456 36581 -9160 -46424 -66301 -67288 -56258 -43729 -32568 -14037 16187 53154 87158 104806
468 104806 95068 63505 24595 -13150 -45177 -69528 -86906 -93958 -83356 -49661 377 53425
480 53425 92641 107521 96364 65913 26596 -12704 -49097 -82183 -105867 -112780 -97123 -57592
492 -57592 -2446 50126 84946 97451 88971 65716 37983 6054 -32778 -72511 -101420 -109817
504a09817J8668M2639M9378M0719K4308R212j350q922j8868l0263l9107l8629
516f2032k4675j678J6743K6862K8310K2587J7632J7400J6919Q446m695k0681l5277
529E861l8716k8897j4574j319R588J7738K4782L4337M0452L6828K0454o226l1316
542F8992m5784m5591l4943j9238o974L458J7708L4170M6022M8523L7640J0951
554A14934j6127l3501l9952l8091l0701k2881j6851l595J5495L3703M4075M2698
566D9206K8349Q818q013j8344k1523k4116k8459k9665k5258j2653P731K7303L5320
579a1304L1904K3052J1826M160K417j404j4203k6682l5140l4275k1403j516J4318
592e8250K1001K2427K2101K3052K4033J7463L082j6786l6065m2259l4098j8599
$$ plain form
504 -109817 -91149 -48510 868 41587 65895 75107 73757 64835 45967 15704 -23403 -62032
516 -62032 -86707 -88385 -71642 -44780 -16470 6117 23749 41149 58068 66514 61819 41138 5861
529 5861 -32855 -61752 -76326 -77645 -68057 -50319 -25537 8800 49252 86080 106534 100308 68992
542 68992 23208 -22383 -57326 -76564 -83538 -80080 -62372 -28202 17820 66343 103983 114934
554 114934 98807 65306 25354 -12737 -43438 -66319 -83170 -86765 -71270 -37567 6508 49206
566 49206 77555 86373 78360 60016 38493 14377 -14082 -43747 -69005 -81658 -73927 -46624 -11304
579 -11304 20600 43652 55478 59638 62055 60651 46448 19766 -15374 -49649 -71052 -72568 -58250
592 -58250 -37249 -14822 7279 30331 54364 71827 74909 58123 22058 -20201 -54299 -72898
604g2898k574R876J6222J8904K4917K9515K6384J5553j665k1744l3421l1452k2572
617d4955j1001j557L996P439J4953K3811K8752K5956J2991m393j7471k2568k0796
630d843j4452j0830j1153p680M49J2269K3647K8691K1485Q699j638q460j0032
643B6152q678j0988j8385k1745j7403n980Q903K0802K3910K0543J4830J0477Q477
656E0915L422p292j9687k9634l2379k2876m799J1210K0723K4172K3216J9299J8066
669E4356J3004M23j5498k8256l4073k8293j2456L058J1571J3893J3290J3146J7164
682B1329J8413J3477K609j3105k3429k4748j8879j0800l346j437k52O614J6091
695a7463K3803K5362J7653J936j1309j7190j7007j4425j1415j2368j2986o584
$$ plain form
604 -72898 -75472 -65596 -49374 -30470 -5553 23962 50346 65899 64234 42490 9069 -22383 -44955
617 -44955 -55956 -57513 -53517 -46078 -31125 -7314 21438 47394 60385 55992 38521 15953 -4843
630 -4843 -19295 -30125 -41278 -48958 -48509 -36240 -12593 16098 37583 46282 44644 36184 26152
643 26152 17474 6486 -11899 -33644 -51047 -57027 -48124 -27322 -3412 17131 31961 42438 50915
656 50915 54337 47045 27358 -2276 -34655 -57531 -62330 -51120 -30397 -6225 16991 36290 54356
669 54356 67360 67783 52285 24029 -10044 -38337 -50793 -47735 -36164 -22271 -8981 4165 21329
682 21329 39742 53219 55828 42723 19294 -5454 -24333 -35133 -38479 -39916 -40168 -33554 -17463
695 -17463 6340 31702 49355 51291 39982 22792 5785 -8640 -20055 -32423 -45409 -51993
707e1993N582J9382K8444K6560J5897L640o076j0131r579j2296j8397k2598k0521
720e2086j0629N670K0648K6582K3433J7243R251L493j99o726j8704k8549l0629
733d1202k2403n458J2973K3475K4293J9277J2380R270P705L077n283j5945k5443
746c284k4170j4155k709P255J1794J1135R995J2927J6631J5037Q190l504j5453
759B9689k1357j7479j1311n209k603k248j13P006J6326K3754K1649J1043l357
772D5790j2636j6979j6082j1151j0075j0539p003Q55J0704K0290K3674J7222O932
785D1002j729o823q167r625j2834j6581j6449r672K106J4889K1475J9097J2468
798B9157L850j308k514l308q935j4511j7651j6435p884M763J1970J3918J1877
$$ plain form
707 -51993 -46411 -27029 1415 27975 43872 47512 41436 31305 21726 9430 -8967 -31565 -52086
720 -52086 -62715 -57045 -36397 -9815 13618 30861 40112 43605 43406 36680 17976 -10573 -41202
733 -41202 -63605 -69063 -56090 -32615 -8322 10955 23335 32605 40310 43387 38104 22159 -3284
746 -3284 -27454 -41609 -44318 -37063 -25269 -14134 -4139 8788 25419 40456 48646 45142 29689
759 29689 8332 -9147 -20458 -25667 -28270 -30518 -30631 -23625 -7299 16455 38104 49147 45790
772 45790 33154 16175 93 -11058 -21133 -31672 -38675 -37820 -27116 -6826 16848 34070 41002
785 41002 39273 32450 24283 14658 1824 -14757 -31206 -40878 -38772 -23883 -2408 16689 29157
798 29157 33007 31699 29185 25877 16942 2431 -15220 -31655 -39539 -34776 -22806 -8888 2989
811B989P733N899O611M639r73r888j6606j8765j2621l226M253P744O669N098O853
826c591J0673J2522J0234K474q909j5366j4880j0904o138j223j068o53M615J2141
840a0073J7148J7121J1261o89r712j3476j2140r984q437q088o896r88Q170J7194
854i589K0475J5227N157l664r188r179p117o477q811r924o861L14R520J6397J4878
869A1158R225K982p81k229m48l144q627j2620j3780q486P65Q521J2469J0808P893
884A3706M548N176N157J258o228j2769j8055j4852o293J860O691Q032O131N477
898a61R304J1498R401L493n937j4395j6371j2677o349k626k01P12M321J0471J5547
913F030J6756J1343J558q175j2628j2018r570o208n657o676l040L546J0560J5893
$$ plain form
811 2989 10722 16621 23232 27871 26898 17010 404 -18361 -30982 -34208 -29955 -22211 -15542 -10444 -3591
826 -3591 7082 19604 29838 32312 23403 8037 -6843 -17747 -23885 -25108 -26176 -26829 -22214 -10073
840 -10073 7075 24196 35457 34768 25056 11580 -560 -10544 -18981 -27069 -33965 -34953 -26783 -9589
854 -9589 10886 26113 31270 27606 18418 9239 2122 -4355 -13166 -23090 -29951 -29637 -20117 -3720 11158
869 11158 20383 23365 22584 20355 19907 16763 8136 -4484 -18264 -26750 -25985 -17464 -4995 5813 13706
884 13706 18254 23430 28587 29845 23617 10848 -7207 -22059 -28352 -26492 -19801 -11769 -5638 -161
898 -161 9143 20641 30042 33535 27598 13203 -3168 -15845 -22194 -24820 -25021 -24309 -19988 -9517 6030
913 6030 22786 34129 35687 27512 14884 2866 -6704 -12912 -18569 -25245 -28285 -24739 -14179 1714
927A714J4898P544r16n527o808n576l480n381r387q999n288J650Q916J0534Q071
942A965M361J954J833M068K798l453r941j3604j1889m237M900Q678P630M992L206
957C261L416O551O853J274n390j1885j2768q753j913L794N591L941K874M744P935
972I525Q451M541k044r963j2382r001l116J096K923L02j461J777P334J0573J0277
987A8832M706m685r007q638n054j491p32k704l758r34M028R207J1074O954P8l131
1003A4745m220k706q90j824o490q589o852j461N991J0502R100M092L31j839j360
1018H530J373k47m960q935r883o490P66O706Q178O798L232K270L107M602M73m744
1034A0776j0042j1935q317o77N237O657O158L142K070M262N655L778q91o494j0600
$$ plain form
927 1714 16612 24156 23240 17713 10905 5329 1849 -3532 -12919 -21918 -27206 -25556 -16640 -6106 1965
942 1965 6326 8280 10113 14181 16979 13526 3585 -10019 -21908 -26145 -21245 -12567 -4937 55 3261
957 3261 6677 13228 20081 21355 15965 4080 -8688 -17441 -19354 -15560 -9969 -6028 -3154 1590 9525
972 9525 17976 22517 20473 10510 -1872 -10873 -13989 -12893 -9970 -9668 -11129 -9352 -2018 8555 18832
987 18832 23538 18853 9846 1208 -3846 -5337 -6069 -8773 -12531 -13465 -9437 -230 10844 17798 17876 14745
1003 14745 10525 7819 6929 5105 -1385 -9974 -16826 -18287 -12296 -1794 7306 11398 11729 9890 8530
1018 8530 9903 9656 4696 -4239 -14122 -20612 -19846 -13140 -4962 1836 5068 7338 10445 15047 15520 10776
1034 10776 734 -11201 -19518 -20195 -14958 -8301 -2143 999 3069 7331 12986 16764 15873 9379 -1221
1049a221r061m561M37K666K614J72J049M399O839Q068N337r13o275p286n900l620
1065g256j632k900m707k415K342Q115J1804J0171M621j560m272m539k918k953
1079A901n036p261n855k258M120Q973Q950O220K251M96l03J312m6m345q029r363
1095h273p180j535M731O632N797L220J648K185L843L654q95n695q872q608l340
1110a2688J583M177L694J458m54J890N031N285L788j463n637p004l247j247R54
1125c880K84k043k102N32N329O637O427K530l090n276m068k778p29j860m268l707
1141a2062p76L552P448Q409M084m73l830m144k450n48j374l721m427k698P79O342
1157e889P560M502O14j142k026j22J264m85m058n452n246j151L697N780M249J525
$$ plain form
1049 -1221 -10282 -14843 -14406 -11740 -9126 -8954 -7905 -3506 3333 11401 16738 15825 9550 2264 -3636 -7256
1065 -7256 -8888 -11788 -16495 -18910 -16568 -8453 3351 13522 18143 16583 12311 7772 4854 1901
1079 1901 -3135 -10396 -16251 -18509 -14389 -5416 3534 9754 12005 12501 12198 13510 13464 9119 1090 -8273
1095 -8273 -15453 -16988 -12257 -5625 172 3392 5040 7225 11068 14722 13827 8132 -740 -9348 -12688
1110 -12688 -11105 -6928 -3234 -1776 -2230 -340 4691 9976 13764 12301 6664 -340 -3587 -4834 -3880
1125 -3880 -3596 -5639 -7741 -7209 -1880 4757 11184 13714 10624 5348 1280 -1498 -2227 -4087 -8355 -12062
1141 -12062 -12838 -9286 -1838 6571 10655 10182 6352 2208 -242 -790 -2164 -5885 -10312 -13010 -12231 -5889
1157 -5889 1671 6173 6787 5645 3619 3497 4761 4276 218 -5234 -10480 -11631 -7934 -2154 2095 3620
1173C620l30r59K179L017L60k275n524o914l510Q10L184L275J978m22M30L593
1189B512N014K880o36m759p107m968j010J930K191O26j195K07L484N687N805L153
1205A3814k594o085m944k929l16L42j578k630q57L023N458P121M954p59l556m156
1221D308k946j244k69l168m356k745K91M751O887N078J372j510k431j722J553
1236C849N48j864m636n144l470J060N076L878J993N91J81J677L561L102q99m565
1252D938p540n774j484J278K602K377J065L48K713M604L954J857l105o237n911
1267d315k398r9J525O63j202j257J288M359N287L890N63l464l761k207n02O45
1283i85o72l153l128M5K765N548N591K035j673k940k260m21J153n78k818l059
$$ plain form
1173 3620 3290 2331 4510 7527 7887 5612 88 -6826 -10336 -9526 -6342 -3067 -1089 -1511 -1081 2512
1189 2512 7526 10406 9770 5011 -2096 -7064 -8074 -6144 -3953 -3327 -4522 -4315 -831 4856 10661 13814
1205 13814 11220 5135 191 -2738 -3054 -2712 -4290 -6920 -7777 -4754 704 7825 12779 12020 8464 4308
1221 4308 1362 118 -151 -3319 -7675 -10420 -10129 -5378 1509 6587 7959 6449 4018 2296 3849
1236 3849 4397 2533 -2103 -7247 -10717 -9657 -4581 -703 1290 1881 2062 3739 7300 10402 9503 4938
1252 4938 -2602 -8376 -9860 -8582 -5980 -3603 -2538 -2190 523 5127 9081 10938 7833 1596 -4315
1267 -4315 -6713 -6812 -5287 -4624 -5826 -7083 -5795 -1436 3851 7741 8304 4840 1079 -1128 -1630 -985
1283 -985 -1657 -4810 -7938 -7893 -5128 420 6011 8046 6373 3433 1173 752 1905 1327 -1491 -4550
1299d550j922J090M098M089J909j220j502j391J190J876N78k833l612l606j111
1314f917K837L093K091N75l78k37K632K892M46k158n024n279k069J528L135K797
1330c6J140k52K61K456L058J371j131m405n060k606M51K058K072k49j573p38K011
1347a172L193L641J292k402m181k315n98K41J065j185k502q06J334L356M313K046
1363E320j144k406k168k73J332N88j810k918j993k63K930M409K237j98j845j749
1379D9K30K293R94j542l596l591j920J651L783K593J266m72p65P81J972J026j596
1396C156l614m789k614J261K832L194J531j84p09J300K820J943rk747m237l556
1412d422l73J357J809P87p07o21J411L013L442J943j262l692k607j415L48N43
$$ plain form
1299 -4550 -6472 -5382 -1284 2805 4714 3494 1992 601 1791 3667 4245 1412 -2200 -5806 -6917
1314 -6917 -4080 -987 1104 1679 1301 1064 3696 6588 7034 4876 -148 -5427 -7496 -5968 -2833 -36
1330 -36 1104 852 1113 3569 6627 7998 6867 2462 -2598 -5204 -4753 -2695 -623 -872 -2445 -3183 -1172
1347 -1172 2021 5662 6954 4552 371 -1944 -2542 -2301 -1236 -2421 -4923 -5729 -4395 -1039 3274 5320
1363 5320 4176 1770 -398 -671 661 1249 -561 -3479 -5472 -5735 -2805 1604 3841 3643 1798 49
1379 49 279 2572 3566 2024 -1572 -5163 -7083 -5432 -1649 944 2210 1738 973 1754 3726 4752 3156
1396 3156 -458 -5247 -7861 -6600 -3768 -574 957 773 64 1364 4184 6127 6118 3371 -866 -4422
1412 -4422 -4795 -3438 -1629 -842 -1549 -2170 -759 2254 5696 7639 6377 2685 78 -1337 -989 -446
1428d46o13l138j890P09K626M927L832M80j482j881k071l29O89j484k792l005
1444e868o23J148L913M018J685k28r06r97P16M62j357l053k937j976O73L612L309
1461A591J319l30j790j168J698J757M07j414l079l012j60J794J561R69q92j444
1477b193j46K073K555J377l94k513k702p44N10J301N06r85j953k06J711K797K362
1494C356J208j990k556j407J08J541N71j340k049q10J371K200K702O01j435k275
1510b04j268L89J919Q07j743j830j376N98K785L168L52j928k061j427j25J981
1526C7J084m09j372q57k22J998K042N02j281j767j735N55J945J901K26j172k233
1543g58j839J117J366P89J58j408n45J475K328J939j32k793l743k267N36J456
$$ plain form
1428 -446 -1059 -4197 -6087 -5378 -2752 2175 6007 6487 5005 3124 1053 724 1413 -71 -2863 -5868
1444 -5868 -6491 -5343 -1430 2588 4273 4045 3139 2142 2858 3320 1963 -1090 -4027 -6003 -5330 -1718 1591
1461 1591 2910 2580 790 -378 1320 3077 3484 2070 -1009 -4021 -4181 -2387 -826 143 -749 -2193
1477 -2193 -2339 -266 2289 3666 3272 759 -1943 -2687 -2177 -876 -370 -1355 -3308 -3514 -1803 994 3356
1494 3356 4564 2574 18 -1389 -1281 260 831 -509 -2558 -3368 -1997 203 2905 3506 2071 -204
1510 -204 -1472 -1083 836 1643 -100 -1930 -3306 -2708 77 3245 3597 1669 -392 -1819 -1944 37
1526 37 1121 712 -660 -1517 -1739 259 2301 2803 1522 -245 -1980 -1425 520 2421 2647 1475 -758
1543 -758 -2597 -1480 -114 675 833 -575 -1120 355 2683 4622 4490 1697 -2046 -4313 -3777 -2321
1559b321J474O96r47n07J927K379J952J39k685k741k189l63Q85J183J73j017n57
1576b519P96J719K751J385l01j767j923q65M68O92r53j580k253o20J721L491K384
1593B626M95j130j349j48R82J132r50k160k802j847R40K171J398J31m2j3J136
1610E70K480J374k25k122k853k317o13J344R29L63K89n28O99J641K239Q99m58
1627C711k633k307q50M10J523J029l47j914m37M75J586J549k46j605q05N56J755
1644A450J317j29k525k842n54R33K066J793m8r00n89K09M60J104k52j243j653
1661a403n18N82J270K054N7n15j032j014K9R93L44n14j515j180j66K211K461M23
1679B567q65k015j512J041J795P17o86j815j976l50J704J925P8m65r40k30J706
$$ plain form
1559 -2321 -847 -151 -1098 -1605 322 2701 4653 4792 2107 -634 -2823 -3186 -2301 -1118 -945 -1962 -2519
1576 -2519 -1723 -4 2747 4132 3831 2064 141 -724 -256 436 -517 -2097 -4350 -4970 -3249 242 2626
1593 2626 3121 1991 642 494 1476 2608 1658 -502 -3304 -5151 -4211 -2040 -642 -511 -553 -566 570
1610 570 3050 4424 4199 2077 -776 -3093 -3706 -2362 -1433 -1070 -781 -1309 -610 1031 3270 4169 3711
1627 3711 1078 -1229 -2079 -1669 -146 883 536 -1378 -1815 -1340 246 1795 1549 -56 -861 -305 1450
1644 1450 2767 2638 113 -2729 -3283 -2350 -284 1509 1461 561 -28 181 641 1745 1493 250 -1403
1661 -1403 -1921 -1339 -69 1985 2042 1527 495 -519 -490 503 847 333 -1182 -2362 -2528 -317 2144 2567
1679 2567 1702 -313 -1825 -784 1011 1728 1042 -773 -2749 -3099 -1395 530 608 143 -797 -1027 679
1696F79J477k13n47j884j342l98P77J072L39l43j221j1P48J544J606J066j096
1713B253j832j377r42L14J205j02j647q10L30K254L097J386j215k405j420m46
1729a357R09J016j219k149j94Q85K935K049j06j224j417p00j07J441L44q82o61
1746d37p40K9Q38R64K84K4m99m58J3Q92J164r4r86j675j688J56J555J317P17j374
1766Bj334L14J939J640O01j233k667j588P44J178Q41J19j748j080J034K283J389
1783B434j15j108j625m45K69L32J85k68m04n23N89M43P63J108m98r71j034p00
1801a568O01J513O03m53j599j610K52J216K146J11j013j301p3J384J894M4j897
1818B50j796j789R39J858Q90l8m06n91P08J394Q25j170r31j189q47O86P37J57
$$ plain form
1696 679 2156 1943 1396 -488 -1830 -2228 -1451 -379 -40 -383 -1604 -1615 -867 677 2283 3349 2253
1713 2253 421 -956 -1898 -1584 -379 -481 -2128 -2938 -2608 -354 2743 4129 2914 509 -911 -1357
1729 -1357 -448 568 -651 -2800 -2994 -2109 826 2875 2769 1545 128 -572 -679 762 1106 224 -437
1746 -437 -1177 -1148 -310 654 938 962 463 5 18 910 2074 1980 994 -681 -2369 -2213 -658 659 1376 2
1766 2 -1332 -1018 921 2561 3162 1929 -738 -2326 -1582 -404 437 556 -1192 -2272 -1238 1045 2434
1783 2434 2319 1211 -414 -859 -590 -258 -73 -341 -745 -1268 -679 -236 527 1635 1137 166 -868 -1568
1801 -1568 -967 546 1149 696 -903 -2513 -2261 -1045 1101 1212 199 -1102 -1175 209 2103 2147 250
1818 250 -1546 -3335 -2396 -538 352 314 -92 -683 25 1419 2244 1074 143 -1046 -1893 -1207 -470 -313
1836c13J67Rk43l52P12P85Q81L54r90j136j064K40Q52Q66m59j549q72R37J900
1855G25J614M16j881j780k11J317J079L43j356j647o61R55J701R54l70j058m69
1872c29N75M71P05l58q97p64k62Q6M16Q00O52J59k90p61p07M70M8j1l68q83k28
1893a476P47K577P51k76k004k077l03J504Q25J78j314j127L32J672J771N1j187
1910F44j101n70J123J157k12o76j416p06J0O73K18M07J45K0O10Q11O92n92K09
1929A446j007j529j148k99M75J401Q56n58m46Q2J030J702R52r14j963j716N5J095
1947d86J202m99j723q93L77K136J443P24p62j163n33L58O73J69o38p04j52Q6L07
1966g8K45m42k42K18m49m0P61J130O53L83o31j290q35J84L54L6p06j477J72J364
$$ plain form
1836 -313 -146 -137 -380 -732 -20 765 1646 2000 1010 -126 -1190 -950 -98 768 309 -1240 -2112 -1175 725
1855 725 2339 2755 874 -906 -1117 200 1279 1622 266 -1381 -2042 -1087 614 1568 1198 140 -329
1872 -329 246 717 1422 1064 167 -597 -859 -773 -357 443 1095 1254 964 203 -504 -34 14 3 -365 -1248 -1476
1893 -1476 -729 1848 2599 2323 319 -1758 -2061 -557 268 446 -868 -1995 -1663 9 1780 1831 644
1910 644 -457 -1027 96 1253 1041 365 -1051 -1757 -1747 -1074 -856 -449 -304 -284 326 1137 1829 1237 1446
1929 1446 439 -1090 -2238 -2537 -2062 -661 195 -363 -809 -727 303 2005 2957 2043 80 -1636 -1581 -486
1947 -486 716 217 -1506 -2399 -2022 114 1557 2281 1519 356 -177 181 854 1023 385 -319 -471 -385 -78
1966 -78 167 -275 -517 -299 -748 -788 -27 1103 1756 2139 1508 218 -617 -433 -79 -43 -749 -2226 -2054 -690
1986f90K006Q30J76k016q57P79J033P85q34j785j476k2J139J097nm91q59N69J474
2005H53J043K15n86j137p77o46m62K3M84L54J43k78M18J19J290O16j53j535j060
2024a076p70N25J629K00l25j523m04R41J693Q05j307j125q45L14J356P23l82j024
2042e95l17L39R41Q98k64j072p39rJ73M17N9m68O21Lk2M52O6J68K90j90j050o28
2064i27L43K32O60J96o82n14L10J197J196M78j253j744o59P06O56L96j136j274
2082a819K02J274J954J143J5j475j385j34m2M65j49r16o28K55Q85L76J129M26
2100A576j71p9n42q76ML05J69n18r03o00Q3J163J409J35r07p57nJ097O57K59j259
2121B40j082n18N33Q82o5n14n27o67J174J283L54j25n51l21m41J92J20m62j35
$$ plain form
1986 -690 1316 2146 2322 306 -551 228 1261 2046 1212 -573 -2049 -2071 -932 165 160 -331 -1190 -621 853
2005 853 1896 2111 1525 388 -389 -1035 -1497 -1474 -990 -636 -493 -771 -353 -234 1056 1672 1519 -16 -1076
2024 -1076 -1846 -1321 308 508 183 -1340 -1744 -803 890 1695 388 -737 -1582 -1268 88 811 429 -595
2042 -595 -912 -573 368 1266 1002 -70 -809 -818 -645 -228 -169 -637 -16 -13 -35 417 483 651 941 751 -299 -927
2064 -927 -584 -352 308 504 -178 -692 -382 815 2011 2489 1236 -508 -1167 -461 195 591 -545 -1819
2082 -1819 -1617 -343 1611 2754 2769 1294 -91 -225 -267 198 49 -867 -1495 -1240 -355 21 1150 1576
2100 1576 1405 1326 784 -92 -88 217 386 -132 -1035 -1635 -1552 -389 1020 1155 248 -509 -514 583 1240 1499 240
2121 240 -842 -1360 -827 55 -10 -524 -1051 -1718 -544 739 1093 968 417 96 -345 -153 -33 -495 -630
2140f30l33k04N73M41J87K74M39r70j76o9J74N46M40k06j041j59K78R67J8J08
2160F57j407n21J62J088J094j20q61p39j5N44R37L75p30r33k70L67O73O18m30
2179D89o31l59j15L88O18K72m0P4j53k42q3J30J1K11r25p02pN37Q74M75K43m50
2201F15p60P6N59J73l4r90r29N14R01N93m3p66o15r1R37M14R2p16p21m67J022
2222b36Q34p9m1l40p45j99M18M47K82K3q53l31O4K49O24L55r8m47m93k03M63Q13
2244E07K33n72r40o61N46Q19N17m36m84m26L35J087P69k27n35p40n70l72Q24l16
2264f42k6j68L00K47N86O10k67J42n92n76j3J92j09M71K15r2m62L87q5L0L11p83
2286c24m59M65Q75M50N09l98r07n37j45J23M81k26q58J09P37N43P25L2m96o91
$$ plain form
2140 -630 -963 -1167 -594 -153 34 308 747 -223 -399 -468 -294 252 692 486 -555 -714 -436 531 549 657
2160 657 -750 -1271 -1109 -21 1073 953 92 -647 -662 -118 819 1194 464 -469 -739 -372 301 919 489
2179 489 -142 -501 -616 -228 390 662 622 696 543 301 218 348 359 570 -355 -1057 -1064 -527 347 822 1065 615
2201 615 -145 -69 490 663 629 -361 -1290 -776 125 718 675 -91 -706 -797 140 554 646 -70 -791 -1258 -236
2222 -236 598 519 478 138 -607 -806 -388 59 341 364 -489 -820 -756 -507 117 472 374 -73 -566 -769 -306 507
2244 507 740 168 -772 -1433 -887 -68 449 13 -471 -897 -562 525 1294 1067 532 -208 -778 -1150 -326 -642
2264 -642 -668 -836 -536 -289 297 907 640 782 190 -386 -399 -207 -316 155 370 278 -184 203 118 148 459 -324
2286 -324 -783 -318 557 1007 1516 1118 211 -326 -471 -348 133 -93 -951 -842 -105 438 1163 1195 699 8
2306Hk17P02N0k11l96o06n35N27K36P91L36j55k47j63N4K13j15L60l78p09m35
2327h90O4J020J74m40n25j24j09N48R56J74j0p65j62k87M93l19n42r9o98L67J237
2348F3N24J37j46k90m01J53K21l05k16p6k42J69M22K68j91k25k36m50K64L16M55
2369B14M71m02m32j08o1L28J21o6o92m07L65N82O85L38m07p47J49j46P65P7k09
$$ plain form
2306 8 -209 493 543 332 -64 -670 -1205 -678 -442 349 685 530 283 120 174 387 272 632 254 -455 -890
2327 -890 -826 194 368 -72 -597 -721 -830 -282 674 848 838 73 -89 -376 117 -202 -744 -843 -1541 -1174 63
2348 63 587 724 578 288 -113 40 261 -44 -260 -336 -578 -409 13 281 90 -135 -371 -821 -557 -241 214
2369 214 685 283 -149 -257 -318 10 131 65 -627 -1034 -669 -87 598 936 529 -218 -69 -215 550 627 418
$$ [...]
8191a6
##END NTUPLES=NMR FID
##END=
