##TITLE=1H_Pr 53-EA
 200.13MHz,CDCl3,
 8 sc
 
 12.11.2025
##JCAMPDX= 6.0         $$ Bruker NMR JCAMP-DX V2.0
##DATA TYPE= NMR FID
##DATA CLASS= NTUPLES
##ORIGIN= UXNMR, Bruker Analytische Messtechnik GmbH
##OWNER= pz
$$ XWIN-NMR		Version 3.5
$$ Wed Nov 12 15:20:20 2025 Russian Standard Time (UT+4h)  she@DPX200
##.OBSERVE FREQUENCY= 200.1313
##.OBSERVE NUCLEUS= ^1H
##.DELAY= (6, 6)
##.ACQUISITION MODE= SIMULTANEOUS
##.ACQUISITION SCHEME= undefined
##.AVERAGES= 8
##.DIGITISER RES= 18
##SPECTROMETER/DATA SYSTEM= spect
##.PULSE SEQUENCE= zg30
##.SOLVENT NAME= CDCl3
##.SHIFT REFERENCE= (INTERNAL, CDCl3, 0, 14.3821)
##AUDIT TRAIL= $$ (NUMBER, WHEN, WHO, WHERE, WHAT)
$$ ##TITLE= Audit trail, XWIN-NMR		Version 3.5
$$ ##JCAMPDX= 5.01
$$ ##ORIGIN= Bruker BioSpin GmbH
$$ ##OWNER= she
$$ F:/spectra/data/she/nmr/H-C/1/audita.txt
$$ ##AUDIT TRAIL=  $$ (NUMBER, WHEN, WHO, WHERE, WHAT)
(   1,<2025-11-12 15:18:05.96 +0400>,<she>,<DPX200>,
      <created by zg, POWCHK disabled, PULCHK disabled
       configuration hash MD5:
       00 E9 B6 7A A2 85 ED C7 34 08 36 98 17 FE 4E 26
       data hash MD5: 16K
       B6 42 2E 9E 33 B9 D0 8E 87 CA FB C8 72 33 BD ED>)
$$ ##END=
$$ 
$$ hash MD5
$$ B1 AA 37 33 A5 37 C4 95 4B 80 7C 5F 77 79 7D AA
##$RELAX= 
##$RELAX= 
##$RELAX= 
##$RELAX= 
##$RELAX= 
##$RELAX= 
$$ Bruker specific parameters
$$ --------------------------
##$DU= <F:/spectra>
##$EXPNO= 1
##$NAME= <H-C>
##$PROCNO= 1
##$TYPE= <nmr>
##$USER= <she>
##$AMP= (0..31)
100 100 100 100 100 100 100 100 100 100 100 100 100 100 100 100 100 100 
100 100 100 100 100 100 100 100 100 100 100 100 100 100 
##$AQSEQ= 0
##$AQ_mod= 1
##$AUNM= <au_zg>
##$AUTOPOS= <>
##$BF1= 200.13
##$BF2= 200.13
##$BF3= 200.13
##$BF4= 200.13
##$BF5= 200.13
##$BF6= 200.13
##$BF7= 200.13
##$BF8= 200.13
##$BYTORDA= 1
##$CFDGTYP= 0
##$CFRGTYP= 5
##$CHEMSTR= <none>
##$CNST= (0..31)
1 1 145 1 1 1 1 1 1 1 1 1 1 1 1 1 1 1 1 1 1 1 1 1 1 1 1 1 1 1 1 1 
##$CPDPRG= <>
##$CPDPRG1= <>
##$CPDPRG2= <>
##$CPDPRG3= <>
##$CPDPRG4= <mlev>
##$CPDPRG5= <mlev>
##$CPDPRG6= <mlev>
##$CPDPRG7= <mlev>
##$CPDPRG8= <mlev>
##$CPDPRGB= <>
##$CPDPRGT= <>
##$D= (0..31)
0 0.7 0 0 0 0 0 0 0 0 0 0.03 0 0 0 0 0 0 0 0 0 0 0 0 0 0 0 0 0 0 0 0 
##$DATE= 1762946285
##$DBL= (0..7)
120 120 120 120 120 120 120 120 
##$DBP= (0..7)
150 150 150 150 150 150 150 150 
##$DBP07= 0
##$DBPNAM0= <>
##$DBPNAM1= <>
##$DBPNAM2= <>
##$DBPNAM3= <>
##$DBPNAM4= <>
##$DBPNAM5= <>
##$DBPNAM6= <>
##$DBPNAM7= <>
##$DBPOAL= (0..7)
0.5 0.5 0.5 0.5 0.5 0.5 0.5 0.5 
##$DBPOFFS= (0..7)
0 0 0 0 0 0 0 0 
##$DE= 6
##$DECBNUC= <off>
##$DECIM= 32
##$DECNUC= <off>
##$DECSTAT= 4
##$DIGMOD= 1
##$DIGTYP= 9
##$DL= (0..7)
0 120 120 120 120 120 120 120 
##$DP= (0..7)
150 150 150 150 150 150 150 150 
##$DP07= 0
##$DPNAME0= <>
##$DPNAME1= <>
##$DPNAME2= <>
##$DPNAME3= <>
##$DPNAME4= <>
##$DPNAME5= <>
##$DPNAME6= <>
##$DPNAME7= <>
##$DPOAL= (0..7)
0.5 0.5 0.5 0.5 0.5 0.5 0.5 0.5 
##$DPOFFS= (0..7)
0 0 0 0 0 0 0 0 
##$DQDMODE= 0
##$DR= 18
##$DS= 0
##$DSLIST= <SSSSSSSSSSSSSSS>
$$ [...]
##$SUBNAM0= <"">
##$SUBNAM1= <"">
##$SUBNAM2= <"">
##$SUBNAM3= <"">
##$SUBNAM4= <"">
##$SUBNAM5= <"">
##$SUBNAM6= <"">
##$SUBNAM7= <"">
##$SUBNAM8= <"">
##$SUBNAM9= <"">
##$SW= 18.0517328524113
##$SWIBOX= (0..15)
0 0 2 0 0 0 0 0 0 0 0 0 0 0 0 0 
##$SW_h= 3612.71676300578
##$TD= 16384
##$TD0= 1
##$TE= 0
##$TE2= 300
##$TE3= 300
##$TEG= 300
##$TL= (0..7)
0 120 120 120 120 120 120 120 
##$TP= (0..7)
150 150 150 150 150 150 150 150 
##$TP07= 0
##$TPNAME0= <>
##$TPNAME1= <>
##$TPNAME2= <>
##$TPNAME3= <>
##$TPNAME4= <>
##$TPNAME5= <>
##$TPNAME6= <>
##$TPNAME7= <>
##$TPOAL= (0..7)
0.5 0.5 0.5 0.5 0.5 0.5 0.5 0.5 
##$TPOFFS= (0..7)
0 0 0 0 0 0 0 0 
##$TUNHIN= 0
##$TUNHOUT= 0
##$TUNXOUT= 0
##$USERA1= <user>
##$USERA2= <user>
##$USERA3= <user>
##$USERA4= <user>
##$USERA5= <user>
##$V9= 5
##$VALIST= <valist>
##$VCLIST= <CCCCCCCCCCCCCCC>
##$VD= 0
##$VDLIST= <DDDDDDDDDDDDDDD>
##$VPLIST= <PPPPPPPPPPPPPPP>
##$VTLIST= <TTTTTTTTTTTTTTT>
##$WBST= 1024
##$WBSW= 4
##$XGAIN= (0..3)
0 0 0 0 
##$XL= 0
##$YL= 0
##$YMAX_a= 892570
##$YMIN_a= -911802
##$ZGOPTNS= <>
##$ZL1= 120
##$ZL2= 120
##$ZL3= 120
##$ZL4= 120
##$ABSF1= 10
##$ABSF2= 0
##$ABSG= 5
##$ABSL= 3
##$ALPHA= 0
##$AQORDER= 0
##$ASSFAC= 0
##$ASSFACI= 0
##$ASSFACX= 0
##$ASSWID= 0
##$AUNMP= <proc_1d>
##$AZFE= 0.1
##$AZFW= 0.1
##$BCFW= 1
##$BC_mod= 2
##$BYTORDP= 1
##$COROFFS= 0
##$CY= -3
##$DATMOD= 1
##$DC= 2
##$DFILT= <>
##$DTYPP= 0
##$F1P= 0
##$F2P= 0
##$FCOR= 0.5
##$FTSIZE= 0
##$FT_mod= 4
##$GAMMA= 1
##$GB= 0.15
##$INTBC= 1
##$INTSCL= 1
##$ISEN= 128
##$LB= 0.25
##$LEV0= 0
##$LPBIN= 0
##$MAXI= 10000
##$MC2= 0
##$MEAN= 0
##$ME_mod= 0
##$MI= 1.114404
##$NCOEF= 0
##$NC_proc= 0
##$NLEV= 6
##$NOISF1= 3.799351
##$NOISF2= 2.8
##$NSP= 1
##$NTH_PI= 0
##$NZP= 0
##$OFFSET= 14.38212
##$PC= 1
##$PHC0= -2980.552
##$PHC1= 6.192338
##$PH_mod= 1
##$PKNL= yes
##$PPARMOD= 0
##$PSCAL= 0
##$PSIGN= 0
##$REVERSE= no
##$SF= 200.129724274929
##$SI= 16384
##$SIGF1= 3
##$SIGF2= 2
##$SINO= 400
##$SIOLD= 16384
##$SREGLST= <1H.CDCl3>
##$SSB= 0
##$STSI= 0
##$STSR= 0
##$SW_p= 3205.1282051282
##$SYMM= 0
##$S_DEV= 0
##$TDeff= 0
##$TDoff= 0
##$TI= <>
##$TILT= no
##$TM1= 0
##$TM2= 0
##$TOPLEV= 0
##$USERP1= <user>
##$USERP2= <user>
##$USERP3= <user>
##$USERP4= <user>
##$USERP5= <user>
##$WDW= 1
##$XDIM= 8192
##$YMAX_p= 0
##$YMIN_p= 0
$$ End of Bruker specific parameters
$$ ---------------------------------
##NTUPLES= NMR FID
##VAR_NAME=  TIME,          FID/REAL,        FID/IMAG
##SYMBOL=    X,             R,               I
##VAR_TYPE=  INDEPENDENT,   DEPENDENT,       DEPENDENT
##VAR_FORM=  AFFN,          ASDF,            ASDF
##VAR_DIM=   8192,          8192,            8192
##UNITS=     SECONDS,       ARBITRARY UNITS, ARBITRARY UNITS
##FACTOR=    0.0002768,     1,               1
##FIRST=     0,             0,               0
##LAST=      2.2672688,     0,               0
##MIN=       0,             -911802,         0
##MAX=       2.2672688,     892570,          0
$$ Real data points
##PAGE= N=1
##DATA TABLE= (X++(R..R)), XYDATA
$$ plain form
0 0 0 0 0 0 0 0 0 0 0 0 0 0 0 -4 3 -8 8 -8 8 -11 11 -12 16 -20 20 -25 28 -34 36 -44 47 -53 61 -66 74 -83 91
37 91 -101 115 -127 138 -153 169 -187 205 -225 247 -273 301 -330 362 -400 443 -491 545 -611 687
57 687 -777 886 -1023 1198 -1427 1738 -2186 2870 -3998 6110 -10875 25983 -166167 -911802
71 -911802 -243077 726852 396354 -411404 -394510 100055 222672 109353 48927 -165692
81 -165692 -334540 31627 489558 175175 -511615 -398212 369467 491536 -180254 -472380
91 -472380 -30783 307148 142191 -93081 -137402 -107496 31142 237579 120192 -262160
101 -262160 -236583 207255 283128 -110731 -233859 49572 127237 -46266 1882 107341 -97269
112 -97269 -200060 132323 304696 -79597 -347755 14333 345034 50297 -270305 -45136
$$ packed form
0@%%%%%%%%%%%%%mPj1J6j6J6j9K2k3K8l6M0m5N3o2P0q0R1j00J14j27J40j57J74
37I1j92K16k42K65k91L22l56L92m30M72n20N74o31O92p62Q43r34J036j156J298
57F87j464J663j909K221k625L165l924N056o868J0108j6985L6858j92150p45635
71i11802O68725R69929l30498q07758J6894M94565J22617j13319o0426k14619
81a65692j68848L66167M57931l14383o86790J13403P67679J22069o71790k92126
91d72380M41597L37931j64957k35272m4321K9906J38638K06437j17387l82352
101b62160K5577M43838P5873l93859j23128K83431P7665j73503M8148J05459k04610
112i7269j02791L32383J72373l84293k68158L62088L30701k94737l20602K25169
$$ plain form
122 -45136 199030 7742 -127087 93601 120259 -200643 -169792 269930 246098 -274450 -318237
133 -318237 210063 339665 -125388 -311127 37861 212088 2226 -85048 13304 -26517
143 -26517 -79327 84722 162466 -89124 -234282 41633 250090 12876 -225962 -70080
153 -70080 149659 71284 -83579 -44772 17500 -24869 8411 89002 -6966 -130522 -10541
164 -10541 146842 28687 -135016 -18781 122291 -1712 -104246 39082 107549 -66374
174 -66374 -127502 74055 148098 -62695 -148865 42851 125939 -22667 -79203 27708 35696
185 35696 -50644 10981 111781 -15341 -158819 193 195959 48439 -192164 -94505 156395
196 156395 118840 -95928 -109937 21595 56892 25352 10743 -40183 -87210 9825 141364
$$ packed form
122d5136K44166j91288j34829K20688K6658l20902L0851M39722k3832n20548m3787
133c18237N28300J29602m65053j85739L48988J74227k09862q7274R8352l9821
143b6517n2810J64049P7744k51590j45158K75915K08457k37214k38838J55882
153g0080K19739p8375j54863L8807O2272m2369L3280Q0591r5968j23556J19981
164a0541J57383j18155j63703J16235J41072j24003j02534J43328O8467j73923
174f6374o1128K01557P4043k10793q6170J91716Q3088j48606n6536J06911P988
185C5696q6340O1625J00800j27122j43478J59012J95766j47520k40603R7659K50900
196A56395l7555k14768j4009J31532L5297l1540j4609n0926m7027R7035J31539
$$ plain form
207 141364 44766 -157457 -102228 131351 142511 -75831 -150341 13984 116001 26736 -57298
218 -57298 -46622 -21364 21120 70239 16643 -102046 -74896 92989 113975 -66735 -129258
229 -129258 27842 116250 9615 -77662 -20316 40767 14478 -1934 13923 -18699 -41455
240 -41455 23027 64320 -10626 -76877 -7436 76333 17964 -64733 -16972 50636 13258 -32236
252 -32236 4145 31769 -13803 -25989 32561 31824 -34778 -27961 35205 26876 -30847 -24525 25517
265 25517 13504 -29322 -7219 27079 -4696 -32197 5128 34670 -5227 -39409 4416 41087
277 41087 -2770 -35392 2313 27444 -2817 -21087 4778 10683 -17758 -7878 23149 -2315
289 -2315 -35510 -1387 35856 2887 -39663 -9189 37751 13371 -28190 -10729 19984 12758
$$ packed form
207A41364r6598k02223N5229K33579J1160k18342p4510J64325J02017q9265q4034
218e7298J0676K5258M2484M9119n3596j18689K7150J67885K0986j80710o2523
229a29258J57100Q8408j06635q7277N7346O1083k6289j6412J5857l2622k2756
240d1455O4482M1293p4946o6251O9441Q3769n8369q2697M7761O7608l7378m5494
252c2236L6381K7624m5572j2186N8550p37o6602O817O3166q329n7723O322N0042
265B5517j2013m2826K2103L4298l1775k7501L7325K9542l9897l4182M3825L6671
277D1087m3857l2622L7705K5131l0261j8270K5865N905k8441R880L1027k5464
289b315l3195L4123L7243l2969m2550L0474M6940k4380m1561J7461L0713p226
$$ plain form
301 12758 -6007 -3417 3686 -4083 -448 17421 2942 -26440 -8942 28763 15797 -28510 -23687
314 -23687 23981 25529 -16126 -18615 10799 13209 -990 106 3902 -5214 -4110 15921 10860 -18622
328 -18622 -14822 15891 15866 -13044 -20693 4485 16529 -4512 -15221 348 7279 -632 -2910 2583
342 2583 179 -5476 3792 11977 -5004 -14090 5842 14766 -4955 -16446 -148 12605 -1451
355 -1451 -12408 -2054 3512 -638 -68 540 -3224 -3446 4252 9996 -901 -10147 1031 13035 6206
370 6206 -8020 -7542 6146 7749 -2659 -3756 -1178 -3628 350 6939 1676 -10728 -7080 10820
384 10820 12419 -5279 -11194 571 10490 9091 -1606 -9159 -4007 7215 11224 429 -14020
397 -14020 -9715 7260 13436 552 -17083 -13164 8701 16671 1111 -16211 -13749 8131 22007
$$ packed form
301A2758j8765K590P103p769L635J7869j4479k9382J7498L7705j2966m4307M823
314b3687M7668J548m1655k489K9414K410j4199J096L796r116J104K0031n061k9482
328a8622L800L0713k5k8910p649K5178J2044k1041j0709J5569O931p911k278N493
342B583k404n655R268Q185j6981r086J9932Q924j9721j1491J6298J2753j4056
355a451j0957J0354N566m150N70O08l764k22P698N744j0897r246J1178J2004o829
370F206j4226M78J3688J603j0408j097K578k450L978O589n263j2404L648J7900
384A0820J599j7698n915J1765R919j399j0697p553N152J1222M009j0795j4449
397a4020M305J6975O176j2884j7635L919K1865P970j5560j7322K462K1880J3876
$$ plain form
410 22007 5746 -18920 -17646 11533 26357 1548 -23921 -13594 11579 17997 1477 -17051
422 -17051 -15596 2784 17858 10897 -15270 -24000 1874 27363 15786 -19592 -27389 8378 33010
435 33010 9164 -23804 -19215 11334 23231 4416 -15223 -16410 -1590 16422 14649 -9196 -23452
448 -23452 -6968 21112 22051 -10429 -30130 -5000 29653 23230 -15714 -29534 1954 27553 12559
461 12559 -14405 -19262 -1305 14808 11772 -3402 -16802 -14053 7617 22899 6135 -24167 -24293
474 -24293 15029 36651 1766 -35954 -16428 26618 27450 -9728 -25497 -4412 14191 12339 2597
487 2597 -10313 -18061 -5087 19301 20884 -13449 -35246 -2606 38276 21184 -29260 -35019 13134
500 13134 39296 6797 -26323 -16866 9692 18683 7446 -8864 -17253 -7855 14539 22835 -3027
$$ packed form
410B2007j6261k4666J274K9179J4824k4809k5469J0327K5173O418j6520j8528
422a7051J455J8380J5074o961k6167q730K5874K5489j1577l5378p797L5767K4632
435C3010k3846l2968M589L0549J1897j8815j9639j187J4820J8012j773k3845j4256
448b3452J6484K8080R39l2480j9701K5130L4653o423l8944j3820L1488K5599j4994
461A2559k6964m857J7957J6113l036j5174j3400K749K1670J5282j6764l0302j26
474b4293L9322K1622l4885l7720J9526M3046Q32l7178j5769K1085J8603j852r742
487B597j2910p748J2974K4388J583l4333k1797L2640M0882j7092n0444n759M8153
500A3134K6162l2499l3120R457K6558Q991j1237j6310q389R398K2394Q296k5862
$$ plain form
513 -3027 -30575 -17072 23147 32596 -8091 -38989 -10318 34270 26799 -17889 -31505 2079 27423
526 27423 11595 -12190 -14446 -3038 7525 12203 6159 -12533 -22761 178 29299 14207 -28000
539 -28000 -29608 17170 38809 -1250 -36381 -12448 25054 19821 -7450 -14196 -3119 3183 6903
552 6903 10482 -2713 -22300 -11209 22646 25592 -14079 -36553 -2889 35072 17737 -24551 -27119
565 -27119 8978 28455 7764 -17529 -15458 2725 15074 11691 -4343 -17379 -10331 12743 22126
578 22126 -1387 -27267 -15634 19876 27475 -7021 -32963 -8888 28650 22145 -15636 -25798
590 -25798 1988 22082 8608 -9517 -9906 -1983 5428 10240 3826 -12891 -16381 5789 23277
603 23277 3996 -23468 -14910 16013 20125 -6862 -20614 -1231 16227 7718 -6422 -6635 -536
$$ packed form
513c027k7548J3503M0219R449m0687l0898K8671M4588p471m4688j3616L3584K5344
526B7423j5828k3785k256J1408J0563M678o044j8692j0228K2939K9121j5092m2207
539b8000j608M6778K1639m0059l5131K3933L7502n233k7271o746J1077O302L720
552F903L579j3195j9587J1091L3855K946l9671k2474L3664L7961j7335m2288k568
565b7119L6097J9477k0691k5293K071J8183J2349l383j6034j3036P048K3074R383
578B2126k3513k5880J1633L5510P599l4496k5942K4075L7538o505l7781j0162
590b5798K7786K0094j3474j8125l89P923P411M812o414j6717l490K2170J7488
603B3277j9281k7464Q558L0923M112k6987j3752J9383J7458q509j4140k13O099
$$ plain form
616 -536 1970 3594 5198 -2204 -10493 -2392 10645 6608 -8227 -11437 1042 11229 4452 -7857
630 -7857 -7773 2503 8447 2873 -4770 -3769 909 3041 3242 1012 -3566 -4565 1026 7243 2499 -8166
646 -8166 -7728 3739 9655 1465 -10003 -6130 6889 8071 -2747 -6773 -625 4759 3498 790
660 790 -1698 -4683 -1110 6678 4578 -5273 -7559 1331 7333 1506 -6898 -4754 2639 5333 588
675 588 -4076 -2491 2242 2984 1022 -985 -2250 -407 2782 2663 -1045 -3538 -847 2708 1227 -1284
691 -1284 -1885 -1978 446 2286 182 -2412 -1637 1722 2380 107 -743 -573 327 2198 2209 -1001 -2764 -229
709 -229 2295 2021 -1576 -3244 -338 2443 1562 -2261 -3303 451 2734 1338 -991 -2195 -75 2959
725 2959 2205 -1445 -2994 488 3743 1319 -2871 -2268 879 2087 327 -2490 -2327 969 2217 344
$$ packed form
616e36K506J624J604p402q289Q101J3037m037j4835l210J2479J0187o777j2309
630g857Q4J0276N944n574p643J001M678K132K01k230m578r99N591O217m744j0665
646h166M38J1467N916q190j1468L873J3019J182j0818m026O148N384j261k708
660G90k488k985L573P788k100r851k286Q890O002n827q404K144P393K694m745
675E88m664J585M733P42j962k007j265J843L189j19l708k493K691L555j481k511
691a284o01r3K424J840k104k594P75L359O58k273q50J70R00J871J1l210j763K535
709b29K524k74l597j668K906K781q81l823j042L754K283j396k329j204K120L034
725B959p54l650j549L482L255k424m190O03L147J208j760k817J63L296J248j873
$$ plain form
741 344 -2141 -1615 1601 2144 -255 -1414 -906 1315 2490 -323 -2076 -330 1355 1035 -1232 -1970 -53
758 -53 1012 535 -1011 -1398 -91 1578 356 -1032 -473 554 1300 331 -762 -450 542 784 414 -1260
776 -1260 -796 513 531 -213 -1113 -451 683 386 -337 -553 -234 593 627 -519 -226 370 401 457 86 -406
796 -406 137 449 -142 -563 -608 -114 115 -262 -238 -323 47 402 -197 -176 509 396 195 113 143 238 -124 -4 416
819 416 -103 -793 236 392 -286 -610 -541 301 78 -162 -67 -388 30 439 -184 -68 -194 -284 638 726 -363
840 -363 -624 314 459 76 -594 -399 -130 153 642 -426 -1197 -37 1109 332 -620 -837 480 1257 136
859 136 -647 -371 217 679 470 -599 -401 -380 728 900 -580 -1380 163 1228 322 -1088 -648 542
877 542 690 179 -230 -426 -414 969 1009 -360 -1618 -92 1295 360 -1114 -1014 399 574 -13 -331 -198
$$ packed form
741C44k485N26L216N43k399j159N08K221J175k813j753J746J685l20k267p38J917
758e3J065m77j546l87J307J669j222j388N59J027P46r69j093L12R92K42l70j674
776a260M64J309J8p44r00O62J134k97p23k16L19Q27L4j146K93N96L1N6l71m92
796d06N43L12n91m21m5M94K29l77K4q5L70L55n99K1O85j13k01q2L0R5l62J20M20
819D16n19o90J029J56o78l24O9Q42k23k40R5l21M18M09o23J16j26r0R22Q8j089
840c63k61R38J45l83o70J95K69K83M89j068p71J160J146p77r52k17J317P77j121
859A36p83K76N88M62k09j069J98K1J108J72j480q00J543J065r06j410M40J190
877E42J48n11m09j96J2J383M0j369j258J526J387r35j474J00J413J75n87l18J33
$$ plain form
896 -198 -431 -163 1252 881 -1302 -1365 1082 1922 -255 -2028 7 1478 426 -773 -484 -8 84 -69
914 -69 505 -175 -1280 -222 1244 921 -931 -1387 236 1867 338 -1245 -486 769 1015 470 -585
931 -585 -624 209 843 468 -767 -943 192 277 162 119 -571 -786 339 1355 421 -1550 -955 1722 1628 -1292
951 -1292 -1572 713 1457 -183 -1312 216 538 -537 -716 552 244 -1322 -917 1590 1339 -1667 -1815
968 -1815 1530 1901 -575 -1920 411 1573 -194 -842 206 195 -371 -360 559 397 -725 -710 715 911
986 911 -346 -1263 -318 914 877 -634 -733 327 851 374 -635 -698 343 588 -438 -493 -24 162 -575
1005 -575 -104 768 85 -1357 -142 1507 857 -1551 -641 1437 1257 -1130 -999 919 1270 -483 -775
1022 -775 437 373 -890 -704 958 227 -1180 -572 1155 912 -883 -812 934 679 -209 -310 227 445
$$ packed form
896a98k33K68J415l71k183o3K447Q40k177j773K035J471j052j199K89M76R2j53
914f9N74o80j105J058J466l23j852m56J623J631j529j583P59J255K46n45j055
931e85l9Q33O34l75j235j76J135Q5j15m3o90k15J125J016r34j971N95K677r4k920
951a292k80K285P44j640j129J528L22j075j79J268l08j566M05K507k51l006j48
968a815L345L71k476j345K331J162j767o48J048j1n66J1R19j62j122J5J425J96
986I11j257r17R45J232l7j511r9J060N24m77j009o3J041K45j026n5M69J86p37
1005e75M71Q72o83j442J215J649o50k408R10K078j80k387J31J918L51j753k92
1022g75J212o4j263J86J662p31j407O08J727k43j795P1J746k55q88j01N37K18
$$ plain form
1040 445 -124 -70 470 99 -225 47 160 75 -309 -301 183 101 78 -184 -303 -92 514 188 -428 -363 474 516 -169
1063 -169 -413 370 616 -492 -237 461 311 -541 -213 293 137 -933 -597 1010 403 -376 -638 512 623
1082 623 -237 -601 534 294 -626 -205 821 -102 -791 -212 344 89 -700 -226 317 83 -356 -198 243
1101 243 95 31 104 143 -68 -177 199 54 -281 -333 11 159 -136 -96 138 -80 -164 116 165 -121 -211 238 302
1124 302 -337 -331 334 212 -105 -323 176 400 -107 -128 149 240 -466 -116 394 169 -213 -286 249 188 -384 -305
1146 -305 278 127 -274 -115 255 66 -357 43 425 -184 -423 132 456 -272 -82 99 335 -309 -346 290
1166 290 10 -188 -103 361 238 69 -23 375 272 -318 104 307 151 -370 -283 423 -215 -468 145 379 -59
1187 -59 -131 207 200 58 -320 148 203 -202 5 225 99 -73 -70 406 221 -399 -50 315 -275 -513 45 300
$$ packed form
1040D45n69N4N40l71l24K72J13q5l84QM84q2k3k62j19K11O06l26o16O5Q37M2o85
1063a69k44P83K46j108K55O98j50q52L28N06j56j070L36J607o07p79k62J150J11
1082F23q60l64J135k40r20M21J026r23o89N79N56k55p89M74N43k34m39J58M41
1101B43j48o4P3L9k11j09L76j45l35n2L44J48k95M0K34k18q4K80M9k86r0M49O4
1124C02o39OO65j22l17k18M99K24n07k1K77R1p06L50N10k25l82p3N35o1n72P9
1146c05N83j51m01J59L70j89m23M00L82o09k39N55L24p28J90J81K36o44l7O36
1166B90k80j98Q5M64j23j69r2L98j03n90M22K03j56n21Q7P06o38k53O13K34m38
1187e9p2L38pj42l78M68N5m05K07K20j26j72LM76j85o20L49L65n90k38N58K55
$$ plain form
1209 300 54 -298 350 199 -178 -271 182 161 44 -151 352 384 -172 -258 153 18 -317 -187 158 195 -355 -19
1231 -19 294 -68 -383 -12 210 29 -29 28 232 -49 -45 331 54 -104 -85 79 42 -177 -132 140 245 -261 45
1254 45 283 5 33 70 73 90 -59 19 46 11 -61 84 104 -235 -68 61 279 -342 -92 127 -27 -299 -63 104
1278 104 -65 9 -84 191 -79 -195 213 39 31 -303 -35 77 -102 -247 104 134 -126 -150 122 74 -151 -137 -101
1301 -101 128 -16 137 -35 -91 -85 -126 98 -46 3 69 119 -162 -121 -20 -24 -50 -119 168 93 44 213 274 93 127
1326 127 164 -18 -47 -161 -42 185 136 74 -12 58 79 -47 35 -36 137 35 185 -50 -275 10 109 -39 76
1349 76 -50 17 73 -61 303 144 49 -36 -132 -139 347 29 62 134 -1 -157 -354 214 40 -93 13 64 -246 7
1373 7 82 -257 -179 272 7 75 -231 -210 -66 90 49 -38 -223 -181 35 -70 -100 -105 -192 223 2 -28 -267 35 154
$$ packed form
1209C00k46l52O48j51l77r3M53k1j17j95N03L2n56q6M11j35l35J30L45L7n50L36
1231a9L13l62l15L71K22j81n8N7K04k81ML76k77j58J9J64l7k19M5K72J05n06L06
1254D5K38k78K8L7LJ7j49P8K7l5p2J45K0l39J67J29K18o21K50K19j54k72K36J67
1278A04j69P4r3K75k70j16M08j74ql34K68J12j79j45L51L0k60k4K72m8k25J4L6
1301a01K29j44J53j72n6Om1K24j44M9O6N0k81M1J01mk6o9K87p5m9J69O1j81L4
1326A27L7j82k9j14J19K27m9o2q6P0K1j26Q2p1J73j02J50k35k25K85R9j48J15
1349G6j26O7N6j34L64j59r5q5r6pM86l18L3P2j35j56j97N68j74j33J06N1l10K53
1373GP5l39P8M51k65O8l06K1J44J56m1q7j85M2K16j05l0nq7M15k21l0k39L02J19
$$ plain form
1398 154 -54 -94 -206 101 -95 97 -117 -143 43 75 -47 322 -133 -69 38 116 31 -146 98 299 99 -55
1420 -55 -290 245 184 1 -192 63 -154 -70 73 -130 -5 -378 113 125 172 -85 -388 230 318 -33 -198 49
1442 49 277 78 198 -74 -8 313 123 -116 278 -11 -175 274 316 -15 -220 -223 236 186 -247 -386 60 459
1464 459 89 -423 -32 185 39 -194 70 342 -86 -344 256 323 -262 -312 40 357 29 -315 19 264 20
1485 20 -260 -176 110 289 -331 -268 213 75 32 -14 89 -58 -369 -161 141 43 -205 -263 -68 175 292 -420
1507 -420 -249 382 230 145 -322 -46 -33 -231 -45 370 130 -252 -70 627 304 -272 -308 322 568 -241 -276
1528 -276 184 375 -127 -297 -127 153 -97 -264 231 73 -251 -237 334 317 -578 -170 192 100 -310 -177 226
1549 226 302 152 -139 -319 74 5 -115 83 28 -131 -80 7 64 -39 -224 -258 353 65 42 -314 -97 104 139
$$ packed form
1398A54k08m0j12L07j96J92k14k6J86L2j22L69m55O4J07P8q5j77K44K01k00j54
1420e5k35N35o1j83j93K55k17Q4J43k03J25l73M91J2M7k57l03O18Q8l51j65K47
1442D9K28j99J20k72O6L21j90k39L94k89j64M49M2l31k05lM59n0m33j39M46L99
1464D59l70n12L91K17j46k33K64K72m28k58O00O7n85n0L52L17l28l44L34K45k44
1485B0k80Q4K86J79o20O3M81j38m3m6J03j47l11K08L02r8k48n8J95K43J17p12
1507d20J71O31j52q5m67K76J3j98J86M15k40l82J82O97l23n76l6O30K46q09l5
1528b76M60J91n02j70J70K80k50j67M95j58l24J4N71j7q95M08L62r2m10J33M03
1549B26P6j50k91j80L93o9j20J98n5j59N1Q7N7j03j85l4O11k88k3l56K17K01L5
$$ plain form
1572 139 -30 -149 265 129 -290 -54 184 122 -336 11 311 4 -255 -27 386 -296 -328 -88 317 -181 -163
1593 -163 -61 260 25 -37 -21 87 90 -358 -69 172 -190 -280 135 327 -42 -285 36 320 227 -177 153 142
1615 142 -357 71 186 -123 -171 333 96 -38 -203 -165 -99 25 -106 211 4 -118 -59 -105 -171 -231 -80 -14 162
1638 162 -23 -30 156 -16 -25 144 89 -97 -220 96 172 -76 54 190 -4 -197 -307 -6 132 -154 -32 138
1660 138 -13 -139 -105 183 59 25 50 271 59 -192 64 -4 -23 -190 54 106 -125 -82 121 231 -24 36 90
1683 90 44 171 -126 -27 -71 -74 144 -27 -164 -298 -19 218 224 -87 196 63 46 -251 -66 97 3 -12 150 66
1707 66 -192 -71 398 234 -199 57 64 63 -264 -219 213 124 11 -106 26 -66 -6 -124 -117 -29 -14 2 31 -187 -20
1732 -20 -72 -5 120 -13 -53 58 70 125 55 143 -130 -35 279 -53 -131 -57 211 43 -397 244 -4 -9 -2 -129 249
$$ packed form
1572A39j69j19M14j36m19K36K38o2m58L47L00l07k59K28M13o82l2K40M05m98J8
1593a63J02L21k35o2J6J08Lm48K89K41l62r0M15J92l69k43L21K84r3m04L30j1
1615A42m99M28J15l09m8N04k37j34j65L8O6J24j31L17k07j22N9m6o6o0J51O6J76
1638A62j85pJ86j72rJ69n5j86j23L16P6k48J30J36j94j93j10L01J38k86J22J70
1660A38j51j26L4K88j24l4K5K21k12k51K56o8j9j67K44N2k31M3K03J10k55O0N4
1683I0m6J27k97R9m4lK18j71j37j34K79K37Ol11K83j33j7k97J85J63r4j5J62q4
1707F6k58J21M69j64m33K56Pjl27M5M32q9j13j17J32r2O0j18PQ8J5J6K9k18J67
1732b0n2O7J25j33m0J11J2N5p0Q8k73R5L14l32p8P4K68j68m40O41k48nPj27L78
$$ plain form
1757 249 -2 -205 36 64 -59 -72 6 -79 -102 -139 31 39 -50 -54 -196 -17 -5 21 -73 95 -184 82 -91 22 -267
1782 -267 158 -105 60 29 188 -211 -71 74 153 256 -283 220 112 -31 -233 44 103 -102 23 -130 29
1803 29 -175 28 -9 206 -44 -129 -143 97 26 -36 120 -349 -226 -18 32 55 -11 -102 149 222 23 -89 20 157
1827 157 -5 46 128 51 -245 -139 51 -288 -218 9 151 -178 157 -31 89 -37 -55 -27 22 13 136 -78 -238
1850 -238 105 100 77 -161 17 -92 -124 -155 51 -70 -132 -212 -136 70 -10 -147 60 -164 -151 -25 -9 -49 -66 116
1874 116 77 163 -45 -63 58 -217 -206 -70 4 51 41 -28 -140 -56 -111 228 17 161 153 182 92 -108 0 -114 -74
1899 -74 -131 -59 64 -152 -48 53 -90 27 -6 162 332 -13 56 21 -38 13 7 -119 53 53 14 -43 42 101 -114
1924 -114 85 -34 -143 -200 194 -113 -100 -100 80 26 -9 -24 -208 86 85 -37 -73 -181 -145 -117 -23 6 92 -17 203
$$ packed form
1757B49k51k03K41K8j23j3P8q5k3l7J70Qq9mj42J79J2K6r4J68k79K66j73J13k89
1782b67M25k63J65l1J59l99J40J45P9J03n39N03j08j43k02K77N9k05J25j53J59
1803B9k04K03l7K15k50q5j4K40p1o2J56m69J23K08N0K3o6r1K51P3j99j12J09J37
1827A57j62N1Q2p7k96J06J90l39P0K27J42l29L35j88J20j26j8K8M9rJ23k14j60
1850b38L43nk3k38J78j09l2l1K06j21o2q0P6K06q0j37K07k24J3J26J6m0j7J82
1874A16l9Q6k08j8J21k75J1J36P4M7j0o9j12Q4n5L39k11J44qK9r0k00J08j14M0
1899g4n7P2J23k16J04J01j43J17l3J68J70l45O9l5n9N1oj26J72%l9n7Q5N9k15
1924a14J99j19j09n7L94l07J3%J80n4l5j5j84K94jj22l6j08L6K8R4K9Q6j09K20
$$ plain form
1949 203 203 199 43 150 121 210 85 30 -105 -56 -36 -46 14 80 -3 -51 17 -181 -165 -212 -197 -63 -82 -14 91 214 26
1976 26 -132 109 -84 -66 28 168 -36 42 -374 75 107 256 -28 43 145 2 -334 -107 293 41 -379 -11
1998 -11 84 -67 209 -212 -220 381 184 -14 70 124 334 63 -221 106 133 80 -327 261 -137 172 -77 1 10 202
2022 202 -68 -75 127 232 86 -172 128 -92 164 -11 -166 -94 186 10 96 -18 -123 -116 -97 -133 -132 -195 -22 -118
2046 -118 108 28 161 211 -92 -95 -134 -124 132 52 -58 37 -42 -227 120 -61 -76 134 31 17 54 -82 346 -95
2070 -95 43 251 -59 -97 -50 -124 125 -208 77 318 -220 -98 77 264 -183 -75 168 14 -57 115 134 209
2092 209 -474 -115 -26 -30 -219 34 500 -12 -119 20 124 112 -144 -159 -44 -51 -87 -257 -111 -140 -125 90 128 37
2116 37 -34 19 -63 -185 32 83 194 218 17 -5 -22 -104 -105 114 -61 248 75 109 29 -150 95 233 -115 -173 220
$$ packed form
1949B03%mj56J07k9Q9j25n5j35M9K0j0O0O6q3m8O8j98J6m7J5J34j9O8J05J23j88
1976B6j58K41j93J8R4J40k04P8m16M49L2J49k84P1J02j43l36K27M00k52m20L68
1998a1R5j51K76m21qO01j97j98Q4N4K10k71k84L27K7n3m07N88l98L09k49P8RJ92
2022B02k70pK02J05j46k58L00k20K56j75j55P2K80j76Q6j14j05PJ9l6Jo3J73r6
2046a18K26q0J33N0l03ll9J0K56q0j10R5p9j85L47j81j5K10j03j4L7j36M28m41
2070i5J38K08l10l8M7p4K49l33K85K41n38J22J75J87m47J08K43j54p1J72J9P5
2092B09o83L59Q9mj89K53M66n12j07J39J04j2k56j5J15pl6j70J46k9J5K15L8r1
2116C7p1N3q2j22K17N1J11K4k01k2j7q2jK19j75L09j73L4q0j79K45J38l48n8L93
$$ plain form
2141 220 93 -14 -119 203 -63 -168 84 171 182 -111 30 315 -330 -48 161 181 78 -156 50 -89 -101
2162 -101 40 47 170 -139 160 -60 157 88 -77 -65 87 -8 30 23 -51 -69 17 108 104 57 -92 133 36 -68 57
2187 57 57 43 2 -71 -5 -90 90 203 136 -344 14 -23 -33 -135 55 248 49 -19 -126 110 -235 -114 16 -49
2211 -49 -107 -112 -33 -16 -86 -182 95 176 -11 -94 11 189 -20 180 14 -140 -215 -65 -58 100 -95 -52 -51 16 15 41 -31
2238 -31 -74 -16 -304 128 -65 -121 11 86 -247 204 275 35 -76 99 102 217 -179 56 175 -169 -6 6 60
2261 60 -151 -98 -150 116 -17 -80 19 2 -177 -41 185 213 0 -16 70 13 9 -138 -48 -69 -49 -29 156 133 38 -108
2287 -108 177 -233 -149 12 131 141 211 27 -43 75 -79 -73 201 30 53 38 -24 -148 254 -55 -258 -305 -69
2310 -69 0 129 26 -209 123 -89 39 87 -161 45 -209 -22 2 -97 -37 83 30 -143 -10 103 -60 -69 92
$$ packed form
2141B20j27j07j05L22k66j05K52Q7J1k93J41K85o45K82K09K0j03k34K06j39j2
2162a01J41PJ23l09K99k20K17o9j65J2J52r5L8pp4j8Q6R1mm7j49K25r7j04J25
2187E7%j4m1p3O6q5J80J13o7m80L58l7j0j02J90J93j99o8j07K36l45J21J30o5
2211d9n8nP9J7p0r6K77Q1j87q3J05J78k09K00j66j54p5J50PJ58j95M3JO7jK6p2
2238c1m3N8k88M32j93n6J32P5l33M51P1k40j11J75LJ15l96K35J19l44J63J2N4
2261F0k11N3n2K66j33o3R9j7j79J36K26K8k13j6Q6n7mj47R0k1K0K0J85k3r5j46
2287a08K85m10Q4J61J19J0P0j84p0J18j54OK74j71K3j5o2j24M02l09k03m7K36
2310f9O9J29j03k35L32k12J28M8k48K06k54J87K4r9O0J20n3j73J33J13j63rJ61
$$ plain form
2333 92 -39 81 -78 121 -88 145 124 -59 155 109 163 64 -215 -142 79 -144 -6 -143 55 -127 -189 -86
2355 -86 81 50 -127 50 -138 79 -117 86 -173 315 -124 -124 198 -45 -170 -46 -134 2 114 -130 41 14
2377 14 96 43 170 59 -90 55 77 -227 14 114 135 29 64 40 -113 -133 -43 36 56 -81 -212 -151 10 3 -168
2402 -168 77 59 -80 231 -4 142 -26 42 12 15 -99 -40 57 -32 -90 -107 85 103 -177 33 174 -134 -149 11
2426 11 -92 -99 105 -190 30 37 -45 -224 116 294 58 55 1 73 103 19 -164 -83 29 -38 -105 -39 119 42 -62 -82
2452 -82 253 -70 49 111 140 -166 123 47 -127 -18 94 -12 138 -102 -91 -6 151 142 9 -69 6 67 95 -41
2476 -41 58 -27 118 -312 89 -73 24 204 -96 -187 152 34 -98 166 47 34 18 156 -4 -127 15 -35 -219
2499 -219 -62 -132 13 37 69 -198 -88 145 -50 166 -81 41 -43 -90 15 -73 -79 -93 8 90 -100 -189 -51 -9
$$ packed form
2333I2j31J20j59J99k09K33k1j83K14m6N4r9k79P3K21k23J38j37J98j82o2J03
2355h6J67l1j77J77j88K17j96K03k59M88m39%L22k43j25J24q8J36J12k44J71k7
2377A4Q2n3J27j11j49J45K2l04K41J00K1j06L5k4j53k0R0P9K0j37j31O1J61pj71
2402a68K45j8j39L11k35J46j68O8l0Lj14N9R7q9n8j7J92J8k80K10J41l08j5J60
2426A1j03pK04k95K20Pq2j79L40J78k36ln4P2L0q4j83Q1J12o7o7O6J58p7j04k0
2452h2L35l23J19O2K9l06K89p6j74J09J12j06J50k40J1Q5J57rj33p8P5O1K8j36
2476d1R9q5J45m30M01j62R7J80l00r1L39j18j32K64j19j3j6J38j60j23J42n0j84
2499b19J57p0J45K4L2k67J10K33j95K16k47J22q4m7J05q8oj4J01Q2j90q9J38M2
$$ plain form
2523 -9 27 84 31 -88 -197 80 27 241 -50 -17 -43 227 9 53 -1 89 46 123 1 53 -139 22 75 -28 211
2548 211 50 68 96 7 67 21 70 66 -200 -122 -196 -227 -99 35 -112 167 132 10 -23 -86 -75 183 -8 -1 69 41
2574 41 -76 105 45 17 143 -23 58 122 -68 -59 49 -6 -81 142 164 -34 38 -147 127 220 -75 -195 114 -59
2598 -59 -123 -78 198 192 -124 44 218 82 -83 -172 204 46 -27 -92 -84 -49 22 -188 -64 -102 -19 -190 -68 121 5
2623 5 -261 58 -16 -56 110 -5 -66 -94 111 77 59 100 -69 -98 -136 -136 42 -110 -21 109 29 -65 -150 67 -9 -165
2649 -165 16 -24 -132 -100 14 175 222 41 2 -185 -54 -70 -213 161 85 -101 3 154 77 -32 62 151 131
2672 131 -268 -150 -36 -301 -27 84 4 16 -44 163 -31 50 52 -55 66 229 47 -62 -29 -6 75 48 -52
2695 -52 -89 143 230 221 -1 -85 288 -53 -97 -113 300 55 -131 -84 164 92 128 -32 259 -117 -18 136 177 -203
$$ packed form
2523iL6N7n3j19j09K77n3K14k91L3k6K70k18M4n4R0m3P7j22N2j92J61N3j03K39
2548B11j61J8K8q9O0m6M9mk66P8p4l1J28J34j47K79l5j22l3o3J1K58j91PP0k8
2574D1j17J81o0k8J26j66Q1O4j90RJ08n5p5K23K2j98P2j85K74R3k95j20L09j73
2598e9o4M5K76ol16J68J74j36j65q9L76j58p3o5QL5P1k10J24l8Q3j71J22J89j16
2623Ek66L19p4m0J66j15o1k8K05l4j8M1j69k9l8%J78j52Q9J30q0r4q5K17p6j56
2649a65J81m0j08L2J14J61M7j81l9j87J31j6j43L74p6j86J04J51p7j09R4Q9k0
2672A31l99J18J14k65K74J11q0J2o0K07j94Q1Kj07J21J63j82j09L3K3Q1k7j00
2695e2l7K32Q7rk22q4L73l41m4j6M13k45j86M7K48p2L6j60K91l76R9J54M1l80
$$ plain form
2719 -203 16 -9 -6 -132 -78 -85 -147 10 -132 -96 -5 128 202 129 -188 -51 56 -101 132 -26 -73 23 -190 -59
2743 -59 37 58 -50 25 84 198 -103 -5 50 146 -134 204 63 -10 -108 210 -201 11 -190 -128 -2 -98 -52 156
2767 156 -19 -158 -43 -215 257 -32 145 113 65 -6 93 -19 -40 -204 78 207 105 -284 118 -64 45 -79
2789 -79 124 204 -174 42 -109 164 17 -77 79 111 123 62 91 128 -178 -199 241 -78 -121 -63 142 153 -22 -142
2813 -142 65 11 12 156 22 -80 -88 -157 35 77 -127 56 10 -7 135 158 95 24 34 29 13 -100 221 108 75 -83
2839 -83 49 128 -72 -284 50 161 -210 -94 135 -241 72 76 -203 345 -56 -7 -74 -23 -69 -92 61 39 77 -107
2863 -107 164 -41 -15 156 89 44 -41 -6 -125 41 -146 40 -231 101 39 -135 51 -88 -81 -118 41 -35 74
2886 74 -179 99 29 -90 35 -19 -127 -65 15 45 -199 102 -70 -9 -175 158 194 -34 23 -15 -75 5 106 178
$$ packed form
2719b03K19k5Lj26N4po2J57j42L6R1J33P4p3l17J37J07j57K33j58m7R6k13J31
2743e9R6K1j08P5N9J14l01R8N5R6k80L38j41p3r8L18m11K12k01O2J26r6M6K08
2767A56j75j39J15j72M72k89J77l2m8p1R9j12k1j64K82J29j02l89M02j82J09j24
2789g9K03Q0l78K16j51K73j47r4J56L2J2o1K9L7l06k1M40l19m3N8K05J1j75j20
2813a42K07n4JJ44j34j02qo9J92M2k04J83m6j7J42K3o3p1J0nj6j13L21j13l3j58
2839h3J32P9k00k12L34J11l71J16K29l76L13Mk79N48m01M9o7N1m6k3J53k2L8j84
2863a07K71k05K6J71o7m5q5L5j19J66j87J86k71L32o2j74J86j39Pl7J59p6J09
2886G4k53K78p0j19J25n4j08O2Q0L0k44L01j72O1j66L33L6k28N7l8o0Q0J01P2
$$ plain form
2910 178 98 199 -94 -224 -135 -33 -9 33 -128 88 -136 -44 -127 -19 79 42 105 58 -80 98 -57 -37 226 137
2934 137 -69 66 -119 104 170 -231 -35 82 32 348 136 -181 117 -310 124 8 84 185 6 35 -237
2955 -237 -41 46 248 237 -4 170 -98 82 -34 -131 -87 93 130 -8 -61 101 66 158 53 -44 78 -22 132
2978 132 -124 -24 204 -15 19 -99 -47 111 17 242 18 -146 -30 -328 28 -1 -38 -56 27 67 96 92 102 57
3002 57 -133 -53 48 66 208 -30 59 139 97 -64 83 -11 -74 189 -85 98 228 -24 45 -73 18 28 41 -36
3026 -36 69 -36 77 -14 28 211 -77 -50 -56 -46 37 -44 62 114 -40 51 7 150 109 172 111 56 30 -25 5 75 105
3053 105 31 42 62 -158 9 79 -51 90 -122 -102 16 88 76 84 44 104 41 0 -36 6 27 -33 -131 83 -6 -76 -28
3080 -28 -38 -203 83 116 -104 197 231 109 114 -87 -128 82 228 -70 72 305 0 77 -122 84 -112 -101 -35
$$ packed form
2910A78q0J01k93j30Q9J02K4M2j61K16k24R2q3J08R8l7O3m7j38J78j55K0K63q9
2934A37k06J35j85K23O6m01J96J17n0L16k12l17K98m27M34j16P6J01j79K9k72
2955b37J96Q7K02j1k41J74k68J80j16r7M4J80L7j38n3J62l5R2j05r7J22j00J54
2978A32k56J00K28k19L4j18N2J58r4K25k24j64J16k98L56k9l7j8Q3M0K9mJ0m5
3002E7j90Q0J01J8J42k38Q9Q0m2j61J47r4o3K63k74J83J30k52O9j18R1J0J3p7
3026c6J05j05J13r1M2J83k88K7oJ0Q3q1J06N2j54R1m4J43m1O3o1n5k6n5L0P0L0
3053A05p4J1K0k20J67P0j30J41k12K0J18P2j2Qm0O0o3m1l6M2K1o0r8K14q9p0M8
3080b8j0j65K86L3k20L01L4j22Nk01m1K10J46k98J42K33l05P7j99K06j96J1O6
$$ plain form
3103 -35 4 76 -198 -227 -34 22 5 -23 11 -84 -5 -123 158 263 -66 -73 69 -48 63 122 45 5 -234 -205 76
3128 76 202 73 -78 104 120 -62 96 62 83 -256 188 -89 0 -68 -115 52 -9 19 -82 37 -75 52 -228
3151 -228 160 117 85 80 165 -49 -133 -6 -33 -81 -147 44 -24 35 -105 -51 -179 230 44 -112 -52 -265 231 -197
3175 -197 102 -152 -53 238 116 57 8 107 -42 -70 169 98 124 -90 -69 190 -73 59 104 -91 188 46 -15
3198 -15 -7 87 -4 -173 91 -46 130 -56 128 -52 -203 -146 -84 -137 116 -47 -205 -7 -198 71 81 136 -75
3221 -75 -97 -9 -92 -216 -36 -263 -169 42 42 -104 83 168 -55 -6 -172 150 17 -117 -94 207 139 -7 15 163
3245 163 109 66 -24 72 10 11 -29 201 23 130 -130 -33 -112 -128 -57 -168 145 -127 -127 164 -175 -82 19 -81 -140
3270 -140 249 -150 -46 -41 -16 -39 -277 20 -208 -173 -105 98 -105 -137 4 153 33 -60 11 -252 -23 122 61
$$ packed form
3103c5L9P2k74k9J93N6j7k8L4r5P9j18K81J05l29pJ42j17J11N9p7m0k39K9K81
3128G6J26j29j51J82J6j82J58l4K1l39M44k77Q9o8m7J67o1K8j01J19j12J27k80
3151b28L88m3l2nQ5k14q4J27k7m8o6J91o8N9j40N4j28M09j86j56O0k13M96m28
3175a97K99k54R9K91j22n9m9R9j49k8K39p1K6k14K1K59k63J32M5j95K79j42o1
3198a5QR4r1j69K64j37J76j86J84j80j51N7O2n3K53j63j58J98j91K69J0N5k11
3221g5k2Q8q3j24J80k27R4K11%j46J87Q5k23M9j66L22j33j34K3L01o8j46K2J48
3245A63n4m3r0R6o2Jm0K30j78J07k60R7p9j6P1j11L13k72%K91l39R3J01j00n9
3270a40L89l99J04NK5k3k38K97k28L5O8K03k03l2J41J49j20r3P1k63K29J45o1
$$ plain form
3293 61 -59 -15 -256 -43 -11 -173 -77 -72 -104 -11 67 -109 139 135 -95 270 68 21 -216 -49 44 -126 10 -92
3317 -92 -32 -204 4 111 109 -163 -72 6 -53 -31 46 11 -105 -59 52 -10 -17 122 216 -86 -34 -71 -47 4 -111 225
3343 225 -91 72 -122 -39 -97 -37 126 -80 52 -106 -83 -26 -129 -19 36 -114 -10 46 -37 -1 21 218 4
3366 4 -181 -37 -92 25 2 32 92 -41 -131 -96 -173 149 -151 -75 -165 -125 47 91 10 102 0 39 -179 96 43 5
3392 5 -107 -19 155 -137 -1 160 -25 36 -55 2 -29 -106 195 -46 191 255 -151 -203 169 109 103 -175 80 -29
3416 -29 61 122 32 -93 134 -11 -237 179 -119 120 -93 79 28 -185 -96 14 -108 129 -30 71 13 229
3438 229 92 177 -145 -43 59 -222 26 -25 13 10 -129 12 -280 51 16 -247 -20 25 -69 -210 79 175 65
3461 65 -63 224 65 -143 122 -69 224 318 -45 138 -29 45 -145 -60 -125 -99 -31 7 -117 92 -44 102 -59
$$ packed form
3293F1j20M4k41K13L2j62R6Nl2R3P8j76K48mk30L65k02m7k37J67R3j70J36j02
3317i2O0j72K08J07kk72R1P8n9K2P7l5j16M6J11o2pJ39R4l02N2l7K4N1j15L36
3343B25l16J63j94Q3n8O0J63k06J32j58K3N7j03J10N5j50J04N6q3L6K2J97k14
3366Dj85J44n5J17k3L0O0j33r0L5p7L22l00P6r0M0J72M4q1R2j02L9k18K75n3l8
3392Ej12Q8J74k92J36J61j85O1r1N7l1p7L01k41K37O4m06n2L72o0ok78K55j09
3416b9R0O1r0j25K27j45k26M16k98K39k13J72n1k13Q9J10j22K37j59J01n8K16
3438B29j37Q5l22J02J02k81K48n1L8lj39J41k92L31l5k63K27M5r4j41K89R6j10
3461F5j28K87j59k08K65j91K93R4l63J83j67P4j90Q5o5K6O8L8j24K09j36J46j61
$$ plain form
3484 -59 123 72 -197 55 42 -71 -58 50 -78 -112 27 64 60 37 -33 -79 -7 -192 -307 -127 79 -23 -64 -257
3508 -257 31 -60 -94 205 -210 90 88 -19 145 45 -146 -154 -65 -185 229 -8 -124 118 -101 121 30 -80 39
3531 39 -127 64 -23 104 75 -105 252 44 58 -88 -144 -2 -71 46 -92 -231 -54 -19 -18 83 -62 -187 44
3554 44 -120 -381 -115 13 47 73 44 -44 106 -25 9 35 171 -32 -109 64 -132 81 175 -179 19 -168 90
3577 90 -38 -124 -56 -75 111 -54 -292 53 -23 67 -30 120 261 27 40 47 205 -84 -168 -12 1 8 32 -80 -46
3602 -46 121 -15 -28 158 -64 67 -151 -11 -163 27 -302 -63 109 119 -63 -87 57 -72 1 35 -81 75
3624 75 -133 -50 31 200 130 -5 -26 3 -18 109 -79 -135 -153 27 -236 -56 3 -190 14 -3 118 62 42 -106
3648 -106 -207 -56 -174 -230 217 12 276 89 -77 -111 -145 -177 18 -64 39 108 63 39 -116 19 -38 79 34
$$ packed form
3484e9J82n1k69K52j3j13J3J08j28l4J39L7mk3p0m6P2j85j15J80K06j02m1j93
3508b57K88r1l4K99m15L00kj07J64j00j91qQ9j20M14k37j16K42k19K22r1j10J19
3531C9j66J91q7J27k9j80L57k08J4j46n6J42o9J17j38j39J77L5JJ01j45j25K31
3554D4j64k61K66J28L4K6k9q8J50j31L4K6J36k03p7J73j96K13R4l54J98j87K58
3577I0j28q6O8j9J86j65k38L45p6R0r7J50J41k34J3PJ58k89q4J56J3PK4j12L4
3602d6J67j36j3J86k22J31k18J40j52J90l29K39J72J0j82k4J44j29P3L4j16J56
3624G5k08Q3Q1J69p0j35k1K9k1J27j88n6j8J80k63J80N9j93K04j7J21n6k0j48
3648a06j01J51j18n6M47k05K64j87j66l4l4l2J95q2J03O9m5k4j55J35n7J17m5
$$ plain form
3671 34 168 74 -129 10 -78 29 -36 -76 -118 -240 69 -20 82 190 202 45 -46 -66 241 135 42 12 25 43 14
3696 14 -219 -100 -37 77 5 -103 82 -83 154 -47 7 66 -217 148 -67 -76 -171 -163 36 -142 -97 66 162 -113
3720 -113 0 -90 24 -7 59 -166 24 32 -169 100 -85 -72 -71 -66 -155 1 75 -177 155 35 125 185 33 26 -8 -29
3746 -29 -136 174 -185 -42 -61 -14 109 -61 -107 270 -197 -110 12 -259 58 56 43 -106 -4 -46 -165 105 -35
3769 -35 29 2 -21 -98 70 -298 13 53 8 -105 192 80 52 -181 10 190 -35 31 123 74 25 57 -228 -169 -75
3794 -75 -43 -69 -19 66 -39 15 -43 30 -117 34 -165 -80 110 -179 162 -13 -30 21 150 26 88 -34 -6 -184
3818 -184 -22 2 -166 -190 40 183 -85 159 40 143 -129 -75 48 136 -169 235 -25 167 16 -39 130 -63
3840 -63 40 152 -23 11 126 196 -279 -80 9 -72 135 61 -68 -78 174 63 -9 -98 37 -49 67 163 11 165
$$ packed form
3671C4J34r4k03J39q8J07o5m0m2j22L09q9J02J08J2j57r1k0L07j06r3l0J3J8k9
3696A4k33J19O3J14p2j08J85j65K37k01N4N9k83L65k15rr5QJ99j78M5J63R6k75
3720a13J13r0J14l1O6k25J90Qk01K69j85J3JNq9J56P4k52L32j20R0O0j52pl4k1
3746b9j07L10l59J43j9M7J23j70m6L77m67Q7J22k71L17kj3j49J02m2j19K70j40
3769c5O4k7k3p7J68l68L11M0m5j13K97j12k8k33J91J80k25O6R2m9m9L2k85N9R4
3794g5L2k6N0Q5j05N4n8P3j47J51j99Q5J90k89L41j75j7N1J29j24O2j22K8j78
3818a84J62K4j68k4K30J43k68K44j19J03k72N4J23Q8l05M04k60J92j51n5J69j93
3840f3J03J12j75L4J15P0m75J99Q9q1K07p4j29j0K52j11p2q9J35q6J16R6j52J54
$$ plain form
3864 165 -10 -47 19 87 67 138 -83 2 317 -21 -60 2 198 29 -43 -37 3 123 4 -56 63 86 -93 310 -1
3889 -1 131 -45 35 -41 21 136 69 343 -61 -226 178 -42 130 -178 -159 85 81 93 -108 51 -8 112 -22 -1
3913 -1 131 -26 218 -111 -19 145 8 11 109 39 64 -78 50 150 114 142 -65 272 200 34 84 47 -152 -81 190
3938 190 10 -117 -148 -34 -27 -293 -92 -116 -8 123 -103 -21 75 -148 -27 63 60 -156 13 131 -6 -234 82
3961 82 106 -114 129 41 177 -114 -150 -154 61 -92 101 -49 -58 137 -31 64 -176 33 37 208 83 27 -21 -37 -33
3986 -33 -32 -93 32 -39 -25 -228 -61 56 -238 2 -177 -68 -241 -3 -202 4 -9 -95 -145 42 -113 38 238
4009 238 -144 -16 90 -314 -136 88 48 -107 -26 120 -56 -91 66 -28 156 -184 -208 68 89 -198 36 -81
4031 -81 149 -91 -146 130 27 4 68 25 -22 -249 -172 92 90 125 71 97 -22 29 15 40 53 154 44 -108 -87 40
$$ packed form
3864A65j75l7O6O8k0P1k21Q5L15l38l9O2J96j69p2OM0J20j19o0J19K3j79M03l11
3889aJ32j76Q0p6O2J15o7K74m04j65M04k20J72l08J9K44mJ2k01J59n9J20j34K1
3913aJ32j57K44l29R2J64j37LR8p0K5j42J28J00l6K8k07L37p2j66N0l7j99P1K71
3938A90j80j27l1J14Pk66K01k4J08J31k26Q2R6k23J21R0lk16J69J18j37k28L16
3961H2K4k20K43q8J36k91l6mK15j53J93j50rJ95j68R5k40K09MJ71j25n6m8j6M
3986c3Jo1J25p1J4k03J67J17k94K40j79J09j73K38j99K06j3q6n0J87j55J51K00
4009B38l82J28J06m04J78K24m0j55Q1J46j76l5J57r4J84l40k4K76K1k87K34j17
4031h1K30k40n5K76j03k3O4m3m7k27P7K64kL5n4K6j19N1j4K5J3J01j10j52K1J27
$$ plain form
4057 40 -93 36 13 -30 -34 150 -33 9 81 127 201 -91 -55 75 0 67 -154 27 61 -72 -44 66 -108 34 105
4082 105 -119 -144 -138 89 -15 -79 -14 -62 -96 -47 -115 33 -229 208 119 29 -119 104 16 -68 53 -36 63 82 -45
4107 -45 148 -170 -37 -78 -57 78 60 17 -75 252 -258 -167 65 -35 -186 -16 165 -200 -72 -21 -55 -322 114
4130 114 19 167 -86 -64 60 -117 -96 -84 155 47 -175 27 59 100 -29 83 6 -106 59 -55 -148 -158 18
4153 18 -27 61 113 137 61 -68 -84 -27 -40 -106 -133 -132 38 138 -154 238 29 153 352 146 29 73 -69 278 -31
4178 -31 -150 -136 -71 68 -3 33 -162 18 3 -24 -277 -14 144 -12 116 65 77 10 129 185 14 -96 56 -152
4202 -152 -83 39 143 -301 -196 178 31 59 -68 76 -44 -17 2 -17 52 -39 -129 158 178 309 28 14 155
4225 155 250 164 -39 144 -42 -127 46 51 -116 89 -4 -46 -60 249 -117 -138 97 50 -155 86 -144 49 56 -167
$$ packed form
4057D0j33J29k3m3mJ84j83M2P2M6P4k92L6J30p5O7k21J81L4j33K8J10j74J42P1
4082A05k24k5OK27j04o4O5m8l4M9o8J48k62M37q9r0j48K23q8q4J21q9R9J9j27
4107d5J93l18J33m1K1J35j8m3r2L27n10R1K32j00j51J70J81l65J28N1l4k67M36
4130A14r5J48k53K2J24j77K1J2K39j08k22K02L2M1j29J12p7j12J65j14r3j0J76
4153A8m5Q8N2K4p6j29j6N7j3o6k7JJ70J00k92L92k09J24J99k06j17M4j42L47l09
4178c1j19J4O5J39p1L6j95J80j5k7k53K63J58j56J28n1J2o7J19N6j71j10J52k08
4202a52O9J22J04m44J05L74j47K8j27J44j20K7J9j9O9r1r0K87K0J31k81j4J41
4225A55R5q6k03J83j86q5J73Nj67K05r3m2j4L09l66k1K35m7k05K41k30J93Pk23
$$ plain form
4249 -167 -55 30 70 -199 32 -72 -32 7 51 -45 88 -94 98 161 -24 44 121 46 129 10 -117 31 -10 16
4273 16 51 -86 59 171 -21 -133 37 -233 -140 109 59 98 -11 -195 -169 -88 25 127 86 -28 72 -96 -40
4296 -40 31 87 152 -137 49 37 -168 -15 -41 -128 38 -169 62 16 -33 12 99 7 137 210 -210 -54 67 2 77
4321 77 -73 -39 182 66 106 32 -43 -150 167 83 119 -54 -27 36 103 68 -46 53 -10 -47 -35 228 10 -47 -93 117
4347 117 -5 -274 -104 15 -210 -90 38 160 -3 79 -40 -43 -50 -163 24 -38 24 17 -186 -12 141 180 -38
4370 -38 -22 258 116 -201 135 239 77 -56 54 -31 148 13 241 4 41 99 -104 115 -184 -22 33 -217
4392 -217 127 -126 62 134 -242 7 22 -15 -97 -35 -49 -13 22 103 68 101 123 -1 -79 -86 -33 -76 12 -118 -150 -41
4418 -41 -111 36 139 79 -238 -216 78 169 -47 25 79 25 123 268 -189 -15 70 29 13 44 -103 37 -183 99
$$ packed form
4249a67J12Q5M0k69K31j04M0L9M4r6J33j82J92O3j85O8P7p5Q3j19j27J48m1K6
4273A6L5j37J45J12j92j12J70k70R3K49n0L9j09j84K6Q1J13J02m1j14J00j68N6
4296d0P1N6O5k89J86j2k05J53k6q7J66k07K31m6m9M5Q7r2J30P3m20J56J21o5P5
4321G7j50L4K21j16M0p4p5j07L17q4L6j73K7O3O7l5j14R9o3l7J2K63k18n7m6K10
4347A17j22k69J70J19k25J20J28J22j63Q2j19lpj13J87o2O2pk03J74J53L9k18
4370c8J6K80j42l17L36J04j62j33J10q5J79j35K28k37L7N8k03K19k99J62N5k50
4392b17L44k53J88P2l76K49J5l7q2O2j4L6L5Q1l5L3K2j24p8pN3m3Q8j30l2J09
4418d1p0J47J03o0l17K2K94R1k16P2N4n4R8J45m57J74Q5m1j6L1j47J40k20K82
$$ plain form
4442 99 -64 -68 -24 53 -217 159 47 -4 237 -116 -75 -37 -50 86 24 10 -10 -73 -145 152 -131 -52 -166 -66 -47
4467 -47 81 90 82 187 155 14 10 -5 -25 27 28 127 28 108 41 -57 28 -36 103 1 217 87 25 272 84 -63 -195
4494 -195 -313 99 -114 50 -10 -49 -219 79 -60 131 197 74 114 18 89 -49 -207 -68 -81 -48 65 -364 79
4517 79 -212 5 125 -156 36 -88 -137 -42 2 107 192 -58 65 -86 -100 278 73 -88 71 65 4 -23 -130
4540 -130 -50 -177 -28 -17 -32 -148 -148 -195 1 54 58 24 -125 97 20 -45 153 -1 186 50 -126 50 134 90 117
4565 117 27 36 314 -28 -25 -33 -101 40 11 -142 106 21 148 78 -138 -51 -40 102 -59 21 -49 13 40 110 -25 -48
4591 -48 -175 82 -27 106 60 -170 100 146 -132 14 32 -167 -17 -164 179 93 -230 11 128 162 -82 71
4613 71 45 -113 33 152 154 23 -54 -15 145 64 27 90 -1 114 -252 86 146 -135 28 2 -10 -12 -51 -108 -86 53
$$ packed form
4442I9j63mM4P7k70L76j12n1K41l53M1L8j3J36o2j4k0o3p2K97k83P9j14J00J9
4467d7J28RqJ05l2j41mj5k0N2JR9r9Q0o7r8Q5o4J39j02K16j30o2K47j88j47j32
4494a95j18M12k13J64o0l9j70K98j39J91O6j23M0r6P1j38j58J39j3L3J13m29M43
4517G9k91K17J20k81J92j24m9R5M4J05Q5k50J23j51j4L78k05j61J59oo1k7j07
4540a30Q0j27J49J1j5j16%m7J96N3Ml4j49K22p7o5J98j54J87j36j76J76Q4m4K7
4565A17r0RK78l42Lqo8J41k9j53K48q5J27p0k16Q7J1J42j61Q0p0O2K7P0j35k3
4591d8j27K57j09J33m6k30K70M6k78J46J8j99J50j47L43q6l23K41J17L4k44J53
4613G1k6j58J46J19Kj31p7L9J60q1l7O3r1J15l66L38O0k81J63k6j2kl9n7K2J39
$$ plain form
4639 53 184 -46 -144 -8 103 -75 73 22 -213 -111 -101 106 -112 104 132 5 194 -163 27 -173 57 -58
4661 -58 -53 328 -44 -12 39 -36 68 83 49 -2 80 77 -33 192 -17 93 -24 11 119 -58 -179 6 -42 13 -14
4686 -14 9 144 183 -93 155 -20 172 117 43 56 -190 -100 -134 17 55 -59 -27 26 124 36 -6 283 63 -186 184
4711 184 -56 -52 -64 -195 181 223 -86 144 100 0 189 5 -69 -179 -67 63 66 -19 233 95 50 -34 -121 -13
4735 -13 -128 27 124 89 157 -68 125 48 -106 27 50 28 36 -168 51 -129 64 -21 -26 35 33 99 17 -239 -92 29
4761 29 -215 -39 -112 60 165 -113 37 19 -129 173 85 164 204 -83 18 -130 160 148 186 49 -55 70 66
4784 66 -88 -111 162 -17 52 20 -11 -44 -208 15 -67 -4 -198 -44 44 43 36 -156 -38 -84 -63 221 85 92 102 -103
4810 -103 9 -18 38 58 -102 -155 184 -170 -39 21 -30 42 -130 138 -118 96 -32 10 -71 -195 -103 -13 -129 -85
$$ packed form
4639E3J31k30r8J36J11j78J48n1k35J02J0K07k18K16K8j27J89l57J90k00K30j15
4661e8NL81l72L2N1p5J04J5l4n1Q2lj10K25k09J10j17L5J08j77j21J85m8N5k7
4686a4K3J35L9k76K48j75J92n5p4J3k46R0l4J51L8j14L2N3R8q8m2K89k20k49L70
4711A84k40Mj2j31L76M2l09K30m4j00J89j84p4j10J12J30Lq5K52j38m5q4q7J08
4735a3j15J55R7l5O8k25J93p7j54J33K3k2Qk04K19j80J93q5nO1kO6q2k56J47J21
4761B9k44J76p3J72J05k78J50j8j48L02q8P9M0k87J01j48K90j2L8j37j04J25m
4784F6j54k3K73j79O9l2l1l3j64K23q2O3j94J54Q8jpj92J18m6K1K84j36PJ0k05
4810a03J12k7N6K0j60n3L39l54J31O0n1P2j72K68k56K14j28M2q1j24R2R0j16M4
$$ plain form
4834 -85 -36 29 0 -160 118 -22 63 -100 -84 181 69 -58 -11 -278 7 -4 97 11 30 -2 -140 97 35 -5
4858 -5 -170 29 -131 -195 85 -59 44 2 -108 -119 47 91 -56 86 80 25 -165 6 -310 -156 -142 17 54 -81
4882 -81 77 12 -85 26 9 6 26 -101 -38 159 -42 137 -89 52 58 17 136 -100 -22 -203 124 266 -29 206
4906 206 -13 -166 86 61 -107 47 99 114 -143 -17 65 -58 74 -92 119 38 203 30 5 -301 55 18
4928 18 -90 -147 85 -64 -55 -51 -51 53 -5 -26 34 23 -29 -69 -164 42 135 -71 -119 3 234 90 -14 22 -98 84
4954 84 -98 122 124 29 21 -201 55 110 133 14 -119 -219 -4 -115 44 -255 88 -72 -228 3 -70 -15 -199
4977 -199 -8 9 -144 79 268 -14 238 136 -8 -43 141 -112 -29 99 -153 -137 -237 56 53 -196 62 1
4999 1 -15 -76 -34 38 109 -173 10 53 146 -233 -130 56 -48 95 79 29 -40 173 -149 153 2 115 -239 257
$$ packed form
4834h5M9O5k9j60K78j40Q5j63J6K65j12j27M7k67K85j1J01q6J9l2j38K37o2m0
4858ej65J99j60o4K80j44J03m2j10j1J66M4j47J42on5j90J71l16J54J4J59L7j35
4882h1J58o5r7J11j7lK0j27O3J97k01J79k26J41Om1J19k36P8j81L27J42k95K35
4906B06k19j53K52k5j68J54N2J5k57J26Q2j23J32j66K11q1J65j73k5l06L56l7
4928A8j08n7K32j49RM%J04n8k1O0j1n2m0r5K06R3k06m8J22K31j44j04L6j20J82
4954H4j82K20Kr5qk22K56N5K3j19j33j00K15j11J59k99L43j60j56K31p3N5j84
4977a99J91J7j53K23J89k82K52j02j44l5J84k53Q3J28k52J6j00K93lk49K58o1
4999Aj6o1M2P2P1k82J83M3R3l79J03J86j04J43j6n0o9K13l22L02j51J13l54M96
$$ plain form
5023 257 174 8 23 -23 -62 -16 0 -186 57 209 157 -117 47 21 -3 109 -165 -33 103 83 137 81 -152 46
5047 46 66 -42 -108 7 -134 -66 -299 -157 -30 109 -11 119 84 74 157 -31 9 136 -95 -121 -232 49 -131
5070 -131 -97 99 -19 18 133 166 -79 168 22 96 48 -25 39 -16 -189 19 -45 -44 63 -141 -174 -151 8 -74 -26
5095 -26 -156 12 -64 43 -136 -32 -10 232 -74 52 -1 219 -50 -39 253 -55 -79 48 -57 -35 -20 -37 -11
5118 -11 -200 -69 -88 168 -66 -316 -261 -34 -75 -81 -106 105 4 -87 -127 -160 8 106 85 65 -37 76 -114 -169 152
5143 152 139 -27 -180 -10 231 328 74 -110 70 145 -42 87 4 -85 -165 -85 -10 24 144 -4 46 -93 62
5166 62 -81 -222 97 -11 -19 101 -155 56 -32 -116 57 -65 -147 56 -39 -101 -120 33 -158 -150 51 -2 6 36 -191
5191 -191 -50 -24 14 -115 91 85 124 -114 274 -14 34 -84 87 159 78 127 -37 50 -31 79 299 -65 -144 -147 -160
$$ packed form
5023B57q3j66J5m6l9M6J6j86K43J52n2k74J64k6k4J12k74J32J36k0N4n6k33J98
5047D6K0j08o6J15j41O8k33J42J27J39j20J30l5j0Q3j88M0J27k31k6j11K81j80
5070a31L4J96j18L7J15L3k45K47j46P4m8p3O4n5j73K08o4JJ07k04l3K3J59q2M8
5095b6j30J68p6J07j79J04K2K42l06J26n3K20k69J1K92l08k4J27j05K2J5j7K6
5118a1j89J31j9K56k34k50N5K27m1ok5K11j01r1m0l3J68R8k1k0j02J13j90n5L21
5143A52j3j66j53J70K41R7k54j84J80P5j87J29q3q9q0Q0P5L4J20j48N0j39J55
5166F2j43j41L19j08qJ20k56K11q8q4J73j22q2K03r5o2j9J53j91QK01n3QL0k27
5191a91J41K6L8j29K06oL9k38L88k88M8j18J71P2q1M9j64Q7q1J10K20l64p9lj3
$$ plain form
5216 -160 85 -57 119 45 -78 -212 -96 -257 -106 4 -62 18 -221 43 -66 27 -64 58 -50 16 109 1
5238 1 36 40 81 2 129 93 -122 88 -3 0 153 -43 176 219 -79 -60 90 -52 -9 47 -155 39 -129 231 274
5263 274 62 73 -116 -88 -39 -44 85 -27 208 33 178 -122 202 133 195 -11 97 -113 19 44 -67 21 83
5286 83 162 -162 81 47 22 -149 -215 126 267 36 -28 -56 -54 -28 -76 22 125 67 119 -62 173 -123 -32 -76 134
5311 134 127 55 288 116 119 -52 40 -126 5 -84 192 37 -12 102 73 -3 -146 -84 -9 166 -87 126 114 75 100
5336 100 -48 144 321 249 -30 -185 -68 137 -3 -209 -20 48 -27 -153 191 -72 -121 -154 132 -71 24 -19
5358 -19 -49 -70 -104 17 -36 197 -65 133 -45 62 77 59 70 -164 -209 166 -19 -76 -74 -39 68 79 43 -35 64 260
5384 260 166 -130 -54 -34 -247 -53 -148 2 -188 17 -10 149 57 -252 -94 65 -19 86 67 34 104 31 173 -34
$$ packed form
5216a60K45j42J76p4j23j34J16j61J51J10o6Q0k39K64j09R3r1J22j08O6R3j08
5238AL5MM1p9J27l6k15K10r1LJ53j96K19M3k98J9J50j42M3N6k02J94j68L60M3
5263B74k12J1j89K8M9nJ29j12K35j75J45l00L24o9O2k06J08k10J32K5j11Q8O2
5286H3P9l24K43l4k5j71o6L41J41k31o4k8KK6m8R8J03n8N2j81K35k96R1m4K10
5311A34pp2K33j72Lj71R2j66J31q9K76j55m9J14k9p6j43O2P5J75k53K13j2l9K5
5336A00j48J92J77p2k79j55J17K05j40k06J89O8p5j26L44k63m9l3K86k03R5m3
5358a9l0k1l4J21n3K33k62J98j78J07J5j8J1k34m5L75j85n7KL5J07J1l6p8R9J96
5384B60r4k96P6K0k13J94r5J50j90K05k7J59r2l09J58J59q4J05j9l3P0p3J42k07
$$ plain form
5408 -34 35 132 75 -64 -51 92 -107 -86 -94 98 50 -6 112 -16 -120 15 79 -159 -180 -227 25 62 -60 13 -7
5433 -7 34 -199 13 -202 -174 178 44 29 -64 -37 -25 163 -69 -5 -40 -181 28 -43 33 209 113 -123 -20 47 -37
5458 -37 180 128 -46 -87 -50 35 -144 4 -178 3 18 -41 -179 164 40 4 -123 83 -16 -85 83 -124 -118 144
5482 144 -198 86 103 -39 63 -107 129 -20 -59 24 -42 -168 126 175 55 -91 -120 -140 -37 115 -188 12
5504 12 146 -115 -23 -177 -56 -23 -16 -63 -61 123 -33 91 80 -255 -240 97 -81 66 -76 55 117 114 37 -19 126
5529 126 102 47 -3 2 -11 -74 111 -198 120 -47 -44 43 -171 103 -67 4 54 116 -17 -94 -147 -86 5 -89 -33 -46 -116
5556 -116 83 42 -112 1 -8 -249 -190 -22 -15 83 94 239 15 -83 -79 116 4 -116 190 -32 176 55 116 50
5580 50 112 -14 -26 81 8 134 95 112 150 17 82 182 62 111 -79 93 26 -1 104 61 29 100 186 -47 101
$$ packed form
5408c4O9R7n7j39J3J43j99K1qJ92m8n6J18j28j04J35O4k38k1m7K52L7j22P3k0
5433gM1k33K12k15K8L52j34j5r3K7J2J88k32O4l5j41K09p1P6J76r6k36J03O7q4
5458c7K17n2j74m1L7Q5j79J48j82J81J5n9j38L43j24l6j27K06r9o9J68k07OK62
5482A44l42K84J7j42J02j70K36j49l9Q3o6j26K94M9j20j46k9k0J03J52l03K00
5504A2J34k61R2j54J21L3Pm7KJ84j56J24j1l35J5L37j78J47j42J31O2lp7n6J45
5529A26k4n5n0Nj3o3J85l09L18j67LQ7k14K74j70P1N0O2j33p7n3O1R1r4N6j3p0
5556a16J99m1j54J13rk41N9J68PR8J1J45k24r8MJ95j12j20L06k22K08j21O1o6
5580E0O2j26j2J07p3J26l9J7L8j33O5J00j20M9j90J72o7k7J05m3l2P1Q6k33J48
$$ plain form
5605 101 40 -43 161 196 -158 8 40 45 104 27 57 -34 27 -133 94 147 -11 119 55 -78 -20 -85 -47 40 57 -8
5631 -8 57 -172 -133 47 -80 -25 15 -136 30 48 -7 -7 59 -28 116 -60 133 37 -67 21 72 -281 26 -59 -2 74
5657 74 4 137 -106 -19 153 22 129 15 -103 90 294 101 98 -9 -66 -39 71 -189 275 111 33 27 -27 4
5681 4 39 41 -167 -180 118 -142 -31 120 -59 52 -59 27 -71 -72 9 -236 8 6 14 252 -52 34 -114 120 111 6
5707 6 14 -150 -296 -46 56 38 290 261 -4 33 55 224 -70 -114 74 59 14 -115 -96 123 117 -179 -100 -100 -153 96
5733 96 33 -16 -82 -27 135 171 80 70 31 -2 91 -5 55 -98 199 -141 74 30 120 48 116 100 -23 68 106 56 -115
5760 -115 175 13 74 -153 -1 -35 -96 -39 -45 228 52 -196 40 -76 -107 -20 75 94 8 46 99 180 -1 76 -18
5785 -18 2 84 55 73 8 51 21 88 69 136 114 43 71 -233 -58 199 123 27 -43 -91 2 36 -6 -125 156 -128 -21
$$ packed form
5605A01o1q3K04L5l54J66L2NN9p7L0r1O1j60K27N3j58J30o4j33N8o5L8Q7J7o5
5631hO5k29L9J80j27N5M0j51J66J8n5%O6q7J44j76J93r6j04Q8N1l53L07q5N7P6
5657G4p0J33k43Q7J72j31J07j14j18J93K04j93lj07n7K7J10k60M64j64p8on4L1
5681DL5Kk08j3K98k60J11J51j79J11j11Q6r8jQ1k45K44kQK38l04Q6j48K34rj05
5707FQj64j46K50J02j8K52k9k65L7K2J69k94m4J88j5m5j29J9K19ok96P9%n3K49
5733I6o3m9o6N5J62L6r1j0l9l3R3r6O0j53K97l40K15m4R0p2O8j6j23R1L8n0j71
5760a15K90j62O1k27J52l4o1N7oK73j76k48K36j16l1Q7R5J9q6L8N3Q1j81P7r4
5785a8K0Q2k9J8o5M3l0O7j9O7k2p1K8l04J75K57p6r6p0m8R3L4m2j19K81k84J07
$$ plain form
5812 -21 -49 -135 -11 100 44 -60 10 -74 4 25 -185 75 116 -19 -39 -75 -61 -96 181 15 -162 212 -80 60
5836 60 -186 170 272 -143 109 52 -78 -198 -51 7 -141 156 16 152 -294 -135 113 -73 -190 78 82 -105
5858 -105 -50 -144 -24 11 -15 3 -117 -155 -85 13 -36 -1 -225 109 102 -31 -14 163 131 25 126 112 -65 -116 40
5883 40 67 131 120 18 33 12 -143 -148 -85 139 -46 -91 -107 60 -6 -36 15 -99 -36 145 89 -229 20 -276 -132
5908 -132 -16 -107 -73 182 49 -121 -18 -87 75 -23 145 116 44 60 22 -195 151 97 -49 134 119 -171 -29
5931 -29 -50 91 -12 38 -61 -74 11 218 48 -174 99 78 -267 -21 -50 -23 -157 138 117 -89 53 -101 -37 -29
5955 -29 -133 -46 70 132 72 -95 -61 54 -125 -259 -101 260 185 -49 34 -48 -65 -7 -25 50 -37 204 -35 -245
5979 -245 -28 -254 -105 -13 -231 -87 -66 46 9 73 158 144 -38 219 -41 29 19 52 123 109 134 -19 176 13
$$ packed form
5812b1k8q6J24J11n6j04P0q4P8K1k10K60M1j35k0l6J4l5K77j66j77L74k92J40
5836F0k46L56J02m15K52n7j30j20J47N8j48K97j40J36m46J59K48j86j17K68Mj87
5858a05N5r4J20L5k6J8j20l8P0R8m9L5k24L34pj33J7J77l2j06J01j4j77n1J56
5883D0K7O4j1j02J5k1j55nO3K24j85m5j6J67o6l0N1j14O3J81n6l18K49k96J44
5908a32J16r1L4K55j33j70J03o9J62r8J68k9p2J6l8k17L46n4j46J83j5k90J42
5931b9k1J41j03N0r9j3Q5K07j70k22K73k1l45K46k9K7j34K95k1k06J42j54O4Q
5955b9j04Q7J16O2o0j67L4J15j79j34J58L61p5k34Q3q2j7N8j8P5q7K41k39k10
5979b45K17k26J49R2k18J44K1J12l7O4Q5j4j82K57k60P0j0L3P1j4K5j53J95j63
$$ plain form
6003 13 -69 59 -100 6 1 146 50 42 154 -119 -81 30 54 -84 141 -150 58 32 -79 -21 28 -109 26 25 290
6028 290 -224 -30 -48 -4 -127 -74 -87 -70 83 -6 -74 -61 25 22 118 -33 12 -130 125 157 122 -146 -174 -42 53 202
6054 202 -136 -40 -58 17 84 98 152 -114 -82 55 150 69 -215 -25 -161 108 -92 -104 228 -19 -46 214 311 -49
6078 -49 -130 70 -78 -26 -22 1 60 115 66 -234 -119 60 94 71 -156 46 -112 50 -14 77 109 4 32 -24 -50 -45
6104 -45 -17 88 -161 224 196 -191 68 -15 99 91 136 98 -15 145 -159 15 116 13 15 40 31 5 -46 -119 -45 156
6130 156 13 -68 16 153 -10 41 -84 -61 125 -114 36 117 84 152 -166 -213 68 12 22 -45 -158 -26 -98 -160
6154 -160 22 7 63 -61 -138 -56 142 151 -12 -66 -108 48 70 285 96 -17 103 47 143 -28 -169 122 -30 105
6178 105 35 64 0 7 97 -115 164 129 86 -71 -105 -107 -44 -27 70 -8 86 59 16 -65 126 165 156 32 95 -79 -15 412
$$ packed form
6003A3q2J28j59J06nJ45r6qJ12k73L8J11K4j38K25k91K08k6j11N8M9j37J35jK65
6028B90n14J94j8M4j23N3j3J7J53q9o8J3Q6lR6j51M5j42K55L2l5k68k8J32R5J49
6054B02l38R6j8P5O7J4N4k66L2J37R5q1k84J90j36K69k00j2L32k47k7K60R7l60
6078d9q1K00j48N2MK3N9N5m9l00J15J79L4k3k27K02j58J62o4R1L2j05K8n6k6N
6104d5K8J05k49L85k8l87K59q3J14qM5l8j13J60l04J74J01j03KK5rk6n1p3P4K01
6130A56j43q1Q4J37j63N1j25K3J86k39J50Q1l3O8l18m7K81n6J0o7j13J32p2o2
6154a60J82j5N6j24p7Q2J98Rj63n4m2J56K2K15j89j13J20n6R6j71j41K91j52J35
6178A05p0K9o4PR0k12K79l5m3j57l4kO3J7R7p8R4k7m3q1J91L9rj24O3j74O4M27
$$ plain form
6206 412 -68 -151 -94 21 22 5 68 -21 84 -108 -129 31 11 -22 72 -71 -58 232 32 -102 -24 35 -63 13 48 43
6232 43 -91 176 91 -105 34 33 22 -84 23 -38 -179 -104 162 63 -67 139 0 113 -48 -156 37 65 28
6255 28 3 101 -19 155 -50 74 -190 80 103 42 231 -33 85 59 -76 70 -91 34 242 -137 197 3
6277 3 -23 -21 179 106 48 152 -92 75 22 211 29 -136 -109 -13 184 -139 154 -28 30 102 -43 41 2 -65 -69 -212
6303 -212 -153 60 228 -136 128 77 -49 15 68 -83 15 -122 -14 -117 -122 85 -82 29 52 91 85 4 -10 213
6327 213 -176 -6 217 -77 -88 -1 -56 -40 -417 82 -113 -45 85 241 -186 103 -121 136 31 64 131 -43
6349 -43 -173 63 -107 175 -85 -40 306 10 -138 -36 -21 207 143 74 22 -15 -237 -54 367 3 -24 -84 -97
6372 -97 -95 -11 18 65 228 -26 -233 24 -23 93 90 -59 -31 -164 -131 -118 120 72 -27 -74 -4 20 2 26 -268 86
$$ packed form
6206D12m80q3N7J15Jj7O3q9J05j92k1J60k0l3R4j43J3K90k00j34P8N9r8P6L5n
6232D3j34K67q5j96J39jj1j06J07o1j41P5K66r9j30K06j39J13j61j08J93K8l7
6255B8k5R8j20J74k05J24k64K70K3o1J89k64J18k6j35J46j61J25K08l79L34j94
6277Ck6KK00p3n8J04k44J67n3J89j82j65K7R6J97l23K93j82N8P2j45Q4l9o7mj43
6303b12N9K13J68l64K64n1j26O4N3j51R8j37J08j03nK07j67J11K3L9oq1j4K23
6327B13l89J70K23k94j1Q7n5J6l77M99j95O8J30J56m27K89k24K57j05L3O7j74
6349d3j30K36j70K82k60M5L46k96j48J02J5K28o4o9n2l7k22J83M21l64k7o0j3
6372i7KQ4K9M7J63k54k07K57m7J16lj49K8j33L3J3K38m8r9m7P0K4j8K4k94L54
$$ plain form
6398 86 -26 41 84 -208 -57 -33 75 8 35 169 227 29 -37 39 -22 194 25 41 -174 29 114 44 -43 -69 5
6423 5 -13 116 127 -126 175 20 204 -83 -33 164 277 22 -124 -3 141 61 105 42 209 -139 -21 -43 -113
6446 -113 -59 21 202 -6 -1 167 -173 -99 -10 144 78 -3 64 56 -120 -36 -37 122 19 38 9 35 123 7 85 73 165
6473 165 4 75 25 -74 64 3 -106 -11 19 45 129 -75 -125 34 84 -21 124 -55 54 202 -224 104 132 -9
6497 -9 32 97 -80 -150 -64 -53 21 -178 -48 -152 28 -134 175 95 26 249 -129 -85 63 -21 359 153 39 209
6521 209 -9 135 162 -142 -215 119 -147 -71 111 50 13 -76 -31 170 -105 213 7 72 -68 170 -36 49 56 73
6545 73 -60 -109 89 109 -199 262 63 54 105 -184 121 -13 -232 -118 39 103 79 -28 -87 -21 -11 15 -77 32
6569 32 78 -52 -70 -137 -10 32 -133 -24 -68 -84 -96 -91 -26 -30 -36 193 128 70 -106 -7 104 263 12 -74 73 -75
$$ packed form
6398H6j12O7M3k92J51K4J08o7K7J34N8j98o6P6o1K16j69J6k15K03Q5p0q7k6P4
6423Ej8J29J1k53L01j55J84k87N0J97J13k55j46J21J44q0M4o3J67l48J18k2p0
6446a13N4Q0J81k08NJ68l40P4Q9J54o6q1O7qj76Q4jJ59j03J9k9K6Q8j16P8j2R2
6473A65j61P1n0r9J38o1j09R5L0K6Q4k04n0J59N0j05J45j79J09J48m26L28K8j41
6497iM1O5j77p0Q6J1P4j99J30j04J80j62L09q0o9K23l78M4J48q4L80k06j14J70
6521B09k18J44K7l04p3L34k66P6J82o1l7q9M5K01k75L18k06O5j40K38k06Q5PJ7
6545G3j33m9J98K0l08M61j99rN1k89L05j34k19J14J57O4k4j07n9O6J0K6r2J09
6569C2M6j30j8o7J27M2j65J09m4j6j2NO5moK29o5n8j76R9J11J59k51q6J47j48
$$ plain form
6595 -75 -40 68 33 -51 89 -20 118 -213 -112 -114 -128 43 138 -18 62 -110 12 -63 -2 18 -143 130 12 -197
6619 -197 169 -138 36 37 25 153 12 124 -74 38 90 143 192 -75 84 -76 -3 143 35 -179 -54 -83 -139
6642 -139 -279 -39 56 -108 -27 148 -4 194 65 -11 -206 2 133 165 -86 -200 82 -15 -11 -7 -99 -128 175 9
6666 9 -24 -104 135 -101 -97 -210 -140 78 -132 242 34 -24 75 31 -116 -20 178 14 -83 131 15 48 -6 135 -45
6691 -45 -90 -29 62 32 -19 165 39 82 -75 72 -227 -49 52 -121 -103 -20 176 92 -4 -238 74 38 79 -123
6715 -123 68 218 -75 8 133 125 -97 -35 -49 62 52 -37 36 32 122 119 5 161 32 118 -130 120 34 -125 80
6740 80 -43 120 -51 -14 145 130 -105 20 34 428 72 7 140 -92 45 12 322 -6 -41 -18 110 47 86
6763 86 -34 -9 36 38 16 44 126 150 -8 30 -64 59 2 -130 -2 19 -100 -282 -66 -65 -9 20 -192 -271 123 59
$$ packed form
6595g5L5J08l5q4J40j09J38l31J01kj4J71R5j56Q0j72J22p5O1K0j61K73j18k09
6619a97L66l07J74Jj2J28j41J12j98J12N2N3M9k67J59j60P3J46j08k14J25k9n6
6642a39j40K40R5j64Q1J75j52J98j29p6j95K08J31L2k51j14K82r7MMr2k9L03j66
6666Il3q0K39k36Mj13P0K18k10L74k08n8R9m4j47R6J98j64r7K14j16L3n4J41j80
6691d5m5O1R1l0n1J84j26M3j57J47k99J78J01j73J8Q3J96q4r6k34L12l6M1k02
6715a23J91J50k93Q3J25qk22O2j4J11j0q9P3mR0lj14J56j29Q6k48K50q6j59K05
6740H0j23J63j71L7J59j5k35J25J4L94l56o5J33k32J37l3L10l28l5K3J28o3L9
6763H6j20K5M5Kk2K8Q2K4j58L8r4J23n7j32J28K1j19j82K16JN6K9k12p9L94o4
$$ plain form
6789 59 -90 -166 -61 -97 -30 154 37 -109 141 -31 78 162 11 190 206 2 93 -52 39 -74 -35 -59 -20 -21
6813 -21 36 -24 84 -1 48 -88 -105 -144 7 -113 66 -123 40 -5 -22 -16 -39 148 49 60 102 -101 -250 -71 180
6838 180 104 7 211 -102 78 -95 88 -57 25 39 -118 -31 -113 -43 75 -12 -127 -124 136 158 130 -8 -403 -53
6862 -53 136 7 -194 -82 9 -3 21 -38 -33 69 -63 18 44 -99 110 38 30 253 -36 -16 -92 52 72 97 -17
6887 -17 -42 -55 78 217 24 30 -129 -197 -27 145 109 29 -35 -112 -75 81 -107 156 46 -89 -125 169 -138 -239
6911 -239 -107 -75 27 38 130 148 -6 46 117 193 -19 -45 127 -18 15 52 120 128 -209 -100 61 -7 -85 107 201
6936 201 -112 151 109 -40 -112 76 -271 -14 114 68 118 -39 -140 -158 -82 64 -145 -1 146 -22 314 -2
6958 -2 13 47 -109 -210 -36 104 -466 -77 -153 -101 14 166 148 152 121 43 -72 59 -63 -231 -37 -90 -9 -57 -71
$$ packed form
6789E9j49p6J05l6O7J84j17j46K50j72J09Q4j51J79J6k04R1j45R1j13L9k4L9j
6813b1N7o0J08q5M9j36j7l9J51j20J79j89J63m5j7Ok3J87r9J1M2k03j49J79K51
6838A80p6r7K04l13J80j73J83j45Q2J4j57Q7q2P0J18q7j15LK60K2k8j38l95L50
6862e3J89j29k01J12R1j2K4n9NJ02j32Q1K6j43K09p2qK23k89K0p6J44K0K5j14
6887a7k5j3J33J39j93Oj59o8J70J72l6q0o4p7L7J56j88K63j10j35l6K94l07j01
6911b39J32L2J02J1R2J8j54N2P1P6k12k6J72j45L3L7O8Ql37J09J61o8p8J92R4
6936B01l13K63m2j49p2J88l47K57J28m6N0j57j01j8P6J46k09J44J47j68L36l16
6958bJ5L4j56j01J74J40n70L89p6N2J15J52j8Ml1p8j15J31j22j68J94n3Q1m8j4
$$ plain form
6983 -71 -150 61 233 176 -128 37 31 60 -33 -18 -90 -213 32 -3 57 12 -47 77 41 42 -113 -34 -157 -104 129 54
7009 54 130 -177 -186 -8 -46 -133 -50 -206 36 -130 12 66 82 22 7 -125 -41 137 13 193 168 200 -103 -64 -68 33
7035 33 268 115 -17 49 -70 -3 5 -200 -135 97 -17 94 -166 -139 -28 -63 72 99 63 65 38 -44 55 -118 -81
7060 -81 19 -105 45 -175 -80 -39 -33 -76 -220 -168 -50 -112 -45 -10 -110 -112 11 35 -124 36 -28 79 -73 110 35
7085 35 143 -18 -152 -78 110 57 -243 11 290 130 26 -22 21 180 102 -78 21 58 -61 100 123 176 31
7108 31 -82 -118 122 70 60 4 201 -12 -253 -129 49 19 -1 162 -49 -173 62 125 -187 41 -75 -50 79
7131 79 119 -3 -195 -63 62 4 12 4 198 -52 -31 123 -53 -236 87 76 -104 -22 -82 -86 101 41 16 -41 38 -112
7157 -112 -109 -146 106 -113 32 -92 40 -92 -216 44 2 159 -104 191 -39 76 -7 47 -57 125 -92 -173
$$ packed form
6983g1p9K11J72n7l04J65oK9r3J5p2j23K45l5O0m5n9J24l6Jj55P9j23N3K33p5
7009E4P6l07rJ78l8q7Q3j56K42j66J42N4J6o0j5j32Q4J78j24J80k5L2l03L9mJ01
7035C3K35j53j32O6j19O7Qk05O5K32j14J11k60K7J11l5J35K7l6Kk7q2R9j73L7
7060h1J00j24J50k20R5M1Om3j44N2J18o2O7L5j00kJ23K4j59J60o4J07j52J83p5
7085C5J08j61j34P4J88n3l00K54K79j60j04m8M3J59p8j80R9L7j19J61K3N3j45
7108C1j13l6K40n2j0n6J97k13k41J24J78l0k0J63k11j24K35O3l12K28j16K5J29
7131G9M0j22j92J32J25n8QqJ94k50K1J54j76j83L23j1j80Q2o0mJ87o0k5n7P9j50
7157a12Ll7K52k19J45j24J32j32j24K60m2J57k63K95k30J15q3N4j04J82k17q1
$$ plain form
7179 -173 -72 -69 92 -147 109 18 154 -41 -168 -119 153 50 -117 -93 -366 -209 -165 105 228 -160 -48 -81
7201 -81 127 68 -108 15 -38 15 -25 -117 -154 -19 -99 -10 -21 -26 -24 94 -6 -95 50 208 128 111 140 -90 50 -103
7227 -103 132 141 8 -82 9 -9 -43 -77 7 55 2 13 -103 -204 -145 83 -60 -63 -147 51 76 -190 -85 158 30
7252 30 -240 -126 137 122 63 -32 -159 141 -185 92 71 9 -44 -190 -130 6 85 -11 -75 -7 77 23 121 -31 45
7277 45 -115 170 122 -207 245 -5 -42 -348 -118 122 87 0 -164 69 -62 -106 -78 -10 28 63 -46 45 46 115 83
7302 83 -14 69 139 -197 -162 32 49 -179 68 244 -63 94 24 -160 153 178 -143 -11 91 -77 -117 27 -16
7325 -16 49 83 23 61 150 18 41 101 -22 55 258 37 31 -29 48 154 87 1 18 65 58 -56 -188 144 65 -58 -75
7352 -75 -7 -6 169 94 95 -67 215 -115 -18 31 -95 1 -128 -45 20 -325 132 -99 -131 193 -98 -102 56 -92 54
$$ packed form
7179a73J01LJ61k39K56r1J36j95j27M9K72j03j67K4k73J57M4K70J23l88J12l3
7201h1K08n9j76J23n3N3m0r2l7J35q0Q9j1nKJ18j00q9J45J58q0j7K9k30J40j53
7227a03K35Rj33r0R1j8l4l4Q4M8n3J1j16j01N9K28j43lq4J98K5k66J05K43j28
7252C0k70J14K63j5n9r5j27L00l26K77k1o2n3j46O0J36P9r6o4O8Q4n4R8j52P6
7277D5j60K85m8l29M52k50l7l06K30K40l5q7j64K33j31m4K8O8L8L5j09R1JO9l2
7302H3r7Q3P0l36L5J94J7k28K47J76l07J57p0j84L13K5l21J32J02j68m0J44m3
7325a6O5L4o0L8Q9j32K3O0j23P7K03k21oo0P7J06o7q6J7M7pj14j32L32p9j23j7
7352g5O8JJ75p5Jj62K82l30R7M9j26R6j29Q3O5l45M57k31l2L24k91mJ58j48J46
$$ plain form
7377 54 37 -3 -19 38 8 -12 -98 -95 126 141 -132 -211 42 -281 64 70 -80 -25 38 155 -140 97 139 -6 -187 82
7403 82 28 -72 -109 50 137 -119 65 -139 63 12 -109 -148 -20 -46 -285 -14 -20 -133 -32 143 125 -249 -10
7426 -10 -8 -129 88 17 178 49 52 -96 -15 63 -67 5 -22 229 56 55 38 -126 107 217 30 -95 31 197
7450 197 96 -150 -26 -23 -59 3 -90 -265 187 199 -52 -167 68 -56 -28 14 167 -207 -127 81 -122 78 -254
7473 -254 -150 114 -221 196 15 -84 -58 117 102 58 -214 -84 68 17 60 -235 -5 -105 -107 -110 -34 -27 70 193 -8
7498 -8 -45 -31 -132 93 -29 52 103 -95 -79 -65 30 43 -112 23 38 -14 -87 -29 36 67 189 -82 -86 -204 -137 126
7524 126 -125 -23 17 128 111 106 146 -243 -148 -43 7 100 -50 175 34 -186 -33 26 208 -140 -46 -158 59
7547 59 -139 -28 -187 95 -120 32 -43 192 -91 -83 117 -154 189 157 -87 -5 -24 35 -75 -241 -92 196 308
$$ packed form
7377E4j7m0j6N7l0k0q6LK21J5k73p9K53l23L45Oj50N5O3J17k95K37M2j45j81K69
7403H2n4j00l7J59Q7k56J84k04K02n1j21l9J28k6k39K71oj13J01J75j8l74K39
7426a0Kj21K17p1J61j29Lj48Q1P8j30P2k7K51j73jj7j64K33J10j87j25J26J66
7450A97j01k46J24Ll6O2r3j75M52J2k51j15K35j24K8M2J53l74Q0K08k03K00l32
7473b54J04K64l35M17j81r9K6J75j5m4k72J30J52n1M3k95K30j00klP6PR7J23k01
7498hl7J4j01K25j22Q1N1j98J6J4R5J3j55J35J5n2p3N8O5L1J22k71mj18O7K63
7524A26k51J02M0J11j7nM0l89R5J05N0R3j50K25j41k20J53N9J82l48R4j12K17
7547E9j98J11j59K82k15J52p5K35k83QK00k71L43l2k44Q2j9N9j10j66J49K88J12
$$ plain form
7570 308 -1 -206 -130 56 19 -147 77 4 -20 73 -249 -26 106 -179 -58 -82 59 -5 194 7 -82 -49 44
7593 44 98 76 -37 65 -8 -145 -156 -17 -219 129 -61 164 75 -5 173 -157 -141 -43 -60 81 -11 213 60 -50
7617 -50 -68 78 19 -124 77 77 -137 45 3 31 -46 -157 -21 208 -80 42 -144 -201 -53 -276 35 94 142 -36
7641 -36 88 71 49 -73 223 -109 -49 121 76 -148 108 13 -117 85 143 143 -2 -79 110 -57 -66 -157 1 -122
7665 -122 24 235 -61 -119 -52 96 119 89 159 85 187 -134 279 -38 314 165 101 -49 -15 32 -55 23 16 32 -178
7690 -178 188 93 -111 122 110 -87 108 11 36 -119 40 -6 0 135 15 -80 185 -82 94 46 23 -291 -62
7713 -62 -127 23 125 233 72 -215 4 -113 11 72 -105 175 -98 -157 -167 -6 -79 -65 -61 -114 -11 49 5 -120
7737 -120 167 -196 35 -72 -108 -76 -93 147 8 -349 -116 47 45 -105 -40 6 47 -80 -62 131 -39 204 70
$$ packed form
7570C08l09k05P6J86l7j66K24p3k4R3l22K23J32k85J21k4J41o4J99j87q9L3R3
7593D4N4k2j13J02p3j37j1J39k02L48j90K25q9q0J78l30J6R8j7J41r2K24j53j10
7617e0j8J46n9j43K01%k14J82m2K8p7j11J36K29k88J22j86n7J48k23L11N9M8j78
7641c6J24j7k2j22K96l32O0J70m5k24K56r5j30K02N8%j45p7J89j67rr1J58j23
7665a22J46K11k96n8O7J48K3l0P0p4J02l21M13l17L52j49o4j50L4M7q7P8pJ6k10
7690a78L66r5k04K33j2j97J95r7K5j55J59m6OJ35j20r5K65k67J76m8k3l14K29
7713f2o5J50J02J08j61k87K19j17J24O1j77K80k73n9j0J61p3J4Mn3J03O0m4j25
7737a20K87l63K31j07l6L2j7K40j39l57K33J63kj50O5M6M1j27J8J93j70K43j34
$$ plain form
7760 70 -13 -39 34 35 -262 -58 -61 -101 -99 -72 -64 14 -59 58 51 -175 32 -137 -173 -73 -59 -39 -50 -40 -107 163 -43 -70
7788 -70 3 155 15 -60 47 275 -105 -154 -9 111 38 -42 -27 149 194 137 33 166 19 63 -25 -41 -56 71
7812 71 51 -114 -186 -59 143 37 -48 30 -59 -75 -203 30 19 176 134 -281 147 -328 70 -61 -209 75 79 35
7836 35 -3 -209 172 -89 -84 127 -82 -88 -106 63 50 116 104 -12 -127 84 -42 27 2 251 183 -59 -7 107 -34
7861 -34 41 -41 -100 245 48 135 157 -189 1 248 -105 -44 -79 26 -158 83 -119 213 -52 96 78 -44 75
7884 75 117 237 216 109 10 -69 -93 160 -230 183 126 5 56 39 -61 50 -52 92 -63 109 22 127 -209
7907 -209 8 -12 -242 -65 38 175 -103 51 -111 -165 65 80 -35 48 -40 114 61 68 -74 222 -10 75 121
7930 121 98 112 -46 -86 -28 161 110 82 -74 104 11 -39 -111 55 -98 -60 34 19 144 51 -97 -12 105 18 -26
$$ packed form
7760G0q3k6P3Jk97K04lm0KK7QP8p3J17pk26K07j69l6J00J4K0j1J0o7K70k06k7
7788g0P3J52j40p5J07K28l80m9J45J20p3q0J5J76M5n7j04J33j47M4q8j6j5J27
7812G1k0j65p2J27K02j06q5P8q9j6j28K33j1J57m2m15M28m75L98j31j48K84Mm4
7836C5l8k06L81k61NK11k09oj8J69j3O6j2j16j15K11j26O9k5K49o8k42N2J14j41
7861c4P5q2n9L45j97Q7K2l46J90K47l53O1l5J05j84K41k02L32k65J48j8j22J19
7884G5M2J20k1j07r9p9k4K53l90M13n7j21N1j7j00J11j02J44j55J72q7J05l36
7907b09K17k0k30J77J03J37k78J54j62n4K30J5j15Q3q8J54n3Pj42K96k32Q5M6
7930A21k3J4j58m0N8J89n1k8j56J78r3n0p2J66j53L8R4j5J25r3j48Q5J17q7m4
$$ plain form
7955 -26 64 143 9 -47 -13 137 182 -42 -188 201 -233 -93 256 -78 102 -27 138 8 -93 121 -31 -102
7977 -102 -20 -74 19 -160 -19 109 -4 20 4 -81 -65 -106 2 -104 37 -14 -114 111 -145 -209 -115 -15 48 -204
8001 -204 -61 -258 -194 -93 233 68 -67 155 163 9 -24 101 -149 56 39 -260 69 -262 -140 145 44 -51
8023 -51 -239 -31 -50 -112 150 96 -18 -30 -93 -187 86 -264 -127 201 -29 22 11 194 13 34 -197 -87 -84 -211
8047 -211 92 -127 153 -50 -63 -1 -260 62 -5 -94 -71 -103 -81 -17 91 -161 -5 -26 67 -45 -8 34 -43 -35 309
8072 309 139 -97 -47 125 -42 47 -102 9 -25 -32 -40 107 -121 -16 -227 67 -54 -167 116 -1 179 -151
8094 -151 54 100 40 120 -50 58 143 -115 64 49 57 -73 90 17 -61 -155 -91 -62 -37 -168 33 64 -198 117 -162
8119 -162 -35 -12 57 -107 13 216 -9 10 -170 33 139 -10 52 86 -29 20 68 -159 -97 -35 -57 1 -167 116
$$ packed form
7955b6R0P9j34n6L4J50M5k24j46L89m34J40L49l34J80j29J65j30j01K14j52p1
7977a02Q2n4R3j79J41J28j13K4j6q5J6m1J08j06J41n1j00K25k56o4R4J00O3k52
8001b04J43j97O4J01L26j65j35K22Qj54l3J25k50K05j7k99L29l31J22K85j01r5
8023e1j88K08j9o2K62n4j14j2o3r4K73l50J37L28k30N1j1J83j81K1k31J10Lj27
8047b11L03k19K80k03j3O2k59L22o7q9K3l2K2O4J08k52J56k1R3j12L7M2p7QL44
8072C09j70k36N0J72j67Q9j49J11l4pqJ47k28J05k11K94j21j13K83j17J80l30
8094a51K05M6o0Q0j70J08Q5k58J79j5Qj30J63p3p8r4O4K9K5j31K01L1k62L15k79
8119a62J27K3O9j64J20K03k25J9j80K03J06j49O2L4j15M9M8k27O2O2k2N8j68K83
$$ plain form
8143 116 22 -2 -32 -46 259 -35 70 188 -9 -17 161 125 140 119 -94 -169 -71 180 -95 -47 109 -98 76 142
8167 142 193 69 179 112 -163 -113 102 156 -20 178 -260 -198 -122 122 -13 -29 124 5 9 -233 -4 -155 122
8190 122 119
$$ packed form
8143A16r4k4l0j4L05k94J05J18j97qJ78l6J5k1k13p5R8K51k75M8J56k07J74O6
8167A42N1j24J10o7k75N0K15N4j76J98m38O2P6K44j35j6J53j19Mk42K29j51K77
8190A22l
8191A19
$$ Imaginary data points
##PAGE= N=2
##DATA TABLE= (X++(I..I)), XYDATA
$$ plain form
0 0 0 0 0 0 0 0 0 -8 8 -8 16 -16 16 -24 32 -40 48 -56 72 -88 104 -121 145 -176 203 -235 275 -320 368 -422
30 -422 484 -550 624 -707 797 -900 1011 -1132 1264 -1410 1570 -1744 1935 -2142 2369 -2618
46 -2618 2889 -3186 3510 -3867 4261 -4694 5176 -5711 6310 -6985 7755 -8639 9665 -10877
60 -10877 12332 -14115 16364 -19296 23301 -29129 38402 -55507 97470 -419304 -217687 892570
72 892570 289780 -551684 -447389 263653 305325 33523 -108657 -148899 -207575 128029 425211
83 425211 75251 -524429 -287459 450359 467040 -282914 -494888 66657 406420 99011
93 99011 -198504 -155484 -8260 96095 190979 48265 -254465 -179625 252213 278743 -149951
104 -149951 -262061 80790 191006 -34275 -58853 73114 -55336 -150543 123433 253627
$$ packed form
0@%%%%%%%qJ6j6K4l2L2m0N6p2Q8j04J28j60J92k25K66l21L79m38N10n95O88p90
30d22R06j034J174j331J504j697J911k143K396k674K980l314L679m077M511m987
46b618N507o075O696p377Q128q955R870j0887J2021j3295J4740j6394J8304k0542
60a0877K3209k6447L0479l5660M2597n2430O7531r3909J52977n16774K01617J110257
72H92570o02790q41464J04295P11042M1672k71802j42180m0242n8676L35604K97182
83D25211l49960n99680K36970P37818J6681p49954k11974N61545L39763l07409
93I9011k97515M3020J47224J04355R4884j42714l02730P4840M31838K6530m28694
104a49951j12110L42851J10216k25281k4578J31967j28450r5207K73976J30194
$$ plain form
114 253627 -116030 -336716 43813 351371 20053 -314484 -55872 233716 32343 -158875
124 -158875 37648 114987 -149372 -139600 241290 204517 -284371 -289830 243074 329963 -175338
135 -175338 -340025 72310 262020 -16638 -154464 -5882 21236 -43847 62142 120760
145 120760 -92372 -200376 72285 252104 -11506 -241000 -42242 192881 78476 -114472
155 -114472 -62324 48013 12129 -258 58533 -11019 -113078 204 143641 23824 -139221
166 -139221 -22350 133994 15630 -106792 25414 108055 -50224 -112296 75669 141087
176 141087 -69376 -151850 52251 138578 -34086 -107122 19294 54377 -37795 -12176 77434
187 77434 -18734 -137615 11682 181200 22446 -197870 -72466 178515 110713 -129122
$$ packed form
114B53627l69657k20686L80529L07558l31318l34537K58612K89588k01373j91218
124a58875J96523P7339k64359R772L80890l6773m88888n459N32904Q6889n05301
135a75338j64687M12335J89710k78658j37826J48582K7118o5083J05989N8618
145A20760k13132j08004K72661J79819k63610k29494J98758K35123j14405j92948
155a14472N2148J10337l5884j2387N8791o9552j02059J13282J43437j19817j63045
166a39221J16871J56344j18364j22422J32206Q2641j58279o2072J87965O5418
176A41087k10463q2474K04101Q6327j72664p3036J26416L5083r2172K5619Q9610
187G7434r6168j18881J49297J69518j58754k20316J25404K50981o7802k39835
$$ plain form
197 -129122 -121193 55723 84713 2499 -28492 -42556 -54502 24880 114273 11980 -157686
208 -157686 -76321 148204 125221 -105110 -149639 45794 140399 12416 -86917 -38095 19541
219 19541 39890 50860 -3716 -89979 -46080 100584 96641 -82754 -126088 47740 126240 -6459
231 -6459 -96910 -15994 61866 23370 -16661 2109 -6546 -23939 26442 56730 -15982 -70534
243 -70534 1688 77943 13085 -73429 -20944 55415 13206 -43334 -7619 28690 -10708 -29603
255 -29603 22629 28850 -34277 -29535 36641 28290 -32353 -25924 27449 18691 -28556 -12081 25793
268 25793 -2175 -32510 2416 29900 -8438 -39901 2825 39707 -4350 -38743 3313 32919
280 32919 -280 -21841 5873 18365 -8042 -7274 22457 3772 -28493 1574 35942 1562
$$ packed form
197a29122P929J76916K8990q2214l0991j4064j1946P9382Q9393j02293j69666
208a57686Q1365K24525k2983k30331m4529J95433R4605j27983r9333M8822N7636
219A9541K0349J0970n4576q6263M3899J46664l943j79395m3334J73828P8500j32699
231f459r0451Q0916P7860l8496m0031J8770q655j7393N0381L0288p2712n4552
243g0534P2222P6255o4858q6514N2485P6359m2209n6540L5715L6309l9398j8895
255b9603N2232O221o3127M742O6176q351o0643O429N3373q758m7247J6475L7874
268B5793k7968l0335L4926K7484l8338l1463M2726L6882m4057l4393M2056K9606
280C2919l3199k1561K7714J2492k6407P68K9731j8685l2265L0067L4368l4380
$$ plain form
292 1562 -38963 -7197 38750 10904 -34231 -12302 24976 12921 -11153 -6609 6434 2593 1027
305 1027 13388 3803 -20814 -4099 29264 12434 -29504 -21243 24782 23463 -22664 -25067 11243
318 11243 13960 -7309 -8058 679 -3128 -3414 11412 8202 -16659 -12001 18839 16123 -14335 -18549
332 -18549 7903 18215 -5733 -17995 367 9080 -2601 -6780 -437 -33 -4799 1416 9004 -3981
346 -3981 -12046 7602 16499 -3674 -13380 4328 16737 881 -11793 374 8300 436 -2081
359 -2081 -480 -2874 -2894 3098 5999 -3266 -10240 1381 12600 3568 -9071 -5206 9023 10122 -2738
374 -2738 -4748 1773 678 1261 5050 -991 -10520 -5975 9291 8509 -10509 -14154 1757 10282 4038
389 4038 -6298 -9876 -623 9773 9049 -2633 -12468 -4223 12392 12459 -3658 -16404 -7870 12538
$$ packed form
292A562m0525L1766M5947k7846m5135K1929L7278j2055k4074M544J3043l841j566
305A027J2361r585k4617J6715L3363j6830m1938Q261M6025j319m6127k403L6310
318A1243K717k1269p49Q737l807k86J4826l210k4861M658L0840k716l0458m214
332a8549K6452J0312k3948j2262J8362Q713j1681m179O343M04m766O215P588j2985
346c981q065J9648Q897k0173r706J7708J2409j5856j2674J2167P926p864k517
359b081J601k394k0N992K901r265o974J1621J1219r032j2639L865J4229J099j2860
374b738k010O521j095N83L789o041r529M545J5266p82j9018l645J5911Q525o244
389D038j0336l578R253J0396p24j1682r835Q245J6615O7j6117j2746Q534K0408
$$ plain form
403 12538 14192 -5871 -18730 -9282 11603 17517 -2425 -21831 -11971 16526 24104 -3883 -24910
416 -24910 -6219 20338 17968 -3829 -17429 -8574 10959 17644 3641 -18588 -19176 8569 25870
429 25870 5875 -25763 -23052 14376 31821 873 -28814 -13889 19393 23955 -1731 -19176
441 -19176 -10155 7995 17979 8910 -14259 -20977 573 22253 13672 -18149 -28980 1994 29969
454 29969 13860 -24083 -28092 9367 30493 6654 -20752 -15741 7600 19052 8179 -9510
466 -9510 -15354 -5823 12930 18689 -2242 -25966 -16372 19479 30609 -8045 -38335 -9898 32118
479 32118 23359 -17668 -27028 3147 22073 10855 -4853 -11739 -10488 4214 20416 12813 -17936
492 -17936 -29740 5165 37075 10936 -36247 -29927 21648 38647 -2959 -33843 -12611 19197
$$ packed form
403A2538J654k0063j2859R448K0885N914j9942j9406R860K8497P578k7987k1027
416b4910J8691K6557k370k1797j3600Q855J9533O685j4003k2229n88K7745J7301
429B5870j9995l1638K711L7428J7445l0948k9687J4925L3282M562k5686j7445
441a9176R021J8150R984r069k3169o718K1550K1680q581l1821j0831L0974K7975
454B9969j6109l7943m009L7459K1126k3839k7406N011K3341J1452j0873j7689
466i510n844R531J8753N759k0931k3724R594L5851J1130l8654l0290K8437M2016
479C2118q759m1027r360L0175J8926j1218j5708o886J251J4702J6202p603l0749
492a7936j1804L4905L1910k6139m7183O320N1575J6999m1606l0884K1232L1808
$$ plain form
504 19197 20031 572 -14068 -12625 1754 18096 16562 -9820 -28449 -7187 27500 24887 -17346
517 -17346 -38452 -2180 37420 18535 -27629 -30798 9799 31199 6082 -19907 -13594 5155
529 5155 13229 9489 -787 -13327 -14743 7384 26991 6360 -30766 -23119 22624 34237 -10291
542 -10291 -39744 -6771 31615 17395 -15882 -18093 1851 10081 6621 4746 -4635 -16630 -2862
555 -2862 24207 18662 -19924 -32556 5435 36621 9856 -31648 -24046 16465 28643 -570 -24429
568 -24429 -12631 10795 17160 5829 -9831 -15174 -2021 16929 17420 -7426 -25881 -7079 24649
581 24649 21513 -14469 -31975 -1977 31344 15393 -23571 -25632 7999 24964 4605 -15608
593 -15608 -9754 4189 9041 7464 -934 -11863 -10002 10259 21015 -1191 -24691 -10428 19641
$$ packed form
504A9197Q34j9459j4640J443J4379J6342j534k6382j8629K1262L4687k613m2233
517a7346k1106L6272L9600j8885m6164l169M0597K1400k5117k5989O313J8749
529E155Q074l740j0276j2540j416K2127J9607k0631l7126P647M5743J1613m4528
542a0291k9453L2973L8386j4220l3277k211J9944Q230l460j875r381j1995J3768
555b862K7069n545l8586j2632L7991L1186k6765m1504P602M0511J2178k9213k3859
568b4429J1798K3426O365j1331j5660n343J3153J8950M91k4846j8455J8802L1728
581B4649l136l5982j7506K9998L3321j5951l8964k061L3631J6965k0359k0213
593a5608N854J3943M852j577q398j0929J861K0261J0756k2206k3500J4263L0069
$$ plain form
606 19641 17504 -11952 -21510 1811 18921 4640 -11747 -7834 2878 5019 3441 2278 -2726
619 -2726 -7372 608 11639 4564 -9660 -9450 4614 11602 1348 -10167 -6953 4531 8067 -14
633 -14 -7166 -4023 3093 3848 2023 -854 -3511 -2220 3092 6519 825 -7647 -4956 6364 9066 -1482
649 -1482 -10500 -4440 8297 6794 -5461 -8347 600 6041 2553 -2103 -2577 -2627 694 6475 3715
664 3715 -5591 -5644 3817 7870 -5 -7737 -3638 4866 4911 -1548 -5608 -2255 2979 2336 -763 -2099
680 -2099 -1786 346 3012 2009 -1315 -2610 625 3674 1358 -1853 -1423 -295 1024 1896 -717 -2887
696 -2887 -1355 1340 1426 -707 -1778 -525 396 1913 1439 -1663 -2105 1076 3095 1740 -1780 -2540 574
713 574 3121 883 -2802 -2909 960 3191 258 -2418 -2231 140 2491 1339 -2464 -2330 990 3611
$$ packed form
606A9641k137k9456r558K3321J7110j4281j6387L913J0712K141j578j163n004
619b726m646P980J1031p075j4224K10J4064O988j0254j1515L214J1484L536q081
633a4p152L143P116P55j825k877k657J291N312L427n694q472K691J1320K702j0548
649a482r018O060J2737j503j2255k886Q947N441l488m656m74n0L321N781k760
664C715r306n3R461M053p875p732M099Q504M5o459m060L353N234o43l099j336
680b099L13K132K666j003l324j295L235L049k316l211M30J128J319Q72k613k170
696b887J532K695Q6k133j071J253R21J517m74l102m42L181K019j355l520p60L114
713E74K547k238l685j07L869K231k933k676J87K371K351j152l803J34L320K621
$$ plain form
729 3611 1207 -3219 -1592 2273 2520 -265 -2502 -1707 1542 2201 -717 -2643 -1192 1702 1786 -1261
745 -1261 -1816 -351 1264 1755 -672 -2027 520 2005 1196 -937 -1357 774 1495 354 -1030 -1365 128
762 128 1260 -354 -1627 -705 757 958 -266 -1063 -21 733 902 402 -964 -478 1220 674 -434
779 -434 -791 -221 768 284 -567 -826 -185 395 256 -1032 -192 391 167 -55 71 -93 557 625 -4 69 -348
800 -348 379 594 -304 26 -249 -353 189 -465 -606 30 168 -276 -43 101 475 200 -16 473 147 -156
820 -156 484 469 -3 -81 -184 64 290 -298 -307 -156 -189 189 -24 -379 -380 -132 492 271 -450 -42 800 622 22
843 22 -591 -331 291 618 229 -144 -766 -13 985 82 -1099 -943 363 862 -151 -1189 -299 433 671
862 671 253 -448 -523 333 744 849 -702 -1088 382 1262 74 -1495 -859 677 784 -385 -586 -537 -71
$$ packed form
729C611k404m426J627L865K47k785k237P95L249O59k918j926J451K894Q4l047
745a261n55J465J615M91k427j355K547J485q09k133m20K131P21j141j384l35J493
762A28J132j614j273R22J462K01j224p97J042P54J69n00j366M86J698n46j108
779d34l57N70R89m84q51k59O41N80j39j288Q40N83k24k22J26j64O50O8o29P3m17
800c48P27K15q98L30k75j04N42o54j41O36J38m44K33J44L74k75k16M89l26l03
820a56O40j5m72p8j03K48K26n88rJ51l3L78k13l55jK48O24k21p21M08Q42j78o00
843B2o13K60O22L27l89l73o22P53R98r03j181J56J306M99j013j038Q90P32K38
862F71m18p01p5Q56M11J05j551l86J470Q80j188j569O36J536J07j169k01M9M66
$$ plain form
881 -71 1050 654 -568 -1028 181 1645 334 -1269 -694 946 786 -379 -449 -416 -90 -134 555 343 -1310
900 -1310 -1036 1350 1685 -712 -1932 228 1931 394 -1093 -177 400 199 -34 255 -96 -1162 -246
917 -246 1168 600 -1327 -1193 665 1448 -181 -1854 -385 1113 932 223 -922 -258 348 727 169 -382
935 -382 -691 477 413 -38 -89 -382 -670 210 1048 -398 -1423 -614 1880 1297 -1641 -1592 1074 1715 -210
954 -210 -1310 153 1203 -400 -457 687 328 -1194 -720 1384 730 -1876 -1808 1734 1810 -991 -1711 526
972 526 1609 95 -974 299 765 -257 7 761 156 -687 -721 664 867 -855 -1212 -129 959 424
990 424 -985 -876 433 907 86 -819 -620 806 551 -263 -260 320 641 -232 -15 592 53 -1309 -227
1009 -227 1357 270 -1672 -883 1175 1090 -1283 -1083 1026 1120 -609 -696 633 624 -685 -711 1168 533 -1002
$$ packed form
881g1J121l96j222m60J209J464j311j603N75J640j60j165p0L3L26m4O89k12j653
900a310K74K386L35k397j220K160J703j537j487R16N77k01k33K89l51j066R16
917b46J414n68j927J34J858P83j629j673J469J498j81p09j145O64O06L79n58n51
935c82l09J168o4m51n1k93k88Q80Q38j446j025Q09K494n83k938M9K666O41j925
954b10j100J463J050j603n7J144l59j522M74K104o54k606O8L542P6k801p20K237
972E26J083j514j069J273M66j022K64P54o05q43l4J385K03j722l57J083J088n35
990D24j409J09J309M74q21r05J99J426k55q14LN80L21q73K17O07n39j362J082
1009b27J584j087j942P89K058q5k373K00K109R4j729q7J329rj309k6J879o35j535
$$ plain form
1028 -1002 -633 948 691 -928 -1136 727 927 -785 -1115 301 461 -235 -394 384 236 18 90 212
1046 212 118 -229 -138 39 109 -176 -421 -127 52 20 150 -458 -237 377 229 -501 -465 492 538 -292 -263 616
1068 616 276 -420 -152 589 293 -691 -586 750 482 -809 -577 547 548 -617 -476 619 626 -314 -72 741
1088 741 269 -396 -235 422 150 -577 -153 381 161 -591 -142 177 138 -333 24 32 -149 -266 299 238 -50
1109 -50 -123 268 199 -93 -93 168 69 -168 228 113 -193 -162 120 410 -223 -668 168 275 -103 -374 232 160 -200
1132 -200 -53 309 88 -293 -198 454 259 -380 -105 257 64 -524 -269 29 71 -198 -85 266 -199 -403 -128
1153 -128 418 -77 -173 156 534 113 -129 -23 437 -31 -466 65 153 -223 4 50 43 -320 -233 536 326 -216
1175 -216 -210 245 241 -30 -60 318 107 -226 181 406 -49 -134 -39 33 -89 -340 130 357 -141 -257 162 75 -275
$$ packed form
1028a002L69J581k57j619k08J863K00j712l30J416J60o96j59P78j48k18P2J22
1046B12r4l47R1J77P0k85k45K94J79l2J30o08K21O14j48p30L6R57M6q30K9Q79
1068F16l40o96K68P41k96r84J05J336k68j291K32J124Jj165J41J095Pr40K42Q13
1088G41m72o65J61O57k72p27M24N34k20p52M49L19l9m71L57Qj81j17N65o1k88
1109e0p3L91o9k92%K61r9k37L96j15l06L1K82K90o33m45Q36J07l78k71O06p2l60
1132b00J47L62k21l81R5O52j95o39K75L62j93n88K55K98M2k69J13L51m65k04K75
1153a28N46m95r6L29L78m21k42J06M60m68m35N31Q8l76K27M6pl63Q7P69k10n42
1175b16OM55mk71l0L78k11l33M07K25m55q5R5P2j22k51M70K27m98j16M19q7l50
$$ plain form
1198 -275 -11 224 293 -298 202 235 -50 -350 164 495 -253 -415 108 271 -116 -346 134 289 -289 -159 138
1219 138 96 -93 -220 187 159 -338 -36 264 84 -118 -149 310 99 -349 80 127 -111 -74 64 252 -207 -369
1241 -369 67 352 -148 35 288 21 -331 38 13 79 -207 97 121 -23 -123 -33 125 136 -360 -64 151 73
1263 73 -167 118 232 39 137 27 288 -40 -239 88 146 -131 -141 124 61 -135 -87 71 -32 -542 39 117
1285 117 39 -169 234 7 -48 59 175 184 -254 -95 123 104 0 -67 -20 100 -291 -235 30 -10 -101 -90 203 4
1309 4 -142 126 130 -216 -33 29 -15 152 -107 -230 266 -12 196 -24 -20 93 -41 48 -140 116 106 16 15 -132
1333 -132 -56 219 -41 -3 -281 97 59 250 201 -2 -230 -112 -17 -114 -198 33 -103 60 -173 -14 -39 -93 181
1356 181 191 -227 -45 23 -59 161 -285 60 -58 -46 188 -105 -241 138 -14 -67 141 -114 60 76 67 -19 -135
$$ packed form
1198b75K64K35O9n91N00L3k85l00N14L31p48j62N23J63l87k30M80J55n78J30K97
1219A38m2j89j27M07k8m97L02L00j80k02l1M59k11m48M29M7k38L7J38J88m59j62
1241c69M36K85n00J83K53k67l52L69k5O6k86L04K4j44j00R0J58J1m96K96K15p8
1263G3k40K85J14j93R8j10K61l28j99L27N8k77j0K65o3j96M8J58j03n10N81P8
1285A17p8k08M03k27n5J07J16Rm38J59K18j9j04o7M7J20l91N6K65m0r1J1K93j99
1309Dj46K68Ml46J83O2m4J67k59j23M96k78K08k20MJ13j34Q9j88K56j0r0jj47
1333a32P6K75k60L8k78L78l8J91m9k03k28J18R5r7q4K31j36J63k33J59k5n4K74
1356A81J0m18J82O8q2K20m46L45j18J2K34k93j36L79j52n3K08k55J74J6rq6j16
$$ plain form
1379 -135 10 148 14 -65 -40 -139 -42 86 177 -69 -246 -262 -33 119 -338 100 52 303 110 -149 13 126
1401 126 231 87 -29 -118 58 150 -66 74 -282 -195 -195 110 -76 -316 86 297 203 -53 -175 33 69 74 -121
1424 -121 -103 -103 41 96 28 -111 63 236 265 128 -411 25 166 285 22 -158 -158 152 295 -193 -154 -70 62
1447 62 -54 -62 45 -63 -47 197 156 -10 -212 -187 -37 128 -440 -260 308 228 -116 -301 44 69 189 -62 -11
1470 -11 229 -40 -68 269 297 -147 -354 145 437 -257 -418 -250 558 118 -269 -52 88 107 -224 80 -27
1491 -27 59 -227 32 267 -154 -278 -73 130 374 -288 -298 239 229 -91 -386 30 173 537 -175 -246 126 105
1513 105 -355 -203 301 -1 -367 -31 359 -58 -612 -94 333 247 -311 -230 275 404 -163 -463 180 235 -185
1534 -185 -161 49 278 -210 -172 410 145 -207 -403 238 164 -110 -336 148 238 -110 -375 -77 205 125 -45 110
$$ packed form
1379a35J45J38j34p9K5r9R7J28R1k46j77j6K29J52m57M38m8K51j93k59J62J13
1401A26J05j44j16q9J76R2k16J40l56Q7%L05j86k40M02K11r4k56j22K08L6Nj95
1424a21J8%J44N5o8j39J74J73K9j37n39M36J41J19k63j80%L10J43m88L9Q4J32
1447F2j16qJ07j08J6K44m1j66k02K5J50J65n68J80N68q0l44j85L45K5J20k51N1
1470a1K40k69k8L37K8m44k07M99K92o94j61J68Q08m40l87K17J40J9l31L04j07
1491b7Q6k86K59K35m21j24K05K03K44o62j0N37j0l20k95M16J43L64p12p1L72k1
1513A05m60J52N04l02l66L36L90m17n54N18M27q6n58Q1N05J29n67l00O43N5m20
1534a85K4K10K29m88L8N82k65l52j96O41p4k74k26M84R0l48k65K98K82q0j70J55
$$ plain form
1556 110 65 71 -177 -110 83 -105 -316 -126 217 86 -241 -240 -164 -2 104 -218 -28 86 130 -265 7 148 74
1579 74 -112 -89 140 78 -426 197 181 -245 -119 -148 599 100 -305 -178 -15 205 -103 35 141 37 -55 -122
1601 -122 148 -69 -8 164 308 -50 -101 0 193 -87 -170 -71 79 -157 -150 10 25 -243 -20 270 96 -255
1623 -255 -16 59 202 -11 117 181 -168 60 121 86 -170 -65 231 94 -143 -230 164 -54 -261 223 148 -162
1645 -162 -159 167 233 -93 -79 290 65 -56 -78 126 137 -208 -86 -14 -21 -448 -13 123 -100 -49 -171 31 59 -169
1669 -169 -54 196 41 -80 157 155 16 -140 -134 47 54 -273 -166 64 -187 -216 53 80 -50 -101 167 45 90
1692 90 31 -110 -67 -400 -87 66 132 -40 136 -90 -42 73 80 -154 -157 -30 -40 53 -147 -56 257 7 -94 260
1716 260 47 112 -83 10 -21 -132 -91 21 22 -8 -241 89 108 -315 22 121 -52 74 173 282 47 47 152 236
$$ packed form
1556A10m5Ok48O7J93j88k11J90L43j31l27JP6J62J06l22J90J14M4l95K72J41p4
1579G4j86K3K29o2n04O23j6m26J26k9P47m99m05J27J63K20l08J38J06j04r2o7
1601a22K70k17O1J72J44l58n1J01J93k80q3R9J50k36PJ60J5k68K23K90j74l51
1623b55K39P5J43k13J28O4l49K28O1l5k56J05K96j37k37q7L94k18k07M84p5l10
1645a62LL26O6l26J4L69k25j21k2K04J1l45J22P2pm27M35J36k23N1j22K02K8k28
1669a69J15K50j55j21K37kj39j56OJ81Pl27J07K30k51k9K69K7j30n1K68j22M5
1692I0n9j41M3l33L13J53O6j72J76k26M8J15Pk34lJ27j0R3k00R1L13k50j01L54
1716B60k13O5j95R3l1j11M1J12Jl0k33L30J9m23L37R9j73J26R9J09k35%J05Q4
$$ plain form
1740 236 -87 61 -20 173 147 -67 -10 138 -7 -131 -174 200 74 -63 105 104 -177 -260 298 276 -82 -74 85
1763 85 75 -258 62 -92 -75 -189 -20 87 -97 -87 94 24 81 -12 2 146 87 47 140 -5 12 67 212 6
1787 6 10 76 59 -23 49 -112 45 281 -181 -47 -22 185 -166 4 133 -16 -196 -107 234 -172 -181 -83 394 106
1811 106 -48 -31 -149 -177 -183 -281 -36 -127 -69 64 -48 -84 123 -13 282 -96 28 247 -3 29 -114 -63 -136 65
1835 65 -3 193 138 -154 -126 63 -59 -117 56 60 252 99 -56 -103 -63 56 175 65 162 123 43 34 102 -38 -81
1860 -81 -189 30 0 -286 5 33 144 -17 -127 -101 -74 -136 24 360 97 11 -27 107 -2 -3 104 -70 -215
1883 -215 -217 -128 -154 -292 -123 104 -53 304 -243 52 -58 -112 138 57 22 187 139 -22 -86 39 -181 67 119
1906 119 -156 79 -33 -13 -131 -29 -132 38 -29 -82 11 -116 -11 106 -219 96 26 -182 -122 -83 -49 -5 86
$$ packed form
1740B36l23J48q1J93k6k14N7J48j45j24m3L74j26j37J68jk81q3N58k2l58QJ59
1763H5j0l33L20j54J7j14J69J07j84J0J81p0N7r3J4J44n9m0R3j45J7N5J45k06
1787FMO6j7q2P2j61J57K36m62J34K5K07l51J70J29j49j80Q9L41m06rR8M77k88
1811A06j54J7j18k8or8K45r1N8J33j12l6K07j36K95l78J24K19k50L2j43N1p3K01
1835F5o8J96n5k92K8J89j22n8J73MJ92j53j55m7M0J19J19j10R7l9q0rO8j40m3
1860h1j08K19l0k86K91K8J11j61j10K6K7o2J60L36k63q6l8J34j09jJ07j74j45
1883b15kQ9k6j38J69K27j57L57n47K95j10n4K50q1l5J65m8j61o4J25k20K48N2
1906A19k75K35j12K0j18J02j03J70o7n3R3j27J05J17l25L15p0k08O0L9L4M4R1
$$ plain form
1929 86 -147 -102 61 35 118 -133 12 -122 306 -32 66 59 224 31 -74 18 53 -26 -4 24 -23 -125 -79 66 241
1954 241 186 43 -126 114 -100 184 116 -155 -178 -87 193 2 31 -93 -164 168 -81 16 -55 8 185 -20 -32
1977 -32 51 97 -25 -94 -150 171 147 -40 6 10 77 111 139 -146 29 -43 32 -42 -11 -198 68 -202 -63 76 18 333
2003 333 97 186 -11 268 -43 50 88 -8 67 -15 -78 89 32 8 4 -101 -12 -237 -317 -27 -79 -6 -61 72 70 112
2029 112 249 -103 -49 -6 155 -54 77 -124 -101 -221 118 134 -132 -209 -234 3 -22 -73 64 -29 137 -102 232
2052 232 216 -187 -233 2 -139 -163 -158 -17 -19 -165 -44 -34 -284 -46 -17 -8 29 49 3 -116 9 147 -60 -58 133
2077 133 55 46 -178 -28 91 214 -31 272 120 94 -35 -102 130 -13 112 172 -33 73 -179 -67 241 224
2099 224 -41 20 -43 -13 -169 -214 25 -12 -213 -51 -3 52 -224 297 16 -96 -22 -38 117 -76 -14 159 -56
$$ packed form
1929H6k33M5J63k6Q3k51J45j34M28l38R8pJ65j93j05R2L5p9K2K8m7j02M6J45J75
1954B41n5j43j69K40k14K84o8k71k3R1K80j91K9j24p1L32k49R7p1O3J77k05j2
1977c2Q3M6j22o9n6L21k4j87M6MO7L4K8k85J75p2P5p4L1j87K66k70J39J39n8L15
2003C33k36Q9j97K79l11R3L8r6P5q2o3J67n7k4mj05Q9k25q0K90n2P3n5J33kM2
2029A12J37l52N4M3J61k09J31k01K3j20L39J6k66p7k5K37k5n1J37r3J66k39L34
2052B32j6m03m6K35j41k4NJ41kj46J21J0k50K38K9RL7K0m6j19J25J38k07KJ91
2077A33p8rk24J50J19J23k45L03j52k6j29o7K32j43J25O0k05J06k52J12L08j7
2099B24k65O1o3L0j56m5K39l7k01J62M8N5k76N21k81j12P4j6J55j93O2J73k15
$$ plain form
2122 -56 -6 66 -28 93 53 -148 106 20 49 99 -193 126 -35 58 156 -211 9 -223 88 -70 279 241 11 -305
2146 -305 -38 -27 -36 -27 33 262 5 6 161 -51 -183 -216 77 179 -10 93 262 -2 185 261 7 254 -35
2169 -35 51 77 37 -118 3 83 -1 -1 -51 42 26 -76 284 168 -48 -52 125 -108 -38 -73 342 -5 82 24 -1 92
2195 92 91 198 15 -81 -71 277 68 -211 18 23 264 129 -156 144 -74 -79 -151 219 257 -106 -285 -147 33 -165
2219 -165 -126 148 -17 -101 -26 -45 -41 -272 250 293 34 39 -41 230 35 112 -307 -3 94 -165 99 126 -127 119
2243 119 -37 -112 -242 96 387 96 53 9 119 -65 -32 37 218 -142 -1 -93 41 -104 -331 -77 178 40
2265 40 -308 33 -122 -189 -79 92 -27 -77 -90 140 -38 -326 -17 247 -30 -156 253 81 -39 -145 161
2286 161 135 -175 -139 -222 22 60 -79 22 174 16 -202 -89 237 -21 84 -75 -138 -182 -47 -33 49 -166 -21
$$ packed form
2122e6N0P2r4J21m0k01K54q6K9N0k92L19j61R3R8l67K20k32L11j58L49l8k30l16
2146c05K67J1rRO0K29k57JJ55k12j32l3K93J02j89J03J69k64J87P6k54K47k89
2169c5Q6K6m0j55J21Q0q4%n0R3j6j02L60j16k16mJ77k33P0l5M15l47Q7n8k5R3
2195I2jJ07j83r6J0L48k09k79K29NK41j35k85L00k18np2L70L8l63j79J38J80j98
2219a65L9K74j65q4P5j9Mk31N22M3k59Nq0K71j95P7m19L04R7k59K64K7k53K46
2243A19j56p5j30L38K91k91m3m4J10j84L3O9J81l60J41r2J34j45k27K54K55j38
2265D0l48L41j55o7J10J71j19n0j3K30j78k88L09K64k77j26M09j72j20j06L06
2286A61k6l10L6q3K44L8j39J01J52j58k18J13L26k58J05j59o3m4J35J4Q2k15J45
$$ plain form
2309 -21 -4 236 -76 -234 -3 -126 99 22 280 -53 -37 54 13 34 280 108 213 -194 96 60 -228 -112 -14
2332 -14 -179 -251 -82 -37 42 -75 45 155 -185 -46 -164 137 151 -200 40 -59 18 -64 -106 29 109 -28 -53 294
2356 294 -98 -197 112 160 49 -146 93 323 -95 -22 -142 85 55 12 102 155 133 -47 51 116 -128 137 320
2379 320 -19 -88 61 25 85 -7 -140 15 134 -91 163 -55 10 92 -26 127 -193 19 24 -145 -112 -59 -105 -208
2403 -208 -20 55 86 189 118 89 74 51 -3 23 -131 -104 -151 103 -96 44 -32 -53 -109 -73 -184 -41 8 32 -144
2428 -144 5 217 21 -104 -143 -35 187 120 -115 -180 112 -46 -35 65 72 198 94 -10 -26 -196 34 148
2450 148 -112 2 -125 -116 -55 4 175 -144 -130 -61 -22 104 -72 -51 -34 -273 -140 85 -109 -156 49 89 -63 -35
2474 -35 -70 -187 -72 -199 36 -120 122 118 -173 -57 -58 -191 67 247 14 -87 -5 126 154 -24 -60 -51 263 46
$$ packed form
2309b1J7K40l12j58K31j23K25p7K58l33J6R1m1K1K46j72J05m07K90l6k88J16R8
2332a4j65p2J69M5P9j17J20J10l40J39j18L01J4l51K40r9P7q2m2J35Q0j37k5L47
2356B94l92r9L09M8j11j95K39K30m18P3j20K27l0m3R0N3k2j80R8O5k44K65J83
2379C20l39o9J49l6O0r2j33J55J19k25K54k18O5Q2j18J53l20K12Nj69L3N3m6j03
2403b08J88P5L1J03p1k9j5k3n4K6j54K7m7K54j99J40p6k1n6L6j11J43M9K4j76
2428a44J49K12j96j25l9J08K22o7k35o5K92j58J1J00PJ26j04j04j6j70K30J14
2450A48k60J14j27RO1N9J71l19J4O9L9J26j76K1J7k39J33K25j94m7K05M0j52K8
2474c5l5j17J15j27K35j56K42mk91J16jj33K58J80k33j01Q2J31K8j78l6RL14k17
$$ plain form
2498 46 -117 45 53 87 67 90 -143 113 65 -88 3 231 -115 -189 161 -14 -204 -138 136 -193 -19 -41 54 57 -36
2523 -36 -158 320 180 46 -188 -145 66 87 -263 2 328 21 -16 -179 79 63 -238 35 -50 -77 -135 199 -111
2546 -111 64 -9 164 144 -30 -184 -26 97 6 -98 -12 87 241 131 -50 43 -226 -24 65 193 -88 106
2568 106 -126 -81 -23 -87 -8 6 10 -11 175 100 -66 -169 -69 57 -147 42 105 279 41 15 62 186 -25 83
2592 83 -63 101 -41 46 -39 -75 41 34 -28 -36 82 157 99 126 -349 20 123 53 -57 -31 105 -116 92 -141 -163
2617 -163 -89 90 95 95 -130 -106 -191 76 196 347 -223 10 31 -21 123 -111 -75 15 -256 -95 36 -35 82 81 104
2642 104 145 -16 -90 207 -40 3 -89 66 114 -57 -16 7 16 -101 147 146 180 69 193 -98 133 -120 -318 260
2666 260 160 -179 -25 -145 175 31 97 15 13 86 -70 30 44 39 67 -14 20 25 42 178 -83 -23 -195 45 -129
$$ packed form
2498D6j63J62QL4k0K3k33K56m8j53R1K28l46p4L50j75j90O6K74l29J74k2R5Lr3
2523c6j22M78j40j34k34M3K11K1l50K65L26l07l7j63K58j6l01K73q5k7n8L34l10
2546a11J75p3J73k0j74j54J58J23r1j04Q6R9J54j10j81R3k69K02Q9J28k81J94
2568A06k32M5N8o4P9J4Mk1J86p5j66j03J00J26k04J89O3J74k38k6M7J24k11J08
2592H3j46J64j42Q7q5l6J16po2qJ18P5n8K7m75L69J03p0j10K6J36k21K08k33k2
2617a63P4J79N%k25K4q5K67J20J51n70K33K1n2J44k34L6R0k71J61J31p1J17jK3
2642A04M1j61p4K97k47M3r2J55M8j71M1K3Rj17K48jL4j11J24k91K31k53j98N78
2666B60j00l39J54j20L20j44O6q2kP3j56J00J4nK8q1L4NJ7J36k61O0j72K40j74
$$ plain form
2691 -129 -51 -99 56 13 -6 71 75 8 1 -74 -161 30 40 -103 123 -170 -51 -23 -165 25 144 -138 -103 -34 187
2716 187 110 172 -182 181 -13 -75 10 -165 -139 -49 -19 34 79 16 69 98 173 144 -7 81 -192 -126 118 -73 -65 -108
2742 -108 -68 50 -53 21 81 -21 -194 -349 -76 41 -99 63 45 -77 170 -15 -101 38 -13 48 85 60 21
2765 21 48 -63 -144 -89 110 275 61 22 -39 316 -98 185 -87 -58 -144 -98 76 -66 80 98 149 84 -131 -28
2789 -28 80 -289 89 23 -39 -90 46 86 31 65 7 116 151 15 21 -56 94 -71 115 61 -35 147 -19 186 48
2814 48 -13 16 57 76 -24 132 -40 -123 -40 -117 136 -54 -156 330 196 199 23 15 142 111 -37 67 124 -170 78
2839 78 114 -135 42 -5 163 86 56 -6 -18 127 -11 107 -14 62 -215 -32 -5 -42 -67 -21 22 -114 -220 -36
2863 -36 45 59 117 24 148 57 44 31 54 108 220 239 -197 -47 56 -36 47 67 -103 118 -149 -86 42 3 -38 -148
$$ packed form
2691a29P8m8J55m3j9P7Mo7pp5q7J91J0j43K26k93J19K8j42J90J19k82L5O9K21
2716A87p7O2l54L63j94o2Q5j75K6R0L0N3M5o3N3K9P5k9j51Q8k73O6K44j91Qm3
2742a08M0J18j03P4O0j02j73j55K73J17j40J62j8j22K47j85q6J39n1O1L7k5l9
2765B1K7j11q1N5J99J65k14l9o1L55m14K83k72K9q6M6J74j42J46J8N1o5k15J03
2789b8J08l69L78o6o2n1J36M0n5L4n8J09L5j36Op7J50j65J86n4r6J82j66K05j38
2814D8o1K9M1J9j00J56j72q3Q3p7K53j90j02M86j34Lj76qJ27l1j48J04N7k94K48
2839G8L6k49J77m7J68p7l0o2j2J45j38J18j21P6k77J83K7l7k5M6M3j36j06J84
2863c6Q1J4N8r3J24r1j3j3K3N4J12J9m36J50J03r2Q3K0j70K21k67O3J28l9m1j10
$$ plain form
2889 -148 -272 -157 -66 109 183 -65 -120 -68 18 35 9 254 -6 -16 96 101 -59 -124 98 109 54 75 11 -147 112
2914 112 21 -52 -132 36 118 31 66 -26 -38 -53 134 159 -30 116 94 -107 -467 -60 129 26 148 96 -4 -174
2938 -174 -239 -46 75 -131 -125 -59 -39 -13 149 -194 -9 23 -239 114 71 113 104 -11 134 104 7 104 -58 -33 -33 55
2964 55 -136 397 40 14 228 11 -4 53 -91 -31 30 201 106 134 -56 -60 -32 -81 58 -19 10 82 -32 4 -251
2989 -251 196 66 -69 -73 36 42 66 139 -21 17 -410 -12 39 -160 152 148 132 -57 -99 86 216 143 30 -89
3013 -89 131 -249 68 -125 10 -191 25 -168 -125 -169 -66 237 -23 -30 -34 104 191 154 65 -122 77 30 7 -100
3037 -100 -33 -34 29 156 64 -121 24 36 -132 136 -156 23 78 -43 -158 109 -64 -103 55 -343 88 0 48
3060 48 -64 -1 171 -224 -40 175 24 57 58 -150 151 108 12 -103 22 -22 -50 -120 66 -26 66 -29 -75 81 -39
$$ packed form
2889a48j24J15R1J75P4k48n5N2Q6J7k6K45k60j0J12Nj60o5K22J1n5K1o4j58K59
2914A12r1p3q0J68Q2q7L5r2j2j5J87K5j89J46k2k01l60M07J89j03J22n2j00j70
2938a74o5J93J21k06OO6K0K6J62l43J85L2k62L53m3M2rj15J45l0r7R7j62K5%Q8
2964E5j91N33l57k6K14k17j5N7j44O0O1J71r5K8j90mK8m9J39p7K9P2j14L6k55
2989b51M47j30j35mJ09OK4P3j60L8m27L98N1j99L12mj6j89m2J85J30p3j13j19
3013h9K20l80L17j93J35k01K16j93M3m4J03L03k60pmJ38Q7l7q9j87J99m7k3j07
3037a00O7jO3J27r2j85J45J2j68K68k92J79N5j21j15K67j73l9J58l98M31q8M8
3060D8j12O3J72l95J84K15j51L3Jk08L01m3r6j15J25m4k8p0J86r2R2r5m6J56j20
$$ plain form
3085 -39 -19 122 119 -100 17 164 46 142 53 -61 -30 -290 109 254 7 -220 80 61 -109 -2 -108 124 -87
3108 -87 -172 139 38 138 -90 -122 78 -14 -185 110 135 -35 -146 84 166 -18 201 -163 9 -12 -77 153 -3
3131 -3 -18 -99 30 26 128 -19 -80 -48 116 43 151 87 113 -76 -66 -93 87 24 -219 108 42 6 -168 -131 162 31
3157 31 93 -58 133 26 6 -94 67 158 -195 266 -178 9 -39 91 146 -21 54 -16 -42 45 166 43 -82
3180 -82 129 -142 -311 -239 -146 -26 -110 4 167 -9 -123 -242 -144 6 69 96 104 122 45 5 -181 -46 -9 203
3204 203 -111 -109 35 56 6 -25 31 161 16 -109 50 -54 -187 136 -158 -10 159 -158 80 -88 -96 232 139
3227 139 -72 -74 18 -127 152 179 -274 -65 -205 -15 81 -94 8 -217 86 21 206 58 0 -16 -145 27 -47
3250 -47 30 -67 -70 -34 99 14 -23 17 -117 -77 70 60 -11 41 51 -1 -3 -13 -30 137 27 181 38 125 -17 87 -154
$$ packed form
3085c9K0J41lk19J17J47j18R6q9j14L1k60L99J45k47k27L00j9j70J07j06K32k11
3108h7q5L11j01J00k28l2K00r2j71K95K5j70j11K30Q2j84K19l64J72k1o5K30j56
3131cj5q1J29mJ02j47o1L2J64p3J08o4K6j89J0k7J80o3k43L27o6l6j74L7K93j31
3157C1O2j51J91j07k0j00J61R1l53M61m44J87m8J30N5j67P5p0k6Q7J21j23j25
3180h2K11k71j69P2R3J20q4J14J63j76j14j19R8J50O3K7QJ8p7m0j86J35L7K12
3204B03l14KJ44K1n0l1N6J30j45j25J59j04j33L23k94J48J69l17K38j68qL28r3
3227A39k11kR2j45K79K7m53K09j40J90R6j75J02k25L03o5J85j48n8j6j29J72p4
3250d7P7r7lL6J33q5l7M0j34M0J47j0p1N2J0n2kj0j7J67j10J54j43Q7j42J04k41
$$ plain form
3277 -154 -85 33 161 -50 120 39 16 120 -14 46 -18 -153 -2 387 -124 -161 -115 111 -108 -194 -85 94 -310
3300 -310 -184 -115 -132 46 164 -89 -23 161 38 -22 -21 27 203 18 -192 -134 -147 54 117 139 2 197 -94 -53
3324 -53 -167 -58 -131 86 -249 192 -352 -77 -28 -66 10 193 -59 -78 3 -190 68 -5 41 145 14 61 -90
3347 -90 -61 -63 79 269 -54 197 78 143 3 -139 69 100 -110 -178 -96 318 -140 285 350 36 -90 -97 229 -51
3371 -51 104 80 -89 -114 33 97 -48 110 -71 -191 -57 -74 27 89 -38 -80 -126 -76 -171 -122 -15 -118 116 -90
3395 -90 -33 -150 -143 68 94 31 295 61 17 -95 71 35 -9 115 129 -52 108 96 -157 92 90 -148 91 96 60
3420 60 -48 -25 124 -45 24 -23 45 54 152 -61 -97 27 124 245 -69 242 -184 6 114 -141 17 -43 34 -98
3444 -98 -43 134 -45 -78 -60 43 -57 28 -59 -163 140 24 -38 -187 -50 -118 -41 -170 -99 215 14 -128 -87 135
$$ packed form
3277a54O9J18J28k11J70q1k3J04j34O0o4j35J51L89n11l7M6K26k19q6J09J79m04
3300c10J26O9j7J78J18k53O6J84j23o0JM8J76j85k10N8j3K01O3K2j37J95k91M1
3324e3j14J09p3K17l35M41n44K75M9l8P6J83k52j9Q1j93K58p3M6J04j31M7j51
3347i0K9kJ42J90l23K51j19O5j40j42K08L1k10o8Q2M14m58M25O5l14j26pL26k80
3371e1J55k4j69k5J47O4j45J58j81j20J34j7J01O2j27m2m6N0r5M9J07j03K34k06
3395i0N7j17PK11K6o3K64k34m4j12J66l6m4J24J4j81J60j2k53K49kk38K39Nl6
3420F0j08K3J49j69O9m7O8RR8k13l6J24R7J21l14L11m26J90J08k55J58o0P7j32
3444i8N5J77j79l3J8J03j00Q5q7j04L03j16o2j49J37o8P7j29P1L14k01j42M1K22
$$ plain form
3468 135 165 -63 -53 21 -83 -11 147 -120 -78 -104 107 -123 -76 56 -117 -178 -164 94 -87 134 184 18 -120
3491 -120 -134 -68 33 -36 -97 60 154 53 66 7 -5 127 138 230 -238 137 138 -38 22 145 -44 -83 -145 -36 -49
3516 -49 136 -50 38 172 -47 93 -30 65 14 91 92 -33 -228 98 68 -239 12 -104 181 -112 -100 -28 135
3539 135 -113 32 284 42 -16 -33 226 -32 78 21 1 13 -18 -192 99 -169 76 17 -162 -166 -107 -99 136 -171
3563 -171 13 -88 31 170 -98 220 104 28 27 137 164 3 -170 16 -86 -234 -172 -10 58 60 -191 36 0
3586 0 29 -62 -203 112 -8 -25 22 -169 -140 -69 -69 69 -4 -115 -138 0 54 -168 120 -33 -63 -35 48 119 -154 34
3612 34 -62 -118 220 -96 -301 -27 53 235 -199 45 -96 26 73 282 24 113 24 -80 79 66 -97 -31 -200
3635 -200 -36 -246 41 -203 -90 22 -111 99 6 -41 15 -268 37 -170 -4 129 49 -30 48 -142 -58 54
$$ packed form
3468A35L0k28J0P4j04P2J58k67M2k6K11k30M7J32j73o1J4K58j81K21N0j66j38
3491a20j4O6J01o9o1J57R4j01J3n9j2J32J1R2m68L75Jj76O0J23j89l9o2J09j3
3516d9J85j86Q8J34k19J40j23R5n1P7Jj25j95L26l0l07K51j16K85k93J2P2J63
3539A35k48J45K52k42n8j7K59k58J10n7k0J2l1j74K91k68K45n9j79mN9QK35l07
3563a71J84j01J19J39k68L18j16p6jJ10K7j61j73J86j02j48O2J62O8Kk51K27l6
3586@K9r1j41L15j20j7M7j91K9P1%J38p3j11k3J38N4k22K88j53l0K8Q3P1k73J88
3612C4r6n6L38l16k05K74Q0J82m34K44j41J22M7K09k58Q9q9j04J59j3j63O6j69
3635b00J64k10K87k44J13J12j33K10r3m7N6k83L05k07J66J33q0p9P8j90Q4J12
$$ plain form
3657 54 -9 -72 22 -189 41 -6 -51 58 18 191 -155 -71 34 29 162 101 136 86 125 28 -63 65 -260 -186 109 -172
3683 -172 -22 67 20 -20 207 -19 41 21 94 90 -112 -161 32 39 152 6 173 -42 100 142 93 -92 173 77 -87
3708 -87 -15 -127 -204 -119 212 158 226 -92 163 -107 15 212 44 50 148 37 -123 -117 121 -66 122 -92 -61 44
3732 44 51 -167 250 -82 52 -38 118 -156 74 -112 -149 -79 235 -37 109 39 21 -207 25 -43 -125 146 -158
3755 -158 -317 -13 137 -59 -94 167 67 63 112 242 -56 13 -156 232 122 -115 -27 -34 -70 70 15 -252 23
3778 23 32 124 44 73 128 75 106 35 222 103 -149 -100 -120 85 34 150 89 3 -69 -52 -49 -91 26 -19 -97 -11 76 -63
3806 -63 -162 -143 -174 -32 83 7 -40 93 -163 39 -96 -82 94 99 -69 2 62 85 113 -80 20 -37 -5 46 37 -81
3832 -81 22 72 108 -158 -231 41 60 157 -26 93 -108 21 56 24 51 146 127 -110 -5 151 -15 -67 -104 -95 -83
$$ packed form
3657E4o3o3R4k11K30m7m5J09m0J73l46Q4J05nJ33o1L5n0L9r7r1J28l25P4K95k81
3683a72J50Q9m7m0K27k26O0k0P3mk02m9J93PJ13j46J67k15J42M2m9j85K65r6j64
3708h7P2j12p7Q5L31n4O8l18K55k70J22J97j68OR8j11j60OK38j87J88k14L1J05
3732D4Pk18M17l32J34r0J56k74K30j86l7P0L14k72J46p0j8k28K32o8q2K71l04
3755a58j59L04J50j96l5K61j00mM9J30k98O9j69L88j10k37Q8pl6J40n5k67K75
3778B3RR2q0K9N5n3L1p1J87j19k52M9k0K05n1J16o1q6p2J7Lm2J17m5p8Q6Q7j39
3806f3r9J9l1J42J15p6m7J33k56K02j35J4J76Nj68P1O0K3K8j93J00n7L2N1rj18
3832h1J03N0L6k66p3K72J9R7j83J19k01J29L5l2K7R5j9k37J05J56j66n2l7RJ2
$$ plain form
3857 -83 153 31 -111 -19 -261 -94 53 62 -43 53 3 59 107 122 88 89 182 81 -128 122 17 -44 154 78 -94
3882 -94 10 128 113 -38 -176 156 -172 -41 -92 115 8 -188 75 194 -173 175 -20 64 -127 -55 18 77
3904 77 -109 -152 -61 6 185 -143 -136 -196 -77 219 -23 -8 -28 34 -95 43 35 -83 -164 -61 -51 97 205 -72 -112
$$ packed form
3857h3K36j22j42R2k42J67J47Rj05R6n0N6M8J5l4JR3j01k09K50j05o1J98p6j72
3882i4J04J18j5j51j38L32l28J31n1K07j07j96K63J19l67L48j95Q4j91P2P3N9
3904G7j86m3R1O7J79l28Po0J19K96k42J5k0O2j29J38qj18q1J03J0J48J08k77m0
$$ [...]
8191I8
##END NTUPLES=NMR FID
##END=
