##TITLE=1H_Pr 53-D
 200.13MHz,DMSO
 8 sc
 
 5.12.2025
##JCAMPDX= 6.0         $$ Bruker NMR JCAMP-DX V2.0
##DATA TYPE= NMR FID
##DATA CLASS= NTUPLES
##ORIGIN= UXNMR, Bruker Analytische Messtechnik GmbH
##OWNER= pz
$$ XWIN-NMR		Version 3.5
$$ Fri Dec  5 14:50:25 2025 Russian Standard Time (UT+4h)  she@DPX200
##.OBSERVE FREQUENCY= 200.1313
##.OBSERVE NUCLEUS= ^1H
##.DELAY= (6, 6)
##.ACQUISITION MODE= SIMULTANEOUS
##.ACQUISITION SCHEME= undefined
##.AVERAGES= 8
##.DIGITISER RES= 18
##SPECTROMETER/DATA SYSTEM= spect
##.PULSE SEQUENCE= zg30
##.SOLVENT NAME= DMSO
##.SHIFT REFERENCE= (INTERNAL, DMSO, 0, 14.3821)
##AUDIT TRAIL= $$ (NUMBER, WHEN, WHO, WHERE, WHAT)
$$ ##TITLE= Audit trail, XWIN-NMR		Version 3.5
$$ ##JCAMPDX= 5.01
$$ ##ORIGIN= Bruker BioSpin GmbH
$$ ##OWNER= she
$$ F:/spectra/data/she/nmr/H-C/1/audita.txt
$$ ##AUDIT TRAIL=  $$ (NUMBER, WHEN, WHO, WHERE, WHAT)
(   1,<2025-12-05 14:49:09.75 +0400>,<she>,<DPX200>,
      <created by zg, POWCHK disabled, PULCHK disabled
       configuration hash MD5:
       00 E9 B6 7A A2 85 ED C7 34 08 36 98 17 FE 4E 26
       data hash MD5: 16K
       DF 47 E1 A2 7D D5 C4 96 B0 B0 86 07 17 2A 1C 9D>)
$$ ##END=
$$ 
$$ hash MD5
$$ D2 3F 3A C6 F5 10 83 F9 84 96 67 C2 98 AA 64 95
##$RELAX= 
##$RELAX= 
##$RELAX= 
##$RELAX= 
##$RELAX= 
##$RELAX= 
$$ Bruker specific parameters
$$ --------------------------
##$DU= <F:/spectra>
##$EXPNO= 1
##$NAME= <H-C>
##$PROCNO= 1
##$TYPE= <nmr>
##$USER= <she>
##$AMP= (0..31)
100 100 100 100 100 100 100 100 100 100 100 100 100 100 100 100 100 100 
100 100 100 100 100 100 100 100 100 100 100 100 100 100 
##$AQSEQ= 0
##$AQ_mod= 1
##$AUNM= <au_zg>
##$AUTOPOS= <>
##$BF1= 200.13
##$BF2= 200.13
##$BF3= 200.13
##$BF4= 200.13
##$BF5= 200.13
##$BF6= 200.13
##$BF7= 200.13
##$BF8= 200.13
##$BYTORDA= 1
##$CFDGTYP= 0
##$CFRGTYP= 5
##$CHEMSTR= <none>
##$CNST= (0..31)
1 1 145 1 1 1 1 1 1 1 1 1 1 1 1 1 1 1 1 1 1 1 1 1 1 1 1 1 1 1 1 1 
##$CPDPRG= <>
##$CPDPRG1= <>
##$CPDPRG2= <>
##$CPDPRG3= <>
##$CPDPRG4= <mlev>
##$CPDPRG5= <mlev>
##$CPDPRG6= <mlev>
##$CPDPRG7= <mlev>
##$CPDPRG8= <mlev>
##$CPDPRGB= <>
##$CPDPRGT= <>
##$D= (0..31)
0 0.7 0 0 0 0 0 0 0 0 0 0.03 0 0 0 0 0 0 0 0 0 0 0 0 0 0 0 0 0 0 0 0 
##$DATE= 1764931749
##$DBL= (0..7)
120 120 120 120 120 120 120 120 
##$DBP= (0..7)
150 150 150 150 150 150 150 150 
##$DBP07= 0
##$DBPNAM0= <>
##$DBPNAM1= <>
##$DBPNAM2= <>
##$DBPNAM3= <>
##$DBPNAM4= <>
##$DBPNAM5= <>
##$DBPNAM6= <>
##$DBPNAM7= <>
##$DBPOAL= (0..7)
0.5 0.5 0.5 0.5 0.5 0.5 0.5 0.5 
##$DBPOFFS= (0..7)
0 0 0 0 0 0 0 0 
##$DE= 6
##$DECBNUC= <off>
##$DECIM= 32
##$DECNUC= <off>
##$DECSTAT= 4
##$DIGMOD= 1
##$DIGTYP= 9
##$DL= (0..7)
0 120 120 120 120 120 120 120 
##$DP= (0..7)
150 150 150 150 150 150 150 150 
##$DP07= 0
##$DPNAME0= <>
##$DPNAME1= <>
##$DPNAME2= <>
##$DPNAME3= <>
##$DPNAME4= <>
##$DPNAME5= <>
##$DPNAME6= <>
##$DPNAME7= <>
##$DPOAL= (0..7)
0.5 0.5 0.5 0.5 0.5 0.5 0.5 0.5 
##$DPOFFS= (0..7)
0 0 0 0 0 0 0 0 
##$DQDMODE= 0
##$DR= 18
##$DS= 0
##$DSLIST= <SSSSSSSSSSSSSSS>
##$DSPFIRM= 0
$$ [...]
##$SUBNAM0= <"">
##$SUBNAM1= <"">
##$SUBNAM2= <"">
##$SUBNAM3= <"">
##$SUBNAM4= <"">
##$SUBNAM5= <"">
##$SUBNAM6= <"">
##$SUBNAM7= <"">
##$SUBNAM8= <"">
##$SUBNAM9= <"">
##$SW= 18.0517328524113
##$SWIBOX= (0..15)
0 0 2 0 0 0 0 0 0 0 0 0 0 0 0 0 
##$SW_h= 3612.71676300578
##$TD= 16384
##$TD0= 1
##$TE= 0
##$TE2= 300
##$TE3= 300
##$TEG= 300
##$TL= (0..7)
0 120 120 120 120 120 120 120 
##$TP= (0..7)
150 150 150 150 150 150 150 150 
##$TP07= 0
##$TPNAME0= <>
##$TPNAME1= <>
##$TPNAME2= <>
##$TPNAME3= <>
##$TPNAME4= <>
##$TPNAME5= <>
##$TPNAME6= <>
##$TPNAME7= <>
##$TPOAL= (0..7)
0.5 0.5 0.5 0.5 0.5 0.5 0.5 0.5 
##$TPOFFS= (0..7)
0 0 0 0 0 0 0 0 
##$TUNHIN= 0
##$TUNHOUT= 0
##$TUNXOUT= 0
##$USERA1= <user>
##$USERA2= <user>
##$USERA3= <user>
##$USERA4= <user>
##$USERA5= <user>
##$V9= 5
##$VALIST= <valist>
##$VCLIST= <CCCCCCCCCCCCCCC>
##$VD= 0
##$VDLIST= <DDDDDDDDDDDDDDD>
##$VPLIST= <PPPPPPPPPPPPPPP>
##$VTLIST= <TTTTTTTTTTTTTTT>
##$WBST= 1024
##$WBSW= 4
##$XGAIN= (0..3)
0 0 0 0 
##$XL= 0
##$YL= 0
##$YMAX_a= 436245
##$YMIN_a= -442342
##$ZGOPTNS= <>
##$ZL1= 120
##$ZL2= 120
##$ZL3= 120
##$ZL4= 120
##$ABSF1= 10
##$ABSF2= 0
##$ABSG= 5
##$ABSL= 3
##$ALPHA= 0
##$AQORDER= 0
##$ASSFAC= 0
##$ASSFACI= 0
##$ASSFACX= 0
##$ASSWID= 0
##$AUNMP= <proc_1d>
##$AZFE= 0.1
##$AZFW= 0.1
##$BCFW= 1
##$BC_mod= 2
##$BYTORDP= 1
##$COROFFS= 0
##$CY= -3
##$DATMOD= 1
##$DC= 2
##$DFILT= <>
##$DTYPP= 0
##$F1P= 0
##$F2P= 0
##$FCOR= 0.5
##$FTSIZE= 0
##$FT_mod= 4
##$GAMMA= 1
##$GB= 0.15
##$INTBC= 1
##$INTSCL= 1
##$ISEN= 128
##$LB= 0.25
##$LEV0= 0
##$LPBIN= 0
##$MAXI= 10000
##$MC2= 0
##$MEAN= 0
##$ME_mod= 0
##$MI= 1.114404
##$NCOEF= 0
##$NC_proc= 0
##$NLEV= 6
##$NOISF1= 3.799351
##$NOISF2= 2.8
##$NSP= 1
##$NTH_PI= 0
##$NZP= 0
##$OFFSET= 14.38212
##$PC= 1
##$PHC0= -3345.779
##$PHC1= 8.992341
##$PH_mod= 1
##$PKNL= yes
##$PPARMOD= 0
##$PSCAL= 0
##$PSIGN= 0
##$REVERSE= no
##$SF= 200.129724274929
##$SI= 16384
##$SIGF1= 3
##$SIGF2= 2
##$SINO= 400
##$SIOLD= 16384
##$SREGLST= <1H.CDCl3>
##$SSB= 0
##$STSI= 0
##$STSR= 0
##$SW_p= 3205.1282051282
##$SYMM= 0
##$S_DEV= 0
##$TDeff= 0
##$TDoff= 0
##$TI= <>
##$TILT= no
##$TM1= 0
##$TM2= 0
##$TOPLEV= 0
##$USERP1= <user>
##$USERP2= <user>
##$USERP3= <user>
##$USERP4= <user>
##$USERP5= <user>
##$WDW= 1
##$XDIM= 8192
##$YMAX_p= 0
##$YMIN_p= 0
$$ End of Bruker specific parameters
$$ ---------------------------------
##NTUPLES= NMR FID
##VAR_NAME=  TIME,          FID/REAL,        FID/IMAG
##SYMBOL=    X,             R,               I
##VAR_TYPE=  INDEPENDENT,   DEPENDENT,       DEPENDENT
##VAR_FORM=  AFFN,          ASDF,            ASDF
##VAR_DIM=   8192,          8192,            8192
##UNITS=     SECONDS,       ARBITRARY UNITS, ARBITRARY UNITS
##FACTOR=    0.0002768,     1,               1
##FIRST=     0,             0,               0
##LAST=      2.2672688,     0,               0
##MIN=       0,             -442342,         0
##MAX=       2.2672688,     436245,          0
$$ Real data points
##PAGE= N=1
##DATA TABLE= (X++(R..R)), XYDATA
0@%%%%%%%%%%%%%%%%Qj6J6j6J6j6K1k9L2l2M0m8N2o0O9p7Q5r7J11j23J36j52J70
$$ 0 0 0 0 0 0 0 0 0 0 0 0 0 0 0 0 0 8 -8 8 -8 8 -8 13 -16 16 -16 24 -24 28 -32 37 -40 45 -52 59 -64 72 -80 90
39I0j88K09k32K54k82L12l42L77m15M56n01N52o12O76p46Q27r20J026j149J300
$$ 90 -98 111 -121 133 -149 163 -179 198 -217 239 -262 290 -322 354 -392 435 -485 541 -608 692
59F92j483J707j993K367k884L634m798O815j0934K2329j07769l50025L64283M22994
$$ 692 -791 916 -1077 1290 -1594 2040 -2758 4057 -6877 15452 -92317 -442342 -78059 344935
73C44935j79499l68762P178K65665O6765j06910l8266p4311m0122J84006J39194
$$ 344935 165436 -203326 -196148 69517 136282 29372 -8894 -83205 -123327 60679 199873
84A99873j66728k43591O8652L32099K7494l46447r5496K57342J40810j21180j54535
$$ 199873 33145 -210446 -141794 190305 217799 -128648 -224144 33198 174008 52828 -101707
95a01707K3221J03120J3755R672k9723j26638L8310J84874j2806j77821l9611
$$ -101707 -78486 24634 38389 48061 18338 -108300 -69990 114884 102078 -75743 -115354
106a15354J56789P0430j50863m0816J34708k2630r3678O7771O6426p6852r2073
$$ -115354 41435 111865 -38998 -79814 54894 32264 -61414 6357 72783 -4069 -96142
117i6142P6065J35987r4966j40896J15474J12044j11583r6258R6987J14965j13994
$$ -96142 -20077 115910 20944 -119952 -4478 107566 -4017 -100275 -3288 111677 -2317
128b317j36792J60472J36768j76456j27412J37692J32184q8247j41396P1075J14380
$$ -2317 -139109 21363 158131 -18325 -145737 -8045 124139 35892 -105504 -34429 79951
139G9951p5506m1599P0064l0372o6694N3630R4921l8333j50961K5800J86878j5609
$$ 79951 4445 -37154 32910 2538 -64156 -10526 84395 46062 -104899 -79099 107779 92170
151I2170j65129j6688J07063O1285n8082p1048L1243K2423k26M9843l8555r9446
$$ 92170 -72959 -89647 17416 78701 20619 -50429 -19186 3237 3011 52854 14299 -85147
163h5147M3028J17489L683j28478n7433J40102O7829j26671m3467P7787K3593
$$ -85147 -42119 75370 79053 -49425 -106858 33244 101073 -25598 -69065 8722 32315
174C2315k9018j3783K5822r831n9170N3931Q0949q5112p6678P3893P8158l9519
$$ 32315 3297 -10486 15336 5505 -53665 266 81215 -3897 -80575 -6682 71476 31957
186C1957j00660K2803J10498l5084q0495M4241L7084l3241k0571K7971L2231n2599
$$ 31957 -68703 -45900 64598 29514 -50981 -6740 30344 -2897 -23468 4503 36734 -15865
198a5865l6299Q7459J6681r1262r82O6426J3451n2344l4641O2679K7636o8865
$$ -15865 -52164 35295 51976 -39286 -40268 26158 39609 -12735 -47376 15303 42939 -25926
210b5926K340M7434j7118k0406O264K0095j570m0438K5900M7420n4300k8684N4830
$$ -25926 -23586 23848 6730 -13676 -7412 12683 11113 -29325 -3425 43995 -10305 -38989 15841
223A5841J4424l5821k8663L2516M7499n1567l7445O1794Q539m6188J576K6456
$$ 15841 30265 -5556 -34219 -1703 45796 -5771 -43216 18578 27117 -19071 -17495 8961
235H961J3853l2500k0729N3092J780n4349J8856L0851j3446j4701l128K6624j979
$$ 8961 22814 -9686 -30415 22677 24457 -29892 -11036 19815 6369 -8332 -11460 15164 13185
248A3185m3396L0595L4984m8059j5653L5561J9503j9767m4191K6420N3517m1532
$$ 13185 -30211 384 35368 -12691 -28344 7217 26720 6953 -37238 -10818 42699 1167
260A167l1275L3800O508p778m987k552J4004j6816j995L7306k5679l3620L4367
$$ 1167 -30108 3692 10200 2422 -2565 -5117 8887 -7929 -9924 27382 1703 -31917 2450
273B450K0215j3275k7478o147M9323r57n2730J6613K8154j1172p007o809J2155
$$ 2450 22665 9390 -18088 -24235 25088 24131 -28599 -11986 16168 4996 -2011 -8820 3335
286C335O000k4583J9515J5548l8058O536K9696j0142j4003j0492J8541K3603l5252
$$ 3335 9335 -15248 4267 19815 -18243 -11707 17989 7847 -6156 -16648 1893 25496 -9756
299i756r200L3132j0454j0140P417l456Q459j0928n034L0225j7741k6452K8024
$$ -9756 -18956 14176 3722 -6418 999 -2457 6002 -4926 -9960 20265 2524 -23928 4096
312D096J0642j1256j1574q105L0256K535l4852J4740J2252j4668J1509j998j0032
$$ 4096 14738 3482 -8092 -16197 14059 16594 -18258 -3518 8734 -5934 5575 3577 -6455
325f455M900m800J7386K240l7024J6008K9939j7651j2431n103J2136K4076k6531
$$ -6455 -1555 -6355 11031 13271 -23753 -7745 22194 4543 -7888 -12991 -855 23221 -3310
338c310j6014K6366k336l272K008j4710J1481O036q713J1770j6328j0006L3662
$$ -3310 -19324 7042 4706 1434 3442 -11268 213 6249 -2464 9306 -7022 -17028 16634
351A6634n124k4040N091O017J5595o203k8617J9071J4114j6275P511n925p027
$$ 16634 11510 -12530 -7439 -1422 14173 7970 -20647 -1576 12538 -3737 3774 -2151 -9178
364i178J6729o542j077N836j9961J2850J7522j9284j925N01L74J9111j4902j1820
$$ -9178 7551 1009 -68 5768 -14193 -1343 16179 -3105 -5030 -4529 -4155 14956 54 -11766
378a1766J8230j0232R94J6617j7995m491P844J361J5875j7306k1333K6235O689
$$ -11766 6464 -3768 -2774 13843 -4152 -8643 -799 562 16437 -869 -22202 4033 10722
391A0722q500R34j7697R378K1934j5514m299k076o076K4291j632k0761O101k902
$$ 10722 2222 3156 -14541 -5163 16771 1257 -3042 -5118 -11194 13097 11465 -9296 -3195 -6097
405f097P814J5373k2973n131J4121n922J2046o65k3053Q740Q135M775O971k8024
$$ -6097 1717 17090 -5883 -11014 3107 -2815 9231 8566 -14487 -5747 2388 7163 14134 -13890
419a3890k786L0225n493p231k993j3770J8967J0481j3293K009j3609m09L0855
$$ -13890 -16676 13549 8056 825 -2168 -15938 3029 13510 217 2226 -11383 -11792 19063
432A9063p687j9842l344j350L1651O639m3791k010K4815R882J016l0010o141L3133
$$ 19063 11376 -8466 -11810 -13160 18491 25130 -18661 -20671 4144 14026 15042 -14968 -21109 12024
446A2024j093q180j794j7334J3180J5616j0495K662j2027j0144L0234M866j9782
$$ 12024 10931 2751 957 -16377 -3197 12419 1924 4586 -7441 -17585 12649 17515 -2267
459b267j0277n866L0416J6639m0372q883K2528P826M387k1053j2004K5476n36
$$ -2267 -12544 -18410 12006 28645 -11727 -20610 1918 9744 14131 -6922 -18926 6550 6014
472F014n909Q146j4980q78J0519k073J1840j4451k4216L1495J9583k2451j6958
$$ 6014 105 8251 -6729 -7607 2912 839 12679 -1772 -25988 5507 25090 2639 -14319
485a4319m031K8325J5011l8522n034K8471p08n219j2057j668K2904j3342j4385
$$ -14319 -18350 9975 24986 -13536 -18570 9901 9193 3974 -8083 -9751 13153 -189 -14574
498a4574K4672j483j3904m16P36J9294p892l0316K2706K0900j8768q421r15J3887
$$ -14574 10098 8615 -5289 -5705 -4969 14325 6433 -23883 -1177 19723 955 -7466 -8381 5506
512E506R990k9544M35K8810r474j1610n28N867J8501k0271k1385L0554Q170j9766
$$ 5506 15496 -14048 -13613 15197 5723 -5887 -6415 -548 17953 -2318 -23703 6851 15021 -4745
526d745k539L795J7223o197k9642J9919K1710k3541q572J0684J7056J114l8321
$$ -4745 -7284 -3489 13734 7537 -22105 -2186 19524 -4017 -12589 -1905 15151 16265 -22056
539b2056R57M3563q093k7941l81J5955K1897k1720k7873K7689R910j8956N821
$$ -22056 -21099 22464 14371 -13570 -13951 2004 23901 2181 -25692 1997 11907 -7049 -1228
552a228N599J499q338j4739K7846J2020m1048l859L0737J4350j1631l6909N151
$$ -1228 4371 5870 -2468 -17207 10639 22659 -18389 -22248 8489 22839 11208 -25701 -20550
565b0550M6588r445l0358J27R526J9235m503k2535J1760K043j1986J6787K363
$$ -20550 26038 16593 -13765 -13638 -4112 15123 10620 -11915 -155 1888 -10098 6689 9052
578I052j2765m910l045K6686J1656m3040j1104K9369J7902k773l4995p173M4287
$$ 9052 -3713 -8623 -11668 15018 26674 -16366 -27470 1899 19801 17028 -17967 -25140 19147
591A9147K771l0230n392M815J6376K745j5459J1307l913k1471K1804J6146j7438
$$ 19147 21918 -8312 -13704 -8889 7487 10232 -5227 6080 2167 -19304 2500 18646 1208
604A208j5991l007L2012J8997m4703j7872L0430J4526k760k2562q760K8156m85
$$ 1208 -14783 -17790 14222 33219 -11484 -29356 1074 15600 12840 -9722 -18482 9674 9189
617I189j2282R546j1776q097J6095O102L242j7834j8268L1007J6895k4664j1247
$$ 9189 -3093 6453 -5323 -13420 2675 8777 12019 -5815 -24083 6924 23819 -845 -12092
630a2092k694J5606K3159k1004j7914R559N736J3392o873k4589J1042J2210OP068
$$ -12092 -14786 820 23979 2975 -14939 -5380 356 13748 6875 -17714 -6672 5538 5544 12612
644A2612j7793j0642J7446L111L802m804k3306J4405K4404r582j4538j5086J2131
$$ 12612 -5181 -15823 1623 4734 8536 3732 -19574 -5169 19235 9653 -4885 -19971 -7840
657g840L2266j6406k4463J2236N671O035n68j6233M894K724p79J8875j3144k2075
$$ -7840 24426 8020 -16443 -4207 1464 7499 6931 -9302 -4408 -1684 -2463 16412 3268 -18807
671a8807J6586J0977j84p857j9610J6493K0195j6921n423P40j255J4250o748q548
$$ -18807 -2221 8756 8572 715 -18895 -2402 17793 872 -4551 -3811 -5066 9184 2436 -6112
685f112Q357q425O834J3368j9151l505J1064k188N136o871o162J5264o646o580
$$ -6112 2245 -6180 654 14022 -5129 -8634 2430 242 5378 -1493 -7655 7609 963 -5617
699e617J2925r912l604J0450n170M264j454r939J3006j456j1309J1688k913m878
$$ -5617 7308 -2604 -6208 4242 -928 3336 1882 -8057 4949 3493 -7816 3872 959 -3919
713c919P807o811N078L951j7170R808J0438j2304K331n69k79R331j1238p70J1505
$$ -3919 3888 -2923 2155 6106 -11064 -1256 9182 -3122 -791 -1360 -1639 7692 -3546 -4316 7189
728G189j3245L594J2016j2548R4K965j438R752j1010p880J8110n106o091O774
$$ 7189 -6056 -2462 9554 -2994 -2900 65 -1373 8379 -2631 -10511 7599 2493 -3598 3176
742C176p772N487M278j0999Q901q31j0563J4060j166r794O279l810M861M820j6281
$$ 3176 -4596 891 5169 -5830 3071 2240 -8323 5737 4571 -5223 1056 -2754 2107 6927 -9354
757i354Q066R986j3241M847J821o100P922n144j786R041j1497K587J1751j2601
$$ -9354 -1288 8698 -4543 304 2125 -3975 3947 -1197 -2983 6058 -5439 -2852 8899 -3702
771c702P14N330n129Q122n719p869J5422n322p094Q946o085J552N173r192P501
$$ -3702 -2988 2342 -2787 5335 -384 -8253 7169 1847 -5247 3699 -2386 -834 4339 -4853 2648
786B648j18j0642J3435j227j1878R832j969R1M180j1377O724P728j3489O126M215
$$ 2648 2530 -8112 5323 4096 -7782 2050 81 172 4352 -7025 -301 7427 -6062 64 4279
801D279r316Q241k786m065R408r970P91J1991j1868j14P195o579N827k782o746
$$ 4279 -5037 3204 418 -3647 5761 -4209 -3418 8573 -3295 -3409 3786 -2793 3034 252 -6494
816f494J3173n974p778J2535n195l255O097o989O035J625j1385J0525R47j0131
$$ -6494 6679 705 -7073 5462 267 -2988 3109 -3880 2155 3780 -7605 2920 3867 -6264
830f264R931k592m599P662p606L437O168j3163O146P365j0236M898r28m040J0095
$$ -6264 3667 1075 -3524 4138 -3468 -31 6137 -7026 -880 6485 -3751 1147 219 -3821 6274
845F274q041k872J1279j0149Q82R456j0363K559K536m939R508o913p885J5230
$$ 6274 -1767 -4639 6640 -3509 -2627 6829 -3534 -975 1561 -3378 6130 -783 -8668 6562
859F562m420o202O746o377M434M499j1175P331J342r391J1284j440q473P236m113
$$ 6562 2142 -4060 2686 -3691 743 5242 -5933 1398 2740 -6651 4633 3193 -5280 1956 -2157
874b157K911N843j3983N013R696j0548L968J077p328R231k863l111P165j0823
$$ -2157 754 6597 -7386 -2373 7323 -3225 743 1820 -5508 3723 860 -2251 4914 -5909
888e909K299J3732j2179j998M881l182Q368n329q522J2981m365n771J1143o696
$$ -5909 -3610 10122 -2057 -4055 826 -2356 6012 683 -7839 5142 777 -4994 6149 -547
902e47l363M579k946R483l998j6662J4539Q092j1031M71l642N002R399j3735J113
$$ -547 -3910 669 -2277 7206 3208 -13454 1085 9177 -1854 -1383 -5025 -23 9376 -4359 -3246
917c246Q656j1119O046O142r283K809l631J047J4150j2634q986J2235j251L208
$$ -3246 5410 -5709 337 6479 -2804 5 -3626 -2579 11571 -1063 -10049 2186 935 4143
931D143k63j3747Q916O941o082M028r378l332J8208m729r231M128l922O914L189
$$ 4143 3880 -9867 -951 5990 -92 3936 -5442 -8774 9434 4705 -4526 -398 -4320 2594 5783
946E783j0656O677l209p146J8371r45j7067J079M851J3632k138k6365R192K2593
$$ 5783 -4873 1804 -1405 -8551 9820 8875 -8192 -7113 -2262 11370 9232 -17133 -7941 14652
960A4652r636q640l394M357J1989j2265j842J4687j3755n555J6378j60o902j0596
$$ 14652 5016 -3624 -7018 -2661 9328 -2937 -4779 9908 -3847 -9402 6976 6816 -86 -10682
974a0682J800K5528p465k3998J0272R061N87j138j3270N961J0482r638N280M16
$$ -10682 -8882 16646 9181 -14817 -4545 4516 5103 3965 -9305 -3344 7138 -2500 2780 3196
988C196j1341Q584K174k711N453j1694l94J4845n387j350k651j0310J5222Q839
$$ 3196 -8145 439 2613 -98 5355 -6339 -6733 8112 2725 1375 -1276 -11586 3636 12475
1002A2475j5949l539K483J1224O468k3298j544K1437p568o636O350k13J476r747
$$ 12475 -3474 -7013 -4530 6694 13162 -10136 -11680 9757 2189 -4447 1903 1690 3166 -6581
1016f581R87K0779j4150j9683J9622J2858o922j5291p267K5700M466k6651M919
$$ -6581 -5594 15185 1035 -18648 974 13832 6910 -8381 -15648 10052 14518 -12133 -7214
1029g214J4337m453k826l890O515L811j8033R118J8337j7150q883R323O158M039
$$ -7214 7123 2670 -156 -4046 2469 6280 -11753 -2635 15702 -1448 -10331 -1008 5150 9189
1043I189j4995o106J8352k124o640N233q473M315R020r950L86J24k705J2131n547
$$ 9189 -5806 -11912 6440 4316 -2324 2909 -5564 -1249 7771 -2179 -1793 -1669 -4374 7757 2210
1058B210q449J0997m843n153Q029k892J527k776n974J7724j444k3483Q613J3778
$$ 2210 -6239 4758 -85 -5238 2791 -101 1426 -1350 -7324 10400 8956 -14527 -5914 7864
1072G864l142p181p666J5370Q087k3877K890J7895j0060o200M140P001L990j8320
$$ 7864 4722 -2459 -10125 5245 13332 -10545 -7655 10240 180 -6020 -1880 5121 9111 -9209
1086i209k7K2538j0329j3837R658N192K449q905o900J8236l847j6199J2448M209
$$ -9209 -9236 13302 2973 -10864 -1206 3986 6435 -2470 -9370 8866 5019 -11180 1268 5477
1100E477p420R77k085Q222k51j4853J0422O418j3694O514M647n232K188m122L329
$$ 5477 -1943 -966 -3051 5171 4920 -9933 489 6907 -6787 -273 4374 -858 1330 -2792 537
1115E37M694j3721N896J2459j2304l11N818l582K436o872J162J3241j1881n220
$$ 537 5231 -8490 -2594 9865 -2439 -2750 3068 -514 1922 -4950 -3788 9453 -2428 -7648
1129g648J5458m733p073Q91J113R855q833r523J8557j062j5359O911M480p08l689
$$ -7648 7810 3077 -3996 -3105 -1992 7863 -970 -10493 8064 7002 -8357 -1446 3034 2326 -1363
1144a363o567J4332J821j8894R129J0049j0136j545K79M946M587j4132N296J2867
$$ -1363 -7930 6402 8223 -10671 -1542 8507 -1629 -3174 -2895 2051 6638 -7494 -2198 10669
1158A0669j4658k158R588k403L05n394J196J3365j2182p719J5363l666o558L592
$$ 10669 -3989 -6147 3441 1038 1343 -4051 -2855 10510 -1672 -9391 5972 2306 -4252 -660
1172f60L73N797n803q219J4994k384j3323R805L936m595L77n031Q418J279j4245
$$ -660 -287 5510 -293 -8512 6482 4098 -9225 580 4516 -79 298 -4733 3685 4964 -9281
1187i281R529P297j1975K829L850j399J730q857N580R495j4301L42J1766o196
$$ -9281 248 7545 -4430 -1601 2249 850 2580 -6277 -697 8798 -5503 -5161 6605 409
1201D09j904j33N08P634j0060l142J4989o776p983Q799p71J59l872l862J3336
$$ 409 -1495 -1628 -1120 6514 -3546 -6688 8301 1525 -6458 2341 1570 1729 -2143 -6005 7331
1216G331m390j2522J2757K661q952J836j214N693K18j1411R365O707j3618L338
$$ 7331 2941 -9581 3176 5837 -3115 -1279 -2493 3200 3418 -7993 1372 8079 -5539 -2201
1230b201N502l851J718n468L941Q671j2827j82J1459p510j685K883j311N485o705
$$ -2201 3301 -550 1168 -4300 -359 8312 -4515 -4697 6762 -748 -2433 450 -861 4624 -2081
1245b081l190J2794p166p226J0493j800k626O61l561Q746k831r665J0908M38r012
$$ -2081 -5271 7523 357 -6869 3624 1824 -802 -141 -3702 5044 2213 -7452 3456 3894 -5118
1260e118O225k06l95J472p588P459M356j3080N483O458o915K118j762J014N830
$$ -5118 1107 901 506 1978 -5610 1849 6205 -6875 -1392 5066 -1849 269 -1493 -479 5351
1275E351j0126J645J0492r850j514P200l170J573l755j939J1260p474o661J1415
$$ 5351 -4775 -3130 7362 -2488 -4002 3198 28 1601 -2154 -4093 7167 -307 -6968 4447
1289D447k988l649L247k909M470j479p422J0415l02r882P168M57k206K419o029
$$ 4447 1459 -2190 1057 -1852 2618 1139 -6283 4132 3830 -6052 1116 1573 -633 1786 -4243
1304d243N414M387j1227M660N700p663L087K94j597N456p620Q98Q564q685q61
$$ -4243 1171 5558 -5669 -1009 4691 -2972 115 409 -1188 4268 -3352 -2454 6110 -2575 -3436
1319c436P437n380J399O3l038P472n184m594J0535m933m193O342l212J262O94
$$ -3436 4001 -1379 20 83 -2955 4517 -667 -5261 5274 341 -3852 2490 -722 540 1234
1334A234n397P837r50r113Q361Q45n418L684l249L225L341j0110N439N919r113
$$ 1234 -4163 3674 2724 -6389 1972 2817 -2601 1083 -2166 1059 4400 -5710 -271 5648 -3465
1349c465K849K662l393L881m644K53P693q685m83Q106n876L72J440l606O079k842
$$ -3465 -616 2046 -1347 2534 -2110 -1857 5836 -2849 -3332 4774 -1102 -730 710 -2896 3183 341
1365C41n097Q811l841l853P245m466j0K598m965N670Oq116P446J350o657M905
$$ 341 -4756 4055 214 -3639 3606 -860 -870 1728 -3237 2433 2439 -5677 1769 3119 -3538 1367
1381A367j672l33L760o633L816M426r554M145M514n688K772k146l54O734p519
$$ 1367 -305 -638 3122 -3511 305 4731 -4823 -678 3836 -1852 920 -1226 -1580 5154 -2365
1396b365j417Q739n809m33L313m511M776j231n773Q574l049m956O779k573j114
$$ -2365 -3782 4957 -852 -1285 2028 -2483 2293 1062 -4711 3863 814 -4142 2637 64 -1050
1411a050L508n565L932K026p173N822L11n833O818j961l588M993m336K044L253
$$ -1050 2458 -3107 825 2851 -4322 1500 1811 -4022 2796 835 -2753 2240 -2096 -52 3201
1426C201p941N073M115p946L404J254k564M065m952L09Q035q393j288P193m121
$$ 3201 -4740 333 4448 -3498 -94 1160 -1404 2661 -2291 -1982 6053 -2340 -3628 3565 -556
1441e56L83o02k391Q417m312p089R332j009m781L105k422L820J141q247O630K802
$$ -556 -173 -775 -3166 5251 939 -6150 3182 2173 -2608 497 -1925 1895 3036 -5211 1419 4221
1457D221q134M146M84j745M191o213Q98P228o730l5L610m450M467o82n635O888
$$ 4221 -3913 233 717 -1028 3163 -3050 -2152 5076 -1654 -1689 1921 -2529 1938 1256 -4379 2509
1473B509j302l181M582n095J214N438o853J582M237m620K838j986k075P206n258
$$ 2509 1207 -1974 2608 -2487 -1273 4165 -2688 -1106 3131 -1489 1349 -637 -2712 4494 -764
1488g64m249R315k266l838J434k352O038p28r506Q198L574p343K209l91Q72K977
$$ -764 -5013 4302 2036 -1802 -368 -2720 3318 2590 -6916 1282 4856 -2487 -278 -669 203 3180
1504C180q124L785P622q856j67M518j779K258n312j135R997m950n566O214j273
$$ 3180 -4944 -1159 6463 -2393 -2560 1958 179 2437 -2875 -4010 5987 1037 -4529 1685 412
1519D12O07K0n121N881M65o265O029m54m009M885l700o45N099n863K008K902l886
$$ 412 1019 1039 -4082 1799 2264 -4001 2028 1574 -2435 2450 -1250 -1895 3204 -2659 -651 2251 -1635
1536a635M032j506n918P311m70m684M067k059J830K374p951L499N113o777K163
$$ -1635 2397 891 -5027 2284 1814 -2870 1197 -862 968 3342 -4609 -1110 4003 -2774 -611
1551f11J914j486L213n883q2Q910o938l779P324q04m96k638k413Q519k925p907
$$ -611 1303 -183 3030 -2853 -2935 5975 -963 -4742 2582 1778 1282 -1356 -3769 4750 1825 -6082
1567f082P785K90l745K727k606K948J648p599M448L722o358L084M30j487M121
$$ -6082 1703 1993 -1752 975 -1631 1317 2965 -4634 -186 3536 -2822 262 692 -795 3326
1582C326n645k4N929n898N00N235m811J985P16l545M327l187k177P378m179j777
$$ 3326 -2319 -2343 3586 -2312 -1812 3423 -1388 597 1313 -2232 2095 -1092 -3269 4109 -70 -1847
1598a847N825n604L4K844l092L534j491l474P844l417n510O184j530r09J639m400
$$ -1847 3978 -1626 -1592 1252 -1840 1694 203 -3271 4573 1156 -4354 1830 300 -609 1030 -3370
1614c370N651J325q216M530L342n066J561r80J175M296p713K079O389o946m72
$$ -3370 2281 3606 -4610 -80 3262 -1804 -243 -1223 -48 4248 -3465 -1386 5003 -1943 -2415
1629b415M207k427J771j963n44O281o002l435P883l385j832K459k053L826r33
$$ -2415 1792 -635 1136 -827 -1371 4910 -1092 -4527 3356 -29 -1861 598 -1455 2371 1438
1644A438n943O108K7n026M495j002k17K616n157K840K513o851M466K721n465L054
$$ 1438 -4505 1603 1630 -3396 1099 97 -120 2496 -2661 179 2692 -4159 307 3028 -2437 617
1660F17N55j927K666m889K131N345p685J217N443m256O98J35j846M802m058k165
$$ 617 1172 -755 1911 -2978 -847 4498 -3187 -1970 3473 -783 -85 50 -1796 3006 -1052 -3217
1676c217O825l805k177M992l268O52J73l499O147j326o009O512N74m525J915j720
$$ -3217 3608 -197 -2374 2618 -650 2 175 -3324 2823 1497 -4512 2000 2574 -1951 -36 -1756
1692a756K955J780p698M970M143p211J811J830j583K417l358N41N507o228j70
$$ -1756 1199 2979 -4719 251 4394 -2817 -1006 824 -759 1658 -1700 -1159 4348 -1880 -2050
1707b050N136m863Q97J962k394L500k700k318O581l859l386N491j993K22M51l493
$$ -2050 3086 -1777 -880 1082 -1312 2188 -512 -2830 3751 -108 -3494 1997 4 226 677 -2816
1723b816N184k74o291N503K63l969L787j740o4K509m674K987K361o689L866L250
$$ -2816 2368 2094 -4197 1306 1569 -2400 1387 -353 -417 2092 -2582 405 2766 -3923 -57 3193
1739C193m907J918o98O2L864o407R44O073n043m66K624k286K842k008k887O557
$$ 3193 -1714 204 -494 -432 3432 -2975 -2031 4042 -1001 -1467 1157 -1129 1713 -295 -3182 3375
1755C375l183l109N464k725j076K511k581K535l91m288N923p5o349M798L5j107
$$ 3375 192 -2917 2547 -178 -1254 1257 -1324 1211 820 -3468 2455 2380 -3969 829 864 -243
1771b43J221l844L172L663p072K065L600l880K326j123j633M746l756j041M843
$$ -243 978 -2866 306 3969 -3103 -1038 2562 -1318 1008 -115 -1748 2998 -758 -1799 3044
1786C044m572L07L888m283J779N91k513M479l040l038O488k627k507L631k710
$$ 3044 -1528 -1221 2667 -1616 163 754 -1759 2720 -320 -3358 3130 503 -2004 1627 -1083
1801a083J750J112n009M285P05m722M405r67k137L626k474K5K693m723L105K664
$$ -1083 667 1779 -3230 1055 1760 -2962 1443 476 -1661 1965 -509 -484 2209 -2514 591 3255
1817C255o516L085K075k497J714k879M89N572n879j156N303l129P85J40k956M957
$$ 3255 -3261 -176 1899 -598 1116 -1763 -1274 4298 -1581 -2737 2566 -563 222 362 -2594 2363
1833B363j185m413N169j669k081L898l108L01K555l543L172P3m856M733L69l928
$$ 2363 1178 -3235 1934 265 -1816 2082 -1026 -725 1830 -1713 1459 1532 -3324 1409 1778 -2150
1849b150K934j278j01L060m884J602L801n133K252J320l559L616q31k624M206
$$ -2150 784 -494 -595 2465 -2419 -817 2984 -2149 103 1423 -2136 1480 649 -1975 2231
1864B231l524J86M271n001N18L703l315J745q31k544N647k591m108N312j205r67
$$ 2231 -1293 -1107 3164 -1837 -1319 2384 -931 814 -17 -2561 3086 495 -3613 1699 494 -473
1880d73J459l631L573J628n484L179J246l319L754k329j297L957l486N59K929
$$ -473 986 -2645 928 2556 -2928 251 1497 -1822 1932 -397 -1694 2263 -1223 -664 2265
1895B265m728K352K478m148K317j39j824L867l309r69M932l919l88K827l343K034
$$ 2265 -2463 -111 2367 -1781 536 397 -1427 2440 -869 -1838 3094 -825 -1213 1614 -1729 305
1911C05J242l702L558r80k041M500l429j731M619k678J72Q95l482M523L85o115
$$ 305 1547 -2155 1403 423 -1618 2882 -547 -2278 2341 -337 -165 730 -2752 1771 2156 -3959
1927c959M169J534k175J718l724J683M512n643KL737k859J535k26k617M717k216
$$ -3959 210 1744 -431 1287 -2437 -754 3758 -1885 -1883 1854 -1005 530 304 -2313 2404 188
1943A88k308M269l124n28L868l930J424J730l588L219m10l706M828j473k057L470
$$ 188 -2120 2149 -975 -1503 2365 -1565 -141 1589 -1999 1220 810 -2896 1932 459 -1598 1872
1959A872l216R16L017m724J667K018l612L839p00l983M639p13k309K090k786K519
$$ 1872 -1344 -428 2589 -2135 -468 1550 -2062 1777 1077 -2906 1733 1020 -1289 801 -1985 534
1975E34K766o425J967L742l516J555j797j96N088m615k007N567k769o35J392k914
$$ 534 3300 -3125 -1158 2584 -932 623 -1174 -1370 3718 -897 -2904 2663 -106 -741 651 -2263
1991b263L704k7m433M396l16k909L055j816k53K372l722K815K042n458K882K010
$$ -2263 1441 1414 -3019 1377 1061 -1848 1207 -609 -862 1510 -2212 603 2645 -2813 69 2079
2007B079m034K552j092q10M092l694o82L728l264J299J089m438M155Q45l688K764
$$ 2079 -1955 597 -495 -1305 2787 -907 -1589 2139 -1125 174 1263 -3175 980 1825 -1863 901
2023I01j466j21L459m791K66M753l311M3K68j921M610j987m511N677l64k986K252
$$ 901 -565 -686 2773 -2018 -1752 3001 -310 -267 1 -1920 2690 703 -3808 1869 1505 -1481 771
2040G71k140J716J664n229L512J858m669L061P68k394K045k144M61L433n071J209
$$ 771 -1369 347 2011 -3218 294 2152 -2517 544 1312 -1082 963 -1181 -720 2713 -2358 -1149
2056a149M338l897L34L49j701L989k371l191N798j571j941K369k815J743J428
$$ -1149 3189 -708 -374 -25 -1726 2263 -108 -3299 2499 928 -1013 1356 -1459 284 1712
2071A712m832L419J279l291L994k471k634M970k128j233K285k454K654P95n461
$$ 1712 -3120 299 1578 -1713 2281 -190 -2824 2146 18 -1215 1070 -1384 1270 2065 -3396
2086c396L826J136l373K763j406k25L372m141O36L286m428J274K360l362K437
$$ -3396 430 1566 -1807 956 -450 -675 2697 -1444 -808 2478 -1950 -676 1684 -1678 759
2101G59o75j452M343l972j732N407k565j648J998j245K901q84m745M913L23m400
$$ 759 84 -1368 2975 -997 -2729 2678 113 -1535 463 -782 2119 1235 -3510 1403 1726 -2674
2117b674L406m32k83K488m455J154K855l810J877J093l229L354o48k307L094k728
$$ -2674 732 300 17 2505 -1950 -796 2059 -1751 126 1219 -2010 1344 696 -1611 1483 -1245
2133a245K13L609m352N02L335l077J356r6k008M392k642k172M529k674q90K958
$$ -1245 -1032 2577 -1775 -1273 2062 -1015 341 245 -1763 2629 -13 -2185 2344 -330 -1220 1738
2149A738k567O46P43k560L646q87l876N160o60l129K368j676J432J424m649L233
$$ 1738 -829 -183 560 -2000 1646 759 -3117 2043 1383 -1746 622 -1054 378 1802 -2847 386
2165C86K686n008J513M86p63K618k946n33M749l892o78L114l124J372R42k338
$$ 386 3072 -1936 -423 63 -700 1918 -1028 -1561 3188 -704 -1382 1732 -1392 -20 922 -1416
2181a416L007j404k188M531l049j646L934j723k31J060k701L330k27m343L872
$$ -1416 1591 187 -2001 2530 -519 -2165 1769 46 -185 875 -1826 1504 1277 -3066 806
2196H06M24k699K944k185k5K748l860J645J993m216K774J427l229K122q50n01
$$ 806 1230 -1469 1475 -710 -735 2013 -1847 -202 1791 -2425 349 1776 -1453 669 -181 -682
2212f82L099m394M00M668l910k19J782j260J903j693k549N184j835k718M095k018
$$ -682 2417 -1977 -1577 3091 -819 -1038 744 -516 1387 -306 -2855 2329 494 -2224 1871 -147
2228a47o42K229k939J997M44l155L745j85l804L661r05j340K340l020J966K546
$$ -147 -789 1440 -1499 498 942 -2213 1532 1347 -2457 1204 299 -1041 1299 -1721 245 2791
2244B791m833J370K613l392J736l99j001L451l405n79M050l372j26K812k604P29
$$ 2791 -2042 -672 1941 -1451 285 -114 -1115 2336 -1069 -1648 2402 -970 -1096 1716 -888 -159
2260a59Q80k061L330k227k162M740k272j487K440j992J579P14l803L347R26m110
$$ -159 721 -1340 1990 -237 -2399 2341 69 -1418 1022 -970 609 1323 -2480 867 1793 -2317
2276b317K975l37j182K496k594N70K210l752J847K248l969K007R59k053K061j933
$$ -2317 658 321 -861 1635 -959 -389 1821 -1931 -84 2164 -1805 202 1161 -892 1169 -764
2292g64l91L850l660o78M076l099M54O05k290L667j464k822M196j411j853L124
$$ -764 -1155 2695 -965 -1643 2433 -666 -212 393 -1897 1770 306 -2516 1680 269 -1584 1540
2308A540j879J04J318l337K896R40m151L087O86k647K328j404j23K682l857J469
$$ 1540 -339 -235 1083 -2254 642 1582 -2569 518 1204 -1443 885 -519 -642 2040 -1817 -348
2324c48K495l613J172J286k391K615j255j712L656k454n86L397l418P38J745k388
$$ -348 2147 -1466 -294 992 -1399 1216 -39 -1751 1905 -549 -1135 2262 -1156 -418 1327 -1061
2340a061J846n42j899L850j845k948M205j302j104J618k221K253N16l756K821
$$ -1061 785 243 -1656 2194 349 -2599 1606 304 -800 818 -1403 850 1366 -2390 431
2355D31J115l001K164l99j402K735k972P13K762l581R58K090k792J698l39j528
$$ 431 1546 -1455 709 310 -1092 1643 -1329 -616 2146 -1435 -477 1613 -1179 519 180 -1348
2371a348K992j928j411L687k513m95K443k724K079N08l400L153l93k301L318j952
$$ -1348 1644 -284 -1695 1992 -521 -1016 1427 -1297 782 1290 -2110 1043 650 -1651 1667 -285
2387b85q56K762k535N83J421k598K367N85l776L244r8j909K143k143P34K202l384
$$ -285 -1141 1621 -914 -331 1090 -1508 859 1444 -2332 912 814 -1095 1048 -1095 -361 1841 -1543
2404a543P05K707l234J377M82j869K855j863j345L739k584q24L024k453R03P09
$$ -1543 -838 1869 -1365 12 494 -1375 1480 -383 -1728 2011 -573 -1397 1627 -826 77 786
2420G86k804L182l45l068L533q88j575K253j842N07J724l057J669J501l257K153
$$ 786 -2018 1164 819 -2249 1284 396 -1179 1074 -768 -261 1463 -1594 75 1576 -1681 472
2436D72J27k159K952j537j144K802k282N77J778l208J753J314k929K148q33r78
$$ 472 599 -1560 1392 -145 -1289 1513 -769 -192 1586 -1622 131 1445 -1484 664 -169 -1147
2452a147K797k051j263L390k227l09K025k346J956j59k659L583q41k671K881j109
$$ -1147 1650 -401 -1664 1726 -501 -810 1215 -1131 825 666 -1993 1590 749 -1922 959 -150
2468a50n17J757k471J393J698l275J916R29k695J845q20r70L312k462q01K973
$$ -150 -667 1090 -1381 12 1710 -1565 351 1280 -1415 430 -390 -1360 1952 -510 -1311 1662
2484A662k270J15J152k064K426j77k507K950j424j380L302k564J36K222k203L94
$$ 1662 -608 -493 659 -1405 1021 844 -1663 1287 -137 -1517 1785 -779 -643 1579 -624 -230
2500b30J253k391K366l63k233L007j260j521K584j557k4J548k870K117J114l310
$$ -230 1023 -1368 998 635 -1598 1409 149 -1372 1212 -345 -369 1179 -1691 426 1540 -1770
2516a770K176M81j822J751j578n0K672l119M92K615k927J156M96j790K286j078
$$ -1770 406 887 -935 816 -762 -812 1860 -1259 -767 1848 -1079 77 573 -1217 1069 -9
2532ij677L470j591j298K069j837N02J419k517J944N17k256K269o21j679K623
$$ -9 -1686 1784 193 -1105 964 -873 -371 1048 -1469 475 992 -1264 1005 384 -1295 1328
2548A328j992m7K234k653J201J347k682J508O47k387J925m59p78K386k367KK447
$$ 1328 -664 -711 1523 -1130 71 1418 -1264 244 891 -1496 429 -30 -808 1578 -789 -787 1660
2565A660k962O53J688k197J710k74j429K759j933j562L421j798l45J532j965J603
$$ 1660 -1302 -649 1039 -1158 552 278 -1151 1608 -325 -1887 1534 -264 -609 923 -1042 561
2581E61M81k645K375j16k096K036p64p6J412k253P92J984k985J146J366k239J821
$$ 561 1042 -1603 772 656 -1440 596 -168 -244 1168 -1085 -293 1691 -1294 -148 1218 -1021 800
2598H00p85j119K342k098K6K097k388J137J503k617J462K56k152K674j187j087
$$ 800 15 -1104 1238 -860 -834 1263 -1125 12 1515 -1102 360 616 -1536 1138 -49 -1136
2614a136K804k076o16K066j592K42R75k178K330K27k879K655j92j759J638j382
$$ -1136 1668 -408 -1024 1042 -550 -308 667 -1511 819 1046 -1833 822 630 -1129 509 -873
2630h73R24J318k794J587J723l176J251M69j368K136j723r5K429k459k43K062
$$ -873 51 1369 -1425 162 1885 -1291 -40 429 -939 1197 -526 -621 1808 -651 -894 1168
2646A168k382J320Q95j948J907l22k116K538j305r41K076j238L16J119k313J733
$$ 1168 -1214 106 1001 -947 960 638 -1478 1060 -245 -1186 890 -348 -32 1087 -1226 507
2662E07L61k759K660l37j713K194j107l46J408j868R46J434k897J604J092k189
$$ 507 868 -1891 769 432 -1281 913 -194 -540 868 -1000 -54 1380 -1517 87 1179 -1010
2678a010J669n66q23J889j933l09K696k335K90J548j862J632q03j789L209j058
$$ -1010 659 93 -730 1159 -774 -1083 1613 -722 -432 1116 -746 886 83 -1706 1503 445
2694D45j734K400j109j86R04j848J353N40k201K406j05j963J972p46r06J962j669
$$ 445 -1289 1111 2 -184 720 -1128 225 765 -1436 970 865 -1098 874 128 -778 1184 -485
2711d85L24J698k538J198R68k396J733j3j359K138j833l79K587k116n10J858j495
$$ -485 -161 1537 -1001 197 1165 -1231 502 489 -870 1268 -565 -944 1643 -473 -983 875 -620
2728f20P51L90j530K140r20j976K714q62j242K006j162P09nj833K034M58k300
$$ -620 131 521 -1009 1131 211 -1765 949 87 -1155 851 -311 398 393 -1440 594 1052 -1248
2745a248J825n01q66J928j514J15J812k747R28J753k354J120K24j261J442p55
$$ -1248 577 76 -790 1138 -376 -261 1551 -1196 -268 1485 -869 251 475 -786 656 -99
2761i9q09K317j938l58K249k161O82O65j493J791q17j374K698j057j375J737n84
$$ -99 -908 1409 -529 -887 1362 -799 -117 548 -945 846 29 -1345 1353 296 -1079 658 74
2778G4r1Q49j917J408M51k381J911L29j748J741p19k55J584k028R23J248k423
$$ 74 -17 832 -1085 323 774 -1607 304 633 -1115 626 -93 -348 1236 -792 131 1379 -1044
2795a044O92J082j270J356r50q38K391j714j034K502j434j16J321j941J326R7
$$ -1044 -352 730 -540 816 -134 -972 1419 -295 -1329 1173 -261 -377 944 -997 329 426
2811D26j798K233m25j334J950j170n97J590j848J057P88k340J757N16k072J698
$$ 426 -1372 861 436 -898 1052 -118 -715 875 -973 84 872 -1468 289 805 -1267 431
2827D31k10q69J802j839j0J815k343R67J439j847M53K42q61K175j617q52K289
$$ 431 221 -648 1154 -685 -695 1120 -1223 -256 1183 -664 -211 31 -830 1345 -272 -1124 1165
2844A165j407m52J587j430P19L30j676J939m74j773K320q10q32J515j206L73J103
$$ 1165 -242 -694 893 -537 182 512 -1164 775 301 -1472 848 38 -794 721 -485 -112 991
2861I91k042J199N97j812J654j68j245J725j123r2J412k251Q19J694k355J068
$$ 991 -1051 148 745 -1067 587 419 -826 899 -224 -316 1096 -1155 -336 1358 -997 71
2877G1O17j413J512j191k84J999j733n30K094j554J33Q79j568J524k04j688K215
$$ 71 688 -725 787 -404 -688 1311 -422 -952 1142 -412 -279 600 -968 556 352 -1336 879
2894H79m67j208J542j129K96R52k246J212J394k582J622J21j193J431o17p27J882
$$ 879 412 -796 746 -383 -87 865 -1381 -169 1225 -1357 265 386 -807 624 7 -720 1162
2911A162j844K72J792k391J387K29j693J573k92j113J588r55n06J765j400j24
$$ 1162 -682 -410 1382 -1009 378 607 -1086 487 195 -918 670 -285 -791 974 -426 -550
2927e50J523j492P11J69j270J949p60j487K022q93k55J148j465Q00J076k452J403
$$ -550 973 -519 192 361 -909 1040 280 -1207 815 -78 -333 815 -650 150 1226 -1226 177
2944A77P46j945J497k69n62J466j715K56J776k210L29J322j555J137j35j448K161
$$ 177 923 -1022 475 206 -356 1110 -605 -349 1427 -783 -454 868 -687 450 315 -1133 1028
2961A028o71j377J952j152j42J207j479Q43P84k017J707m60j148J851p06j038
$$ 1028 357 -1020 932 -220 -362 845 -634 209 993 -1024 683 223 -925 926 220 -818
2977h18J508j123L97R40j795J089N61j915J419L1j288J568o09n18J892k104M59
$$ -818 690 -433 -36 904 -891 198 759 -1156 263 294 -994 574 -35 -553 1339 -765 -306
2994c06J310j645P08N73j499J661n90j407K164r14p57J623j452L71Q06j995J510
$$ -306 1004 -641 67 640 -859 802 212 -1195 969 55 -702 921 -531 -160 646 -1349 161
3011A61N57j520J171j07j170J616j068k00J498j560M51J051j662J184R6j410J560
$$ 161 718 -802 369 262 -908 708 -360 -560 938 -622 -171 880 -782 402 498 -912 648
3028F48p19p89J690r83k99J357j985Q84Q66j553J209P3j529K139r52r80K036j213
$$ 648 -71 -860 830 -153 -452 905 -1080 -196 670 -883 326 399 -1130 1009 57 -923 1113 -100
3046a00j55J018j464J352j6k059J875J68j634J606n87k89J157j390J92J012j360
$$ -100 -255 763 -701 651 635 -1424 451 619 -1015 591 4 -285 872 -518 -326 686 -674
3063f74Q42L18j581J839p40j025J999j148p89J975j634N06J016j798J047K71j521
$$ -674 168 486 -1095 744 4 -1021 978 -170 -959 1016 -618 -112 904 -894 153 424 -1097
3080a097J737o52o75J844j483n28J401j004M81N92j754J777j12j691J848o11p08
$$ -1097 640 -12 -687 1157 -326 -854 547 -457 24 616 -1138 639 527 -1164 684 73 -635
3097f35J580j588L67J347j832O31J156j754O43N76r28J426j228m25K024j711j73
$$ -635 945 -643 -276 1071 -761 -130 1026 -728 -85 491 -437 989 -239 -664 1360 -351 -524
3114e24J210j407Q06N76j759J983m57j453J837o71p39J265j151N34R22j430O98
$$ -524 686 -721 85 661 -1098 885 428 -1025 812 141 -598 667 -484 50 972 -458 240
3131B40K09j406J569n63o93J402q91j77J140j512L69J026j548P42Q58j323J002
$$ 240 449 -957 612 49 -644 758 -133 -310 830 -682 -313 713 -835 -93 765 -558 444
3148D44l50q41J398r56l71J790j469J12J125j356Q99k27j311J957o60j158J752
$$ 444 94 -747 651 -305 -676 1114 -355 -243 882 -474 425 198 -1113 844 184 -974 778
3165G78r89j41R32j314P81O26j569J212K12q49P61n46l90J489j643M61J505j897
$$ 778 -211 -352 580 -734 47 673 -896 316 528 -321 440 -106 -496 993 -650 -189 1316 -581
3183e81P20M04j399J291l36p10J025o21n92J853j762L54J104j459J002K21j302
$$ -581 139 543 -856 435 99 -611 414 -207 -799 1054 -708 -354 750 -709 293 514 -788
3200g88J495n86q89J679j048k82J281j265N07P78j839J472L64j982J436j16r18
$$ -788 707 121 -768 911 -137 -419 862 -403 104 882 -957 515 879 -1103 333 217 -701
3217g01J378j084J09J171j582N53J131j547R77j05j010J475p95p12J772j258k5
$$ -701 677 -407 -298 873 -709 -156 975 -572 405 300 -710 765 -30 -742 1030 -228 -253
3234b53J181j623M62P50j607J590J39j412J362p39l39J303j417K09J087j182Q95
$$ -253 928 -695 -233 517 -1090 500 639 -773 589 -150 -489 814 -603 -394 693 -489 406
3251D06L00j726J359J64j259J157n00k05J201j567M30J260j731R51N12j479R64
$$ 406 706 -1020 339 503 -756 401 -99 -304 897 -670 -240 1020 -711 240 752 -727 237
3268B37M5j086J522q97o06J663j186l8J001j463Q68O19j716J486l45r61J302p13
$$ 237 282 -804 718 -179 -785 878 -308 -346 655 -808 60 679 -1037 449 104 -857 445 -268
3286b68O8J100j561N80Q20j688J007N10j441J261l39n80J217j065j51J413j653
$$ -268 -200 900 -661 -81 739 -949 58 568 -873 388 49 -531 686 -379 -530 883 -770
3303g70O29R62j705J098J49r28J337o88p26J600j118l66J128j056J47Q95j595
$$ -770 -141 821 -884 214 363 -565 772 84 -642 958 -160 -526 602 -454 -307 588 -1007
3320a007J841o78j078J401k5j112J166q47K04J089j735Q73M74j213Q19K36j033
$$ -1007 834 156 -922 479 454 -658 508 -339 -135 954 -781 92 566 -647 172 408 -625
3337f25J359r23k16J154r87o9R95j527R19J98j351J544m83q09J661j037l48J258
$$ -625 734 -189 -405 749 -238 -307 688 -839 80 278 -1073 471 -12 -821 840 -197 -545 713
3355G13j068K74L87p10P08J48j215J214l8j160J215n88j85R22j069N44P60j972
$$ 713 -355 -81 306 -404 304 452 -763 451 413 -747 468 -120 -305 617 -452 92 852 -1120
3373a120J066L21r87J028m88k45J156j008Q7J047j368L64P39r47Q06k87q86J155
$$ -1120 -54 267 -720 308 -180 -425 731 -277 -190 857 -511 -147 592 -355 451 164 -722 433
3391D33l73o28J423j011j51P01j168J060N5q02Q16j86j011J444p08j99Q14j123
$$ 433 60 -568 855 -156 -307 394 -774 286 341 -461 355 169 -842 602 -106 -305 509 -614
3409f14M19J000j754R12O70j443J226M5r43J080j109J48J213j568M59R32j107
$$ -614 -195 805 -949 -37 633 -810 416 461 -482 598 -511 -363 850 -718 -259 673 -434
3426d34O95J19j008J246m67l83Q69o89n28J349j137L08L38j049J009K81j181J014
$$ -434 261 380 -628 618 151 -232 637 -52 -580 769 -368 -60 278 -771 238 519 -662 352
3444C52m07l08J097j051PQ40j001O81L25j256P52M13r82J209m70m10J080j245
$$ 352 -55 -363 734 -317 -310 530 -471 210 535 -721 31 444 -538 671 201 -209 871 -374
3462c74Q1P31r48N19K39q21Q22k22r92J805p18n21R46q94K13P80j166Q80J00j105
$$ -374 -293 438 -510 9 248 -573 249 27 -965 840 122 -399 547 -347 -134 646 -520 360 460 -645
3482f45J009k62o47J117o58k24J052j257K44P91j159Q65J91j238J291l32o83J083
$$ -645 364 102 -545 572 -86 -310 742 -515 -271 520 -639 226 417 -821 470 138 -545 538
3500E38q31O7P70r32J30M70o31O73j52p81J288o52o53J227r40M6R80j045Q06J64
$$ 538 -293 -226 544 -388 -258 212 -419 254 102 -679 609 -43 -696 531 -409 -363 617 -428 378 542
3520E42j281R55k6p40N66M5m17J069j281L5J389j576O18O05q69O07J3n38J013
$$ 542 -739 216 190 -550 16 61 -356 713 -568 -533 856 -720 -102 503 -366 241 254 -284 729
3539G29q70n73J487j207P5Q60j280N84N26q88Q28n5p41J179n70n99J033q64K90
$$ 729 -141 -714 773 -434 -359 501 -779 -195 331 -557 271 216 -525 654 84 -515 518 -346 -56
3558e6M88p85M78K77j089J025q1q68J192o71l08J313j090P3P74r58K46K15o21
$$ -56 432 -353 125 402 -687 338 257 -611 581 -90 -398 915 -175 -102 672 -286 -40 175 -446
3577d46J109q30j74J201p11o25O68o02O72K3q71R11Pj022Q32l63l88J216j144
$$ -446 663 -167 -341 860 149 -476 192 -410 262 285 -586 325 332 -690 142 -221 -609 607 -537
3596e37M82N84j405J061J9j002J262k00r12J122n04n08J081j103L94Q67j102P02
$$ -537 -55 529 -876 185 204 -798 464 264 -648 474 -30 -538 543 -560 -166 701 -401 301
3614C01J53r48R92k39r74Q61l23l1R56j172K03P52r67N74K5r37J152L6j335J292
$$ 301 454 -494 498 259 -715 146 -177 -208 748 -424 -221 531 -436 138 163 -774 378 414 -921 371
3634C71m09r3K75o87P01K32j179R94K88r87Q32l25m85P49n08O0Q02q69J08M95
$$ 371 -38 -131 144 -543 158 390 -789 205 493 -494 338 13 -472 277 -231 -171 631 -238 -130 365
3654C65p13O79j20m70N64j58n13O51n66K55K41p60O14N03j102P80k72m62R07l09
$$ 365 -348 331 211 -259 305 147 -366 285 -281 -26 215 -545 69 572 -530 250 -22 -484 423 114
3674A14o24R04o66K75K99q87Q20K18j100N88L05r92J195n62k15J222j233l9R97
$$ 114 -510 394 -272 3 302 -585 235 453 -647 -59 246 -746 449 -113 -328 894 -339 -378 619
3693F19r71M10J38q21R39m56k88R66n90j41P54q95J89N96q09N34j16p67J132l95
$$ 619 -352 58 196 -625 314 -142 -430 536 -54 -195 559 -336 -147 449 -360 174 58 -709 423 28
3713B8k95O81m42k89P63q98L14N43r88N70M48o95N56l93k54Q65q24J15Q50r86
$$ 28 -267 414 -28 -317 446 -452 -138 405 -583 -13 435 -260 296 -97 -351 514 -310 -195 655 -331
3733c31J41N74n78M15j87l72P33n55k98P93n05J65P72j165O65K09j010R02j11
$$ -331 -190 384 -194 221 34 -338 395 -160 -458 335 -170 -5 767 -398 267 476 -534 368 257
3752B57n44N14k08k45N50p42K66M86r59O83K81p45P88m78m08J088n69l16J057
$$ 257 -287 227 19 -226 324 -418 -152 334 -625 58 339 -406 382 -96 -504 584 15 -301 756
3771G56r64J46O38r72N54l6o58R50o28j69Q24n46k17R27o98J02K33q83P62m8n95
$$ 756 -208 -62 576 -396 158 122 -536 414 -214 -383 441 -105 -322 605 -93 9 242 -641 121 73 -522
3792e22Q88k14o01J062o62k65Q98j019N98M24j099Q59j40n71P29l52k49P41p07
$$ -522 366 152 -449 613 -49 -314 584 -435 163 587 -512 347 207 -364 365 13 -236 505 -202
3811b02j35Q17p42J80L82j143J147j75k20N94o20k5N38n20o1O68r69N75J24o63
$$ -202 -337 480 -262 -82 300 -843 304 129 -91 503 -117 -142 396 -124 -185 483 -486 89 213 -450
3831d50N06K03p36P45k50l9N55q60K61O48q58M9O39n72M03k29k13N26m66j65R04
$$ -450 56 259 -477 268 18 -21 534 -326 -65 583 -275 -226 413 -159 244 15 -198 328 -138 -303 601
3852F01r61L15L48n40M26l56j5N42n57k68Q08k06l45O29q65L26L00o75P03k06
$$ 601 -360 -45 303 -237 189 -167 -182 360 -197 -465 343 137 -208 421 -444 -118 182 -493 210 4
3872Dm64P17m82n7R23q00J88L90p13L49J52m78M43K5m72O36n81NO85p96K9O14
$$ 4 -460 257 -225 -282 641 -159 29 419 -294 55 207 -271 172 197 -275 361 -220 -215 470 -326 -297 317
3894C17q24P27K1o64O27o5m99Q05o60J4Q13r46K14L86q67Q62J6p23M50J32m28
$$ 317 -507 220 241 -423 204 139 -360 445 -215 -201 612 -334 -120 266 -601 261 277 -446 4 136 -292
3915b92Q15o96K05J49m94R2N94p15O91j69n04O69j63l66L26j04m42Q76p35J37
$$ -292 523 -173 32 181 -313 -221 373 -342 349 180 -324 345 182 -184 142 38 -404 472 -263 -126
3935a26N02o59L30L7o19J294o42m53N51k85j60O79q17K99L70o96N17k8n56R89
$$ -126 376 -283 47 84 -535 759 117 -336 215 -70 -230 449 -368 -69 301 -395 122 94 -462 527
3955E27m46m98N37m43N44k6n94K62N66o71M60o3k91L64j06n57Q23n08l7M96q51
$$ 527 81 -417 120 -323 221 195 -399 -137 429 -242 218 155 -136 228 122 -435 388 -120 -157 339 -512
3976e12Q92K9r30P78k0p04P44m52J06N30l49r5J89k79J87J23o10O07p4n84Q80
$$ -512 380 409 -521 257 237 -467 277 -175 -69 461 112 17 206 -73 114 237 -373 234 160 -424 456
3997D56n74j17N38o08J94K3j89N20Q8n38P41p99J88L03k12N7K37o54K4N09o12
$$ 456 -118 -235 303 -305 -111 -88 -277 243 331 -207 534 -265 -77 226 14 71 308 -346 -322 187 -425
4018d25M09Nj54P07o23p6N32m25K81K63n16J31J39p01Q10l63m20O67j52k07N74
$$ -425 -16 -11 -165 542 -81 -157 375 -50 231 494 -22 109 248 -453 357 -6 -426 241 89 -118 456
4039D56q27Q2P48q82M70J55m09M41k21l77Q12n53mL04k80j46O25p41M38p3k65
$$ 456 -371 -289 459 -423 47 202 -207 234 13 -364 448 -105 -109 195 -85 -231 394 -347 91 18 -247
4060b47N37l72j34N66n16K2Q19j000L90K70q32O11M54j023P97j96n09P26n96J72
$$ -247 290 -82 -216 350 -166 -144 675 -325 65 335 -497 114 568 -455 342 146 -363 363 -233 -61
4080f1K17m59K85M87r33M99L9l66O32l64l41P93m24l02O95o29M77j80j63K39l3
$$ -61 156 -303 -18 469 -464 35 74 -292 340 -24 -365 428 4 -298 397 -232 245 65 -98 141 108
4101A08m15N50m46L0O13p69L30K36j45k38N20n29K22J41l28K65n17K17N83o73
$$ 108 -307 243 -203 -173 440 -329 1 237 92 -146 374 -155 67 208 -120 145 -372 -155 428 -245
4121b45J09N17o64M97k59j48L56J66n16N32l48k09M64p90K82P05o69M47qm46M33
$$ -245 -136 381 -283 214 -45 -193 163 329 -187 345 -3 -212 252 -538 -256 449 -220 227 219 -227 206
4142B06j75l2J45k52Q3N26o24L60J22q92P77j52l87M86k80q8N93n06P3M61q67
$$ 206 31 -1 144 -108 -25 501 -123 237 359 -533 244 92 -295 191 -89 -177 416 -90 -17 444 -423
4163d23N34J33m39J07K69m17N88j88o97J046p11k00N72l32K44K63q17N05Rk1L50
$$ -423 111 244 -195 -88 181 -236 352 164 -533 513 -198 -398 174 -158 86 349 -468 37 46 25 375
4184C75l37k57M97j25p5J08l40K45N7m91P37m66k40O01j19m75N86n88K63L15n69
$$ 375 38 -219 278 153 78 186 -154 91 148 -343 394 -72 -312 289 170 -305 281 -307 -44 271 -298
4205b98L33R3k74L99o8o00P90l14l22K87k29M00j14m22P57o4n82M39q4m50N99
$$ -298 35 128 -146 253 185 -415 375 61 -261 26 -203 197 83 -339 418 354 -228 211 127 -323 276
4226B76m24L36j2n61N08K2k29L81j41o62P65j40m18N88l95O2L76o02L58N7l02
$$ 276 -148 188 176 -385 123 145 -84 297 156 -506 259 119 -299 289 -106 -44 332 -270 88 145 -157
4247a57K83k8k53J77k00j0M84j96n5J03k26L86j59o62O14J39o88R56p41qL04l48
$$ -157 126 98 -155 22 -178 -188 296 100 45 148 -78 308 149 -513 101 240 -448 508 -233 -241 63 -285
4269b85K71J38m37K68L19n92N39m55o8O71n47L9L73n99J47M26n40N97l33l01N52
$$ -285 -14 124 -313 -45 274 -318 221 -234 -302 369 -178 -139 234 -365 -218 208 -332 265 -68 -369 183
4290A83k18l72M28k03K60K47o83J92M57o10O23j89o71Q13l73l70P40k10k08N44
$$ 183 -35 -407 21 -182 78 325 -358 -166 291 -319 304 115 -556 257 -116 -486 254 44 -164 380
4310C80n70M31j10n69N06J30m71O08m58pK49l47Q3L69n56L06L50p08P52j46m01
$$ 380 -190 241 131 -438 68 198 -273 335 -123 -130 119 -228 -145 224 -332 -26 324 -384 368 222 -179
4331a79O25l71j38K89o46M00K21m66N75l1n68L57n0n75Q88m15k3L70m99M14j1
$$ -179 446 75 -63 226 -420 -20 201 -265 310 279 -289 68 18 -557 331 -84 -107 263 -236 178 167
4352A67p46R14k92l74L61J9k08O47n39M5M02m14J45j32k92L07L63o33N89l67j42
$$ 167 -579 335 43 -331 30 49 -159 488 -51 -6 396 -18 127 -5 -297 10 373 -260 329 -38 -180
4373a80L98m30J09P86j031M39J57o01N67j41l74M12q7P8J46l38J5M64n54J11p7
$$ -180 218 -212 -103 683 -348 91 248 -353 214 73 -301 111 24 102 248 -90 -75 389 -165 -54 -131
4394a31l86O93j2m89N28l09r1M41m74L8K73k12K03o7L6J19%k37M44m72o9N54o50
$$ -131 -517 176 164 -325 203 -106 -197 244 -230 -192 81 -131 72 5 41 160 160 -77 367 -105 -174 380 -270
4417b70K79N5j41J69J02n38P22m99k8N97o68J68J34o0k21L54l91K39L24n05M09
$$ -270 9 64 -77 92 194 -344 378 -121 -149 448 -220 -52 82 22 -199 155 -236 3 327 -178 231
4438B31p5l97N94m73j1M73n95M07k49j16M13J74n40N06k51l32N82o12J51L16n53
$$ 231 156 -241 353 -120 -131 342 -253 154 -95 -211 202 376 -164 342 91 -241 341 -271 -120 196 -357
4459c57N48q5m28N25M8n80M10l3j36L11l37j15M90m95J81K44l77N91o07J18L61
$$ -357 191 106 -322 203 251 -329 81 48 -88 223 -114 -229 261 -234 -53 191 -186 405 -202 -84 277
4480B77jo58P63m11k54P23n99L21o4m37K96J35k59L34l4l00M64l23j11N02m70
$$ 277 276 -382 381 -30 -284 439 -160 161 97 -340 -44 91 -168 166 132 -168 296 -27 -138 364 -106
4501a06L49k08j66K95j14j8Q4O5l83M64m93L23J03l48N34k62l7L66l47m12P09
$$ -106 243 35 -131 164 50 32 116 181 -202 262 -231 92 195 -153 381 119 82 448 101 -311 398
4522C98p55l3N95m05L16J2n50N73P8o29M75J14l27j9M5j15M94n30K11L72p51O42
$$ 398 -357 -390 205 -200 116 128 -422 151 229 -400 75 189 -138 -157 -112 -227 267 -263 -52 320 -431 211
4544B11j98m4L84k16K0M84n69k21J71n5P7J35o07N82l7m33Q88n23k25M47o20J86
$$ 211 13 -31 353 137 157 641 72 -149 22 -33 44 179 -428 154 117 -316 572 49 -176 271 -349 -163
4566a63N43n98Q3J11k25L83o1k25K83l98L57L5k5j58M34m11J76J93n92M83k87
$$ -163 380 -218 -135 -24 -249 134 73 -152 131 -267 90 125 100 -58 376 -35 141 334 -258 225 -62
4587f2j81N59o51L46J79l83N6K80m76M89o9k79J16P4q3J48k18j2L02k64J10J85
$$ -62 -243 316 -335 11 190 -193 -137 143 -333 156 87 -192 -76 -2 -85 63 -155 -167 135 -129 -19 166
4609A66k74O6K30m53N28j80k67M32m53K35J35j78M6N6J2J51k90k32M25M3l31K74
$$ 166 -108 -42 188 -265 263 83 -184 248 -205 30 165 -13 33 89 101 252 -38 -270 155 198 -133 141
4631A41k24K11l5j28r1O00p14L30k4j71K31l87r4M93O5k80J63m05N50L4n83N47
$$ 141 -83 128 93 -35 -126 474 -240 90 66 -105 126 -261 -355 138 203 -77 86 -319 231 265 -318 229
4653B29n68K95K10l92L70o4l53J75L11l19L50j99k12J25K4N9m4M4k48K60k36K13
$$ 229 -339 -44 166 -226 144 80 -273 -98 213 -106 244 45 -167 -42 -18 41 -3 41 -207 53 -183 30
4675C0J01l05L0K74k78L04n0j56L55n02K48J14n37M61l7m39N64L7l88L51l81K44
$$ 30 131 -174 -144 130 -148 156 106 -50 305 -197 51 165 -372 89 52 -387 177 214 -174 177 -204 40
4697D0Ok09k5K16m07K79N9k41K21J46M0L09o95K7K37r8k6o5L66j16Jj36J77R9
$$ 40 46 -163 -188 28 -379 -100 -41 -282 -61 85 125 434 -261 -234 3 -95 -121 -186 180 64 65 -71 106 205
4721B05l75J75j74r1M75l79q9L42j69k0K07k36P2J30j89J18m41K35K40k63J30
$$ 205 -170 5 -169 -260 215 -164 -253 89 -80 -100 107 -129 -57 73 -116 2 -439 -204 36 -227 -97
4742i7M49m85J91l05k5L25l68K0L53J9J52J23n64J99J67l92K86kl18J24L6N8M34
$$ -97 352 -133 58 -247 -272 53 -315 -295 58 77 229 352 -212 -13 154 -238 48 46 -272 -148 -112 -54 380
4765C80o70R2O04o12J77K4k25K01J0K0P7j45j95P51o25O5L09l60K99k48o5L86
$$ 380 -290 -198 406 -206 -29 -5 -230 -29 -19 1 78 -67 -262 489 -136 -71 238 -122 177 -71 -136 250
4787B50k95l23O09lk78P4k36K85P7k10J27J5l36K99l7n6L90k02j54J82j39j00
$$ 250 -45 -368 241 238 -40 34 -202 83 160 -50 77 92 -244 55 18 -38 352 150 -4 178 39 -61
4809f1J63k12P8O5j91K46k7l26L83l88P41l18k93L09m8k80L59O4j79J49l94K10
$$ -61 102 -110 -32 33 -158 88 61 -265 118 -270 471 153 -140 169 121 -159 200 264 85 234 -160 50
4831E0N6j50n9L65n13L79O3m49L05L8l11M50j96m09N06k65K69N1k65P3L0m23M57
$$ 50 106 -44 -103 262 -251 128 191 -258 47 85 -226 224 28 -381 125 -140 129 180 -85 -12 18 -405 52
4854E2J18k41L77l70n7M15m63J29J31j79J88P4l23M08l90L4L29k2n47N54k69k8
$$ 52 170 -71 306 -64 -121 294 -169 -40 91 -88 100 174 -149 259 -131 -97 232 210 -337 217 -52 -80
4876h0M64l62K65k48k47K79K7j28Q0k78J64K44m76L34R0m15L57k17O3J35p1k89
$$ -80 384 22 287 39 -208 71 98 -30 50 -228 -64 180 -296 38 128 -287 70 -147 -84 51 -20 -309
4898c09K96j42K10j25K01m3k32R0K02k17KK1MO4K60m87J35J82k83J09L28l61j18
$$ -309 -13 -155 55 -70 131 88 -144 -54 148 -69 -67 -46 -42 22 282 -205 -70 112 -171 -62 266 -95 -213
4921b13J67j47L99l17j3P0r6K17K17l77M42k37j45q5J28k23L52k8j07K41k22j97
$$ -213 -46 -193 206 -111 -124 -54 -150 67 284 -93 349 112 -33 -118 10 -213 139 111 4 245 23 -174
4943a74L83k19J01j07n2N1n7L6K47l58J19K23l25J01k8r1K4J69k0Q6p6J35q4o5
$$ -174 209 -10 91 -16 -68 -17 -74 -38 209 -149 -30 193 -132 -31 -59 -150 -126 43 23 109 33 168 84 19
4967A9j5R8m62N55m8l12KK28l4r1K25k85K57k42J78K05m30J48k70J12J21K23j93
$$ 19 4 102 -360 195 147 -165 -163 65 31 -60 165 -120 137 -105 73 278 -152 -4 -274 -162 -41 182 -11
4990a1M07m79l9K58l03M1L64m41L79j31k04j27L86j86J16k5K6J31m07M41Oo25
$$ -11 396 -83 -122 136 -167 -126 238 -203 176 45 -159 -286 100 -86 30 5 31 162 -245 196 202 -423
5012d23N87k69l4N02l19p7M2k20K4N98n15L75m15M7L40j72l31N53k86K6J81m73
$$ -423 164 -105 -139 363 44 -33 9 -211 -187 411 -104 271 -144 -97 243 71 -260 293 7 33 214 -259
5034b59L49K11m92L63J71p92O85k05l17M11L0j41K11k97p0J95m65N23k30r3Q1
$$ -259 90 301 -191 172 343 -449 236 31 -286 125 155 14 225 -72 -142 53 -412 111 -119 -212 -131
5055a31J06J1J78j24N8J29l02k8J63j3LJ78l69K45k1j48n9J25j81K21k42L15j56
$$ -131 -25 -14 164 40 98 227 -75 -103 60 47 50 228 -141 104 83 -65 -124 1 -180 41 -201 114 -42
5078d2k43L54P3j62j47K52k51JK03Q7N4j61M0j22j01J89j92K6J86k41K32j1p7
$$ -42 -285 69 142 -20 -167 85 -166 -165 38 125 179 18 58 -64 -165 24 -168 -142 44 -197 35 24 -53
5101e3m5K74l35J0J2l47N68j70j18J93j37r8M58k96j4J64l58N27k9k64K7j8j17
$$ -53 -98 176 -159 -149 -137 -484 84 -86 -204 -11 -148 -246 212 -84 -98 66 -292 235 206 -58 -31 -49 -166
5124a66L19m24j36P70m37M6J12j14n1N01l25r9o2j93K98R1l62M18J00k04J04q61
$$ -166 153 -271 -407 363 -74 -28 84 -30 -81 420 95 -4 -66 -259 39 130 -232 186 286 82 186 -675
5146f75P15p5j93K20P9k87L06J74m03J42j18J45J24j04j07L55l98J8J96k27K74
$$ -675 40 -35 -228 -8 71 -216 90 264 -139 3 -115 30 154 50 -57 298 -100 -82 114 -113 161
5167A61k50J49J13l21J4L51k25J49r8k20K50o6R6K08l25j35K11k03N0J53k18K23
$$ 161 -89 60 173 -148 -134 217 -8 141 43 -177 73 7 103 311 -14 -149 62 -141 -91 62 -156 67
5189F7J21l33K42k00j07M99n31K57J07l52M14J06m36K16J12l98K20q6k32N28l60
$$ 67 188 -145 97 -103 -210 289 -242 15 122 -230 184 290 -146 70 182 -216 4 -82 -314 214 -146
5210a46L9N33n61K24m0R7P1l27K49j51m7k4J82j98J29J74l03K13M3l10K61J21
$$ -146 -107 426 -135 89 49 146 217 -110 139 -12 -59 -83 99 -99 30 204 -99 114 157 -153 108 229
5232B29m18K43J57j97L15o11N93o8m44K30J60k83K90j18M3j27k4K80Ro51N37J58
$$ 229 -189 54 211 14 329 -282 311 243 -201 29 189 -94 196 78 121 -6 -30 250 259 -392 145 303
5254C03k08o8J54j05j58P7j39L33k40k78N31j16J23j19m46N40j45k38J57l6l26
$$ 303 95 27 181 76 -82 -5 -144 189 -51 -329 202 86 209 90 -356 184 39 -199 -42 -78 -404
5275d04O00l76J43L66k94j3J97l83K70Q9l60N51m40P4J25p2j94J8K47k69J76j02
$$ -404 196 -180 -37 329 35 22 219 -164 106 195 -165 386 -54 20 145 73 -121 -103 144 -125 51 -51
5297e1L2jJ0K17k02k88M00m68L51L38m67K89k41q7K01J86k34j66p1P1K23m9r0
$$ -51 -19 -20 -10 207 5 -283 117 -351 0 338 -129 160 -81 -168 33 219 -15 -181 -252 -181 42 -7 -97
5320i7J64j69K25o5j51K68q5l63L73O5p0P2l73J35q2k2J5L9M27k32k98r4P04o24
$$ -97 67 -102 123 58 -93 175 90 -273 100 165 95 167 -206 -71 -153 -175 -160 -121 306 74 -224 -318 386 -238
5344b38J60K12k46L6L01k92j3J21%J95k6m05L18n48K17O68q43L98p7K18K29m26
$$ -238 -78 134 -112 -76 225 -67 -80 41 41 236 210 -195 123 -425 -208 460 -383 15 -62 156 385 -41
5366d1n2M50m28j00L11k17J29J41j89J6L9k60N30k68k75M78m67L1J66P0j17J33
$$ -41 -93 357 -71 -171 140 -77 52 193 4 20 59 -201 329 61 -214 264 -203 -172 -6 64 -53 80
5388H0l21K97J04k82K14k31K43M3j02K25r0l36J94J13l02J28K7l36N02l14P8M0
$$ 80 -241 56 160 -122 92 -139 104 147 45 270 180 -156 38 151 -151 -23 4 -332 170 -144 -66 -26
5410b6r1k24M08j57N2k1n0k90N15m27M70j51N8R3k05J95k77mJ71j71p8M92k44
$$ -26 -117 -341 67 -90 -38 -59 -109 -399 116 -311 159 8 66 159 -46 149 -128 -132 39 -132 -210 282 38
5433C8j74N98o96o9N74n51L33J83k67Q4j98j7L01N7M6p2j4j61O7j5O0q5j50O1
$$ 38 -136 462 -234 -303 271 -280 53 236 -31 53 -145 -162 139 196 242 170 156 -5 62 47 107 22 -128 -67
5457f7J45k19N33o59L47l2j11K13j8l71M93j83k56L88l06K44j51k29K63K30j97
$$ -67 78 -141 392 -267 80 48 -63 150 132 -239 254 71 -185 203 -103 141 -10 -239 24 254 57
5478E7k8J44n43L84j35Q8K1N3q8J66L6k55J63P4M3j65j99J66L17j85Q4p2n5L05
$$ 57 29 173 -370 14 -121 -33 -12 41 -47 119 155 -100 63 137 180 15 -184 -18 299 114 198 126 71 376
5502C76o27k5L41l22J03K73k62R8l6J95J06l33K48k01J8J64j77r0J19l3j87L47
$$ 376 -251 -276 65 -257 -154 119 -143 -45 -81 114 220 -113 135 -66 -48 116 -61 -151 -32 -65 -252 95
5524I5k46J8L31l02J11K68k44q0M47o91O17l07j06L5j69J9J54k4K6J49l32N5K23
$$ 95 -151 -133 198 -104 7 275 31 -49 398 -293 324 17 -89 -54 -223 -204 -50 -74 -48 101 -231 -176 47
5547D7l2J14M9k00L00k03R5K14m14J75Nk87P6R8j65K06Mk54K44J58k70K31J4l80
$$ 47 15 129 178 -22 278 75 170 384 -30 145 150 -137 -61 37 -128 78 82 -172 72 230 -40 191 205 -175
5571a75L44l19J88K9k74L26k27MK40k99j69L99oj81Q9q5K0K51l13J88k2l49N81
$$ -175 169 -150 38 67 -207 119 -108 -104 136 -163 -332 67 61 -120 -31 -116 -96 155 -158 30 8 -341 240
5594B40k87j77J22J13j36K53l88P8L31n66M73j17l9J64j22j36L99M7k27R2L0l87
$$ 240 -47 -224 -102 11 -125 128 -260 -182 149 -417 56 -61 -100 64 -58 -194 205 252 25 117 147 -240
5616b40K10j48K87l4K1k7l4r8K83k96K2J61j16o7J35j20K50k08n2L81k51k20N23
$$ -240 -30 -178 109 75 96 69 35 -63 220 -76 -54 107 -9 -76 59 -61 189 -19 -71 310 59 -161 362
5639C62n23J83K68m67J13L76l08o6K93l22J35j44m6K8m4K02J37l01L12l55k6L79
$$ 362 -161 22 290 -177 -64 312 4 -62 231 -91 44 -100 -146 -118 -162 40 177 -124 188 -167 -193 186
5661A86j34k39J37l18K38K50j71PJ96q8k5Q9l38L03m2o6L14m44k0K58l18O8L20
$$ 186 52 -187 -50 -368 -130 120 -51 -44 152 64 39 128 -210 93 51 -15 299 -145 -165 93 -225 -157 163
5684A63l77J44K53l29L71l8k61J78j73J92l05O7o5K91j08o4K00k58K24j96n3K12
$$ 163 -214 -70 183 -146 225 187 -74 104 -69 123 -182 -115 -180 111 3 -61 139 -119 105 -91 -144 68
5706F8l31K06K62k48R8J91k18K76m48j44M28N5k81K34k18n7M63m92J80p3J55n5
$$ 68 -263 -57 205 -43 55 246 28 304 -144 -288 140 195 -86 148 -70 -127 336 -156 24 -49 106 51
5728E1oM6l71J90J64J08l86J30K32l84J46N19p16M35j03j23j1M7O0k93K13j5O
$$ 51 45 91 -280 -90 74 182 -204 -74 158 -226 -80 439 -277 158 55 -68 -79 -32 28 -265 -52 -67 -61
5751f1R0K6k11P0O8K37n7K6l02L06l04j13N49m25o0L97k86p2J03K16J4J6j04j24
$$ -61 29 55 -156 -86 -18 219 162 188 -114 192 -112 -225 324 -101 -161 236 -50 -122 -19 197 211 227 123 -1
5775aP7k13j7K39k00K19J95o47N27k02l09M76J23l88M20k62j49m2K48O7k87j36
$$ -1 76 -137 -154 85 -115 104 299 -348 179 -23 -332 144 267 -121 299 37 -112 -154 94 161 -126 -262
5797b62L88l51K18J91j63J49r1k88j8L34p5J69k20m1K54m38J61K7q6j97O91n38
$$ -262 126 -225 -7 184 21 170 79 -209 -227 107 32 201 -19 -60 194 -244 -83 -56 -142 -339 352 -186
5819a86L88j65Ok62K27n9J21k58K56K47j92k34J94m20M25M0l57O32m35j85L19
$$ -186 202 37 43 -219 8 -51 70 -188 68 315 123 -111 83 -337 88 128 -229 403 -32 -217 102
5840A02l46L36j12J3J01r0J45Llk62J17P8k2m7j27j14M56q3k56L79l00qK18l27
$$ 102 -244 92 -20 -7 94 4 149 152 149 -113 4 82 60 13 -114 -228 228 145 -111 268 -32 -40 178 -149
5864a49M38n23k83N83RK77j88l87J93J78J72l67J16j80L52l12M7N93p30p3L52
$$ -149 289 -234 -517 66 75 352 164 -223 -30 148 320 -47 69 -111 241 -71 -24 569 -161 -234 118
5885A18l21L45k0j49J48L7j41L7k8j44J88l87M12K80p43J24K46l54N60m04r6N15
$$ 118 -203 142 122 -27 121 158 17 54 26 -118 70 -317 95 375 -368 -244 2 -352 208 -196 -292 223
5907B23l9k07J96l83L4L0j04K15K42m33P1o0L9M64l42J60Mk36j09L69l46M74j95
$$ 223 184 -23 173 -210 -176 -146 -250 -35 207 -226 -155 -215 -176 288 -54 106 110 -126 -235 134 -212 262 67
5930F7j05L2j07j45J61N1r7K55l40K80Mk98K43P3o4J1j06n1J44J0K9J80j89rK5
$$ 67 -38 -6 -113 -258 -97 -46 -143 112 -228 52 56 -242 1 74 10 21 -85 -136 8 18 47 227 38 29 54
5955E4j79L09r7O7j21k76L16m2q9L3J79l95Q5J67j31L32l07nJ79o2k35L26J54
$$ 54 -125 184 87 154 33 -243 73 31 -58 -25 154 -241 -156 11 -120 212 -95 -100 79 17 -218 108 262
5978B62l61K02j43J94k28J2J81j60j34J72k02O8L84l81J09J75o6J57j33j51J25
$$ 262 -99 103 -40 154 -74 -62 119 -41 -175 -3 -205 -137 247 -134 -25 150 84 241 108 -43 82
5999H2l46L73j95JK36r3M7M2l37L6L92j34J18%j81k39M52k26j25j14o6M59m6p8
$$ 82 -264 109 -86 -85 151 58 105 147 -190 -154 238 104 222 222 41 -198 254 28 -97 -211 -277 182 136 58
6023E8J47j31k61J86l6r5J22p6RN0l2K08k73k18N13j95j43L84l40P4L1r5OL5J0
$$ 58 205 74 -187 -1 -37 -132 -10 -86 -77 -27 -59 149 -124 -342 171 -24 -167 217 -123 -49 -18 -113 -107 -72 -62
6048f2L42j49j79K37k35k45N25k82j35L23m91O65j16l28J2J70L1O0J8j42Lk88
$$ -62 280 131 -48 189 -46 -291 234 -48 -183 140 -351 314 198 -130 -118 52 83 143 161 19 22 -266
6070b66K56J80j46p0J81k91K24k92J08J91n5K47j86j71L8O7k46J95l05J74K06
$$ -266 -10 170 24 -46 135 -156 68 -224 -116 75 20 267 81 -90 -52 15 -231 -36 -341 -167 39
6091C9j08j8K06k39K52l42J09L21j45k72L80k10k86M43j05q5L42m77j62L19o4
$$ 39 -69 -87 119 -120 132 -210 -101 220 75 -197 183 -27 -313 130 25 -60 282 -195 -357 -38 -102
6112a02L77k53L6LLj87L23j51j46J30m6p6L40k26p3J04m3K27k8l1m7k77K17K02
$$ -102 275 22 58 61 64 -123 200 49 -97 33 -13 -89 251 25 -48 56 13 240 212 181 134 -143 74 276
6136B76m47nK17k63K73N3j99o9K69q4j06j80L04N2q2q9K33j52r3k0q5N36l54K21
$$ 276 -171 -176 41 -222 51 104 -95 -164 105 21 -85 -265 39 91 9 -80 153 1 -92 -112 -197 339 -15 206
6160B06l94L92k76J21p5J86r3l12K53J04l53P2J87l29L63l24n8J32L3K41J26l58
$$ 206 -188 204 -72 49 -26 160 67 -245 8 112 -241 -169 18 -311 52 -272 -330 -198 -165 76 202 -156
6182a56K48p9M6m5k01J18q3J89m40M16p9J78L6m60M55l42k8N87k25k11K14j41
$$ -156 92 13 59 14 -187 -69 -152 37 -403 13 -66 112 148 -312 143 -199 -227 360 135 -76 138 -3
6204cJ27Ql74J52K2k27L84j51l7J40J72m37N03k57N2M9k01L66l25l7O9m2P4J21
$$ -3 124 132 -242 -90 -68 -295 89 -62 -99 41 213 -224 279 22 74 123 -78 288 -37 -74 -5 -47 27 148
6228A48o3j74J90j65J69K23n73M73j86l06M46Pk23k0Q0L4RJ8r6k42J75L19j13
$$ 148 85 -89 101 -64 105 328 -245 228 42 -264 182 189 -34 -54 26 60 69 87 -9 -251 -76 243 130
6251A30l3k13L93m16J57j49m3N04l19pJ79j72J46M1l01j44J67J58Q7j48l62O43
$$ 130 97 -116 277 -139 18 -131 -174 330 11 4 183 11 157 198 -103 -247 -80 78 165 17 -345 298
6273B98j83J09j03n1k91M02p8J97m73j14L22k11L67J5k71J64k21j9J9j5J85M0
$$ 298 115 224 121 70 -221 181 103 300 -173 -287 35 -176 191 206 -65 99 -122 -141 -122 -137 48 88
6295H8j54J52J60l01J45P9m35J79J82k64K99K10l88M6k44K82O3q4MJ17k53K56
$$ 88 -66 86 246 -55 90 169 -266 -87 95 -169 130 340 -48 -2 -246 36 99 15 19 136 -117 139
6317A39k78j26K29J26l80N76m39j61M20j7l62M34m98M14K11n32L69k27J88n0J36
$$ 139 -139 -265 -36 90 -290 286 -153 -314 106 89 -273 161 -337 77 288 -244 125 -102 86 36 172
6338A72l77L26m13M97j82l00K69k5L4J1nN4K07l50p3J37l87O56l47K32J73k97
$$ 172 -205 121 -292 205 23 -277 -8 -33 1 12 7 61 268 -82 -155 -18 -405 251 -96 136 309 12
6360A2j38K99j15j0j33J68q9j33J35O7j14l02M68m06L01K62o87L98K76m55J70
$$ 12 -126 173 58 48 -85 83 -6 -139 -4 63 -51 -353 115 -291 10 272 -415 -17 259 -196 -26
6381b6M85n57J25K07m69K90M0k69L61k02j19L44l27O4N9n0r5K06m1L4Qj72k8J
$$ -26 459 -98 27 234 -235 55 95 -174 187 -15 -134 210 -117 -53 6 -44 -139 67 26 60 68 -104 -132 -131
6405a31J01P6m8k0Q3n4J27q5l3j39J19o3K48J1k15j35M8J03J40j77K40j33m14
$$ -131 -30 46 -2 -22 61 7 134 49 16 -123 -4 -67 181 192 -23 -158 -110 -7 133 -44 196 63 -351
6428c51J39K83J52k41J38l38J9n1M51p9j86J76j15J44q2L5k28N07m86K9K16m87
$$ -351 -212 71 223 -18 120 -218 -199 -250 201 122 -64 112 -3 141 59 94 -134 373 -113 -84 132 -355
6450c55N31j80j77K32J64l21J53j63m8L21K0j21j07O1j95J24K29r3o3N4q5J15
$$ -355 176 -4 -181 51 215 -106 47 -116 -164 157 177 56 -51 10 -185 -61 168 75 12 66 -19 96
6472I6R2j05k89J72J03n19O28q1j43J83k34J83K50m30L09k04m36M17l1j63L12
$$ 96 188 83 -206 -34 69 -450 178 97 -46 137 -97 86 336 -94 215 11 -425 -8 -39 -202 110
6493A10k71J01Q2N7J02O3n38n9M52p1n7J96k84L77j85k50L48k32J35J62q4J19
$$ 110 -161 -60 22 79 181 244 -294 -353 99 28 -29 167 -117 260 75 -175 173 -59 76 238 154 273
6515B73k51%M05l50k16M23l71J62q1p9J23J12q9j14k4j87L60j98j35L52j72p0
$$ 273 22 22 427 77 -139 284 -87 75 -6 -85 38 150 61 -53 -77 -264 96 -102 -237 115 -57 -127
6537a27J74K2K50j90j23J55m9j26P9k03l46N27j22OJ99j45l4L37m99J64J2K17
$$ -127 47 69 319 129 6 161 112 -14 65 -138 -484 43 -79 -73 126 -19 -53 284 -215 -51 -39 178
6559A78m6k21j59L27l15L77J03j32k67K55k48L5N02m77j59K88J3j39oLL56l97
$$ 178 132 -89 -248 79 -236 141 244 112 -155 100 -148 -113 389 -88 -247 41 54 -85 -91 -88 268 -129
6581a29K57l17J88o1m3o7L36j45K3L7j13j98K58j77k67O81m13R8j04L9L81n66
$$ -129 128 -189 -1 -62 -105 -172 164 19 42 79 -34 -232 26 -151 -418 263 -150 -52 -156 -117 264 -302
6603c02O89l06l70M00n0k98K75K29k10N7k25j52M59l19J41J32l16M3J48j74L41
$$ -302 387 81 -289 111 61 -237 38 267 57 114 -111 -263 196 -123 18 150 -166 -123 25 -149 192
6624A92l3j90L01m70J70M41r9k87O7n28L38R1L3o3R5k98M85j94q8O6K5J48l35
$$ 192 159 -31 270 -200 -30 411 312 25 92 -436 -98 -7 26 -37 58 -240 245 51 -37 29 54 202 -133
6647a33j26L79j87j98L25o3j74O9Q5o9M28k52j53J04j26L76j74k83L3J77j35J03
$$ -133 -259 120 -67 -265 60 -3 -177 -108 -23 -92 336 84 -69 35 -91 285 111 -172 -139 38 -97 6
6669Fq4J39L08m24L2K39k79J39Rl56L66k73k2K20k38J96K17l78M07K61q60L29
$$ 6 -78 61 369 -55 -23 216 -63 76 85 -271 95 -178 -200 20 -218 -22 195 -183 224 485 -375 -46
6691d6K01l15J57m1j07K51q5q4J16l74M78J23m77J6K53l1j30J36l64K63L20l13
$$ -46 155 -160 -3 -44 -151 100 15 -69 47 -327 151 274 -203 -187 66 35 -95 41 -323 -60 260 -53
6713e3J66k60J56l6n6K43k23N6K20k27k58M33k04NJ22k37j50M01j95J23j73R8
$$ -53 113 -147 9 -27 -83 160 -63 -7 213 -14 -272 161 -43 -38 84 -153 -303 98 -97 26 -147 -49
6735d9Q7J44k07Lj48K40L8k26K87j27j76K85Km34N81m05j18J32K77k43J12j28
$$ -49 38 182 -25 -22 -170 70 108 -118 169 42 -134 151 153 -281 300 -105 -223 -91 186 -57 55 -73
6757g3J54m0k83K70l5k2q2j45J13J79j19K46k0l83L74P3j16rk40K87P8k24j9K75
$$ -73 81 41 -242 28 -7 -29 -111 -256 -143 36 -83 163 143 -240 134 207 91 82 -158 129 207 -17 -36 239
6781B39l87J44p3l9J35P4k87K25n5k09L31j74nN2l19L31j88O3L13m43M7L83l13
$$ 239 -148 -4 -77 -116 19 93 -194 31 -24 -233 98 -76 -81 -29 -348 -17 -205 -142 171 -272 -225 158 -155
6804a55K71J04m14K59K12m09Kj0J87K69j44r7j44n6L12j4l95QK33k23K10Lk56
$$ -155 116 220 -194 65 277 -132 -130 -140 47 316 172 75 -69 -125 187 173 -222 -214 19 -204 6 9 -247
6827b47M85l73K75K53j48l76j9o9L62J47l41P4j42L5L12k30J94pk99P8K56m23
$$ -247 238 -135 140 393 245 -131 -150 -219 143 290 -51 23 -119 -84 228 -2 192 185 -114 -36 220 -203
6849b03J20l3k4K94j65k60L80k15j37M26l02K83k35l13M24n6k60O8J87Q3rNN7
$$ -203 -83 -116 -140 154 -11 -271 109 -106 -243 183 -119 164 -71 -384 40 -16 -276 -208 -21 62 53 58 115
6872A15n0k4j29L18m81L24K56k90J22k89J66l0K0k50K64j18M45k65l40M83J7k49
$$ 115 65 41 -88 230 -251 73 329 39 161 -128 38 8 28 -222 42 -76 369 104 -236 247 264 15
6894A5k13N1L03j8k75L02K7k38j02L85l10J78j06j44K05l09J9M80o1j50j59J28
$$ 15 -198 -147 156 138 -137 165 192 -46 -148 237 -73 105 -1 -145 60 -249 -230 250 189 39 -120 8
6916HP0K89n51M59k26j02m5J2Q4R5r6q8M2J4K85n5m65K45K7k33N37n24M4K19m01
$$ 8 78 367 -184 275 49 -53 -98 -86 -2 93 -3 -91 -49 -35 250 195 -270 -25 2 -231 306 -218 -174 45 -356
6941c56Q4M80l99J38l0J37q3l8J0J59k54N9k4q7J86J01m3j52O6J0K53Q0k99K55
$$ -356 -272 208 -191 -53 -83 54 -29 -67 -57 102 -152 -93 -117 -204 -18 83 40 -112 -46 -36 217 297 -2 253
6965B53p14M83j2l20L94j22j53L24k56RL22k18NJ23j45j07J37j92O4J47m41M65
$$ 253 -461 22 10 -310 84 -38 -191 133 -123 -114 208 -10 -5 118 -27 -134 3 -189 -125 22 -419 46
6987D6q1J9K45k87KR3j79m6J34o2R0L19n01M83k82j63L49M7k87j1J54J16j34j99
$$ 46 -35 -16 229 -58 -56 37 -142 -188 -54 -116 -26 293 -208 275 -7 -170 179 226 -61 -72 82 198 64 -135
7011a35NK25k28J96R0j35J72k73J9M19k33j90j53J25Q0kj29L19k49k30N11l73
$$ -135 -130 95 -133 63 153 18 190 -83 -64 355 122 -68 -221 -96 -16 -18 -147 172 -77 -307 204 -169
7033a69j17M07K71p37M67k78P8K17j87M40m74J91M3j18m6K01k77K60k40o0R5j27
$$ -169 -286 121 392 -345 122 -156 -78 139 -48 392 -82 109 152 34 -12 189 -88 172 -68 -128 -33 -160
7055a60p6M66m1N8J7o06L04o2J16q4J31k89L72l30k15N20j46L0L46j19j35j11
$$ -160 -236 230 189 247 264 -342 -38 -100 16 -68 63 -226 146 -184 -399 121 -25 5 351 232 97 -14
7077a4j58J84J92m00L19Q3n45L99j72k48O70m19K20M2l36K9J52l4N2J52k72Q3
$$ -14 -172 12 204 -196 123 206 -339 60 -112 -360 310 -109 111 153 -183 -154 -2 -36 16 168 -104 -21
7099b1M6j98M07l26L73R4l80K12m24K82M2j35m0N8r2J16K74m07L05k84J97j44
$$ -21 25 -173 234 -92 281 375 -5 207 -217 65 107 -28 -68 -10 -102 14 288 -119 186 -98 99 -45
7121d5K65j47l97K83K05l9j37R1J35k92L14m5k51J31j09j27M64l85J43j4k44M55
$$ -45 220 73 -324 -41 164 125 -12 79 214 -78 236 191 -60 71 -38 -165 299 -86 57 43 -201 254
7143B54j67j66P2p0J4L06m30j00N89k88J13J85m01Q2J27n9j75K69j84L2L7j10
$$ 254 87 -79 -7 -77 -63 243 -187 -287 302 14 127 312 -89 -7 120 61 -114 155 -29 3 40 -70
7165g0J71j18k0L04l28P3L37l44J92k44NJ73j9p2m3j4j3M96p42M04rj43J15j60
$$ -70 101 -17 -37 267 -61 12 349 5 197 -47 -42 131 112 40 -3 -17 -30 466 -276 128 119 -24 91 -69
7189f9k76L06o9M3L36n13K44r2K09L1k0o5J0p8j77N0p6L18q9k01Q5N3l21K81k11
$$ -69 -345 -39 -108 -65 271 -242 2 -90 119 150 130 65 75 -3 -180 -130 -206 112 23 -178 -93 -40 -361 -80 -291
7214b91J93J50q5J47k7j68J11L3p3J24J76m44J42J95l59K02j55m2M55l32J2P7
$$ -291 -98 52 -33 114 87 -81 30 63 -10 114 290 -154 -12 183 -176 26 -129 -171 284 -48 -36 41
7236D1k1j16J74r7O8J17k2n4J58n57N92l24J21j9RK38k44k55m7K09r8L86l79K65
$$ 41 20 -96 78 -19 49 166 144 90 248 -309 283 -41 80 61 70 308 64 -191 -238 -29 -127 259 -120 145
7260A45k23j07K70L9R2k95o5L4L2K26k47K87n1k39L13l93K12J51m90M92k8j54
$$ 145 -78 -185 85 124 216 -79 -144 -110 -78 148 -99 188 137 -102 211 -182 30 181 -309 183 155 1
7282AR4Q3k79O0q5j59K29Q9Q9J22k23K66l77j62K15J35R4j65k63L49J19m41K38
$$ 1 95 178 -101 -41 -126 -285 -56 33 122 244 21 287 -90 -252 -37 98 192 27 -236 113 232 -209 29
7305B9L41k46Jk31rL50k12L2J26k07Q5j95j68K03L92k26pr1k11P17o93O10r1n00
$$ 29 370 124 125 -106 -115 235 23 55 181 -26 59 -136 -304 -101 291 65 58 -33 -244 473 -220 390 299 -201
7329b01N9J24k19L49p1k64J32L85l14k3P7LK24l10L39m69j7M21j54k77J87L7K6
$$ -201 -142 -18 -237 112 41 -223 -91 294 -20 -43 34 37 261 -49 290 -179 -196 225 71 -206 -19 18 44
7352D4O6j84P7%o7J90Q1k33n2Q6r6o7J1Q1R3N2j28O9K1J8J9j69J42L0j55N1k7
$$ 44 110 -74 3 3 -64 126 207 -26 -78 8 -88 -155 -144 -63 30 82 -46 23 44 62 81 -88 54 84 -71 -20 -47
7379d7J4K61k20K62j01l64L27q1j47P4J51k46M21j19l31L88m23L50j16k38L3K36
$$ -47 -33 228 8 270 169 -195 132 51 -96 -22 129 -117 304 185 -146 242 -181 169 53 -185 -152 84
7401H4k02J01k10O4N50n94J29j2q1J3L14l93L10q9l5M1j04K03K32l29lk13j1K30
$$ 84 -118 -17 -227 -163 387 -207 -78 -90 -171 -158 156 -237 73 -16 -51 -10 -114 89 321 -8 -11 -224 -235 -5
7425eK5k35L22j84J00L09L2m48L07l0%ok03J92j57k20J79P3m05N75k65j28Q0j42
$$ -5 20 -215 107 -77 23 332 364 -84 223 193 193 187 -16 176 19 -201 -22 51 -354 221 -44 -172 -92 -234
7449b34P4J02p5K95k81J15J40p4o4K76k21j69L20k5k03J30l02J61r5L25R6L1l26
$$ -234 -160 -58 -133 162 -119 -4 136 62 -2 274 53 -116 204 179 -24 106 -196 -35 -130 195 291 322 -4
7472dp9k17J45L22m47L86J09l30J43M6j95K58j1k01M97k83j59J9q8j38j02K62
$$ -4 -83 -300 -155 167 -280 106 215 -115 28 74 -121 137 126 -75 422 139 -20 -1 -89 -227 -329 -67
7494f7J51K02l67M10k92k76Q21q52M93k5k3l83K12k49L31K9j68J03J7j91N5k8
$$ -67 84 286 -81 329 37 -239 582 -270 223 198 175 -208 4 -245 86 115 -53 50 67 -124 -69 -97
7516i7J01Qj03J99N0j46k4j5n3K22J37j72J48l98J57J11j28J54j28qM0o0k1mK89
$$ -97 4 12 -91 108 158 12 -12 -27 -80 142 279 107 255 -143 14 125 -3 151 23 15 55 -5 -26 -30 259
7541B59k62M2k69L02O4m57M36k90O7J53r4j52N9J41j03J00N5k31M51m36L20k52
$$ 259 -3 39 -230 72 136 -321 115 -175 -108 45 -49 -201 -142 -1 -104 -4 51 -180 271 -165 155 -97
7563i7l64M46K80j60K07m20j98N80l88J03k1j14p2K72J07n8k30q9K88l0R4j45
$$ -97 -461 -15 265 105 312 -108 -306 274 -114 -11 -32 -146 -218 54 161 103 -127 -216 72 42 136 -9
7585ij37J37K96o58P30j51j87k77K57o8k2J11k62O40m38K59m25L20J95k33j53
$$ -9 -146 -9 287 -371 359 208 21 -256 1 -67 -89 22 -240 400 -38 221 -204 116 311 78 -75
7606g5K22k10N3K85l51jK23k29QK80k49K64j56m6%L7m1j58m09P69k82p8K73k92
$$ -75 147 -63 -10 275 -76 -77 146 -83 -75 205 -44 220 64 18 18 55 14 -144 -553 216 -66 -144 129 -163
7630a63q1M50j55m8K08m08P2J72l64N17l9l94R9J2L7K84nl70L23l58J73P9j92
$$ -163 -244 206 51 3 211 -197 -125 47 -317 200 161 -233 -134 -122 -85 199 194 -176 147 -211 -38 41 -151
7653a51M42p6n94P38j78m48K06J16l05L34k29J80J36l97K00K63l31K10J35l05
$$ -151 291 215 -379 359 181 -267 -61 55 -250 84 -145 35 171 -226 -26 237 -94 116 251 -54
7673e4J89j16mL6k72K3L55j72n1K28l41Q3L23j00K76k86j38k55J10lK64n9mQ6
$$ -54 135 19 15 51 -221 -198 157 -15 -66 162 -179 -96 227 127 403 117 -21 -276 -166 -169 95 36 32 118
7697A18k76L74m52L22K9k89J50P8j34K25j43K42p7M3j75J67k43o6L89m24MM3N3
$$ 118 -158 216 -236 86 115 -174 -24 54 -80 145 2 244 167 210 35 202 -41 -107 282 -142 -138 -95 -42
7720d2J4K25n17M83k6l54K97m4k84K58k29J54L08l33L03j04j4k0j35l7J61l56
$$ -42 -28 197 -320 163 137 -217 80 36 -248 10 -219 -65 243 -90 213 109 95 75 -60 -97 64 -292
7742b92J05L61k37N5O3l77N04j11j59K14j64j72L20l15N5L02j92L7J29q2L4Rp6
$$ -292 -187 174 -63 -8 55 -322 182 71 -88 126 -38 -210 110 -205 -150 152 -40 -3 126 44 78 87 11
7765A1q7K15k94P3J08q1J44l78R7O77q37L27J17q8R6j58j96M61k63J20J93l92
$$ 11 -76 139 -155 -82 26 -55 89 -289 -192 485 -352 -25 92 4 100 -58 -254 207 -56 64 257 -135
7787a35J00K19l92L15k41J3L14j46k27J42l3nL95n07K87M7l47J89l9q9M44m08
$$ -135 -35 184 -208 107 -134 -121 193 47 -180 -38 -71 -76 319 -188 99 146 -201 -12 -51 -140 304 -104
7809a04o8J79j63K28p2j69O3J62P5q2l3j04l7r5L40O6j22N9m0j24J40j39m7K83
$$ -104 -172 7 -156 72 0 -169 -106 56 131 49 16 -88 -125 -220 120 186 64 123 83 -41 99 -40 -87 196
7833A96k48RR6j9o9L94n28M27j76k00M01j27k13M7P0j87K62l32K37J01l54K39
$$ 196 -52 -43 53 34 -35 359 -169 258 82 -118 283 156 -57 -10 60 -127 135 -197 40 141 -213 26
7855B6J71l14J11J25l19J19K19j48K9p1QM4R4k18P8J01k42K90l23L81J51l48j2
$$ 26 197 -117 -6 119 -200 -81 138 -10 19 -52 -44 0 94 -124 -46 55 -187 103 -220 161 312 -36 -48
7878d8k3L12m19N7J71J99k07j2J9oO3j61PQ9k17L25l26K78O8j03j47q4Oj47N49
$$ -48 -71 241 -178 -121 50 249 42 30 49 43 106 -55 -48 41 -176 149 -177 101 169 66 -81 -165 -159 -306 243
7903B43j31j7j55J32N0j98J72k35L37j01J37k13j84J78j63J56K34o37M05P8j68
$$ 243 112 95 -60 72 122 -76 96 -139 198 97 234 21 -163 15 -148 8 242 -395 10 88 -80
7924h0J90j20q6J09MQm1k5j27L57l56K97l4j38K12Rk76K84j88M1J05l52K17j36
$$ -80 110 -10 -96 13 17 25 -16 -41 -168 189 -167 130 96 -42 170 179 -97 187 -1 40 145 -207 10 -126
7948a26J76J60k58K16K09l40j13o3K38m55M60j60K08k47p3K11j11p0Q7J1J09P5
$$ -126 50 210 -48 168 377 37 -76 -139 99 -356 104 -56 152 -95 -168 43 -68 -138 -51 -40 69 144
7970A44P8k91M3j55K04q5m7o4J06j0N32m55j54L33l43M2N1Kqo1m06K11J43OK77
$$ 144 222 -69 -26 -181 23 -62 -109 -173 -67 -77 455 0 -154 179 -164 -122 -71 -69 -77 -138 -544 -333 -190 -184 93
7995I3J66j29J6k61N23p0n75J79j89Q2L77k81J34M13l96J3j1k67L10j25j98K26
$$ 93 259 130 146 -115 408 338 -237 -58 -247 -165 212 -69 65 478 82 95 84 -183 127 2 -196 30
8017C0J26jR5j79j58K11J43m17J10N0J6J25k63MM36m19j46K20m3K31l44L05K6
$$ 30 156 155 250 71 -87 124 267 -150 -40 10 26 151 -112 -108 328 -91 -237 -17 -60 171 -173 132 158
8040A58j80k85K33K0O8L22j41p9m92J65Q0J43J22j40j23jK06l85L03k14J55K97
$$ 158 -22 -307 -74 -54 14 336 195 116 -376 -211 -131 12 134 -6 -129 -130 76 -309 -6 -220 -65 232
8062B32j48j47Q2k7M1J44k78k15M03k0j12J24j60J92k81K31O9j07J62j76OJ6o0
$$ 232 84 -63 19 -8 33 177 -101 -316 87 67 -45 79 -81 111 -170 61 130 23 185 9 15 31 -29
8085b9m5J81K73m30J18k4j33n9K4J88Qm15M83j00j08R8L2m00O07k36k86N20l37
$$ -29 -74 107 380 -50 68 44 -89 -148 -124 64 72 -343 140 40 -68 30 62 -338 269 33 -253 267 -70
8108g0R2k5J42j03j90o9O88o03K1K02m2j29j4R0R1J3N2N7j3k92J79R7J8l47R6
$$ -70 22 -3 139 36 -154 -223 465 -138 -117 85 43 -86 -100 -10 81 94 146 203 190 -102 77 174 192 -155 -59
8133e9K22Q4n30K27j32K64Q3l16J20M0k26J6K57k07O4J09k96J23J55k25J13J4
$$ -59 163 247 -283 -56 -188 76 159 -157 -37 3 -223 -207 50 -157 -93 16 -280 -157 -2 -227 -114 -100
8155a00J90j35rK90q0n50M27j22R2J61k82J78j02Q4j02J75l07j39N20j48K87n7
$$ -100 90 -45 -54 236 156 -394 33 -89 3 164 -118 60 -42 42 -60 115 -192 -331 189 41 328 271
8177B71l37L62k85m9J66%k00J1N5k9j11K95m1j51
$$ 271 -66 296 11 -38 128 128 -72 -61 -6 -35 -146 149 108 -43
8191d3
$$ Imaginary data points
##PAGE= N=2
##DATA TABLE= (X++(I..I)), XYDATA
0@%%%%%%%%%%Qj6J6j7K5l2M0n6O4p2Q9j10J33j60J89k17K52k94L39l89M45n07
$$ 0 0 0 0 0 0 0 0 0 0 0 8 -8 8 -9 16 -16 24 -32 32 -40 49 -61 72 -88 101 -116 136 -158 181 -208 237 -270
32b70N78o57P43q38R42j056J181j318J470j633J812k011K226k460K715k993L298
$$ -270 308 -349 394 -444 498 -558 623 -695 775 -858 954 -1057 1169 -1291 1424 -1569 1729
49A729l635M005m411M864n365N921o550P261q076R016j0115J1425j3014J4993
$$ 1729 -1906 2099 -2312 2552 -2813 3108 -3442 3819 -4257 4759 -5356 6069 -6945 8048
63H048j7534K0931k5731L3080m5867P4297k49093J29731N08383l25869l69737
$$ 8048 -9486 11445 -14286 18794 -27073 47224 -201869 -72138 436245 110376 -259361
74b59361N6765L46354K5876j80361p5725K9069l431J50725P5830j83906j96232
$$ -259361 -202596 143758 169634 -10727 -86452 -57383 -60814 89911 165741 -18165 -214397
85b14397J28511K87321j1874l55531o0380L07175J22101j91789j48497O1778J39097
$$ -214397 -85886 201435 189561 -165970 -226350 80825 202926 11137 -137360 -75582 63515
96F3515q44m9022k3720p2124L4536J67970l0822j86720j4004J67112O2100j53269
$$ 63515 62671 13649 -10071 -82195 -47659 120311 89489 -97231 -111235 55877 117977 -35292
108c5292o4759J46489J0439j15696M9080P4718p5608p3190P4359J15296q2804
$$ -35292 -100051 46438 56877 -58819 -9739 64979 -10629 -83819 -9460 105836 23032
119B3032j42788J07797J27682j17717r9728J02172J02269j00330j26276J37946
$$ 23032 -119756 -11959 115723 -1994 -101722 450 102719 2389 -123887 14059
129A4059J39425j77351j31998J62434J27450j11085j37555P5663J34277p4014
$$ 14059 153484 -23867 -155865 6569 134019 22934 -114621 -38958 95319 21305
139B1305q2710P4515K499o5124M9049P6147m8075j22643K9577J74776k1038j82608
$$ 21305 -61405 13110 15609 -49515 -466 75681 27606 -95037 -65460 109316 88278 -94330
151i4330L734J36756L9462p8965p4476M2819N3250j6586J4330k0290p9811M6971
$$ -94330 -90596 46160 85622 6657 -67819 -25000 28250 11664 25994 5704 -74107 -27136
163b7136J10843k4108j22425l3103J36225O8860j38528n8391J05848L1620m9562
$$ -27136 83707 59599 -62826 -95929 40296 109156 -29372 -87763 18085 49705 143
174A43j8759K1219M820m1642L0660P3134p3637p9621Q5109P4657n6962q8474K6387
$$ 143 -18616 2603 7423 -34219 -3559 69575 -4062 -83683 1426 76083 19121 -69353 -42966
187d2966J09380k6005r9437M2539N7507m0713k4262K7354K4253l6133l7092P2450
$$ -42966 66414 40409 -59028 -16489 41018 305 -23957 3397 27650 -8483 -45575 26875
199B6875K8368r4773o559P9268L733n5611k5245N5992L6225o9152j3918O0985
$$ 26875 55243 -39530 -46089 33179 36912 -18699 -43944 12048 48273 -20879 -34797 26188
211B6188j3082l2164J3638J7004m10l0134R865M6999m1926l9370N8572J9048m5366
$$ 26188 13106 -19058 -5420 11584 11174 -18960 -9095 37904 -4022 -43392 15180 34228 -11138
224a1138j9117K9994L9864m0783m6091O0688K2476n6656L04L4234M359k5683j9967
$$ -11138 -30255 -261 39603 -1180 -47271 13417 35893 -20763 -20459 13775 18134 -7549 -27516
237b7516M3827J4106n8451J0931M3630k0247j9312M785J7829N281l7520J4867
$$ -27516 16311 30417 -28034 -17103 26527 6280 -13032 -8247 9582 14863 -22657 -7790
249g790M2166m3064k4292M4648J4209k5433l1441J9988N2248l5148m4668M1957
$$ -7790 34376 -8688 -32980 11668 25877 444 -30997 -11009 41239 6091 -38577 3380
261C380J6612k0945k868k116J0545m606j0702K9609j2209l8443L3629K5727k6647
$$ 3380 19992 -953 -3821 -5937 4608 2 -10700 18909 6700 -31743 1886 27613 966
274I66k0626J635L8835O212n4846R633M1704j7195j4691K227O986J0087j9525
$$ 966 -19660 -18025 20810 27022 -27824 -18191 23513 6318 -8373 -6146 840 10927 -8598
287h598M625K3077l1776m419L7265j1495k0353R01J2849J9797k7649j8594L8133
$$ -8598 -3973 19104 -12672 -17091 20174 8679 -11674 -10773 2076 21873 -5776 -24370 13763
300A3763k116k2537J2044m51N93o11j0288K2743n122l2023K6505J7760k2869p781
$$ 13763 11647 -10890 1154 703 1296 685 -9603 13140 8018 -24005 2500 20260 -2609 -10390
314a0390j50K0682Q815l6338O628K5551j8192K560O611j3924P235J734L983O648
$$ -10390 -10540 10142 18957 -17381 -10753 14798 -3394 -834 5777 -8147 -912 822 4805 11453
328A1453l0356O668L7283j9726k0504Q172Q918J6741j9244k3371L0354O285j6779
$$ 11453 -18903 -12235 25048 5322 -15182 -7010 1908 18649 -595 -23966 6388 12673 -4106
341d106N304q281M069J3241j2867L996k234j3428K7360K054l1950Q329J4239M337
$$ -4106 1198 -7083 -3014 10227 -2640 1356 -878 -14306 13054 15108 -16842 -8513 5726 10063
355A0063l086k5394J3079K3841k1021k103O235j0100J4434O02j1877Q485j1131
$$ 10063 6977 -18417 -5338 18503 -2518 -4621 1614 -8486 5948 6550 -5327 3158 -7973
368g973K965K2440j9020r442J2238j974J0939p089j8901K0000M26r996J6230j2117
$$ -7973 -5008 17432 -1588 -11030 1208 -766 10173 3084 -15817 4183 4609 -5387 10843 -1274
382a274j1864J5987Q86M741p888k1845K4772J4676k1277j82n780L265K4074j4989
$$ -1274 -13138 2849 3735 8476 588 -21257 3515 18191 -3086 -3268 -9048 -5783 18291 3302
396C302j4371R114l534J4976L792k6455O074R572j133J1631j7220j2166K2329
$$ 3302 -11069 -1955 -5489 9487 13279 -13176 -7102 2470 1337 12968 -4252 -16418 5911
409E911j901j044M634k1499N887J7625m608J808j7074p242L3386k532k1204L504
$$ 5911 4010 2966 7600 -13899 -8012 9613 5005 6813 -10261 -17503 15883 13351 -7853 -4349
423d349n733J2060J5351j9329l705M03l347K5289m808k7813N495Q596J7308N825
$$ -4349 -10082 1978 17329 -2000 -5705 -5302 -8649 16640 11832 -15981 -10486 -1890 15418 21243
437B1243m1712m179L7569L890j0364k0185o469L5299J696k2701J627o809Q319
$$ 21243 -20469 -24648 12921 16811 6447 -13738 -20207 15092 16788 -5913 -4286 -11095 -2776
450b776K0279j5532o233k7q692K3679P811k8175m730O496J9707J4165l8933j3498
$$ -2776 17503 1971 -4262 -4289 -12981 10698 18509 -9666 -14396 -7900 11807 25972 -12961 -26459
464b6459L4651O408q111j4066j1472K5978O816j7746O424o371n749J6491k973
$$ -26459 8192 14600 6489 -7577 -19049 6929 13745 -4001 2423 -3948 -9697 6794 3821
477C821k83l830k0556K5317K3406l1246j6582R263K1283J2819l5049j1419L6630
$$ 3821 3538 -292 -20848 4469 27875 -3371 -19953 -10690 10593 23412 -11637 -23056 13574
490A3574J91j7036m835j387J9561l521k1354K1489N824k1863L076N421R292j013
$$ 13574 13765 -3271 -8106 -9493 10068 6547 -14807 6682 12506 -9357 -6281 -860 8432 7419
504G419k7207J6044K7660k4174j3313R163Q872Q521k2448o118L1924p042k0787
$$ 7419 -19788 -3744 23916 -258 -13571 -4408 4464 12985 -9463 -15581 16343 9301 -11486
517a1486P087N909J0366j1318k3178K7882J5248k7528l070J0881Q531k485k5286
$$ -11486 -4399 1510 11876 558 -22620 5262 20510 -7018 -10088 793 9324 6839 -18447
530a8447J2852K7607k4490j2972J8367R724k990k8248k359M4659n424l7320O613
$$ -18447 -5595 22012 -2478 -15450 2917 12641 9651 -18597 -20956 23703 18279 -19041 -12428
543a2428K0034J1185j7030k8732K5552K1401k4860j37J1733m828m437r101J7025
$$ -12428 7606 18791 1761 -26971 -1419 19982 -4878 -5015 6718 1890 -2547 -11648 5377
556E377J5623l7101o950L9038N965k0141k6013N842M4838p216m0643P134J9029
$$ 5377 21000 -16101 -23051 15987 21952 1811 -24202 -18360 26478 19262 -21381 -14247 4782
569D782R491m424k4505Q326J3839j3912R983P530j8299q18M607J4726Q818l7506
$$ 4782 14273 9849 -14656 -6330 7509 -6403 3580 11110 -7189 -8007 -3400 11326 20144 -17362
583a7362j1558L9831J2945j6455k5173n405M2228N785l9883k529J6596J0950J917
$$ -17362 -28920 10911 23856 7401 -17772 -23177 19051 24836 -15047 -17576 -980 9970 11887
596A1887j8183L233P237j8105J4563J9580k3033j3902Q568K2579J2922m0942k0006
$$ 11887 -6296 -3063 4174 -13931 632 20212 -2821 -16723 -8155 14424 27346 -13596 -33602
609c3602M0771J5174j6442j7291n731K7031N929k3094N943m92j0360J8129O011
$$ -33602 7169 22343 5901 -11390 -17121 9910 15839 -7255 -1312 -1804 -12164 5965 11976
622A1976p987j0158j3093K5391J9555l1514j3011J2592J2217J5613j9994k3220
$$ 11976 3989 -6169 -19262 6129 25684 -5830 -18841 -6249 5968 21581 1587 -21633
634b1633J8031J1152J783m488k2232J0223K0806p672j772r639j1150K0647P131
$$ -21633 -3602 7550 9333 4845 -17387 -7164 13642 5970 4198 -5441 -16591 4056 11187
647A1187q133k294j5610R978K6411j5415j9391j195J1806K6281j4557l1026J6306
$$ 11187 3054 760 -14850 -4872 21539 6124 -13267 -14462 -2656 23625 9068 -21958 -5652
660e652J4664l580j338j3478K526J2052m639Q928n666k3462J7157J7230j0453
$$ -5652 9012 5432 4094 -9384 -6858 5194 555 9483 3817 -19645 -2488 14742 4289
673D289p746j1053J1764K2950j8735j3167J0011j47Q652k097j3997J0107J23k439
$$ 4289 -3457 -14510 -2746 20204 1469 -11698 -1687 -1834 6818 4721 -9276 831 954 -1485
687a485J3083j4976r072J7106r44k405l20q431J2268J86j3172J2130k462r641
$$ -1485 11598 -3378 -12450 4656 3712 1307 987 -7444 4824 5010 -8162 3968 1506 -8135
701h135J3468k365m016L358r527Q529N562j4205Q085M687j0645P861k055k576
$$ -8135 5333 2968 -1048 2310 -7217 1312 6874 -7331 754 5441 -5204 2657 602 -1974
715a974P492j2619K813J5974j3764l236P242l625O856n200p272J3460p229m668
$$ -1974 5518 -7101 -4288 11686 -2078 -5314 1928 -1697 5159 -41 -7313 6147 -1082 -5750
729e750J4968j0312n866R961l016M543m239j1274J6680J541j3680Q032k435j453
$$ -5750 9218 -1094 -6960 3001 -15 4528 289 -10985 5695 7236 -6444 1588 -847 -2300
743b300Q546j0169K551O840j2367R047N627j4550N441K460j772O965j2310R52
$$ -2300 6246 -3923 -1372 5468 -6899 2148 7775 -6775 -1334 1126 -646 6319 -5991 -5039
757e039J5636j3142k174R049p496M319J351p122R140n739m620J3968q970n594
$$ -5039 10597 -2545 -4719 4330 -3166 1153 2504 -4618 4522 -1217 -5837 8131 -839 -6433
771f433J1022n389K041J060j0383J2422J444j3124R157r3n320Q280p137N96O937
$$ -6433 4589 -800 1241 2301 -8082 4340 5784 -7340 1817 1724 -3596 4684 -2453 -1857 5080
786E080j1387P972N706j5208P357N239o996N452o883K80J2209j2437q89J0677
$$ 5080 -6307 1665 7371 -7837 -480 4759 -2237 3215 -3668 -3388 8821 -3616 -4505 6172
800F172r526K790M357q467P935l111o013J3308p371o861J1690n330n01L760q638
$$ 6172 -3354 -564 3793 -4674 3261 150 -5863 7445 74 -6787 4903 -427 -928 2832 -5806
815e806R017J126j2635J1548R78r662P991l167p48O311j0508M878P672j2931N927
$$ -5806 3211 4337 -8298 3250 4228 -5434 2557 -610 -1358 4953 -5555 -677 6995 -5936 -9
830iM155r043P285j973l676R348r648j092J2546j0406k12N885o618P258k048q889
$$ -9 4146 -4897 2388 415 -3261 6087 -3561 -4653 7893 -2513 -2725 3160 -3458 3800 1752 -7137
846g137J2135m398o028J1820p025l636P637n241M376m03j0720J3014J685j2600
$$ -7137 4998 600 -5428 6392 -633 -4269 3368 -1873 2503 2100 -8620 4394 6079 -6521
860f521P769j261k108Q103r861J746P827j0634N987M884j2356O384K299l706P034
$$ -6521 1248 -13 -2121 5982 -3879 -2133 5694 -4940 1047 5931 -6425 -41 2258 -1448 5586
875E586r765j303J3809r179k736P165p695N252K871p979O499m029l589J4425q714
$$ 5586 -4179 -5482 8327 -852 -3588 3577 -4118 1134 4005 -3974 2525 -1504 -5093 9332 618
890F18q695J0272k006K557j72j0568J0347K930j1413R393j203q175P760j305K836
$$ 618 -8077 2195 189 2746 2574 -7994 2353 5283 -6130 3263 2060 -6115 1645 340 3176
905C176J158j5719J0448J3601j5487k210M034O82Q367j0429m977J3140p814j175
$$ 3176 4334 -11385 -937 12664 -2823 -5033 -999 -317 8050 -2379 -7356 5784 -2030 -3205
919c205J0643r883o45L657k940J0303o964j3431J5023L199n385K119j0389N035
$$ -3205 7438 -2445 -3090 567 -2373 7930 966 -12465 2558 5757 372 2491 -7898 -2863
933b863J1981r512n44j190n590J6557j636j5509O434J500J422N379j0922J574
$$ -2863 9118 -394 -938 -2128 -7718 8839 7203 -8306 -1872 -372 1050 6429 -4493 -2919
947b919N866q850J2081L401j9632K514J0917N293k124k1437N718K6554j1343j5221
$$ -2919 2947 -5903 6178 9579 -10053 -7539 3378 8671 6547 -14890 -9172 17382 6039 -9182
961i182L591M608R558p604q942J4937o562j0993J7376J122j2582l132K762J9103
$$ -9182 -5591 -983 8575 971 -7971 6966 404 -10589 6787 7909 -4673 -7805 -5043 14060
975A4060l766k7462J0353J6875o384l042p923K436J4223q839l198O128j0121N032
$$ 14060 10294 -17168 -6815 10060 3676 634 -7289 -4853 9370 531 -2667 3461 -6660 -1628
989a628Q238p834K913m509m296J5872m213r180L249n984R821J1281j8332n430
$$ -1628 6610 -1224 1689 -2820 -7116 8756 4543 -4637 -1388 -7372 2449 13730 -4602 -10032
1003a0032J0221N527L526j7602n714K5215m045j4556Q384J391j876l709j817J6302
$$ -10032 189 5716 9242 -8360 -14074 11141 7096 -7460 924 2315 439 -3270 -5087 11215
1017A1215p383k1864J8987J5908j5043j2361j558K0346Q274k7663j66K1750o214
$$ 11215 3832 -18032 955 16863 1820 -10541 -12099 8247 16521 -11142 -11308 10442 4228
1030D228p103J54K424N819j2442J693K0418j4921j4106J5361N394k180r265p251
$$ 4228 -2875 -2721 -297 5522 -6920 -5227 15191 270 -13836 1525 6919 4739 -4526 -11777
1044a1777J8423K464j4103M924j726j146J0285q304m601O604l207P422q60j2414
$$ -11777 6646 9110 -4993 -69 -1795 -2941 7344 -960 -5561 1043 -2164 5258 4398 -8016
1058h016R747J682r600Q299O34l980J985n550J0258L439k2439O137J9398p548
$$ -8016 1731 3413 -6187 2112 2746 -1234 751 -4799 5459 8898 -13541 -7404 11994 4446
1072D446q895k677J0071R839k1123k869K2748q387j1314Q551M524Q91j2550l542
$$ 4446 -4449 -7126 2945 12784 -8339 -11208 11540 3153 -8161 390 4914 5805 -6745 -10287
1086a0287K1946n398j9432J2202Q288l756n619o770J4524K177j9125R248J1199
$$ -10287 11659 6261 -13171 -969 7319 3563 -2056 -8826 5698 7875 -11250 -2002 9197
1099I197j1658J73J837K776K397j3290N470J2643j3797P17J0105p643M9J49q43
$$ 9197 -2461 -2288 -451 2325 4722 -8568 -3098 9545 -4252 -3535 6570 -1073 -1024 -875 -1718
1114a718O534r861M27J5037j0671o512J0277l484o52r46k004J1346o526j0510
$$ -1718 4816 -5045 -4618 10419 -252 -6764 3513 29 -623 -1569 -3573 7773 1247 -9263
1128i263J5342j084j1760M250L050M990l771j1655J4374M933j8846N501R836n151
$$ -9263 6079 4995 -6765 -2515 535 5525 1754 -9901 4473 9406 -9440 -3939 5897 746
1142G46k226l719Q477N884j8452L856J5965j1766m281N826J486L838j0298k49
$$ 746 -1480 -5199 3278 9162 -9290 -5434 10531 -1235 -5516 310 1796 5634 -4664 -4913
1156d913J4830j1288p930J3625j404l916n76j071J0720p131j2119J5529J726j1824
$$ -4913 9917 -1371 -9301 4324 2920 -996 -1572 -2643 8077 946 -11173 4356 6082 -5742
1170e742N403J959J098j895q635J1055L690j6238Q454Q332q677k5j337L468M732
$$ -5742 -339 1620 2718 823 -7812 3243 6933 -9305 -851 7481 -1196 -1221 -2558 910 5642
1185E642j2600M130J2034j1994j519Q471l955L09m020N42J1045j0607n100J4624
$$ 5642 -6958 -2828 9206 -2788 -4307 4164 209 518 -3502 -2960 8085 -2522 -7622 7002
1199G002m868o564M189r18N169m433p283J4236k043j2783R944K368n185j29k992
$$ 7002 2134 -4430 -241 -1159 4010 -423 -7706 6530 4487 -8296 1648 4016 -1169 -1298 -4290
1214d290Q658R35j4486R399Q190j2542J334L309N39K916r745M071J0589j3154
$$ -4290 4368 5303 -9183 216 8406 -4136 -2802 507 1046 3962 -5783 -1712 8877 -4277
1228d277j009J0824n733o43o52m7Q530r279n216J4033m772o478O324j622K142
$$ -4277 -5286 5538 -195 -838 -1490 -1537 6993 -2286 -7502 6531 1759 -4719 1605 -17 2125
1243B125j955n965J1043k426j1278J0831J730p007L186k015L847J553j0692P796
$$ 2125 170 -5795 5248 2822 -8456 2375 4105 -2902 284 -1731 2116 3669 -7023 773
1257G73N879j1657M137M234m519K339m086K609P277j2235R26J1432p872j595K728
$$ 773 6652 -5005 -868 3366 -1153 1186 -2900 -291 6986 -5249 -4323 7109 -763 -2358 370
1272C70j557N049n709l178J1846o696o126R762k414k286N78l309Q639k729j0082
$$ 370 -1187 3862 -1847 -5025 6821 125 -6001 3761 1347 -939 -361 -3670 4969 2240 -7842
1287g842J0940J169q255M401m16N92J983p815O622M630j1836M661N624o294K403
$$ -7842 3098 4267 -3988 413 -3 589 2572 -5243 1379 6009 -5827 -1166 4458 -1836 567
1302E67k626P33P388r524m2R680p772q48M756l789L400k713l368R807n698n501
$$ 567 -2059 -1326 6062 -3462 -3504 6176 -1596 -2444 2312 -1477 1923 -790 -4158 5649 -49 -5550
1318e550R757l580k894L770l310M023n66p169R249o66q178P022k86l248L523n068
$$ -5550 4207 627 -2267 1503 -1807 2216 1650 -5519 3730 3064 -5114 1908 1622 -1626 1897 -3171
1334c171M105L547r986N477N082q187K583J056j176M833p681N53R571q702j678
$$ -3171 934 4481 -5505 -28 5054 -3133 -550 506 -670 4163 -3518 -2965 6606 -2096 -3774
1349c774P439m685J693m64l278P642m844n180R984l430m297N230l714K667J479
$$ -3774 3665 -1020 673 209 -3069 4573 -271 -5451 4533 1103 -3194 2036 -1678 989 2468
1364B468p244P069P25p825O798l77m495M953l472J398M070q994M550N332q725
$$ 2468 -4776 2293 3018 -4807 1991 1614 -2881 2072 -1400 -2 4068 -4926 -376 4956 -3769
1379c769L417K250l790M256m087k27O873p757k21P818o035l36K568k941N498l593
$$ -3769 -352 1898 -1892 2364 -1723 -1950 4923 -2834 -3055 4763 -1272 -1608 960 -1981 3517 -76
1395g6n016R489l427m917O244k887O49K432o305N427J859q417O262J109n140M858
$$ -76 -5092 4397 970 -3947 2297 -590 59 2491 -3814 1613 3472 -4945 1317 2426 -2714 2144
1411B144l521J75N258o894K101M589p215L878K300n975M206o01k272M959n409
$$ 2144 -1377 -1202 4056 -2838 -737 3852 -3363 515 2815 -3160 1046 445 -1827 3132 -2277
1426b277M09P052p683r5N641m545K161o35k941P799n026m958Q710k356l641L032
$$ -2277 -1868 5184 -2499 -2594 3047 -1498 663 28 -2913 4886 -140 -5098 3612 1256 -2385 647
1442F47k412M891l29r217Q099K967q084L213N38j36L462p806K723O959q540Q61
$$ 647 -1765 3126 2797 -6420 1679 4646 -3438 -225 313 177 3639 -4167 -1444 5515 -3025 -2164
1458b164N166m124K693k323k540P848m625l861O304l074N92L097o791M498K656
$$ -2164 3002 -1122 1571 -752 -3292 4556 -69 -3930 2374 -700 -108 2989 -3802 696 3352
1473C352o459M056q79k976O876m654k213O671m438n70K277l961N354p44o935Q372
$$ 3352 -3107 949 70 -2906 3970 -684 -2897 3774 -664 -1234 1043 -2918 2436 1692 -5243 3129
1489C129Q08p688L229l21K345J642q702N124P076r422M31L496j637K977m980p1
$$ 3129 3937 -3751 -522 -843 1502 3144 -5558 -434 6642 -2780 -2349 1147 -490 2487 -2493 -2564
1505b564Q837o994m134P658j824j142q57k972Q782j882q683O848J378l670K054
$$ -2564 6273 -721 -4855 2803 979 -163 -1020 -3992 4790 2908 -5775 1073 2451 -1219 835
1520H35l614K796M081p587L000M192o662L681l8l534N701l165k014N514l942L31
$$ 835 -2779 17 4098 -3489 -489 3703 -2959 722 684 -2850 2851 -314 -2328 3186 -756 -425
1536d25K479o476N449K737p060L860O46j816L121n486K04P705o258j164N304k825
$$ -425 2054 -4422 1027 3764 -3296 564 1210 -606 2515 -2971 -2767 4938 -1320 -2484 2820 -5
1552eR32j841k857Q496l730p229R076N83m324K88k631O134M87r309O085M240o657
$$ -5 927 -914 -3771 4725 995 -6234 2842 3425 -899 -611 -3242 2892 3379 -5930 155 4395 -2262
1569b262K225J66j032L771o037J185O950o890K98L912l280K393j958l103O840
$$ -2262 -37 129 -903 2868 -3169 -1984 4966 -1924 -1626 2286 -994 1399 -559 -3662 3178
1584C178k962l448P166l978j668L448l795K499N02m296O045o91n471N958k195
$$ 3178 216 -3232 3934 -44 -1712 1736 -2059 440 942 -3354 2691 2000 -3471 2487 292
1599B92l760N449k484M92J896m708N082k8p372N460K092l945K588k353J448L815
$$ 292 -3468 1981 -503 -11 1885 -2823 2259 2231 -5141 319 2411 -1534 1054 -1299 149 3964
1615C964p951J731O465n887J98K329j486L857m959j549Q125n152m133O953j839
$$ 3964 -3987 -2256 4209 -1678 -1480 849 -637 3220 -1739 -3288 4837 -315 -4448 2505 666
1630F66r33J031k547M840k811n907Q575o92n486M614q83M48J000o250M405L527
$$ 666 -267 764 -1783 3057 246 -5661 2914 2222 -3264 1350 467 915 1915 -4335 70 3597
1646C597o858L390K243l483K764k972l76M886n801P31O087o290Q72L602l770J647
$$ 3597 -3261 129 2372 -1111 1653 -1319 -1695 3191 -2610 -1879 4208 -2082 -1210 2392 -1378 269
1662B69j087j347O510n772k262P491l553k651L120k004K749p97m410O804j159
$$ 269 -818 -2165 4345 -1427 -3689 3802 249 -2402 718 -1286 1463 666 -3744 3060 1901
1677A901n374N552j568k148K862l377L336K017p479M509L455o500J688J513k39
$$ 1901 -3473 2079 511 -1637 1225 -2152 1184 3201 -4278 231 3686 -2814 -1126 387 148
1692A48K671n934J707O589p039j110M896k234Q22o30k056N452l831l079O527l182
$$ 148 2819 -3115 -1408 5181 -1858 -2968 1928 -306 516 -114 -2170 3282 -549 -3628 2899 -283
1708b83j774M223k882J228N33m189N624j020n601N597L97l271K407k551K032K551
$$ -283 -2057 2166 -716 512 1045 -3144 2480 1460 -4141 1456 1853 -1418 989 -1562 470 3021
1724C021o740L232L685n726K862R12k554K930k667k49M200n604J105N897n795
$$ 3021 -3719 -487 3198 -2528 334 1246 -1308 1622 -1045 -1294 2906 -2698 -1593 4304 -1491
1739a491L41K324k070K941l284k206P213l101l770M848j691j84J046m145N013
$$ -1491 -1150 1174 -896 2045 -1239 -3445 3768 667 -3103 1745 54 -130 916 -3229 1784
1754A784Nn374M981J46m121L586j177m00K377m528L472K467o783K971L652m275
$$ 1784 1789 -3585 1396 1542 -2579 1007 -170 -570 1807 -2721 751 3218 -3565 -594 3058 -1217
1770a217J493j784Q07M513n573r43O061l860l96J683k699L876j093l524N050k246
$$ -1217 276 -1508 -701 3812 -1761 -2704 3357 -503 -899 784 -1915 1961 868 -2656 2394 148
1786A48k653N185l243q53L049l114K729K2m642N125K35m872M032n46j463K880
$$ 148 -2505 2680 -563 -1416 1633 -1481 1248 1270 -3372 1753 1988 -2884 1148 602 -861 2019
1802B019m278J989L380n466K523J871m032K988k77k284L367k799p8M497n562L97
$$ 2019 -2259 -270 3110 -2356 167 2038 -1994 994 717 -1567 1800 -999 -1077 3420 -2142 -1745
1818a745M795l812K76K11j533N211l382l824O237j099k844K344k590K817J418
$$ -1745 3050 -762 -486 -275 -1808 3403 21 -3803 2434 1335 -1509 835 -1755 1062 2480
1833B480n853L942J290m077L479j007k137L830k705o7L380n186K734K754n170
$$ 2480 -3373 569 1859 -2218 1261 254 -1883 1947 -758 -825 2555 -2631 103 2857 -2313
1848b313K158J161k474L545k876j445N137l515j153L720l540K038J324m233L551
$$ -2313 -155 1006 -1468 2077 -799 -2244 2893 -622 -1775 1945 -1595 443 1767 -2466 1085
1863A085l56k661M622l093k299N255k486r76J606k656L901o7n893M877J372l670
$$ 1085 729 -1932 2690 -403 -2702 2553 67 -909 697 -1959 1942 1875 -4018 859 2231 -1439
1879a439K272k199P27L823n363Q89M187m737K329P79l609L865j017k511M461l462
$$ -1439 833 -1366 -639 3184 -2179 -1290 2897 -1840 489 1268 -2341 1524 507 -2004 2457 -1005
1895a005m51M384m268L83K527l297K795l10l705N309j538l431M301k337k92L192
$$ -1005 -1456 2928 -1340 -957 1570 -1727 1068 758 -2947 2362 824 -2607 1694 -643 -935 2257
1911B257m413K064K138m141L201j90l914M890r87k584K966k999J986K723o266
$$ 2257 -2156 -92 2046 -2095 1106 916 -2998 1892 905 -1679 1287 -1712 274 2997 -3269
1926c269K082M284l955J127j338l36M894m306k746N965k293q71K002l246L229
$$ -3269 -1187 3097 -858 269 -1069 -1405 3489 -817 -3563 2402 109 -762 1240 -2006 1223
1941A223L72m584M313p29k713M280k498j359L775l152Q65J712l996L254J052m217
$$ 1223 1595 -2989 1324 595 -2118 2162 -336 -1695 2080 -1072 -207 1505 -2491 763 1815 -2402
1957b402L352n32k280L969l132o77M039l619J426J851m609L128J408l824K500
$$ -2402 950 418 -1862 2107 -1025 -1702 2337 -1282 144 1995 -2614 514 1922 -1902 598
1972E98j119R2L679n512j01N746l508j145J277j447M233k289m411N847n92l317
$$ 598 -521 -429 3250 -2262 -2363 3383 -125 -1270 7 -1440 2793 504 -3907 1940 1348 -1969
1988a969K792j969J464K213m988K422K497m751K563O76k373K648j676m67L662
$$ -1969 823 -1146 318 2531 -2457 -35 2462 -2289 274 950 -1423 1225 -451 -918 2744
2003B744m617N41M218m240P56J455k338L575j967k818M595j999j360K994l319
$$ 2744 -1873 -1332 2886 -1354 -598 857 -1481 2094 127 -2691 1904 -95 -1455 1539 -1780
2018a780J378L189m399J338R13k229L358k258k276N600k301k530K764j965K171
$$ -1780 -402 2787 -1612 -274 639 -1590 1768 -490 -2766 2834 533 -1997 767 -1198 973
$$ [...]
8191b18
##END NTUPLES=NMR FID
##END=
