##TITLE=1H_Pr 53-C3
 200.13MHz,CDCl3,
 8 sc
 
 13.11.2025
##JCAMPDX= 6.0         $$ Bruker NMR JCAMP-DX V2.0
##DATA TYPE= NMR FID
##DATA CLASS= NTUPLES
##ORIGIN= UXNMR, Bruker Analytische Messtechnik GmbH
##OWNER= pz
$$ XWIN-NMR		Version 3.5
$$ Thu Nov 13 13:43:55 2025 Russian Standard Time (UT+4h)  she@DPX200
##.OBSERVE FREQUENCY= 200.1313
##.OBSERVE NUCLEUS= ^1H
##.DELAY= (6, 6)
##.ACQUISITION MODE= SIMULTANEOUS
##.ACQUISITION SCHEME= undefined
##.AVERAGES= 8
##.DIGITISER RES= 18
##SPECTROMETER/DATA SYSTEM= spect
##.PULSE SEQUENCE= zg30
##.SOLVENT NAME= CDCl3
##.SHIFT REFERENCE= (INTERNAL, CDCl3, 0, 14.3821)
##AUDIT TRAIL= $$ (NUMBER, WHEN, WHO, WHERE, WHAT)
$$ ##TITLE= Audit trail, XWIN-NMR		Version 3.5
$$ ##JCAMPDX= 5.01
$$ ##ORIGIN= Bruker BioSpin GmbH
$$ ##OWNER= she
$$ F:/spectra/data/she/nmr/H-C/1/audita.txt
$$ ##AUDIT TRAIL=  $$ (NUMBER, WHEN, WHO, WHERE, WHAT)
(   1,<2025-11-13 13:42:24.14 +0400>,<she>,<DPX200>,
      <created by zg, POWCHK disabled, PULCHK disabled
       configuration hash MD5:
       00 E9 B6 7A A2 85 ED C7 34 08 36 98 17 FE 4E 26
       data hash MD5: 16K
       04 D4 46 EA BB 88 FB EE C3 77 97 E5 6C 80 3B F8>)
$$ ##END=
$$ 
$$ hash MD5
$$ 2D 7D 89 6B A8 DD 03 CE 0D 3B A2 C7 F3 B2 C3 86
##$RELAX= 
##$RELAX= 
##$RELAX= 
##$RELAX= 
##$RELAX= 
##$RELAX= 
$$ Bruker specific parameters
$$ --------------------------
##$DU= <F:/spectra>
##$EXPNO= 1
##$NAME= <H-C>
##$PROCNO= 1
##$TYPE= <nmr>
##$USER= <she>
##$AMP= (0..31)
100 100 100 100 100 100 100 100 100 100 100 100 100 100 100 100 100 100 
100 100 100 100 100 100 100 100 100 100 100 100 100 100 
##$AQSEQ= 0
##$AQ_mod= 1
##$AUNM= <au_zg>
##$AUTOPOS= <>
##$BF1= 200.13
##$BF2= 200.13
##$BF3= 200.13
##$BF4= 200.13
##$BF5= 200.13
##$BF6= 200.13
##$BF7= 200.13
##$BF8= 200.13
##$BYTORDA= 1
##$CFDGTYP= 0
##$CFRGTYP= 5
##$CHEMSTR= <none>
##$CNST= (0..31)
1 1 145 1 1 1 1 1 1 1 1 1 1 1 1 1 1 1 1 1 1 1 1 1 1 1 1 1 1 1 1 1 
##$CPDPRG= <>
##$CPDPRG1= <>
##$CPDPRG2= <>
##$CPDPRG3= <>
##$CPDPRG4= <mlev>
##$CPDPRG5= <mlev>
##$CPDPRG6= <mlev>
##$CPDPRG7= <mlev>
##$CPDPRG8= <mlev>
##$CPDPRGB= <>
##$CPDPRGT= <>
##$D= (0..31)
0 0.7 0 0 0 0 0 0 0 0 0 0.03 0 0 0 0 0 0 0 0 0 0 0 0 0 0 0 0 0 0 0 0 
##$DATE= 1763026943
##$DBL= (0..7)
120 120 120 120 120 120 120 120 
##$DBP= (0..7)
150 150 150 150 150 150 150 150 
##$DBP07= 0
##$DBPNAM0= <>
##$DBPNAM1= <>
##$DBPNAM2= <>
##$DBPNAM3= <>
##$DBPNAM4= <>
##$DBPNAM5= <>
##$DBPNAM6= <>
##$DBPNAM7= <>
##$DBPOAL= (0..7)
0.5 0.5 0.5 0.5 0.5 0.5 0.5 0.5 
##$DBPOFFS= (0..7)
0 0 0 0 0 0 0 0 
##$DE= 6
##$DECBNUC= <off>
##$DECIM= 32
##$DECNUC= <off>
##$DECSTAT= 4
##$DIGMOD= 1
##$DIGTYP= 9
##$DL= (0..7)
0 120 120 120 120 120 120 120 
##$DP= (0..7)
150 150 150 150 150 150 150 150 
##$DP07= 0
##$DPNAME0= <>
##$DPNAME1= <>
##$DPNAME2= <>
##$DPNAME3= <>
##$DPNAME4= <>
##$DPNAME5= <>
##$DPNAME6= <>
##$DPNAME7= <>
##$DPOAL= (0..7)
0.5 0.5 0.5 0.5 0.5 0.5 0.5 0.5 
##$DPOFFS= (0..7)
0 0 0 0 0 0 0 0 
##$DQDMODE= 0
##$DR= 18
##$DS= 0
##$DSLIST= <SSSSSSSSSSSSSSS>
$$ [...]
##$SUBNAM0= <"">
##$SUBNAM1= <"">
##$SUBNAM2= <"">
##$SUBNAM3= <"">
##$SUBNAM4= <"">
##$SUBNAM5= <"">
##$SUBNAM6= <"">
##$SUBNAM7= <"">
##$SUBNAM8= <"">
##$SUBNAM9= <"">
##$SW= 18.0517328524113
##$SWIBOX= (0..15)
0 0 2 0 0 0 0 0 0 0 0 0 0 0 0 0 
##$SW_h= 3612.71676300578
##$TD= 16384
##$TD0= 1
##$TE= 0
##$TE2= 300
##$TE3= 300
##$TEG= 300
##$TL= (0..7)
0 120 120 120 120 120 120 120 
##$TP= (0..7)
150 150 150 150 150 150 150 150 
##$TP07= 0
##$TPNAME0= <>
##$TPNAME1= <>
##$TPNAME2= <>
##$TPNAME3= <>
##$TPNAME4= <>
##$TPNAME5= <>
##$TPNAME6= <>
##$TPNAME7= <>
##$TPOAL= (0..7)
0.5 0.5 0.5 0.5 0.5 0.5 0.5 0.5 
##$TPOFFS= (0..7)
0 0 0 0 0 0 0 0 
##$TUNHIN= 0
##$TUNHOUT= 0
##$TUNXOUT= 0
##$USERA1= <user>
##$USERA2= <user>
##$USERA3= <user>
##$USERA4= <user>
##$USERA5= <user>
##$V9= 5
##$VALIST= <valist>
##$VCLIST= <CCCCCCCCCCCCCCC>
##$VD= 0
##$VDLIST= <DDDDDDDDDDDDDDD>
##$VPLIST= <PPPPPPPPPPPPPPP>
##$VTLIST= <TTTTTTTTTTTTTTT>
##$WBST= 1024
##$WBSW= 4
##$XGAIN= (0..3)
0 0 0 0 
##$XL= 0
##$YL= 0
##$YMAX_a= 606679
##$YMIN_a= -595285
##$ZGOPTNS= <>
##$ZL1= 120
##$ZL2= 120
##$ZL3= 120
##$ZL4= 120
##$ABSF1= 10
##$ABSF2= 0
##$ABSG= 5
##$ABSL= 3
##$ALPHA= 0
##$AQORDER= 0
##$ASSFAC= 0
##$ASSFACI= 0
##$ASSFACX= 0
##$ASSWID= 0
##$AUNMP= <proc_1d>
##$AZFE= 0.1
##$AZFW= 0.1
##$BCFW= 1
##$BC_mod= 2
##$BYTORDP= 1
##$COROFFS= 0
##$CY= -3
##$DATMOD= 1
##$DC= 2
##$DFILT= <>
##$DTYPP= 0
##$F1P= 0
##$F2P= 0
##$FCOR= 0.5
##$FTSIZE= 0
##$FT_mod= 4
##$GAMMA= 1
##$GB= 0.15
##$INTBC= 1
##$INTSCL= 1
##$ISEN= 128
##$LB= 0.25
##$LEV0= 0
##$LPBIN= 0
##$MAXI= 10000
##$MC2= 0
##$MEAN= 0
##$ME_mod= 0
##$MI= 1.114404
##$NCOEF= 0
##$NC_proc= 0
##$NLEV= 6
##$NOISF1= 3.799351
##$NOISF2= 2.8
##$NSP= 1
##$NTH_PI= 0
##$NZP= 0
##$OFFSET= 14.38212
##$PC= 1
##$PHC0= -3146.401
##$PHC1= 16.39234
##$PH_mod= 1
##$PKNL= yes
##$PPARMOD= 0
##$PSCAL= 0
##$PSIGN= 0
##$REVERSE= no
##$SF= 200.129724274929
##$SI= 16384
##$SIGF1= 3
##$SIGF2= 2
##$SINO= 400
##$SIOLD= 16384
##$SREGLST= <1H.CDCl3>
##$SSB= 0
##$STSI= 0
##$STSR= 0
##$SW_p= 3205.1282051282
##$SYMM= 0
##$S_DEV= 0
##$TDeff= 0
##$TDoff= 0
##$TI= <>
##$TILT= no
##$TM1= 0
##$TM2= 0
##$TOPLEV= 0
##$USERP1= <user>
##$USERP2= <user>
##$USERP3= <user>
##$USERP4= <user>
##$USERP5= <user>
##$WDW= 1
##$XDIM= 8192
##$YMAX_p= 0
##$YMIN_p= 0
$$ End of Bruker specific parameters
$$ ---------------------------------
##NTUPLES= NMR FID
##VAR_NAME=  TIME,          FID/REAL,        FID/IMAG
##SYMBOL=    X,             R,               I
##VAR_TYPE=  INDEPENDENT,   DEPENDENT,       DEPENDENT
##VAR_FORM=  AFFN,          ASDF,            ASDF
##VAR_DIM=   8192,          8192,            8192
##UNITS=     SECONDS,       ARBITRARY UNITS, ARBITRARY UNITS
##FACTOR=    0.0002768,     1,               1
##FIRST=     0,             0,               0
##LAST=      2.2672688,     0,               0
##MIN=       0,             -595285,         0
##MAX=       2.2672688,     606679,          0
$$ Real data points
##PAGE= N=1
##DATA TABLE= (X++(R..R)), XYDATA
$$ [...]
896E15M03j917M41J947j429j453J990M69j858N27J385j434n19J780j61j855R02
913b67J690j466j235K062q1j903J148J249j699o41J907J03j878P05J304j271m65
930g38J529m52j404J049J136j546l90J420jj293O26P40j051j40J125l13j053O77
948g9N54o34p5O61n73n48J056K38j400M59J142o79o41O94K99q50J11R43n94p50
968f66Q06L74o21j96L94j24j62K40nl25J88N38m56k29L30j00j14J08J31k56OK97
990A58j5k99P2Qm3K97j03m85K86N21j63l93J03K47j74n7M7l6j25K18JkN2k89q6
1015b60N34o1o40K44O68k25p38M50L98l96k85N75r0o14M59L45l90m53O01k1k44
1036a43K65P1o03L11O13o54l07N00L32n00j41N17m00k67P25L9p01J86N34m65k86
$$ y = [515, 918, -999, -558, 1389, -40, -1493, 497, 966, -892, -365, 1020, -414, -933, 847, 686, -1169, -267, 1423, -43, -1278, 784, 703, -1200, -52, 1197, -502, -1143, 764, 867, -1011, -306, 998, -273, -738, 791, 339, -1065, -16, 1120, -426, -816, 604, 603, -690, -64, 676, -375, -515, 610, 297, -756, -79, 475, -159, -234, 427, -146, -694, 362, 600, -800, -341, 801, 122, -519, 175, 474, -376, -265, 678, 84, -666, 140, 514, -107, -303, 91, -33, -195, 45, 40, -285, -97, 441, -15, -244, 86, -14, -128, -20, 111, -145, -139, 158, 143, -156, -84, -76, -119, 178, 75, -410, -124, 397, 234, -159, -56, 191, 17, -40, 7, -29, -154, 64, 65, 63, 115, -174, -260, 274, 213, -427, -183, 485, 260, -478, -28, 370, -26, -311, 264, 174, -440, 19, 364, -26, -479, 122, 101, -143, 122, 193, -410, -99, 514, -140, -447, 53, 385, -115, -256, 261, -139, -406, 319, 358, -343, -157, 377, -88, -374]
1057c74N90j14o59O23M55r46j14J152j83j005L33Q81o22o20Q58J38q22K64N38
1076C73l19m23O37k9n36L46J78o18J11P62n09l69N36L58q17J10P14l85o37O76
1096A59L96q52M2P57l73o70N25L28o78J17P04n56m09N59L81n87j65O53k43m26
1116c38M41J42m86J31L88k19k31K97Rk96O5K75l53K2M98k45l39L22P0m88J64M69
1138B98r5n88M46L15l66l11M16j7l63J98J62k26K9R5j3l2j8Q8l5Q8J2j52M9J67
1162A47k10p1L88j33k75K12O6k10j0K73L2m30J39J74p2k02J66rM6M4P6j92P7J46
1186A72j05q3J52r7j37K85j23l04J40L31l50k08N01K6n51J59O37l31n06N66J18
1207B92n73K1N87k14m60L47L34n35L0N56l91k78M02nl68J74K04k45j55N07j66
$$ y = [-374, 216, 102, -557, 66, 521, -425, -539, 613, 430, -575, -242, 639, 17, -603, 255, 393, -429, -165, 373, 54, -369, 268, 239, -297, 49, 227, -391, -280, 482, -27, -396, 140, 498, -319, -209, 505, 120, -517, 159, 555, -297, -255, 502, 129, -541, -16, 312, -366, -249, 455, -101, -510, 49, 430, -157, -322, 331, 88, -338, 103, 245, -241, -110, 278, 59, -172, 125, 134, -162, -97, 178, -175, -153, 345, 100, -239, 83, 153, -335, -171, 298, 203, -385, 61, 376, 10, -301, 115, 98, -265, -67, 95, -131, -102, -7, -20, -52, -70, 18, -17, 71, 83, -69, -20, 147, -63, -134, 254, 121, -154, 58, 124, -86, -96, 177, 209, -221, -82, 92, 20, -182, -16, -25, 21, 65, 141, -51, 26, 172, 67, -16, 136, 39, -98, 187, 64, -240, -100, 231, -119, -327, 174, 200, -351, -192, 445, 114, -392, 174, 292, -281, -260, 327, 113, -347, 0, 334, -201, -171, 385, -6, -284, 118, 113, -255, -81, 123, -122, -277, 230, 64]
1228F4l79M42J70o23q9Q65k55o42M47L82n66k43P92o8q20M66O55p17k19O17o7
1249B12o15K90N45o07j07O11j31n27L92K08n42p6O44k70m07N08L20p13K3O14l25
1270D7m45N24L64p75N9P18m73n02O14K68n34r1N79j47o28L97M09n60n4N62k28
1291A04l36K63R5j92K9K71j92j45K21Q3k74J15R5j70o2J63O8l39J72J54k68P8
1313f7J44q9p0O9J04p8k79M11m8j83J43J29j54o8J14m7j02P2k8J55p4ko7M8J03
1338A36k37N5K02r8k32K88Lk49R6J18q5j20K02n1j28Q2K39k86k3K06o2k30J29
1361d5K67k60r3K86o3l10L78J01l90RL55j98k46K57J19k68M7K94j78n04N90J54
1383C02m93j0N09k87k48L12J42m00PM12j09m65M47M5m05J5M49k41l17N26M8n66
$$ y = [64, -315, 127, 297, -326, -415, 450, 195, -447, 0, 382, -184, -427, 365, 297, -523, -57, 598, -119, -338, 279, 212, -403, -113, 432, -175, -282, 329, 198, -329, 63, 271, -271, -347, 297, 27, -380, 128, 448, -265, -242, 372, 47, -398, 126, 490, -285, -226, 492, 19, -483, 131, 399, -135, -226, 353, 206, -422, -25, 384, -176, -230, 332, 104, -232, 31, 126, -66, -37, 234, 42, -103, 118, 201, -73, 42, 137, -33, -95, 68, 136, -203, -31, 123, -145, -67, 77, -12, -82, -13, 91, 13, -266, 145, 97, -86, 57, 186, 32, -36, 78, 31, -71, 1, -27, 128, 54, 52, -15, 33, 136, -101, -46, 156, 58, -174, 114, 117, -132, -36, 82, -3, -123, 79, 28, -100, -18, 221, -65, -88, 118, 56, -174, -45, 222, -38, -131, 155, 92, -218, 160, 261, -129, -120, 235, 37, -209, 48, 167, -101, -54, 240, 62, -442, 148, 302, -191, -201, 308, 21, -227, 85, 227, -173, -166, 246, 137, -328, 119, 164, -241, -226, 223, -18, -335, 191, 239, -327]
1405c27J21N67m21l31N45k5n00K59N27k85m67M51J57m96J31L86m46j54M83J22
1425B97n67K77J53j16l69L61J41l65J29L60k96k83L78N2l16J69J51k53j15L57
1445A45k2l74K88J21k07n8L08j20k43K41J76k43j35K10J5k07K42r6j01O9M3r2
1467d0n5P5J63k37j25L30q8o2NJ49j73o4J73J18k72n0K06k4l0q1l3M9J17p1j1
1492c1RQ4r8K9j8J55j63o0P4RP7Np6J16j29L6O3q2p8J2J65K8q9J6n9P3m1N2j88
1521a09M7Q0N4j16J40l7m5m4R7j5q0j64K61r2j49J42J56j87j4K86j19k06J39k
1545B3k7l7M7N6j43J94j5k66O3J70r8m5J47q3j20J39O4j41J1P2P5j41Q5j15J5
1570g0p4J29J75j23p4J76k37R4J03K6k36N6J37o6J5l5O9m8m9J12kk7k6O8j36J02
$$ y = [-327, -206, 361, -60, -391, 154, 129, -371, -112, 415, 130, -337, 114, 271, -225, -94, 292, -154, -308, 175, 297, -270, 7, 160, 44, -325, 36, 177, -188, -59, 301, 5, -278, 100, 152, -164, 5, 156, -97, -212, 145, 123, -251, 37, 158, -49, -107, 201, 81, -162, 79, 255, 12, -123, 87, 102, -105, 137, 41, -60, 9, 52, -40, -95, -20, 143, -94, -219, 111, 23, -39, -34, 115, -58, -122, 51, 169, -103, -153, 53, 29, -1, -82, -115, -66, 51, -20, -31, -22, 62, -36, -7, -25, 130, -33, -93, -19, -10, 67, 72, -4, 112, -17, 19, 82, 0, -78, -66, 99, 127, 38, 54, -5, 68, 27, 79, -109, -62, 18, 72, -44, 96, 59, 14, -30, 67, 52, -28, -192, 69, -23, -172, -30, 126, -61, -75, 211, 92, -114, 25, 23, -4, -41, 6, 62, -81, 113, 98, -168, -105, 65, -33, -78, 69, -14, -134, 5, 69, -72, -61, 11, 86, -55, 30, -85, -70, -144, -15, 160, 37, -37, 139, -98, -4, 99, 125, -111, -55, 82, 16, 31, -4, 65, 17, -32, 80, 78, 51, 25, 93, -43, 59]
1596E9J2j64k9R7O4j32K53k88R9M5l5Rj03J25nl0M7k5j4J2J2L6j56J20J6j77J13
1623c9P8n5rL2M2j20L8J05j64N1J3J5J1k6J38j02k2k4K1l6Q7j1j1L1l2Q7k18P4
1651d6J01o6j6R9j26pkJ1O7j15K35j59K3J24Po6j2m4R9L8j30m9lJ37j48LJ3O3
1679C1j5mk2j49K01p6N4l8k7O1J0j0J03o5n0ok5R7N5m8j94P4J20j83L9O7P4L6
1707A10k47K54j02M1m1R2j42n5K93k33j33J20J54j74rJ84j34k25K73J00j39p4
1729h7K07P1k83J40p2J26k04J94j36l4J27J03k15j07K70j27j87J53J77k91J32
1750d3K10j97j95L21J38k65r8J46J55k36K73p3k71J71Lo8j81J41K02k56P9J27
1772H3m2k58K58K5r2j21K44j36QK12k9j59j37L16k23n0N4N6j04P1K15k18k6K7
$$ y = [59, 71, -93, -122, -25, 39, -93, 160, -128, -29, 16, -19, -10, -113, 12, 7, -23, 24, -1, -15, -3, 9, 45, -111, 9, 25, -152, -39, 39, -16, -25, 7, 49, -71, -33, 72, -92, -41, -28, -13, -2, -28, 110, 8, -14, -38, -17, -53, 34, 23, 12, 43, 11, 98, -120, -46, 55, -11, -27, 72, -54, -61, -63, -52, 15, -100, 135, -24, -1, 123, 130, 64, 52, 8, 107, 145, 15, -34, -37, 100, -48, -45, -32, 31, 16, 12, -10, -159, 42, -34, 20, -18, -45, 16, 26, 16, 119, 54, 4, -2, -27, 70, 125, 77, -117, -43, 77, -106, -67, 0, 74, 110, -137, 117, 15, 56, 15, 107, -35, -90, 203, -30, -163, -43, 111, -63, -72, 112, -22, -247, 26, 126, -13, -87, 120, 191, -92, 48, -24, 102, -102, 92, -44, -78, 49, 152, -63, -170, 100, -27, -214, -61, 116, -175, -43, 167, -30, -225, 96, 234, -31, -129, 17, 172, -64, 209, 136, -135, 36, 39, -29, -210, -69, 133, -123, -44, 83, 41, -217, 41, 66, -26, -147, 97, -39, -31, 181, 152, -7, -144, 172, -51, -101, -47, 9, -95, -24, 191, -27, -53, -26]
1796b6K10k44j3J37O8l64K48J17k47J14P1l7j33M6K6j21J7K24n1j47R1j0J1K6
1820A3o3m5J20J28M3k09p3K4M3o5L01k92r6M4J60o9j5J89j37j31P9J59j14N1q1
1845c6J26j11O2o8J12n0o7K4l2K4q4J26p1o0R3J7j16J40n7kL3p3M7P7j21LK38
1872A74k21M9J90k59j4J01O8j30n6J95j7k20K55O9k64k3L90m08Q9J60j0k70J76
1895B4R6r8j84J43K30k94J4K78k86k7Q9J45j31j06K70j70o5J79L6j99KK41J9k05
1919AQ8J52l93j1K31j34j40K90N0k65J31J24j64j34K87l3j99J13J89k23j00K69
1941A29O1k87NK93j53j85J28J07k66J25J31j08r0J23K1j56P0l0K4mJ17J7j05M7
1965A4J21r9j54J84l2m7m4J07m3j23K27j08Jk0m8%M8N2q4Pj0J04j12l0J19J36
$$ y = [-26, 184, -60, -73, 64, 132, -232, 16, 133, -114, 0, 71, 34, -99, -53, -27, -148, -131, 93, 42, -105, -14, -24, -13, 13, -50, -95, 25, 153, 196, -13, -86, -62, -19, -84, 217, -75, -171, -127, 33, -36, -51, 138, 1, -130, -51, 108, -6, 45, -36, 90, -21, 41, -27, 85, 35, -32, -8, -40, -16, -100, 26, -45, -105, -12, 5, -111, 29, -28, -30, 3, -70, -23, 54, -67, -64, 174, -47, 2, 192, -67, -81, 20, 88, -42, -98, 97, 80, -140, 115, 184, -80, -103, 287, -121, -32, 128, 118, -152, 24, 120, 22, -162, -19, 211, -83, -69, 209, -77, -104, -15, 130, -1, -107, 163, -7, -72, 107, 143, -56, -54, 187, 206, 1, 89, 241, -152, -163, 68, -66, -206, 84, 134, -131, 0, 124, -40, -174, 113, 80, -119, -6, 183, -40, -140, 129, 190, -97, -92, 201, 48, -137, -9, 98, -168, -43, 88, -20, -110, 13, 34, -122, -52, -82, -58, -62, 55, 72, -33, 14, 135, 36, -118, 66, 34, -13, -57, 50, 7, -116, 111, 3, 4, -16, -64, -64, -16, 36, -48, -41, -51, 53, -59, -89, 30, 166]
1991A66j87M9J3J3j47R0J73j29J4Oq9K8Oj05J01j80K04m0O3m5j63J08nK4P4k4
2017A8J4n8k4p0K7J16Q2k35L4L05k09n1R7n5m2jN4Lq1j8Q2p8N6J67j36j6J06N1
2045A38k02J7R5q6LJ71r5j72N8N0l1Q1l9P9j43k9J04k3j16J50Q3k60R6M5Q9j44
2071h1%J25j83R6J91j08k35J91N6l9k6K20k53O8J8j9n2n6K30k67O0J18k1j20P6
2096a1Q6oj21J00J10j92j10J85N4q7k7J60k34J18j2nl1Q2pj73J06J79n9lq5Oj1
2123A2q2J15j8m2N7P4j58k0J23j69l6K21j6j45O4J43j77o0j1K71k22M0pQ1q4j7
2149f3L6j7m7J63j26k1J08p3L3L6m3L1LN3o0j17J15L9j08M5J4O6p8k4J06Mp7r7
2177i9K27m6j51L8m6M9N8j06n7R0O2j06MM4l9J19q1l9J07M4j59J0J99r1n0Mlk
$$ y = [166, -21, 28, 41, 54, -93, -3, 170, 41, 55, 61, -28, 0, 6, -99, 2, -178, 26, -14, 49, 4, -159, -51, -56, -32, 42, 18, 32, -26, -50, -120, -93, 23, 105, -130, -96, 209, 0, -51, 46, -9, -51, -52, 2, 5, -76, -94, -12, -90, -34, 133, -3, -19, 87, 138, -64, -47, 48, -38, -35, 136, 41, -131, -73, -23, -54, 27, -12, 67, -76, -105, -1, -24, -140, 10, 93, -167, -71, -26, 63, -81, -81, 44, -139, -43, 148, 40, -195, -4, 52, 13, -13, 207, -46, 22, 40, 21, -31, -87, 143, -124, -64, 54, 33, -87, -11, 75, 69, -52, 48, 158, -34, -144, 41, 95, 8, -19, 141, -93, 25, 13, 8, -23, 59, 52, -121, -15, 164, 105, 102, 17, 23, 12, -70, 45, 27, -15, 42, 116, -42, -62, 61, -108, -144, 77, 61, -84, -20, 123, -54, -114, -125, 146, -76, -36, -43, 38, -46, -63, -27, -44, -91, 72, -54, -75, 33, -40, -7, 29, -14, 17, 20, 73, 13, -104, 11, 50, -58, -13, 1, 67, -11, -35, 71, 75, -2, -99, 128, 82, -69, -31, -77, -28, 30, -76, -133, -43, 19, -87, -83, -39, -78, 41, -40, -79, 28, 72, -87, -77, 122, 31, -19, -15, -18, -20]
2205b0j2J38N9k08K7N4p4M4R4j34l9P6Rk7j9O8k4p8J29r9k1L6O8p0m9L2J67k20
2233i3O4R3pj45J36L7j28M4J64j02j02j7J18j32O1NO9j44J78N1j33j11K18j15
2257In1Q5O8j66Q5R3k37j2J60rk13J25J21q5r9J60J7m0o0P0n2l9QO4m8M1O6L8
2285I9j56J04K1q1K8J8KK7NJ3j78l3j0J76j07J04r9L6n2J45j31Q9j4o1j5J16K0
2312F6j52J21k4P8k5o3K0N9o6J0ql1JK3J03j75J09M0j63M9O1on4M6Q2o0q6N6m
2341GO2o9p4J4m4J49K0p8q0JJ81j19m6J25j37R3JP3j03l1Q7j34M9j1J2K4O3k9
2369FnN3l2l8P3k7N6j37O3K7k4j0j29J16Q2j11O1L9j61k9R2J00q6q3J33J4j61
2396a18K04j67J05o8K0J03j13P3M4j51L7P3j66J43j0n7K2J13q0j23JJ75k1r6J13
$$ y = [-20, -32, 106, 165, -43, -16, 38, -36, 8, 102, -32, -71, 5, 14, -13, -32, 36, 12, -66, 63, -36, -57, -21, 47, -23, -72, -40, 127, -93, -29, 64, 57, -88, 48, 85, -43, 1, 165, 63, -39, -56, 62, -70, -9, -4, 65, -79, 99, 150, 17, -94, 124, 9, -42, 43, 111, -55, 30, 123, -114, -126, 34, 25, -188, -63, 58, -27, -126, 34, 51, 11, -49, 21, -31, -70, -62, 2, -46, -5, 61, 99, -57, 47, 68, -13, 15, 33, 35, 62, 67, 80, -98, -131, -141, 35, -72, 32, -67, -31, -83, 62, -69, 20, 6, -55, -70, 46, 66, -86, 35, 11, 89, 64, 1, 21, 80, 14, 24, 16, -15, -14, 9, 112, -63, 46, 86, -77, -28, 33, 27, -27, 19, 101, 41, -45, 11, 7, 69, 0, -74, -60, -104, 45, 65, -13, -93, -92, 89, -30, -76, 49, -88, 5, 6, 79, -24, -55, 32, -102, -53, -64, -52, -28, 35, 6, 1, 54, 22, -16, 57, 30, 86, -51, 12, 39, 15, 5, -124, -8, 74, -37, 24, 63, -98, -127, -35, 65, -21, -104, 29, 43, -118, 86, -81, 24, -44, -24, 79, -34, 39, 83, -68, -31, 42, -124, 19, 9, -48, -26, 87, 7, -116, -115, 60, 39, -57, 56]
2421E6j33n0J32OP5m8m9o7J70j51OO8r3J4R5j02K8K5j6N1o9m8j8P1J01m1N0Jq7
2450b3o1J09p2k2o1J83P0j18r2J17k9n9O4l8Q4k5o1R6j8j84J27Jq4P1K9j09N0
2477e5J07o5m3J72n5p2k7Qk9MR2j3L7j58K1J9J13L6j49J46n7N3k2j20Q1m1J17
2504A00j36k5J22j32JK1M7LL8k4L1Lk1r0k2J3N8lQo0J18J3k04J94j7Q1j02p4O4
2533Ek3M3n5M9M9PJ1j12K6l2J8JO8l7n9Q2J5q3j5NP5kJ6m2N9P5k18J5M6k4J7r7
2565a17K14j84P9q0J90j36L2J16p6k8J5K1k3rn1Q0l8K5K6l9J4o6Q7Q1j30N4K4
2592H1q8o2m1R5L3NL5l7kRk2M0j86L7J28o3j0Q5M1o3q5J09j68J14oPo2J19q2N5
2622A6P8r5N0o2pk7O0n0k2O3N3Ml5p8J16j29P7l3P3NJ7l0j41K20j86K9N9j00J01
$$ y = [56, -77, -127, 5, 11, 86, 38, -11, -78, 92, -59, -53, 15, -78, -64, 31, -71, -43, -18, -34, 17, -52, -100, -118, -47, 54, 13, 63, 64, -23, -84, 25, -47, -69, -130, 53, 123, 5, -87, 30, 1, -58, 6, -32, 52, 27, -34, 62, 44, -140, -13, -12, -96, -25, 4, -105, -55, 52, -13, -56, 116, 61, -11, -38, -30, -59, -55, 37, 24, 61, -97, -76, -57, 56, 92, -57, 89, 32, 85, 63, -57, 24, -17, 100, -36, -61, 61, -71, -70, -49, -2, 1, 39, 15, 46, 49, 28, -62, -84, -71, -13, -16, -8, -68, 50, 63, -141, 53, 36, 117, 15, -59, 5, -18, 25, -30, 19, 68, 75, 86, -26, 0, -32, -14, -13, 55, 18, -41, 41, 56, -27, -42, -37, 38, 36, 52, 10, 69, 144, -74, -59, -13, -37, -20, -117, 97, -87, -8, -88, 102, -34, -2, 114, 38, 10, 25, 46, 23, 14, -37, 43, 5, 30, 56, 17, 31, -35, 52, 133, 3, 57, 81, -7, -69, -110, -15, 18, 23, 58, 21, 19, 28, 6, 46, -140, -103, 25, -38, -48, 37, 78, 15, -70, 39, -129, -15, -21, -14, -76, 43, -39, 16, 94, -1, 49, -13, -20, -47, 13, -37, -59, 4, 57, 61, 26, -52, 64, -65, 12, -21, 52, 57, 74, 44, -97, 123, -63, -34, 25, -75, 26]
2651B6Kj1r3M1j10J41j69K10jq7J34K8k7j47Q6N1p9J39j20O0lq6L8o9J30r2j6
2678b4m1n4J24L0o4P1j34J40r4L0K0L0j77J31k4J03n5r6J43j35J72j40N5lm1o2
2704i5J44J3j9k2J7J6k4j95J05O8j4n4N4P7p6Nj1r0Q6o5Q8N6r6po1M1Q8k9N8l1
2734B7L6J9jQ3j22o0k5R6j05J28mo8kL1n5K0l6N1J46j39J7p3J8k7K9O5l6Mo0P0
2764B7n1lmJ20j71Q1p3M6L8r0J51l1j08J32j43K21j12N8l5j58N7J21j12J9n2J36
2790F4k2j16P0ok4n0J43j62J20o1P8l9M7j12R8j8l4k6J4J85j54l2P7n9r9J88j20
2817e0O4M0p2OK5R5r8J09l0k56J64K2j07k2J30l8N0JK5n1mo6L8J3K1M0j1j6j7
2846EJ4j43J6K06l3j02LO7r0J25k1l7j8K3P6j44o0M6N0O8l3k0M5jJ7n5L1L8j35
$$ y = [26, 28, 17, -76, -35, -145, -4, -173, 37, 36, -51, 83, 111, 84, -63, 23, 74, -5, 134, 14, 74, 71, -15, 23, -46, 84, -8, -24, -65, -119, 5, 35, -29, 42, -92, 48, -46, -16, 4, 34, -143, -12, -36, 67, 12, -84, 59, -76, 96, -44, 11, 8, -33, -95, 49, 62, 43, 21, 38, 54, 30, -165, -60, 8, -6, -60, -6, 71, -5, 0, -11, -101, -15, -80, 8, 64, -32, -39, -100, -59, 29, 0, 58, 27, 63, 82, 81, 164, 42, -18, -43, 53, -52, 76, 72, 4, 2, 33, -22, -2, -38, 13, 159, 20, 37, -36, -18, -45, -16, 49, 13, 17, -43, 27, -24, -27, -31, 89, -82, -1, -74, -28, 10, -80, 71, 40, -68, 64, -79, 142, 30, 88, 53, -105, -48, 73, -39, -20, -72, 64, 42, -74, -4, -10, -34, -84, 59, -103, 17, -44, 34, -5, 42, -70, 28, 10, -24, -50, -36, 149, -5, -37, 40, -19, -118, 70, -50, 14, 54, -18, -12, 13, 108, 10, 119, 89, -167, -3, 19, -88, -110, 20, -18, 32, 33, 58, 7, 3, -63, -25, -12, 9, 49, 38, 22, 5, 19, -124, -108, 98, 65, -37, -34, 33, -57, 68, 47, 10, -8, 15, 91, -53, -113, -67, -17, 51, 18, -2, 43, 42, 59, 4, 35, 73, -62]
2875f2m2J87j15J6O0q7L9N2M1r7JM3J0j29R8j4n0j05J70M2j25J24Kq4l8j2O4J
2903a0NO8j63J01K7j02J04Nr6k0J52m1l3j6N8q3k4O8k8O0p4ML5J2k6m7N8m2lk
2933e3oR3n7NO0j56rQ6P2mlq1J7R1m3q1OK6P7M4j54K5O6p1Q3m5Q1p7J34j15j01
2964i0Q1n9J44r7q7J56o6o2N2j0P2j17K8Rl9P8K6M1KK0j54%J46j38M5o2J08j16
2992h9J37oK0j11Q1j04J40K8p5K4Pj44R7n6N6j05P7J46j80O4j46P9n2N8J4j08
3018a48M1N7N5j47j4K19r5J17j03J79k34O5p9P6m6RQ9r0L1M2j4n8J04n7p2O2M0
3045B9j59J01jR3P6j68P6j39n6J31lQ2j37k7J30KO6q6l7J01Rj25O9q8J32r4J0
3072a3R1K1j24L9o6rJ37n2m7K3N0m8O3j3o9P1MK7j42J13j9l1Ql7N3j46J44nj45
$$ y = [-62, -104, 83, -32, -16, 44, -43, -4, 48, 89, -8, -7, 36, 46, -83, 15, 1, -49, -154, 16, 58, -67, 57, 59, -25, -63, -75, -11, -10, -5, 63, -100, 1, 28, -74, 30, 35, -61, -81, 71, 30, -3, -19, 39, -44, -68, 0, -28, 32, -42, -38, -3, 9, -17, -64, -6, -48, -51, -53, -59, 34, -23, -18, 42, -114, -123, -37, 35, 31, 28, -53, -36, 55, 12, -69, -63, -37, 40, 84, -70, -45, 21, -50, 33, -12, 69, -8, 126, 11, -90, -9, -68, 76, -21, -108, 48, -18, -80, -28, -38, 34, -83, -55, -46, -85, -7, 19, 60, 62, 82, -72, -72, 74, -64, -19, -81, 27, -89, 48, 42, 62, -49, 32, -72, 68, 96, 21, 45, 52, -92, 5, -51, 5, -100, -23, 123, -57, 7, -139, -60, -112, -54, -40, -148, -107, -50, 5, -142, -156, 63, -32, 85, -18, 161, -73, -8, -87, -11, -57, -48, 41, -49, -18, 24, 10, -48, 56, -1, -73, -11, 29, -130, -29, -30, 63, 139, -29, 47, -92, -148, -17, -20, 62, -75, -102, 28, 30, 96, 10, -27, 74, 83, -42, 27, -61, 71, -23, -13, 78, 99, -25, 14, -52, -61, 76, 24, -23, 0, 50, 2, 65, 52, -17, 54, 58, 85, -57, 56, 37, 6, 14, -23, 30, -116, 28, 23, -122]
3101a22J47N6r7r6J84p4J19j01r9j8J39Np6kJ71k5o1j1k9j04L5nJ2J72n3O5j67
3128c5Q1o1m9l2L0Q2L5o9N4%j5Qn8k0P4r9L9J7Oj44J48nL4k8j10J09n4J65N7j28
3158C2p0R5N8l3n2m3p7K03j71O0M1O5k53K66r4k5p2J08q4J30o2l1j1m6Q1n6k2
3185f3L1O3L3o2j12J15L5j0N6q6J29j40p1J49o7J35j95J32o9N6j35J04m4K5M7
3210E6K7p9j4k9j11R1J37o5l1J1J51j91J5l5J23j0J12q4j71kM1J63j07n2kR4k
3237C6RM3M4j44j5o3K00m4k8M9j4q7o6R2k2J1j14P5M2O8l4j93K32j09M2l2j5j2
3265d9P5L6%o9K1O1j32Q0p4K21j14J0j30J49J1j93J10K8K1Kj33n8J41o4j2J26
3291F4j15%N0L7j18J00n2P9l0K3k7m9k0J49j47O9Qj9L3J4l2J09o9p5P2o6j24K29
$$ y = [-122, 25, 81, -16, -112, 72, -2, 117, 16, -83, -101, 38, 43, -33, -35, 136, 111, 50, 39, 10, -94, -59, -64, -52, 120, 67, 132, -35, 46, -15, -64, -96, -66, 16, 51, -18, 36, 36, 21, 29, -29, -49, 25, -74, -35, -18, -12, -156, -8, -13, 21, -7, -117, -8, -62, 103, 160, 32, -38, 57, 115, 82, 30, -13, -90, 113, -58, 2, 43, 108, -145, 121, 27, 2, -70, 38, -46, 84, 22, -9, -20, -66, 15, -41, -63, -32, 31, 64, 2, -110, 5, 40, 30, 86, 0, 129, -11, -82, 67, 0, 135, -60, 72, 3, 59, -76, 28, -16, 9, 56, 83, 4, -10, -39, -150, -59, 78, 13, -18, -7, 144, -47, -32, -67, 56, 46, 158, 74, -97, -99, -58, 105, -2, -54, -56, 38, 36, 45, 88, 132, -12, -27, -90, 110, 66, 38, 87, 73, -14, -80, 12, -10, 1, -113, -38, 4, 72, 38, -155, 77, -32, 10, -22, -37, -49, 26, 62, 62, -7, 14, 75, -57, 23, -51, 170, 56, 66, -64, 85, 96, -97, 13, 41, 62, 64, -69, -127, 14, -50, -62, 64, -51, -51, -1, 36, -82, 18, -34, 45, 15, 38, 11, -38, -58, 91, -56, 13, 21, 2, 35, 49, 17, 126, 57, -18, 54, -12, -136, 93]
3319I3r5o9L5L4M1qk8P3N2j16L2j9o8P9Pn3L3j20Q1J35j29Kj1N7L1o4j7j6K13
3348A85j48pK6j18J07k5L6q4n7J13k8J1R7n3k9q5oO2J8kj18J97j32N6P7m7j11
3375f5J33m4n1R8j24N7N5m4n1O3o8J5l3M6K4J9j21J29o3J9m9N7l7j7jO1rrOMr7
3406i7J12l6N9j26J7O0J49j17P1j4k27J11N7N9j08j2L4l1L2M8j02kN7l0J6m7P
3433f0R1j30J11mr4L6M0J1q1P3J8p9J26j4o1J4M2KJ0j3j20J2Q4P7J7j9j5k2r4
3462d2J03n5p5J52j19p4M8L8Jn1MP5m4J9m6NP5j00Q1nl9Lk6J16K4q9L6K1K9m7
3492A8j3J2KP9q0L1j3L5Qq8QK0n2J1o8P7L3m9J48j43JP5p6l9l1R6MLp8N8p2Q2
3524aQr4P2O1q1K4M3m8O8j59Q4J09j3j01N6k3l2mj3J0n4J31o8J04j9Kq8k5Oj4
$$ y = [93, -2, -71, -36, -2, 39, 31, 3, 76, 128, 12, 44, 25, -43, 36, 43, -10, 23, -97, -16, 119, -10, -8, -19, 38, 69, 5, -12, -28, 185, 37, 30, 56, -62, 45, 20, 56, -28, -85, 28, 0, 11, 108, 55, 26, -59, -65, -3, 15, 13, -105, 92, -40, 16, 93, 46, -65, 68, 24, -27, 71, -53, 4, 59, 15, -36, 27, -41, -26, -59, -13, 11, 30, -91, 38, -25, -6, -55, 2, -35, -52, -53, 8, -1, -10, -4, 0, -97, 15, -21, 38, -88, -71, -11, 138, 21, 92, 78, -149, -38, 19, 78, -30, -42, -8, -39, -7, 41, -61, -63, -6, -36, -20, -67, -60, 31, -99, 12, 8, -86, -50, -10, 1, -80, -7, 11, -68, 58, 44, -17, -3, 39, 41, 51, 38, -82, -70, 14, 91, 108, 89, 74, 52, -42, 61, 6, -69, 83, -36, -110, -62, -24, -23, -74, -70, 5, -39, -20, -66, -61, 14, -86, -5, -10, -49, -46, -72, 44, 68, -21, 15, 36, 65, 18, 5, 17, 19, 98, 18, 49, 36, 71, 79, -9, -1, 19, -33, -22, -90, -13, 20, -29, 119, -24, -23, 52, -24, -63, -94, 2, 6, 9, -69, -11, -83, -1, 7, -87, -15, 46, -35, -11, 32, -16, 52, -107, -23, 86, 73, -28, 28, 5, -27, -31, -44, -34, -88, 43, -25, 79, 60, 62, -26, -51, -45, -59]
3554e9rJ39j21QJ86j13o9J2k3J24qm4L2m1j2Rp0l3L7L6j6OO9j7Mk2k9o0L6Q6o2
3585b4Q0k2j9Rr7R8N4j00K1Nj28R6J60j92k6KJ40p4N0N5j28L6p0K5L4j4M0l7J04
3614G8n0m3N0k1P8J1j02Q3o0j9r1Jl0J97m2p6j4J87j55l1K1j2R0j35Q6k1k2m0
3642h2l5J19p7O9Q1j55R4L6k1N1r3j8L0RpO4k2P2oj12l0O9m1n3R8qp4O7j18J4
3672g9O2N4j4m4L1K7J5j03J29j29L0J12j46K9M0J06k11J73nM2j27l5O4m1M3j12
3698h9L3O4J2N0j72Q4KjJ21o4q5k7N8j22R5J7j4J17q1M6Jq8K2L5O4j57P4N6j13
3727f2L1RO6j43j5J23J2J03q2NN4m4Jj44Q5l3P5p6O4J18j27m7J76k19P6qK8l2
3755fQ8j17N3R8q7%j2K4q5lK1O8J5j72J10M5On2l5l6L5j02J58rM6o9rN7j22K30
$$ y = [-59, -68, 71, -50, -42, 144, 31, -38, -26, -49, 75, 67, 23, 55, 14, 2, 11, -59, -92, -55, -19, -35, -29, 40, 23, 27, 5, -24, -84, -48, 38, -24, 56, 34, 15, 24, -73, 25, 79, -21, 0, 5, -123, -27, 133, -59, -85, -83, 57, -17, 33, 88, -40, -4, -74, -49, -15, -29, 11, -26, 78, 28, -15, 35, 14, 92, 103, 1, 84, 24, 5, -86, -85, -115, 82, 40, -36, -50, 137, -18, -49, -28, -40, 50, -85, 1, -20, -42, -82, -117, 2, -75, -6, 75, -80, 14, 50, 29, 80, -13, -31, -1, 8, 1, 65, 43, 115, 109, -3, -33, 36, -5, -58, 40, 32, -42, 25, -93, -79, -17, 37, 23, -21, 10, 37, 52, -51, 78, -51, -21, 91, -55, -26, 14, 120, -91, 82, 77, 119, -8, -43, 21, -20, 23, -89, -56, 8, 20, 70, -102, -18, -16, -17, 104, 40, -45, -72, -14, -136, -41, -24, -38, 79, -2, 44, 45, -43, -21, 14, 78, -79, -5, 51, -62, -31, -22, 44, -99, -114, 9, 21, 124, 42, 47, 101, 57, 58, -86, -1, -34, 41, -35, 29, 147, 20, -27, 149, -70, 6, -2, 26, -6, 82, -35, 18, 116, 29, 29, 17, 41, -44, -47, -26, 42, 57, -115, -5, 40, 46, -6, -41, -77, -42, -144, 14, 5, 51, -18, -27, 30, -92, 138]
3785A38j06j10R4kQ6j16J32m2j4j33J19Rq0O1r8L6N9l9O1q2K1m8k4J43k3k18J30
3812d6L7J14j34N9J71j94j17j7K68j11rK6P8j00m5j6J07j27P3L5l1j17P2q3J62
3837E5l8R7m9l3j5J4m6Q6l5k1M6j9m8M5p3q4O4P5l7M9k3k2ql0p6Q1J61q3l2k9
3867b8L6K2J2m9l6K4R6N2j33L0J1j2k8j10N7Q6j78Q2L4L0m3O4l3n7m5M7K0M5l5
3896c9L3o4J29j09m3J13j39J84j38J13M9J2j19n4J42j23O9P1j46J45o0L2j01m0
3920h3P6OJ5M0n8m1M6j33L7J29m5m3O9om8J00n6L3m7P2k2r7J22m3J5j45L9KR0
3949B4rM1m6m0j3p7O5L7K4J28j10o6P7K8oM6j13q0J48l3n7J00j46N1p0K01q8q4
3977f8O0o2M3K0J6L5j19P5O8q7oj1J54o8Q1k49J18l4n8J38k1q9K5J3p5J57j25
$$ y = [138, 32, -78, 16, 14, 100, -16, 116, 74, 60, -73, 46, 55, -25, 36, -62, -26, 33, -6, 55, -27, -6, -54, -78, 65, 42, -176, -46, -9, 105, -29, 30, 201, 7, -110, -127, 141, 30, 21, 47, 125, 25, -20, -36, 71, -56, 17, 52, 21, -96, -24, -107, 55, 17, 114, 65, 32, 17, 31, -15, 71, 36, 15, 61, 42, -6, 39, -34, -118, -54, 21, -16, 33, 10, -12, -20, -50, -126, -45, 116, 33, 1, -28, 8, 30, 42, -7, -43, -19, 77, 129, -4, 26, 37, 25, -3, -113, -56, 30, -148, -66, -32, -2, -45, 19, -14, -71, -116, -69, -49, -4, -39, -6, -70, 59, -50, -93, 20, -119, 65, -73, 40, 89, 101, -18, -72, 70, -53, 16, 87, -59, 86, 26, 58, -43, -83, -7, -1, 14, 54, -4, -45, 1, -132, -95, 34, -11, -54, 15, 9, -39, 61, 5, 38, -9, 63, 41, -56, 66, 23, 38, -107, -68, -66, 24, 15, 56, 10, -30, -43, -120, -55, -18, 6, 134, 24, -42, 35, 63, 57, 103, -10, -90, 58, 25, -32, 68, -78, -27, -97, 104, 16, -68, -8, -70, -27, -7, 9, 44, -75, 0, 68, -19, -25, -36, 118, 50, 131, -118, 0, -34, -92, 46, 25, -64, -39, -26, -101, 56, -69]
4004f9N9J09j03J24j16q3O6J05Jr9Qj65J74j6J21p8nO8o3j07L2Q0m0k0K1j13J19
4031A0J9O6j16K8R7j83l9Q7n5M8O0j30K12l5j2j8o8J02j07M3J2r3R8p5O6k4l3
4058d0j2J4m7J67j34L1L4j08K24j03m3P5Qj95J19m1Kj6J80j64L3p0M1J18j37N8
4084fML6n0L5p9K0N2m6J57k14J36L0q3mP2j04J17k05J30K5KJ8q0P8n0l1o5L8Q4
4113A7l0K0K5O5j04J24j02k2O5j97J69Rn5Rl7l1J04q8P7j39J54j3j7JkM8j74J26
4141Bn4J01k6nQ0j57oK8Q6J3j35M3J07Kj1j20P3j21Q5K7rl2l3R5p1J3mJ01j19
4170d7J07m5l0j5l5O6k0k7P2J4k4jLk8j64J73O1n7j2O1j7pl8pm9P3P7j83L0m1
4200a10Q7qJ12j22J10j51M6Q3R5j53L9o2M9j0J7R1j27O7r4P6q6L4Q4j32N5oQ7
$$ y = [-69, -10, 99, -4, 120, 4, -79, -13, 92, 93, -6, 2, -163, 11, -5, 116, 38, 33, 101, 38, -69, -37, 43, 3, -17, 4, -109, 10, 29, 95, -21, 7, 104, -79, -118, -31, -86, -38, 22, -108, 104, 69, 57, 39, -29, 73, -34, 9, 21, -72, 26, -49, 17, -7, -40, -52, -38, -85, 82, -52, -21, 13, -95, 129, 26, -17, 58, 66, -129, -10, -51, -49, -65, 115, -49, -16, -86, -45, 73, -64, -6, -2, 34, -16, 19, -60, -40, 12, -34, 123, -91, 45, 75, -8, -12, 60, -44, 73, -132, -2, 23, 25, 43, -37, 41, -9, -40, -105, -67, 17, -13, 7, 32, 97, -7, 117, 15, -7, 58, -139, 30, 39, -16, -7, -44, -75, 29, -59, 18, -121, 33, 20, 3, 4, 2, 50, -124, 2, -52, 49, 23, 18, 98, -59, -65, -37, 49, 62, -73, -30, 77, 79, 68, -52, 21, -100, -15, 12, 3, -29, -62, 33, -38, -25, -29, 72, -47, 60, 15, -15, -30, -65, 1, -19, -46, 26, 40, 16, 15, 18, -10, -174, -1, 60, 3, -9, 52, 35, 28, -10, -17, -66, 7, 84, -99, -69, -110, -23, -31, 81, -41, 69, -82, -36, 47, 142, -11, 28, -34, 15, 5, 22, 113, -14, 53, -41, 35, -51, -17, 67, -65, -10, -16, 71]
4227G1k7J2o0M0l8m8J3n9R8j2J77j28k6l2J2J17r6M2j08J68r4%j2K8j8O5j1q4
4255a0L2lq5Q4n5o3J13m4k3LKl2L8J1LQ5j2l4O6l2R3p9j10K7Q9q4K6R5j03Koj9
4287b5J17j07p7m7O6R9j74J23R2o4p2n5O8K1n9k6J20Q3j81Q6nK3O3r0M2m4M7l7
4315a3O8j39N0J91j5r8l5J07j29j21J33L9j27O8J04p0R3p2m3LR2m6j03NrL2k5
4342f0J26j16J44p2l6K6K7p1mK8rJ08p5OoN1j48R6K7j5Lp7M1N4R9k55P1o9J23
4371A7QM2L2j58k9P6R9o0L5k12K02j91J18J35j84P7p4J12k19N7N9R8L8q9l1J9
4397b3N7L7Jk8l6Lk4q4J46r7J12L6j29L6P3o1o0p9J38J10j68M6n0O3l5L0L4r5
4425d7j13P9Q6lQP5J8p2o3J9R7j09m0J60J9r6K7r0J98o6o7J9p8K8j7L5O7J5j56
$$ y = [71, 44, 56, -4, 36, -2, -50, -37, -96, 2, -10, 167, 39, 13, -19, -7, 110, 14, 56, -52, 116, 22, 22, 10, 38, 20, 85, 74, -10, 22, 19, -66, 18, -37, -100, 13, -31, -54, -51, -49, -81, -43, -32, -29, 56, 44, 10, 76, 44, 137, 58, -52, -25, 64, -20, 6, 101, -2, 0, -6, -25, 92, -15, -92, -139, -73, 26, -148, -25, 67, 3, -69, -124, -56, -35, -94, -120, 0, 83, -98, -12, -17, 6, 69, -21, 21, -23, 24, -13, 55, -84, -34, 157, 142, 44, 9, 116, -13, -134, -1, 38, -89, -21, 83, 13, 106, 34, -9, -6, 86, 40, -63, -58, -67, -35, -60, 66, -50, 94, 22, -14, 12, 39, -32, -36, -8, -17, 91, 16, 22, 16, 67, -81, 15, 42, 27, 30, -47, -6, 48, 147, -108, -37, -106, 17, 25, 67, 99, -59, -88, -12, 87, 27, 62, -150, 52, -139, -21, 114, -70, 7, -67, 45, -174, -117, -58, 40, 78, -11, -42, -23, 34, 71, 72, 44, 8, 11, -13, -97, 49, -48, 64, 100, -29, 7, 80, 19, -41, -120, 18, 128, -40, 6, -44, 19, -16, 14, 48, -47, -160, -81, 5, 2, 10, 85, 103, 31, -32, -13, 84, -25, -65, 95, 114, 18, 45, -45, 153, 87, 20, 39, -39, -11, -28, 7, 74, 89, -67]
4454f7J54j74J50o1l6RJ06k0j6j05MN5nN8N5q7p0K3o8J69k2p5R5ON3l8p8j0J3
4483A8lO7j61P5j2KJ18k3J2j7j19K4j9J27j25J61j40p2J03N9q4L2L1q5P8p8QL9
4511A6n3M0J5O1j39J6L6K3ql1R4q5k4J10q6L5J01j71lJ59j04M4M2o8O2o8j6M1
4539C9m0K7o1K6k5Q0m6j09R5Lj21R9M6k6P1k6o4n6K1O8N9m7j49J77J3k9O3r4n1
4568e7J34m4l5mL9J0J7l3mm5R5n9p8J02Ok6q5L9K9j04J15k8J4O7r9J57k00J49
4596G2j32N4j24J37J8jm5pN7o5O9o8L6J6p3J44j30J17p0N0j9R3p6j40J88k49J66
4623A8J3p5o0R1O4j81K16m5n7m5J80j19j4R6m0J4k5m7J12%n3r8J1M0M7lj23j7
4651a00Q4J03k5J6j11P3K7j47J45j08J05m9j7q2M4R1r1J9j9J33r2l6on6O1p3n7
$$ y = [-67, 87, -87, 63, 2, -34, -25, 81, 61, 45, -60, -56, -1, -6, 52, 107, 20, -50, -27, -95, 74, 52, -23, 72, 78, 131, 93, 15, 5, 18, 15, 82, -79, -4, -16, -14, 104, 81, 93, 76, -43, -19, -38, 89, -36, 125, -15, -87, 16, 75, -9, 23, 54, -31, 47, -31, -23, 16, -37, 3, 18, 79, -60, -44, -8, 15, 7, -24, 70, -15, -39, 71, -15, 20, 121, -50, -53, 106, 2, 46, 88, 20, 82, 14, -2, 39, -1, 26, -35, -9, -34, 46, 0, -109, -14, -11, -132, -33, 13, -13, 58, 32, -32, -88, -67, 1, 60, 13, -136, 41, 54, 25, 88, -6, -57, 77, 33, -2, -6, 33, 43, 60, 27, 23, -22, 73, 14, -64, 38, 44, 18, -67, -28, 1, -103, 12, -16, -2, 65, -34, 123, -77, 72, -60, -6, -130, 7, 25, 24, -21, -28, 29, -36, 33, -35, 1, 17, -56, 88, -42, 75, 5, 55, 36, 129, 53, -87, 101, -148, 18, 31, -44, -104, -13, 51, -130, 86, 41, -16, -61, 119, 0, -14, 82, 42, 56, 31, -16, 96, 96, 43, -55, -44, -4, 43, 40, -83, -100, -16, 87, 62, 78, -33, 40, 67, -80, 65, -43, 62, 13, -4, -86, -42, 49, -42, -23, -42, 91, -1, -37, -43, -99, -38, -111, -168]
4678a68K34j22J06qo9op5J38m5l6J08j09Q2O5k8p5Q9Jk5j28Q2J8l8L0J2q6MO4
4706A5Q6j18P3po2K1K2r9Q0o1L3k8N1k7L0j6j0K4M2K8m6N7j53J02mJ0R8j98L7
4735b0K5m6m5M6O4M2j01J46o7k4p2P7M3j70J24J4j08Q6k1K1m5K6j4Q9j34J57q3
4762A0n0M5J24j43L7L6q6j7%l9J14q5O7R9j78Q5N0l2o8L9o8J45o5O5j90K09j09
4789eJ27rj18K1k1J16o8l6o5J7K9M8K7j46J47Kk2m5M1O7j79Q4j41J00L0K33j23
4816A11j08m8J21q2j15R3nK0p7J95j6Po5L2l5o8j25J37M3k2Mn5JJ23p0L8o1j28
4844a55J28M4m6m4P7M7r2k0J41k0N1k1q1o4J30N1j32nJ2N1l9q1NJ3O7k1j06Q7
4872b3l3LJ26j01K7j36J81r0J7J05j24jJ17j13J5n0J53p4J8l9L9l0K5q4qMM8L7
$$ y = [-168, 66, -56, 50, 42, -27, -33, -108, 30, -15, -51, 57, -52, 30, 95, 67, -8, 81, 82, 57, -71, 11, 29, -9, 21, 33, -53, -49, 15, 101, -17, 56, 49, -13, 8, 30, -69, 11, -50, -17, -45, 6, -21, 9, -7, -17, 7, 49, 77, 31, 88, -65, 37, 33, 43, 141, -57, -20, 5, -41, -86, -40, 24, 66, -35, 111, 44, 20, -52, 25, 68, -102, 22, 36, -72, 14, -7, 14, -31, -5, -19, 70, -64, 93, 10, -40, 5, 129, -14, 23, 59, -27, -44, -44, -83, 31, -54, 13, 112, -66, 19, 69, 37, -31, 8, -60, 85, 20, 85, -105, 104, -5, 122, 113, -5, 16, -5, 111, 43, 7, -58, -41, -12, 36, 63, -83, 64, 66, 44, -1, 40, 107, -72, 12, -129, -29, 1, 234, 111, 3, -45, 76, -6, -121, -28, -33, -13, -90, 105, 89, 96, 31, 63, 28, -40, -165, -28, 15, -7, -3, -58, -57, 66, -4, 34, -27, -155, -27, 17, -29, -73, 4, 51, -41, -61, 80, 60, 111, 90, 9, -55, 75, 126, -6, -11, 1, 52, 13, -68, -63, -50, 17, -4, -110, -23, -56, -53, 73, -28, -1, -137, 44, -46, -29, 76, -48, -49, 68, -45, -30, -80, 73, -1, 17, -22, 17, -13, 12, -72, -80, -76, -28, 9]
4900IN7M6j13P9j6r7qn6R5j5j14J97o0N0j68K12j20m3J34q7k7J00j30N4L6P1j57
4927g1J68j79J09k1K%K3M0j96K23q9P3p0M0j4M1l5m9N3m7J49q0r6M1j3J22j15
4954IMlj24M3Q2P3r1j9J06o3r8j3J02O5k69J49jJ19p8Q4Pj04m5N9k1RK3l1l2m1
4984i9J70o0Jp7J47j48r6J39K5PO8q8Q4j6l8q5L5LJ3R3l6M5j7j54K24j12r1O6
5012Cl1R0m5o2j3L3J15j79J4O3K5J3j8k9j2n3J11K4j7p0JN6q3Q3%l7P2j41J77
5041I0j25Oj8M5m2J8m7N2NrJ32k27O7R8j11P3Q8p3j57J65K0mjN5q7L9n4p8N9N1
5071C0NL1m5LJ7j01M7K7K0Ln6L7j11Q8o9L5L6M9l6k9L8j17R7L8k3P9o1q8o5J74
5101E3j10L7J26j09p1J1J98q3l8J9o1k1J03p9O0O9q0O0o1p3K7P1q5p7kJ11J8Q7
$$ y = [9, 66, 112, -1, 78, 62, -35, -43, -99, -4, -19, -133, 64, 4, 54, -114, 98, -22, -65, 69, -18, -45, 55, -75, -21, 15, 86, -71, 97, -82, 27, 6, 8, 8, 31, 71, -125, 98, 9, 82, 12, 52, 38, 79, 44, -5, 48, 1, 150, 70, -26, 15, 2, 124, 9, 13, 10, -114, -71, 11, 84, -7, -26, 80, 17, -81, -94, 8, 73, -196, -47, -48, 71, -7, 77, 84, -20, -65, -6, -27, -18, 5, -26, -58, -99, 71, 11, 12, -65, 82, -66, -162, -23, 2, 9, 77, -11, 73, 57, 19, -66, -31, -28, -15, 78, 42, 87, 70, -84, 140, 28, -63, 3, -28, 62, 17, -45, -58, -25, 90, -89, -75, -12, 13, 26, 8, -21, -33, -86, 25, 49, 32, -38, -37, 19, -64, 19, 19, -18, 54, -87, 90, -35, -29, -47, -2, -44, -26, -73, -21, -16, -25, 107, -120, -53, 45, -66, 7, 95, 22, -135, 30, 50, 46, 45, 100, 13, 52, -2, -80, -21, 30, 35, 66, 21, 24, 41, -60, -13, 14, 34, 37, -19, 18, -93, -5, -74, -39, -3, 46, 10, -19, 19, -98, -1, 37, 14, 93, 32, -56, -121, 53, -57, -20, 106, -3, -74, -63, 135, 52, 14, 33, -28, -49, 54, -25, 35, 104, 24, 84, 23, -50, -23, 48, -37, -114, -116, -5, 13, 100]
5129A00j62J04j7l8nM5l6r2P8j05L5J04J8N2n7r2L9k9M1n1J76j63J16o4L7n1L3
5156A6j7L4P6j19J20j83J13r9P4Q5j27J3J55j54k7N2o4J03j58rR2m0Q7j9j40J47
5182A1m8j5R2j37O7n5lJ10mn0O4P9j25J9j4m2J39n0K0j33J15m8l3nj6J82j28P4
5210F6n5m3M0j4R0NK5j38L1R1q1j5r6J61j60O3j3M5jM2jO6p4O%r5J53j69J96j21
5240Dp1N3J74j09q7N9p2O1J6o3K5j8L7r9J62r6o6J70q3n0k0P6K2O7j13K2r0J34
5268D5P4j71J88j09l2j2J37j69Rq2J46J8l8J1R4q8j18P6ln4ML7O8L1qj17J11q5
5296c7P6n0o4k3K4O9O8k9l0l6O5J1n8Q9l2M5m4j58J08o0J99j29m4j9k4P8P0M5
5324A10j73N7k7O4J0j28Q7r7J06k5P9p3M0j16k5M7J9J23Kr8K6n0J6Q7L4jj18J3
$$ y = [100, -62, 42, 25, -13, -18, 27, -9, -101, -23, -128, -93, 11, 29, 81, 24, -68, -29, -58, -17, -68, 108, -55, 61, -3, 34, -17, 16, -1, 33, 109, -10, 110, -73, 40, -59, 15, 100, -27, -14, 141, -13, -40, 12, -52, 51, -107, -116, -24, -64, 23, 4, -136, 11, -37, -52, 40, -97, -30, -85, -88, 22, 18, -32, 32, 111, -14, 5, -9, -51, 88, 38, 58, -75, 40, -8, -41, -46, -62, 120, -8, 66, 11, -32, 8, -6, 84, 89, 114, -24, 7, 98, 17, 2, -94, 67, -93, -30, -43, 2, 1, 43, 42, 108, 34, 40, 40, -55, 98, -71, 125, 4, -67, -14, 160, 51, -36, 23, -49, 12, 28, -35, -10, -28, 9, -90, 72, -24, -90, 80, -3, -53, -73, 3, 25, 92, -21, 1, -89, 45, 119, -52, 136, 27, -5, -17, 120, -49, -40, -122, 24, 42, 4, 15, 109, 21, -97, -21, -24, -78, -74, -37, 31, 62, 54, -63, 48, -37, 39, -11, -75, -98, -74, -5, 63, 34, 4, -32, 33, 44, -14, 75, 43, 88, 44, -114, -6, -66, 133, 4, -40, -59, -83, -5, 65, 110, -63, -6, -33, 31, 41, -87, 0, -97, 9, -16, 63, -10, 30, -86, -111, -64, -45, 78, 80, -18, 8, -42, -26, 61, 95, 94, -24, -11]
5352a1o1K0N9l3O1m3Q3M2l4r5L0P9r2Q4j3o8o2R8J09j72KM5k9M7p2L9j2J02k7
5381G6j10o3L3N2P2j06o0J32n6O7lj8Jp5L5N5j23J9J57q6Q3l9p3j9j7J09o4kJ3
5410a0N9k2M4j04O2n3L2J7r2K4M1j5O2mN0m0j04M4L2l5P9o4m6nNJ14J6r0n0NK1
5441b7K3M4J7r2m1R3j16j7J13K3J2M7j59J49j24o8J61j7j53J3R9MK1QL0q4N4k7
5469a4n9Q2K2j00l6R4Q8m2L0L5j92J63l9m7R0K5j71J9O4o1J22j79J61M0k05J62
5495E2o8o5P0P6n7k2J4rj46K98j86m2O4Q7j3k27K07r9l1N1J44j05nj35J29nQ8
5522F5p7l3L6m4P2j01M3O7l3M9k4r1P2O4k7K2j13N1o5N3l5J66k16J69j23j9o4
5549a36K6J26J4M1j82J06M3j00K2QR0m6o8M2K7J18j15o9J12L4j56m2Q1NMJ25j22
$$ y = [-11, -72, -52, 7, -26, 35, -8, 75, 117, 83, -12, 18, 97, 5, 89, 76, 8, -54, 44, 153, -19, -17, 28, -1, 46, -26, 13, 1, 103, 76, -34, -97, -64, -12, 60, -46, -106, 26, -30, 37, 34, 16, 17, -58, -23, 32, -91, -72, 85, -1, 82, 43, -30, -49, -66, 43, -21, -23, -10, 49, 27, 71, -33, 29, -24, 8, 25, -67, -43, -2, -17, 45, 41, 91, 51, -53, -9, 23, -12, 67, 3, -43, -48, -43, 71, 87, -3, -53, -48, -27, -4, 40, 57, -35, -76, 17, -99, -116, -3, 20, 32, 79, -80, 69, -55, -123, 38, 21, -132, -119, -20, -16, 5, 13, 43, -41, 13, -14, -73, 9, 31, -69, -105, -11, 77, 35, 65, 100, -92, 71, 32, -15, 75, 100, -71, -52, 12, -49, 73, -106, 55, 95, -110, 52, -16, -81, -11, 65, 8, -14, 0, -9, -155, 143, -43, -85, -21, 66, 53, -174, 33, -66, -97, -46, 98, -7, -12, -147, -18, -23, 65, -12, -45, -9, -53, 19, -82, -39, 28, -5, 44, 20, -71, 1, 65, 38, 60, -53, -2, -67, -14, -49, 117, -99, 70, -53, -72, -136, -110, 16, 30, 71, -111, -5, 38, -62, -40, -32, 58, 12, -56, -14, 13, 131, 16, -53, 59, 93, -63, -105, -24, -19, -15, 110, -12]
5576a2K2n5J68j35j0nQ7m7N4l5o5PP2Mnm2k8J3k0J33j73N8mJ02lk3k1j7J24j07
5606C7kj18K06n3L6p2j62R9Q7q2L2q9J05J8j06P1O6j82QJ45j07L4P5j18L8K4j01
5633a11J36oL0M2j53Q5K6q5j5J5K5J1O8r6K9O3j07K2j19J55L9o3Kk0k6JJ75k02
5661g9N9N1M9o4M2k7M8j22nQ8J3j64J08k6K8j28J35pn5J85j41O1l1p2N8M4o2L5
5689B1pm5rR5k6J26j82J28o2J9m7M5p6O3n0qp1J04L6j33J05J9l4Q4j48PJ04m9
5717Ioq4J72j07ONk5P0j4O9j32P3r4Q7O2p9qm0k5J4K1o3K02q5q3K9K0N5o0J7j77
5748a71K45j42M4J0k5m9O7N1n6m7R8K9j28j6J52j64K04o5R5j02k4ml6QN4N7j16
5775c1P9L8p5L6r0j8P5Q%j41J03M7n5R0j30RJ58j55m0J55j3k0j72Q8J2Q5j46J18
$$ y = [-12, 10, -45, 123, -12, -22, -27, 60, 13, 67, 32, -33, -26, 46, 50, 45, 3, -25, -12, -32, 101, -72, -14, -18, 84, 81, 58, 37, 20, 144, 37, 35, -83, 123, 70, 106, 34, -128, -29, 58, -24, 8, -81, 24, 42, -64, 7, 73, -109, -101, 44, -63, -29, 46, -72, -34, -10, -111, 25, 19, 49, 91, -62, 23, 49, -36, -51, -36, -11, 0, 68, -28, 1, 64, -43, -21, -140, 15, 54, -9, -7, -27, -53, -52, 123, -79, -20, 31, 80, 16, 58, 31, 79, -43, -48, 40, 53, -111, -3, -29, -1, -129, 6, -1, -56, 129, -12, 49, 18, -54, 4, 48, -14, 21, 14, -31, -40, 55, 29, 155, -27, 101, 39, 58, 11, 56, -20, 43, -7, -15, -86, 18, 54, -79, 26, 45, 11, 95, -53, -46, 58, 9, 3, -81, 91, -16, -10, -5, -30, 40, 26, 95, -37, 36, -58, 29, 91, 12, 4, -36, -61, -47, -26, -89, 113, 28, -55, -26, -6, 49, -11, 6, -171, 74, -68, -24, -14, -39, -88, -21, 30, -26, -73, 25, 54, -74, -90, 62, -102, 102, 37, 132, 30, 6, 2, -34, -26, 28, 85, -31, 48, 86, 11, 47, -43, -61, 14, 22, 22, -119, -16, 31, -24, 66, -64, -55, 103, -52, -92, 63, 50, 30, -142, -54, -42, 43, -103, 15]
5803A5Qj25j3J5J43n2O8p9O6o8k4m4L1J78q6mk3k5J10p9q1R1o2M4M7j87Q1J0L1
5832a4q0PP9m1QL0l4L5o9J94l1p7n5n9J78L4j64LJ05k9M2k3O5j30J29m8j81J53
5860B7Qj07K3P9l0n9J7J5J43j61mn4O9j7P0j01P5J8%p5L8K7n2P9j35O6J0Rl6Q5
5890B7q7l4J32k9J23k07J40Nr1J53J8j06M7l8kl2m3N8m6J10j26N5J1m1J0LQ9q0
5918A9j84J97m3K7l8J01r8jK6j73J67j4%j14Q5J58m6r4P8p5Q9j26P5N8O8n3j33
5945d4N9n5J04j4l3p0Q2j72J63M6j02L5Pj4RO2k01J25p0P0L0P5mp3l9R0r7qk3
5974f2MP0P5j01R4p0n0O8L9p7M7j36M8J1P4j82K18o3o5J03o3N6l7J4j26J45j04
6001g0m9R0l1J4J78j34o8J6j0J64q3n0J5Q4o5Jj0j1K6k7P4m1O4q0J61j49j29J90
$$ y = [15, 23, -102, -115, -100, 43, -9, 59, -20, 46, -22, -46, -90, -59, 119, 33, 29, 6, -19, 91, 12, -69, 22, -40, 4, 51, -136, -55, -45, -14, -94, -87, -8, -49, -41, -11, -45, -10, -79, 115, 84, 7, -48, -107, 71, 105, -59, -56, 49, 20, 62, 39, 104, -26, 103, 55, -126, 27, 35, -72, -49, 30, 0, -59, -42, -27, 116, -45, -49, -103, -34, -51, 19, -82, -7, 11, 11, -64, -26, 1, -51, 28, -107, -41, -31, -22, -58, 27, -60, -94, 38, 9, 132, -75, 65, 70, -21, 132, 150, 44, 91, 53, 51, 19, -24, 34, -12, 98, -28, 27, 38, -3, 7, 10, 99, 19, -165, 32, -11, 16, -22, 79, -19, -20, 6, -167, 0, -14, -14, -128, -43, 115, 69, -25, 53, -22, 67, -59, 16, 74, 142, 89, -44, 15, -40, 64, 50, 17, -53, 29, -143, 20, 66, -36, -1, 6, -8, 1, 63, -138, -13, -83, -13, 17, 92, 88, 15, -24, 66, -31, -39, -62, -58, 12, 87, -14, 80, 10, -40, 28, 67, -10, 37, -99, -51, -40, 34, -148, 70, 7, -58, 45, -18, 38, 1, 15, -111, 34, -70, -119, -29, -60, -46, 132, -2, -70, -54, -64, 100, 17, -33, -18, 66, 1, 2, -8, -19, 7, -20, 54, 13, 77, -3, 158, 9, -120, 70]
6029G0Pq8l8R1jr8R2Jp6K2j3Q8j71J80n2K6o4l0J2Rk1L0M1K0l9l8N5m9N5JPPP8
6062A14n3k5o1J62j89J5n3M8J1J48j20N7j8j6M3m8j7J28j69O6k5N3o2n0kQJ8N7
6090B0l4%J61j18o9M0n9J82k56Q6J18j58J20Ok4k0P8Rj18P1qj7l2m8J47p7j53
6117a53J97Lj7j59Q9Jq5J16k35K41r8Q2p6J16m3m8N4O9L2o0m6L6j0n5J38j53J29
6144F5j24P8m4r3J02k2J77n1k73J92m7R5rq5J55k5r4rM4p8K6j3J15j3L2j40J35
6171I6o0M1p8j82K32k8J4Kj5j52J41n8J10j16L0O3o1K9p9N9m0L7K1n8J01m2M0
6198D7L0m2j51J90j03n0o1J80N4m8p7l8Q7jkr4J50j24J26k02J14j23R3Q1J21j64
6224gJ2k8NN8l2P5k4j3K2j02J13j0j23M1l8Q0n2k4N5j01J24q7P7k6l5J96j53N4
$$ y = [70, 77, -11, -49, 42, 41, -57, 35, 36, -40, -18, -31, 57, -114, 66, 14, 40, -24, -54, -42, -33, -54, -24, 17, 37, -2, -40, 15, -34, 21, 22, 29, 36, 114, 61, 36, -25, 137, -52, -37, -90, -42, -31, 117, -3, 54, 36, 20, 63, 15, -2, 126, -43, 23, -2, 51, -11, -61, -63, -55, -37, 20, -14, -14, 147, 29, -40, 0, -59, 123, -133, -47, 71, -87, 33, 39, 15, -5, 73, 82, -36, 35, 27, 10, -22, -70, 77, 0, -153, 44, 47, 30, -129, -40, -39, -124, -8, -243, -2, -100, -18, -94, 22, -21, -69, -15, 54, 86, 26, -20, 16, 6, -49, 89, -64, 65, -59, 19, -25, -118, -16, -38, 139, 88, -185, 7, -40, 55, 46, -39, 116, 91, -3, -12, 32, -46, -20, -33, 82, 69, 101, -39, 96, 36, 77, -1, -183, 49, 21, 35, 37, 22, -130, 11, -47, 63, -53, -23, 40, -21, 8, -71, -12, -52, -15, 6, -52, 49, 7, 47, 77, 35, -116, 74, -29, -79, -140, 40, 94, 46, -31, -69, 18, 17, 15, -79, 71, -53, 73, -129, -15, -138, -45, 36, 157, -7, 5, -23, -18, 40, 8, 83, 59, 46, 68, -34, 79, 69, -54, -13, -51, 29, -23, -47, 8, -93, 31, -56, 21, -5, -40, 156, 3, 57]
6252E7j58M5o5R0n4j4M7j2K86k38Q2m2j2P5j00q8J19l8L7J6n7m3P4R3p0j40J28
6279A8m5O7n3p7L9K6N3n1k7J20jq6M9M4Pj08P3j08K3J00j56O3R4ql2KK4o5N7k1
6309B1o9R1Mj37M3J32l6n2PN2k8L9j71K0J25n1j3Q1m3J9q5K2q5J00l0k1J77n7
6337E5%o4K4j5o4L8k6J11K4j81J20P8j32M2l7J1N0j3k3n6J40j01p4Q9j9J6M5l4
6365Dm7J04o5J5L8p2k7P0p5J29p2q1J49j29O2j29P6J51j74J17l2j1J1m8J0j12
6391a38J09R4k7M0j8r5J0K8M7j28Q8r5J8P3N6n4q0L6R6l1l4N1p7N2k9o3J09j36
6419i8J54oj7j01N8R1r9P1q5MP9n3L7n4Mk3J4l2N3rL5J9p4qR1Mr3n1J76o5r2Q2
6451A2l6M1qN3J0Q3k40O9q0O7N5k5k6KJ04p5p5K48k56k7J28k0J64j51n1kN3n6
$$ y = [57, -101, -56, -121, -31, -85, -99, -52, -64, 222, -16, 66, 24, 12, 87, -13, -101, 18, -20, 17, 33, -24, -67, 7, 100, 30, -110, 18, -27, 40, -13, -90, -51, -25, 28, -23, -50, 70, 69, -17, 32, 76, 83, -25, 48, -60, -37, 63, -93, -30, 64, 56, 24, 26, 50, -15, 42, 21, -48, 43, 47, -90, -47, 85, 49, -3, 4, 56, 28, 67, -104, -84, 41, -10, -23, 58, 15, 34, -51, -29, -114, -14, -44, -65, 112, 55, 55, -9, 15, 0, -64, -26, -52, 59, 83, -98, 22, 100, -32, 10, -27, -16, 34, 21, -2, -58, 82, -19, -93, -4, -23, -7, 38, 4, -43, 61, -4, 11, 49, -23, -50, 20, -55, 74, 2, -79, 70, -59, 3, -126, -50, 101, -73, 44, 12, 1, 12, -36, -26, -138, -29, 65, 38, 78, 60, -35, -25, 3, 50, -78, 10, -85, -67, 6, 62, 8, -72, -36, 60, 29, -5, 46, -31, 21, -8, -71, 38, -98, 56, 50, 33, -68, -10, 81, -18, 53, -32, -28, 51, -2, 35, -19, -15, -38, -24, -56, -3, -12, 23, 42, -32, -40, 51, 55, -38, -89, 87, 22, -70, 12, -24, 17, 9, 62, 72, 155, -85, -16, -96, -29, 26, 1, -25, -23, 81, 6, -69, 179, -77, -104, 24, 4, 168, 17, -34, -36, 17, -39]
6479c9J7R0K9n8Okj2p3Q5M8k9Ko0P9k0j57Q5j6nO0m2J33j23J01p4M6j8j18J36
6508G1o9L3j48J05qL1r1N4J7P6m1k3J3L3j47m0J02Q3O5r9j3N7k9j33J10L4j16
6535g3Pn6J52l7L3m1m8k6k2Q5Mk4R2q1K5on7J08j6k9N3K1l3q8J21k9j5l2k0N6
6565B4K1QRl1j2Q6j3p8K4k3j18J21n9N8OR1j3j69L4n7J63m1p0M6n6J22o5j3K9
6594B4p4P9l2n5K45q7p0n6KJj6M9R5j86M0l8J44M9n2pj96P9R9lL6j5n4J8q5Ml
6625f5O0k0j6k2L8L6j7j1j5j35J71L9J9j6M6r5qr0QN4K8M8j15NM2o0O4J1o0J61
6655H5q3j3N2N4j33J13n1j7N2n5J26j47R0j20J19l9pm2okQ5M1o1%l5M4N8j14M8
6684D2k5j01J33p0J23k5r0K2j6R1j61N9L7P0L3r9o6l7N3J51j60M1n0m6J75k00
$$ y = [-39, -22, 68, 97, 39, 45, 43, 31, -42, 43, 91, 62, 64, 4, 83, 63, -94, -9, -25, -30, 30, -12, 121, -2, 99, 25, 71, 53, -65, 71, 2, 35, -113, -8, -16, 15, -76, -22, -5, 71, 30, 7, 20, 53, -94, -134, -32, 51, 116, 17, 4, 61, 32, -101, 9, 43, -73, -66, -122, 30, -7, 26, -15, -63, -89, -111, -26, -22, -46, 46, -35, -10, -16, -73, 35, 19, -10, 43, 64, 31, -57, 64, 35, 20, -12, -32, 24, 45, 53, 62, 31, 19, 105, 92, 14, 38, 15, -103, 18, -41, 17, 23, 114, 101, -68, -34, -91, 72, 31, -39, 7, -49, 73, 8, -5, 24, -50, 29, -3, -58, 187, 100, 30, -26, -24, -23, -39, 10, 105, -81, -41, -79, 65, 114, 62, 55, -141, -62, 37, 34, 70, 55, 1, 19, -66, -62, -65, -5, -25, -41, -63, -25, 11, -6, -17, -32, -167, 4, 43, 62, 46, 92, -3, -11, -101, -93, -39, -11, 37, -78, -73, -31, -91, -27, -16, -76, 85, 2, -11, 41, 95, -38, 75, 24, 7, 59, 4, 130, -17, 73, -47, 72, 33, 26, -16, -22, -24, 61, 102, 41, 41, 6, 50, 108, -6, 42, 17, -84, 49, -21, 102, 77, -13, 9, -7, 84, -77, -18, 19, 89, 122, 23, -43, -80, -27, 124, -36, 5, -45, -91, 84, -116]
6710a16m8K05n0K8J9q1o0K8J90k37J96o7j3l3K5L2J9j0M7j02O2M8m2O2j17L7J1
6737C3O1j58J54q8O7L1j0j61J38o4L4k6N9n8P6j53Q1o0N7n8K7L1rr8J10K7r1P4
6765B6k5M3k2M8j05N5L7o1J48j01l4rNJ7m0J2J32o7k9j3j63L0J20j8JO0K3j17
6793d7P3j9l7m9rN7P2m0L2qo2N8P0q5j04J56q4J15m1N8o4R7j04L0m7l9J7P7p9
6822fk9K1M5Mm9k8nJ5J31k6k0o5K4l2n5J17m7L3Ql3l4R1o8Q0r2l1J58j13j08J11
6852cp0J01m9KL6L4l9n6N6L0L3j46P5Q9l6m6R6j16n6R6r1J59j34M4p8R3PKl6m3
6882d6O2o7O7J2K3l5l2K0J12k60K64j04m6J2j0K5k9R3p7N8q3J32q1Npo7J6O5j19
6911i7J91j01qJ79j21Jk5o7M9N0L8j23l4o0L9j9O5J27j71KJ95L5j11N3k3J2n8
$$ y = [-116, -164, 41, -9, 19, 38, -43, -103, -75, 115, -122, 74, 7, -6, -39, -14, 18, 37, 27, 74, -28, 34, 82, 40, 102, -15, 22, 33, 94, -64, 90, 2, 69, 100, 90, -71, 67, 3, 37, 11, 70, 12, 88, -65, 16, -44, 13, -45, -18, 13, 4, -94, 16, 43, -48, 26, 1, 44, 22, 70, -35, 20, 57, -4, 144, 43, 9, 0, 5, 22, -18, -6, 126, 59, 30, 17, -146, -116, 4, -14, -13, 47, 70, -47, 26, 7, -30, -79, -88, -31, 41, 1, 33, 25, -37, 21, 91, 6, -98, 58, -26, 89, 48, 106, 42, 139, 35, 65, 18, -21, -4, 73, -6, -35, -14, 31, 35, -14, -42, -47, -32, 99, 73, 53, -12, 12, -20, -75, 42, -5, 28, 36, 3, -31, 60, -8, 72, -20, -51, 107, -6, -114, -3, -73, 28, -21, -19, 17, 51, 12, -44, 12, 42, 75, -71, 4, 93, 57, 11, 107, -9, -65, 31, -60, 99, -35, 9, -69, 24, 31, 33, -3, -46, 16, -51, 16, 28, 51, 16, -16, 4, 116, -144, 120, 16, -30, -18, -28, -3, -32, 61, -16, 42, -41, 91, 10, 15, 8, -59, -43, 22, -97, 94, -7, -15, 164, 43, 44, 19, -48, 1, 51, 89, -34, -68, -128, -89, -108, -43, 84, -87, -85, 110, 145, 34, 87, 64, 76, 18]
6938A8L4M0j44P8j9L0k7p3O6j7J3N1j6r2L9Q4n0j25N2K3J8Nl6R2m3q2J25j70Q1
6967d5K8n2M3lR9K3o0rj4JJ6p2J49k4j06o6J35j1m8J07j51J07K2j6r7J37o3oQ1
6996A05j25j2N6r9L5n4R8J3M4L5j17k5M3L4j94J00J54j08K3O8r7k4M6N9k7n3o0
7023h2J36j24J57j03NL5J9p4P7o6L1o0P1j0N3l5l0K3l0p7M8O3l4o8L4JJ19o0J5
7052C4r8J06j06J13m0p9O5m4rJ5J53j71J00P6p2m6J12nm8m7n1qJ4jM0q8J27j22
7080h0Q0K2L2r6L9P1j3q1O6k6J12j35j7J02j10L7o2M4kjn4P9P2k7o0J08lpj40
7109e0k0P1k0L3O1m1j4k6m9J13k5L0o4J6l9J18j57M4o8k7M8o0J66m4L9p2k1L3
7137b5j08J81q1R5o3l3N9Kl7pn4M7nk6L4L2J28j16N8j06m7K03j25P2o5On4L0n8
$$ y = [18, 52, 92, -52, 26, 7, 37, 10, -63, 3, -14, -1, 50, 34, -58, -19, 65, 15, -110, -58, -35, -17, -12, -48, 44, 1, -81, 44, -126, -45, -17, -69, -26, -29, 70, 93, 33, 24, 10, 11, 27, -45, 104, 80, -26, -92, 43, 32, -16, 91, -60, 47, 69, 53, -44, 93, 30, 24, 105, -20, -32, 24, -75, -40, -94, 4, 17, 61, 96, -21, -46, -3, 31, -163, -63, 91, -17, 6, 74, -23, -47, -1, 58, 31, -22, -82, 54, -70, 87, -16, -11, 24, 43, -31, 46, -20, 11, -49, 22, 12, 65, 30, 0, 23, -7, -84, -36, 27, -7, -75, -41, -40, 79, 19, 34, -64, 42, -64, 49, 9, -70, -5, -49, -58, -43, 110, -61, 39, 115, 43, -3, 109, 104, 56, 9, -42, -50, -36, -37, 3, -85, 42, -80, 0, 22, 54, -42, -3, 68, 55, -26, 40, 14, 126, -9, -26, 76, -34, 3, -59, -15, -17, -18, -72, 7, 79, 52, -8, 100, 97, 90, -50, -70, 1, -19, 14, 75, 34, 20, -6, -55, 58, 33, 63, -1, 15, -24, 94, -63, -19, -87, -114, -66, -126, 40, -4, 35, -37, -58, -25, -133, 48, -33, 62, -1, -34, 25, 27, -10, -17, -71, -24, -29, -55, -21, 11, 139, 23, 81, -25, -72, 131, 6, 78, 13, 19, -35, -5, -63]
7166f3J38n0P7j41J41K0k56J13J06j15K7l8O1q7M2J51j58Rl1R0o4J02o8O5m7o
7192A8k4m6jJ62j57Q2l4q6L0J28N7j19l0l8K6j3J0L7Lk4m6O7oj4J0J28j87J31
7220F4Lo0J0Ol6K9Ljj7m5J16j81J78no5L3m6l0P3q3N6j4J29j15j06N4k2R0n0l8
7250g0k3N4K2N3kl1O2r8n6J70j08K1k3R2n0p3l5J40j12o4J39o8J74j00O3k7j0
7277D0o3R8j01jM3o2O8Jl7L1n3O4j11N2M0k8P0j2r7rJ56r4O2Jp9OP3M4n8r1j2
7308e9R1l0k8L3m5M7K0J23q8j6j92J76j14J62q7j10O1K2Q6j56J10m5J30j00M0
7333C1j04R9j02R8l3M0p4j1j1J46K2j56J13Rk1j14J8O5m8Q1M9n2n4K9k8o0M6N7
7361C5n1p6J19qj47J27RM0m1pl1R8r6j8k5l2O9N0ok8JOO6J7j45J46m8q3Rm8R0
$$ y = [-63, 75, 25, 102, -39, 102, 122, -134, -21, 85, -30, -3, -41, 20, -67, -25, 126, -32, -23, -54, 36, -28, 74, 6, 71, 24, 18, -6, -52, -53, 109, -48, 34, 0, -86, -56, 72, 129, 10, -20, -58, -32, -45, -35, 2, 5, -19, -65, 2, -4, -18, -8, 120, -67, 64, 67, 7, 17, 23, -13, 16, 19, 18, 1, -44, 72, -109, 69, 64, -1, 32, -14, -44, 29, -54, 2, -12, 117, 2, -104, -50, -72, 18, -32, -70, -93, -39, -17, 36, 34, 3, 65, -33, -89, 81, -27, -6, -29, 63, 13, -60, -95, 45, -67, -131, 8, -60, 114, 14, 77, 50, 40, -23, 75, -26, -27, 16, -46, 22, 23, -14, 17, -36, 28, -83, -31, 9, -19, 51, 39, -58, -67, 89, -5, 57, 58, -21, -15, 58, 102, 44, -47, -59, 32, 2, -26, 7, -38, 9, 29, 152, 64, 48, -144, 32, -82, 80, -7, -117, -56, -34, 52, -104, 6, -39, 91, -9, 31, -73, 26, -76, 22, -11, 29, -45, -56, -67, 79, 101, -55, 58, 67, 46, -68, -50, 15, -33, 48, 97, 45, -9, 20, -8, -68, -22, 35, -16, -92, 27, 19, -128, -1, 8, 48, 7, 0, -31, 67, -29, -47, -72, -104, -35, 15, 9, -19, -18, -12, 54, 71, -74, 72, 24, -59, -50, -98, -8]
7392hL5j08Q8Q3K3k2k20P7N1q8J29K6l3o0o3%O9J1r2O0NN9j0o8N7Rj31P8J7Rm9
7423f6M7o4Q6J6K4n3j0L7o6J15n2Qj09J23Nj08J76j65LP6K5J9j58J45j20L0rm0
7451h5J8lM8K5l0O1nJ7O7q8n2M9j13J25pn5K4lk9p9J21j8M8N0K8p9K8Kj7m8m1
7482d1J18j16P4M0j04M8n1M0N6j03r4J79k9l3K3p3R0r0n2J49j00J4R2q2P6M9m
7509G6o3jj8l0O4o8j6N8O9j26J11j9j2J4j16J42o4m5O1j7P4n0q1J47k00J11k3
7536b2n6J23p4J3qj8KK8pn6O2m9on3J15m7L4O6M4p3O6k4j17l7jJ51n3p0O5P8m0
7567C6J6m3K6j10J54m3K3j6J2q9L8k6O9p3Kk5n2O3jlP5j08J82j87K33j87J14j55
7595g5P9J6J5q1R0J0q4Q3p1J11j27J10j57M6o3Q5N4o5K7k6J3Q5M4k17R7j55Q8
$$ y = [-8, 27, -81, 7, 90, 113, 91, -129, -52, -1, -89, 40, 66, 33, -27, -90, -90, -21, -10, -102, -42, -37, 22, 12, -56, 1, 10, -121, -43, -26, -17, -66, -19, -83, 3, 19, 43, -10, -20, 17, -49, 66, 14, 22, -87, 36, 41, -67, 109, -56, -53, 23, 48, 67, -91, 54, -66, -36, -45, -85, -67, -70, -22, 3, -27, 34, 29, 46, 113, 25, -27, 22, -91, 34, 27, -28, -4, -7, -36, -115, 6, -12, 36, 86, 114, 35, 63, 65, 48, 0, -41, 77, -39, 35, 75, -29, 19, -32, 8, 64, -39, -133, 46, 17, -16, 7, -66, 24, -66, -118, 31, -69, -55, 37, -45, 31, 80, 76, 13, 12, -6, -36, 28, -40, -56, 2, 71, -55, 56, 37, 25, 39, -77, 65, 1, -44, 17, 0, 74, 24, -57, 90, -110, 1, -22, -78, 45, -29, -16, -24, -42, -40, -12, -19, -75, -13, -62, -68, -121, -6, -53, -19, 47, 91, 18, 84, 60, -57, -94, -95, 56, 3, -67, -2, 76, 36, 52, 9, 35, -75, 79, 36, 59, 43, 55, -34, 4, -22, 47, -26, -24, -49, -101, -38, -39, -42, 33, -75, 107, -80, 153, -34, 80, -75, 4, 20, 35, -46, 44, 54, -30, 53, -18, 93, -34, 76, -81, -35, -98, -13, 41, -24, 3, -23, -10, 75, 119, -98, -1, -156, -68]
7622f8Q6P2j4m7k0k7N7j14J91j03Q2r7R3p8l6J48j50J7j08K16o0P0j00O6j49O5
7648hk6o2O4O7m0qq5J02mp1N1Q5o2j18J09J4m2K0k1J01p2j18J46J1k4p0K9q3J14
7677aJ2j22J22k7K15k75K21k02L0Q9o4M7l4l2L4n1R5j4o0lr1Q1P1%L6n8l6l5p2
7706a24R1nm6PJ25o3qJ02l2P6N8k14K0O2j1J00j32o4Kj0M6NL5m3pj4R1l6l5j0
7736c4n1L5K6k6m4R0Q2j58R9P9j30o9J49q1p5Q4O7l6J0l5j23J30M9j36J49J5j02
7763c6Q1q6R1n8o8J08k9k8J7P8P9q0j11R3p8M3K1r0N1j9N4K2j47P8J9j3M6ml5
7792an8P1q5J37r8J10l8nPJ5n1m2N5j02K67j16l3Lr2%R8o3%LNN5o0l1J84j89J10
7823E6p0o2R3j7j1n3P9m3J1l1Q7o7P2ql0m7N2Qj06P3j03K17j20n4J79q6m1M5l6
$$ y = [-68, 18, 90, 76, 29, 9, -18, 39, -75, 116, 13, 95, -2, 91, 13, -23, 125, -25, -8, -116, 100, 40, 110, 10, 76, -73, -8, -34, -96, -32, 35, -5, -13, -98, 4, 0, -71, -20, 65, 3, -115, -6, 8, -34, -14, -35, 66, -6, -124, 22, 33, 9, -61, -32, -115, -1, 11, -111, 11, -16, 199, -76, 145, -57, -27, 62, -2, 45, 11, -21, 13, -38, 57, 43, -17, -20, -111, -30, 41, 41, 77, 19, -17, -52, -124, -33, -38, -84, -77, 48, -15, -23, 79, 47, 123, 181, -33, -13, 49, 38, 138, 6, -58, -56, -66, -20, -15, 20, -23, -30, -44, 47, 11, -24, -34, -85, -50, -24, -50, -94, -4, 78, -80, 19, 98, -32, -101, 48, -33, -108, -24, 43, 7, 17, -18, -141, -11, 38, -98, 51, 66, -36, 45, -41, 50, -8, -76, 32, 3, -25, -8, 70, 149, 69, -42, 51, -27, 16, 37, -53, -2, -21, 33, 55, -92, -14, 5, -8, 38, 34, -1, -59, 12, -73, 64, -34, 76, 38, 33, 40, 55, 4, -38, 17, -85, 182, 66, 33, 36, -56, -56, 42, -21, -21, -18, -13, 42, -18, -49, 135, -54, 56, -14, -76, 17, 0, -11, -64, 15, -28, -17, -48, 39, -28, 44, 36, 6, -41, 11, 19, -87, -14, -117, 100, -20, -74, 105, 19, -22, 23, -13]
7852a3O7Jp3L9p1Q8k8R1q8Q3j22K6n2J69j54J5L9p6P5n8Q8p1lkj6J7J30k38J92
7881E5k8l9R1j16QJ7q7Q1o9J44lk6j09J16mj25Q0n0o3J14j2R0k3n9r4J8N8q3M7
7910g1N8q3R8K2j21m5J30q6M9N8K1j19J12p2j2J71j70N7l8qM9Q2j30M4l6JM5J32
7938A38j61J1N6P8j37nJ07n5%K4r9P5r8L4O6J3r0L4Q2q2L8q4K1j4J83j00kM7p
7967G3q0M3r2J30J8l6j09L0J89j30r4O6k6kJ12k14J03L4M0p7K4m4j1LO5j6N7p1
7995a5M4r2M7mJ06q9l1M2m1MP9p4NK3J15o2q8qQ0K6m1j10R4M5l6j3K9o3P4p7O1
8026C0Q8j19J4K5l9P0l0l9O2j37N3J35j53R0j31R1KqL5L9j11K9L1j8N5l7o0J6
8054a7O2LK4j19l8J27J9k3k6n9M0N2J5j57J08m7P0l0J5k3Q1j24Q4M0q4j9j49J29
$$ y = [-13, 54, 55, -18, 21, -50, 38, 10, 101, 13, 96, -26, 0, -52, 117, -37, -22, 17, -59, 16, -42, 46, -25, -28, -30, -46, -29, 101, -137, 55, 27, -12, 79, -37, -29, -12, -99, -18, -87, 57, 54, 28, -81, 35, 31, -94, -14, -64, -127, -13, -25, 65, 42, -17, -111, -93, -35, -118, -71, -13, -96, 2, 24, -97, -142, -12, -98, -49, 9, 30, -89, 23, -49, -61, 110, -60, -3, -41, -49, 0, 82, -48, -4, -40, -39, 6, 138, -23, -12, 44, 122, -15, -20, 87, 32, 32, 56, -43, 32, -66, -32, 34, 47, -43, -9, 73, -9, 29, -55, -34, -48, 135, 35, 33, 80, 73, -7, 36, -56, 74, 92, 56, -53, -23, 166, 36, -58, 8, -18, -20, 92, -122, -19, 15, 55, -22, 2, -42, -53, -50, 15, -1, 56, -15, 29, -63, -16, -20, 86, -3, -34, 8, -33, -29, 50, -24, -19, 4, 119, 57, -31, -39, 41, 67, 26, -84, 10, 55, 19, 6, 35, -28, 46, -31, 30, 118, -1, 13, 38, -1, 69, 39, 0, 62, -75, -22, 113, -40, 50, -81, 10, 12, 4, 39, 78, -33, -4, 27, 9, 64, 27, -33, -17, 45, 48, 72, -47, -85, 42, 61, 38, 12, -47, -7, 45, 60, -97, 11, -36, 34, 4, 19, -4, 77, -47, 37, 77, -7, -26, -175, -46]
8082d6N1j13k6P8J60m3j93K69j39k3LN9o1M7%k3J9Q1j57J01k12J25M9N5M8k28
8108a19J20m8J0M7k7q8J78o9kj19J55j0j6J2q5M6NN5j82J47P9r4O0o3m0J80k22
8135i0R8PJj1n5J3qP6p2N5J80j45M5j09q5J17O8r1m4J1O3M8M3j48N0j9j6M6o2
8164c4M1%m4n5J62j08K1j5M1p7N2kL2P4o1Qn1r3J05k2N5jK2L7%l9%
$$ y = [-46, 5, -108, -134, -56, 104, 61, -132, 137, -2, -25, -22, 37, -24, 23, 23, 0, 19, 100, -57, 44, -168, -43, 6, 61, 109, -119, 1, -47, -37, 10, -17, -105, 73, 4, 2, -117, 38, 28, 12, 24, -61, -15, -10, 45, -137, 10, 89, -5, 55, -8, -48, 132, -90, 8, 15, 16, 5, -50, -37, -45, 31, -41, 14, 194, 49, 94, -15, -100, 17, 85, -6, -50, -39, 24, 72, 115, -33, 17, -2, -18, 28, -34, 7, 7, -37, -92, 70, -38, -17, -32, 9, -68, -16, -18, 14, 88, 27, 35, -16, -109, -4, -26, 29, 28, 50, 87, 87, 48, 48]
8191D8
$$ Imaginary data points
##PAGE= N=2
##DATA TABLE= (X++(I..I)), XYDATA
0@%%%%%%%QqQj6K4l2M0m8N6p2Q8j04J28j60J92k24K64l12L68m32M97n69O56p53
31d01Q58r77J108j252J411j587J779j987K218k474K752l054L383l744M138m566
47b395N036n552O118o738P421q180R026r970J1029j2230J3607j5205J7079j9313
61a0267K2035k5438K9835l5754M4194n7283Q0471j33494M66769L3660j010013
72e95285L64213N62655j79067l16352J89955q8202j33401L05289J98571m42426
82a34050j76710L79646J88478k62887j59625L2575J46226J72427o6614l26411
92b06945Q976L48157M5432k46428L079O9620q6808R1729J69289k23558k04629
103b32086K62881J41949k86364j7429K87371j00234k31068K17502J25942l13931
$$ y = [0, 0, 0, 0, 0, 0, 0, 0, 8, 0, 8, -8, 16, -16, 24, -24, 32, -40, 48, -56, 72, -88, 104, -120, 144, -168, 200, -232, 265, -304, 352, -401, 457, -520, 588, -664, 747, -840, 939, -1048, 1170, -1304, 1448, -1606, 1777, -1967, 2171, -2395, 2641, -2911, 3207, -3531, 3890, -4290, 4736, -5234, 5795, -6435, 7172, -8033, 9046, -10267, 11768, -13670, 16165, -19589, 24605, -32678, 47793, -85701, 381068, 414728, -595285, -231072, 331583, 152516, -163836, 26119, -62083, -195484, 109805, 308376, -134050, -310760, 68886, 257364, -5523, -165148, -132573, 13653, 186080, 119466, -206945, -197969, 150188, 195620, -50808, -47729, 21891, -64917, 26812, 196101, -27457, -232086, 30795, 172744, -113620, -131049, 156322, 56088, -174980, 42522, 168464, -145467]
113a45467k6459L48799p2354l45195J22280K94598j11446j56966J23842L5608
123F7240j22982M2229R7413o8549o9234K6030K1359M3630L4199r6360m5045J54236
135H4166J6539k23483R956K47909m6414k29536O8150J55789q7632m9172J22007
146F8279l5716j40515R1740J36185j03582r3079Q9164L5249o6095j744L0423q32
158I477K1334m463o1595J7688Q2405l7535p9335L8041J5916o0112M7858O8806
170E8485r1760l9749J32836m09j52567N2953J53431j01296j33522J18973P7127
181G4502j06035J3978R4591q5526p0562J29485M1527j37881j4516R6930k5047
192A1446l9904M6164k6051l8100Q7849J1348j27907K3577J36853n4208j04357
$$ y = [-145467, -171926, 176873, 104519, -240676, -118396, 176202, 64756, -92210, 31632, 67240, -55742, -13513, 83900, 15351, -53883, -27853, -6494, 37136, 71335, -25025, -70070, 84166, 100705, -122778, -112822, 135087, 88673, -140863, -72713, 83076, -4556, -53728, 68279, 32563, -107952, -16212, 119973, 16391, -76688, 12476, 47725, -18370, -20114, 10309, 9477, 30811, 26348, -35247, -17559, 64846, 27311, -52024, -13983, 1933, -58179, -10321, 58485, -33275, -73024, 59812, 59403, -93164, -40211, 113220, 11924, -121598, -2625, 74502, -31533, -17555, 77036, -8490, -79052, 50433, 91960, -45921, -60437, 36493, 11446, -28458, 17706, -8345, -46445, 41404, 52752, -75155, -51578, 85275, 31067, -73290]
203g3290Q2788L2086j10134N7279J26379j32977j16025J79847Q4060j80597k2171
214g2755J52925n2589j08173J13052L8339j56135L4049J65879q9547j36373J19522
225H194Q0866j15617r464P9091p6810l7017J42620r792j65241N6247J42470q5841
237I706p5550J02344q500j02266Q6886Q1304j47582m0174J78874j1781j67884
248i4623O3977J18861j03101m7663J21227l0088j21931R1786R8242j30602n2648
259h6563J37391o630j11968O4587O9172r7674j4225J06140l7446q9606P9197N1450
271F3825j03686m92J03692m9563p5213Q7383L0427j04643J4884R4342n8108o8061
283f5213Q8975K6683j01304K2107R3213o1133o2401Q2136K0710q3558J9250O7876
$$ y = [-73290, 9498, 41584, -68550, -11271, 115108, -17869, -133894, 45953, 130013, -50584, -72755, 80170, 27581, -80592, 32460, 70799, -85336, -51287, 114592, 25045, -111328, 8194, 89060, -26557, -36021, 43070, -33740, -70757, 71863, 62071, -103170, -46923, 95547, 9706, -65844, 36500, 28000, -74266, 12620, 93924, -53658, -93832, 85042, 73261, -94623, -30646, 88215, -14886, -62549, 58678, 28590, -93341, -1555, 96687, -33915, -86563, 50828, 44198, -67770, -3183, 65989, -31685, -45910, 60230, 22784, -66822, 12375, 63825, -39861, -40353, 63339, 13776, -61437, 25946, 56373, -48270, -33386, 60956, 2848, -65213, 23762, 50445, -50859, -28752, 64461, 3328, -59073, 23063, 43773, -39785, -20535, 47341]
295D7341n0267l9584O8404L617o8939L1245N0665n5437k1824N9769r289m6809
307c1108L3741K3719m9036M116N2357l1432m1292N2240J8361n6921Q641M5744
319B9130l1101k4682M2527o21m5007K4183L7624m0975j8873M7417m388l8413K5151
332A972J7936l5425O252L4957k6693k4427M2110O355m7745J5772L9016l7052j8613
345b5585M7412r132m4793L4600L1455n1885j0893N9115j3120n2820L6588L2723
357C3665n1476j985N3254k9001m1981N1500K1236o2546L295N8369k8825m0570
369c5065M9264J0504n8943K2596N3711m9872l5438O4709J0093o4084J9862N0920
381C8257m7553k5765O6469o227p0396L5119N6926n4626l0561O1271k587n6273
$$ y = [47341, -2926, -42510, 25894, 29511, -39428, -8183, 42482, -12955, -34779, 24990, 15701, -31108, 2633, 26352, -22684, -18568, 33789, 2357, -38935, 13305, 31666, -25255, -16614, 29130, -1971, -26653, 15874, 15253, -29754, -5571, 32053, -8922, -27795, 19622, 15234, -23179, 1972, 19908, -15517, -9265, 25692, -1001, -25428, 16682, 23037, -24708, -8936, 30080, -6972, -25585, 21827, 12695, -32098, 2502, 33957, -17928, -28821, 30294, 17174, -35646, 942, 33665, -17811, -19796, 33458, 4457, -37524, 13976, 35212, -27334, -24039, 34330, 5505, -35065, 14199, 24703, -34240, -11644, 42067, -7805, -43243, 21466, 31559, -32525, -12663, 38257, -9296, -35061, 31408, 25181, -45215, -10096, 46830, -7796, -38357, 22914, 20327, -35946]
393c5946L5950M0345o2643j6039P4541j1572o6440L6485M2512n2261q721N8707
405C4918k5211n4683N3065L9226o8136j5096O4785j3370m5797L8464J7426n4745
417b9154J1881O0429l6037n2476N1501L1400n5518q45M6723k9994k9794N3260
429B1376J0528o3766P075N9311k1553m2188L0875J3666l4098J6047K9662l8861
441a1926j8450N0129N577m7006R784L3444k5339j3357L7209q985m1512K6657L6548
454C2773l4556k4573L1690Q000k2486R673R587k4785L003L1971j4479k7359K1938
467C97J4639k2462L723K0403j9715j7131L0880J1647l4952n920K8999n45j4743
480d780N353j634p359J4094P053j9823n383J7584k90r507J0287k184j9745J3611
$$ y = [-35946, 4, 40349, -22294, -38333, 36208, 24636, -41804, -5319, 37193, -15068, -23789, 34918, 9707, -44976, 8089, 47315, -20821, -35917, 28868, 15498, -30299, 8165, 25591, -29154, -17273, 43156, 7119, -45357, 6144, 37544, -17974, -18819, 27904, -2090, -31884, 21376, 31904, -31862, -24787, 34524, 12971, -29217, 1658, 15324, -18774, -2727, 26935, -11926, -30376, 19753, 25330, -21676, -11892, 21552, -3787, -17144, 20065, 11080, -30432, -3775, 32773, -1783, -26356, 5334, 13334, -9152, 521, 10108, -14677, -11674, 20297, 5818, -21541, 397, 15036, -7426, -3703, 16700, -3015, -20146, 10734, 22381, -12571, -18491, 10508, 9963, -4780, 573, -1061, -8420, 5674, 12727, -7096, -12479, 5105, 4815, -4692, 5595, 3411, -16334, -2723]
494b723K5674j9035k4136J7796J7118j2208p429L180n498M982J7582j1317k1535
507a7549J4743J6553j4003l601R452j2928n736K7852M012l6955l066L6180R77
520A5931k4205L146N594p097J2938Q379k6050r036L1127O227k7150J959J6473
533H236j1984K61K3209j6423l1247K5955L2041k8010k6055K3171J3250j4398L863
546A869L970k0372N853K9350j3604k9096J7988J9819j8825n515J7841j0670j2968
559a4360K7148P617l6849j372L5751n857k5966J1102J0428j5377N814J8028j9432
572c325j6573K7447R168k8382J507K2360j2653j2411K1549J353k6049R472K6851
585B0314j6899k1077J9658R854j7750L172J1858j5826n432K3090K66k3430N917
$$ y = [-2723, 22951, 3916, -20220, -2424, 14694, 2486, -4943, -1763, -7261, -2279, 15303, 3986, -17549, -2806, 13747, -256, -3857, 5595, -7333, -13069, 14783, 18795, -18160, -21226, 14954, 15931, -8274, -5128, 466, -6631, 6307, 14686, -11364, -20400, 10727, 16954, -10196, -8237, 8236, -3748, -3487, 19722, 3299, -27948, -1993, 30048, 2038, -24017, -846, 12404, -1994, 1869, 5839, -14533, -8680, 20670, 7066, -22030, -4042, 15777, -3048, -8563, 9278, -1392, -14360, 12788, 20405, -16444, -17816, 17935, 12078, -13888, -2786, 7642, -7735, -1921, 16107, -3325, -19898, 7549, 16717, -11665, -10158, 12202, -451, -12862, 8687, 10040, -16009, -6537, 20314, 3415, -17662, 1996, 11850, -5900, -2728, 9130, -6696, -12128, 10962, 11228, -12202, -6285]
598f285J7950j1495q553J5138l093j5773J2567J3153j8066q246J8761L044j5405
611f303K996Q877q064k25J0711q124j0986J2346Q058j2456j991J1040m045q126
625f292R454L948j2366P06J0933n504p356Q347K677q833J485P390m930m422P138
640B375M87p247L357M409n865n37P615k272o949L757N681l351k628J679k023k57
656a769N228j791o189L475M722l976k385L472r22j917M456op175J649Q619k940
672B551o850L023L438k096J552J226o047r84Q185j46q123J975N529l791j233M955
688C164l147m689O487L534q456j620Q206r05o052M319K062p038K455P960n427
703H53p019O707M186p115j46O545m544m651Q106J952r191J576Q195m799n524O533
$$ y = [-6285, 11665, 170, -8383, 6755, 3662, -12111, 456, 13609, -4457, -12703, 6058, 9102, -6303, -3307, 5570, -2494, -2719, 7992, -132, -11118, 1228, 9286, -3170, -5161, 5879, 1834, -6292, 3162, 7110, -5256, -4550, 6383, 879, -6477, 1870, 4547, -4286, -2801, 4589, -341, -4763, 2375, 2862, -4385, -1028, 3381, -2484, -3021, 4594, 2322, -4627, -870, 4811, 1460, -1168, 511, -1512, -1769, 3459, 1668, -4521, -1046, 3676, -300, -2685, 787, -135, -2052, 2404, 2398, -4777, -3128, 5491, 2551, -4299, -1276, 2162, 66, 1618, 2844, -3203, -4187, 3998, 3852, -4271, -2296, 3233, -558, -1791, 3164, 17, -4672, 1815, 5349, -3107, -4727, 3479, 2574, -3478, 841, 2903, -4135, -1680, 6280, 853, -6166, 541, 4727, -2388, -2534, 4011, -533, -5184, 2922, 4874, -4317, -2741, 5454, 655, -4869, 1664]
719A664J849p245K080O677o225m289Q546R77q480K465O511n125l749P149K44p643
735d594L376O413o007l518P776j21p627L366N613n586k758O447n95o794M175N234
751D800o196k543O920q24n900L475L899n281j204O033j624n316L994L730n432
766a469j212N359j494m229L472K445n041k18N101j547m250L303K304m135J29M025
782B543k077k973L297J469l671j00L706j604k721K763R01l122P59K574j882j792
798a930K453P74k418L93K018j273j082J898j10j769R70J193j542m12J543j95j355
815h44P62O91j013n7J221q31p22J041J54q72L84N87n16k21N64k83l46O95Lr06
835e09K91P64o81l23R09n08p13R75N11j389Q1J469p43r75J236L80j470M42J364
$$ y = [1664, 3513, -3732, -1652, 5025, -1200, -5489, 3057, 4034, -4446, -1981, 4530, -595, -4344, 2805, 3049, -4594, -1218, 5195, -812, -4330, 3446, 3325, -4302, -936, 4677, -909, -3667, 2780, 2185, -4609, -434, 4800, -1396, -3939, 2981, 2157, -3743, -268, 3631, -1650, -2854, 3179, 1555, -3761, 233, 3963, -1469, -2681, 2678, 1184, -3045, 427, 2872, -2169, -2387, 2714, 1167, -3083, 220, 2524, -1611, -1482, 2543, 466, -2507, 790, 2259, -1412, -1512, 2194, 590, -2131, 632, 1533, -1589, -830, 1744, -138, -1930, 523, 1297, -1121, -728, 1290, 17, -1065, 833, 723, -1046, -76, 1117, -425, -837, 706, 511, -844, -82, 609, -404, -461, 760, -71, -793, 248, 402, -470, -86, 501, -15, -236, 328, 45, -301, 394, 397, -509, -218, 546, -135, -458, 451, -57, -770, 205, 716, -673, -592, 877, 134, -841, 395, 775, -695, -253, 1111]
854A111j283p73J574K50j792L98J547j279q23J858k91j555R63J190j376p17J751
871G53j96j669J271J054j944k92K290o83j992J458J115j771k76J930p91j763J871
888C65J079k344j84K281o87j683J370Q05j808Q1K054j127j588J648R64j991L3
905g32J617r15r75J656L07k175P38J922j387j369J801N13j945O02J602j523r00
922a163J883J72j847L75J537r04r38J340Rj370P15J254j281p94J379L26j394M16
940b85J056q68n86J344l48r60N33P43p71k78P37k68o70Q84M38j324j1J261l81
959B46j021P89N65q88k9Q10k26q11N69N56n68l87M82o6j76K35q3k68K54K97l07
980b7k62M22Nk87J95J40k97j07L38J08l65Q1J68l9P3j39k24Q0M79k71l86J67K59
$$ y = [1111, -172, -945, 629, 879, -913, -515, 1032, -247, -1070, 788, 497, -1058, -95, 1095, -281, -998, 753, 557, -1112, 159, 1213, -731, -1023, 1267, 584, -1408, 50, 1165, -606, -882, 1048, 257, -1506, 365, 1444, -900, -1084, 1197, 510, -1173, 197, 1002, -806, -725, 1329, 202, -1386, 262, 1226, -765, -732, 885, -30, -1005, 651, 958, -1217, -479, 1443, 56, -1313, 488, 1001, -944, -342, 1260, -263, -1163, 720, 892, -955, -580, 957, 53, -885, 455, 464, -906, -191, 1063, -218, -1012, 367, 693, -701, -285, 771, -97, -683, 661, 313, -647, -114, 629, -142, -420, 317, 49, -621, 263, 701, -623, -634, 627, 246, -775, 14, 579, -309, -338, 472, 246, -565, 4, 560, -8, -395, 87, 21, -155, 80, -3, -271, -17, 280, -27, -289, 133, 138, -149, 46, 186, -111, -218, 120, 228, -137, -56, 112, 73, 146, 7, -217, -137, 342, 71, -315, -148, 111]
1003A11Mj29L7K0j14J56M3j17M5j59P9L06l4o91P0Q33j54p04R1P59m00l75L61
1026C8K54o20K83N91n14j90K47K0j82K4K22m20N3N72l41m84M77M41p89K0N28j27
1048A03m35L99K71o32R9P51m47m81N51P0o13L65M96p72l54J002P0j044K79R75
1068F53o61n61Q13K22p81M3P82k22p50N59J77m15J54L56m23o2M38j41o13N66L78
1089E12p55j12Q12l51o90O31M36o88k60R36j58o81L56N68p08k24Q87m29n37M28
1109b7N04o86q5O77j64n37L93J78n25J28M63k01k98L36Jk76J21J30j94j00L77
1130B15j0m70K08M03m83j51N08r6n35L60L64l88j97M04K17n03R6L28k99j97K53
1151B7mn6JL0P1l9j84Q9O7N3j75L4J35R6k81J39L3j12l9K52j0k39N2K06j58j57
$$ y = [111, 115, -14, 23, 43, -71, 85, 128, 11, 56, -103, -24, 282, 248, -443, -373, 460, 306, -398, -307, 452, 52, -323, 38, 292, -328, -45, 546, 32, -158, 89, 109, -73, -49, 173, -247, -194, 378, 37, -447, 30, 471, -318, -298, 230, 103, -332, 67, 338, -294, -195, 556, 109, -372, 179, 249, -364, 1, 497, -275, -629, 373, 443, -601, -322, 653, -8, -569, 244, 466, -315, -272, 510, 288, -462, 97, 274, -141, 13, 369, -54, -116, 322, 181, -432, 134, 512, -243, -355, 457, 106, -584, 47, 483, -205, -465, 471, 313, -368, -12, 556, -152, -376, 511, 82, -455, -27, 477, -209, -294, 383, 219, -318, 75, 253, -272, -144, 319, 118, -180, 156, 157, -119, 2, 132, -62, -162, 215, 205, -265, -57, 346, -137, -288, 220, 124, -411, -51, 313, -75, -272, 132, 349, -154, -58, 270, -29, -226, 27, 23, -33, -32, -2, 69, 30, -154, -65, 2, 55, -120, -86, 49, 145, -136, 3, 36, -76, -115, 137, 127, -112, -60, 146, -12, -169]
1177a69J45J79j88r9J29r9K7J62o5j04J80p2j68L58O3m89L2M92k45l93M69J05
1199B50m38J19M41k19n78M62M12o84p7O22j23n88L94L03l61j22M66j03n24M09
1219F1Q0l67J28L25k28k04M38m3m91J17O02m77l43P69j74o33L87N21m53m32P07
1240B90J57q77J97O74m62m68P74m5o10K11N76o13k74N83J43n78L08L91m98r9M28
1261B08m4n02L64K30m83J07M23k18n05N43K09n51j98P86k75m36L90M27n53j11
1281a89N77q5o96M44M02n31j74L83k4l22J91M06m85r6L30r5k68K22J91l12O1K43
1303A73k70k8K73j25k24N5L48k94k2J75J00l36J78J95k00j47K57R1l30l4L13j82
1325c4j47J60P1K9j38J9Jl2Q1J0qN4n3r1K83k37j29J51J51k51J08L3n3Jl2K52
$$ y = [-169, -24, 155, -33, -132, -3, -102, -75, 87, 22, -82, 98, 26, -142, 216, 279, -210, -178, 314, 69, -324, 145, 250, -188, -69, 372, 153, -425, 37, 449, -235, -312, 310, 187, -401, -7, 296, -65, -187, 279, 176, -348, 61, 141, -226, -98, 227, -1, -205, 233, 190, -301, -184, 418, -59, -402, 367, 193, -440, -53, 468, 15, -417, 290, 447, -430, -233, 441, -21, -489, 285, 240, -370, -159, 417, -196, -470, 113, 256, -322, -14, 377, -121, -220, 208, 164, -338, 26, 256, -227, -120, 303, 85, -420, 123, 332, -219, -417, 369, 94, -342, 48, 475, -78, -189, 388, 303, -393, 51, 453, -78, -252, 131, 107, -215, -24, 382, -103, -199, 131, 36, -232, -10, 181, -131, -70, 173, -97, -125, 148, 23, -201, -146, 202, -92, -114, 61, 161, -175, 3, 198, -2, -149, 108, 199, -131, -165, 148, -34, -181, -21, 50, 79, -59, -40, -39, -71, 10, 20, 12, 66, 13, -78, 205, -32, -161, -10, 141, -110, -2, 31, -22, -21, -53, 199]
1351A99k33k2J59m9j24J69M7l02J51J71l01o9L57o3k33K07J90l36q6L60m3l23
1373a74J70J75j95k02M84n8m08K84K02m44j02N03j15l89K43K54l53j27N16j23
1393A41m23L31K23m59N6L72k12k43K07L62o24L0M60j94l26L95J09m73N0N76m39
1414h1k20L23K20m31m0M33k07k39M51k1n34J91M28k47l41M37M1l59%M74k51l11
1436b84L69kk82J12M99l66k39L64N8l48N0L20l74j66M50O6m92K24L39k26j77J79
1458G4L8k45L8J78r0jK6rn6J06J18l27J6K39Ok17L7J41o7n2L9J59k33L6J39Kr7
1485bp2J52j08P3r4Q6q5R9L2j55M6L9m8j0J13K1j77J39j77J18L8k07K37lm0j27
1511a12K03l4n8r7P4Lp4J74o8j37K39j1j98N6RKk7M9R3q1j8J26o4r4O5M8j25j12
$$ y = [199, -34, -56, 103, 54, -70, 99, 146, -156, -5, 166, -135, -204, 153, 90, -143, 64, 254, -82, -168, 192, 149, -174, -4, 171, -24, -226, 258, 200, -208, 76, 278, -166, -268, 235, 120, -269, -26, 228, -125, -252, 264, 141, -282, 49, 272, -187, -131, 241, 29, -214, -7, 355, -269, -239, 221, 27, -299, 96, 205, -268, -218, 358, -81, -301, 22, 242, -189, -229, 204, -3, -242, 209, 188, -346, -155, 273, 26, -315, 122, 163, -196, -196, 278, 27, -284, 85, 83, -199, -87, 412, 46, -193, 171, 229, -119, -69, 251, -123, -289, 161, 227, -265, -41, 298, 72, -105, 74, 112, -133, -95, 83, -7, -8, 18, 9, -47, 59, 177, -150, -134, 105, 111, -106, -69, 72, 5, -47, -8, 151, -82, -46, 93, 95, -2, -74, 78, -30, 43, -51, 35, -50, 49, 81, -74, -28, 11, -37, -47, 66, 87, -90, 49, -128, -10, 28, -179, 58, 55, 15, -112, 91, 57, -1, -98, -24, -21, -95, 79, 11, -126, 113, 102, -96, -40, -31, -29, -56, -7, 86, 5, -13, 113, 49, -45, 20, 68, -57, -169]
1539a69J92J27k96J61O2r0m0RJ57k89J67K5j38P8J30l0j21N5mP2n1N0l1q1J87
1564A32j25o4m2J10J09k02J67ok27P3K37k01l2O8L9k40K57K2j27m8N2O5j92J20
1588e5j2J24r9n7J3K9P9Kq6j5J37m4j55J49J48l25J93J55j95N7J1n3RN6l5j07
1614g6p4K48lk52J74j3oKJ8m0M0k3N8q6j09J16n2N8N6j6m4n2P5m8M4Jq6Q3r7O3
1644d1L1k1O6k7qn5M6LQ8p6l9N4o3J40n0j28R1K1j47J99j2p0Rn1M9m9O6Q6r2K0
1674D0oq9K0O2p7J1N2P7j93m4J39j9O5n5nn7J63mj71K24j13M2m2m1J1m6Q0q2N7
1703an3J63j24j0K6J47k57J36J2q6m1L03j42k36R0J80r5k05J85J06q7N5J5k67
1727a86J18J71q4q6M6J44j03l5R1m9o6J08Pk03J17K04m1m12K33Q3n5j51K68r7
$$ y = [-169, 23, 150, -146, 15, 77, -13, -53, -44, 113, -176, -9, 16, -122, -44, 86, 56, -65, -10, -14, 58, 7, 57, 26, -55, 132, 7, -57, -99, 11, 120, -82, 85, 79, -148, -75, 162, -39, -71, -3, 36, -204, 53, 75, -52, -100, -48, 17, -175, -55, -67, 57, -42, -99, -86, -57, 22, 24, -62, -77, 60, 16, -139, 10, 158, -167, 26, 181, -14, 43, 54, 1, 10, 66, 31, -76, -150, 98, 95, -157, 17, 4, -2, 0, 18, -22, 18, -5, 53, -33, -142, -26, -78, -20, 36, 20, -24, -76, -1, -49, -5, -4, -90, -7, -104, -41, -10, -31, 35, 8, 0, -55, -9, -6, 82, 6, -33, 21, -42, 98, 48, -80, 11, 32, -115, 84, 72, 2, 11, -40, 9, -40, 26, 112, 20, 40, 34, -55, -35, 27, -50, -39, 13, 90, -103, -147, -8, -27, 38, -17, -22, -79, 84, 80, -91, 133, 20, 62, 20, -21, -10, -56, 24, -58, -1, -54, 109, -15, -25, 1, 148, -109, 27, 39, -47, -88, 215, 73, -163, -73, 107, 12, -193, -8, 98, 11, 66, 81, -186, -68, 103, 19, -67, -21, 123, 20, -15, 76, 27, -39, 69, 76, -127, -10, 194, 153, -259, -26, 57, 2, -149, 119, 22]
1751B2l44L38J01k89j9K13k4j09J74J28j68j40K85l5j62j86L17j91j44L67l0l59
1773b55J68K59l27L0K15J2j20Q3Q5j25o8K25j07j15P8J73k70j41K83j25j15K15
1795E8Q1k78J05Q1Kn9j06K17k19J44O7l0j96J55J7q7k2J65j16n1j0K07k26K2J05
1820B6k5L7n8J63j86oK40k09J5pJ64r6k0j6NL7j31O0m1l2P8%j9J5J15j10Qq8J20
1849C9n9j04J04L0m6L7nQ1q4m2k4R0j78J65L7L9q8L7Lr5J06P4j96N4K08k47l3
1876i7J13k4R4j99K26q1k27J85Q0k12R3K44k18j71K84jj46L9N0J25k78P2K63k98
1900h4J2K20Jl26K27J14k25RJ01j2j94K31O5k21N6K31k50j20J33K45l55O5J86
1923A09Q9l49K13m2q0M7J25j98m2K77oj76K4K61j83k88K98M1k38K4L72k33l4L
$$ y = [22, -322, 16, 117, -172, -191, 22, -2, -111, 63, 191, 23, -117, 168, 133, -29, -215, 102, -89, -233, 134, 104, -255, -87, 172, -155, -125, 90, 102, -18, 65, 150, 25, -43, 182, 75, -40, 38, 211, -59, -200, 83, -42, -157, 58, 139, -139, -34, 47, 49, -10, -116, 101, -118, 26, 93, 63, -133, 22, 39, -48, -70, 95, -21, -72, -82, 125, -101, -79, 26, 1, 38, -20, 143, -43, -49, 191, -18, -3, -10, 154, 58, 38, 22, 27, 64, -67, -7, -48, -80, -2, -2, -21, -6, 109, -1, 7, -81, 39, -20, -124, -20, 10, -36, 1, -4, 77, -7, -49, -73, 17, -161, 4, 41, 80, -8, 29, 32, -63, 43, 117, -79, -25, 183, -64, -97, 16, -8, 86, -113, 113, 32, -195, -10, 70, -142, -49, 195, -23, -194, 90, 89, -57, -18, 32, 157, -121, -49, 214, -84, -72, 148, 149, -177, 50, 164, -61, -52, 49, 37, -157, 74, 139, -82, -26, 205, -45, -165, -32, 213, -142, -77, 109, 198, -151, 62, 20, -60, -13, 112, -86, -128, 149, 143, -33, -9, 252, 69, -219, 79, 120, -118, -94, 278, 45, 11, 14]
1947A4Q8j41j38L51k6j57k2J85l06J69L8j95Q2J85Qj67N9lJ33l59K40L4j52K5
1971e5L4L9p0kk5N5M8N8p4j17J07J05j41J14m6j3o0J96O1k29j42K82j89JR8R1
1997A26K8j52J6M3n8Jnr7K03j95J73j68N2J9M7o0j2J31j89KR2J3l5Q3L9K6n7j41
2025g5J37O2j55j0J36q3N2P7j40m1J45m3j76P7n7M6L4Q0j86Q6o6K04j58j02J84
2050B8N4j10j53K73k2k18J39J13o9l9ql2q2J66O8k67M9J31L4j21O0K4k0L1O7m7
2076D9k53K59J38j57j54L00p2j28J1J27j96J22N9n0k30J73J37l21J52J12K4j88
2098h6J50O5j92J0kP6j98J48J37j82Q1K4oj97J85J7oN3L4q9j01J54n4L0r1K5J2
2125cj06K3M4j2n3J03l9mP4N4j02RR5l7q3M7Q8r3o5J71q9r5J8J70J09k89Q7r5
$$ y = [14, 102, -39, -177, 174, 148, -9, -31, 154, -152, 17, 55, -140, -58, 127, 135, -32, 27, 24, 157, -202, 38, 72, -80, -55, -21, 18, -52, -54, -79, -24, 24, 82, 8, -109, -2, 103, -38, 76, 30, 17, -43, 153, 214, -15, -157, 125, -64, -63, 35, 126, 154, 2, 18, 61, 3, 4, -1, -98, 105, -90, 83, -85, -33, -14, 33, -27, -39, 92, -97, -95, -3, 10, -25, 58, 97, 123, 66, -75, 62, 124, -31, -41, 95, 12, 64, 141, 1, -40, 105, 62, -114, -37, -94, -48, -14, 66, -120, -34, -100, 104, -54, -156, 28, 82, -28, -181, 92, 70, -148, -9, 104, 35, -4, -12, -44, -126, 40, 108, -159, -110, 21, 55, -66, -6, 18, -2, 29, 96, 49, -204, 55, 193, 36, -118, 182, 110, -18, -7, 120, -76, 46, 105, 55, -175, -2, 135, -186, -34, 78, 102, -86, 64, 129, -63, -53, -55, 21, -177, -29, 108, -74, 7, 31, 25, -172, 13, 30, 24, 77, 111, 22, -79, 75, 21, 51, -40, -15, -3, -109, -86, -42, -54, -107, -4, -43, -47, 27, 81, -21, -12, 83, 46, -37, 10, 98, 5, -60, 111, 22, -73, -55, 115, 224, -65, 22, -73]
2153g3J36J2m4Qn8J57j08P3m8K4o7JM7l5pN1m2k2JrN9j31J1RN6n0M1K5l8j2J21
2184H8p3r6j6Q8R8q9rN3L2m1K0p5l9m8K43q2j42N0Q3o2r6Q3K1p8P8M6jJ8q3O0
2214C1q8J56j19mN6r0J47p9m3J58j22j5N4L1p7QN5o1k3OL9j48J52L6q6n2J39K2
2242H3j23M7l2l8nJ29k8j52J96r4M3Pj6l1p3L0K32j94J7jn5l1P6J09j51L5Q7q6
2270a9j46J86Q0k25J57J70j50o1mO3j7j81J64R8j44R6kj27P6n0J16j61J86l7k9
2295C9m1R6m3q3J17o6n0K5l3LjJ08j30P1lR7j36j2J10k5J2p2O7q6KN6L2m9k7Q3
2325F1o3p4J72n0m7q9O9l4N7NJ8K5j7j7k3J23j36R2j33k1J04J12k04J16mq4N3
2352A1j13J38k8o8K0P5L4k7r2Q2J0M6L1j99O0O3l1l5k0Q3n9OQ7n6KnL4n4N5q3
$$ y = [-73, 63, 75, 31, 39, -19, 138, 30, 103, 55, 79, 12, 13, 60, 25, 18, 69, 27, 5, 6, -3, 56, -75, -64, -55, 1, -49, -8, 17, -21, -33, 88, 15, -81, -97, -9, 89, 0, -9, 44, 76, 35, 55, -20, -59, -107, 136, 54, -88, -38, 45, -17, -113, -30, -9, -87, -9, 37, 36, 54, -29, 31, -57, 99, -20, -24, 32, -58, 89, 10, -33, 125, 3, -12, 42, 73, -4, 4, 59, -2, -25, -19, 20, -128, 24, 60, -26, -78, 61, 83, -40, 7, -25, -63, -68, 61, 33, -119, 77, -17, 26, 33, 17, -14, -87, -57, 175, -19, -2, -3, -58, -89, -13, 96, -55, -20, 67, -19, -165, 21, 101, -124, 33, 203, 53, -8, -12, 51, 34, -147, 17, 115, -29, 67, 65, -62, 14, -36, 80, -81, 105, 68, 39, -2, 94, 51, -32, 85, 19, -31, -6, -39, -36, -37, 71, -59, 12, 9, 106, -30, -42, 68, 43, 55, -17, 50, -36, -34, 22, 54, 5, -22, 61, -2, -76, 96, 46, -1, -90, -21, -55, 2, 7, 25, 50, 33, 16, -7, 116, -20, 72, -61, -82, 22, 134, -70, 46, 42, -42, 11, -102, 36, 8, -60, -40, 35, 69, 42, -50, 32, 42, 88, 119, -80, -20, 43, 12, -23, -43, 40, -19, -13, 74, 18, 20, 15, 49, -5, 50, -33]
2382c3J4j38J70k5j4J39p1r9Q7L2o3j16R1J9m0P4j83J60k4J0l1J9P3P0r7j09P1
2409a4O0m7p2J2Q8r6P7o7J16m5L6M0j31j1P8m5m7J79k44J24J17j54j0qR7k1j32
2436a20K04J8k26O4O6l1J06Qp9J65j57l3k0O9J4n2N6n4L6j56J37k5P0j04JJ20
2462G7q3Nm2O9p9M8J2o6K2P4L0K7j59Q0P3o5k2m6Kl2R0l6pM1j14K43j58m3J21
2491F2o0O0j04J22j05rK8M1l5l9J00K1j5k2j45O0k2J74j55K7O6r2Q5j28J29N2
2517I6j59RQ5p8O9J0%O5p2qQk3L8n1p2J46j24J26O9j29k4k3k6P4kJ9RN1k9p9n1
2548g6J47J9p4J7l9m7L6M2r2R9rj07M5M2m3J53n5o6j5N2Mq2O8m7k9R6l8r2J07
2577A6o8m3Q1ql9j5J17K2mj20j4J35n3N4p4j11J03L%Jq8nJ65J23j40KJ13j65K4
$$ y = [-33, -19, -157, 13, -12, -26, 113, 42, -57, 30, 62, -1, -117, -26, -7, -47, 27, -156, 4, -20, -10, -41, -22, 51, 121, 24, -85, -14, 46, -1, -73, -61, 27, -69, 8, -59, 57, 12, 48, 88, -43, -54, 24, -21, -68, 111, -133, -9, 108, -46, -56, -64, 33, 12, -120, 84, 102, -124, -60, 6, -25, 81, 89, 10, 175, 18, -15, -35, 34, 48, -4, 52, -2, 34, -122, 15, -10, 60, -44, -43, 77, -6, -1, -43, 26, -53, -5, 7, -59, -37, 37, 67, 94, -65, 15, 88, 23, 1, -45, -43, -75, 15, -21, -28, 13, -101, 142, -16, -59, 62, 2, 62, -42, 80, -25, -34, -6, 35, 0, -39, 61, 82, 67, 45, -100, -40, -62, 112, -43, -16, 50, -42, 43, -85, 44, 96, -63, -54, 31, -47, 22, 32, 32, 97, 25, 17, 25, 2, 40, -11, -83, 63, -61, 65, 134, 5, -19, -42, -68, 6, 4, 23, 32, 83, 54, -25, -76, 71, 90, 16, 33, -6, -53, -17, 25, -67, 32, 23, -84, -39, 3, -40, 113, 58, -8, -23, 29, 33, -49, 19, -28, -57, 39, 1, -91, 16, -52, -95, -14, -22, -61, -76, 41, 63, 59, -61, -75, 60, 7, 61, -13, -124, -21, -18, -18, -17, -105, -110, 55, 178, 38, 40, 153, -12, 12]
2606A2k9K0pL0l9N5j28K04K6j24p2M4LJ12j48L3p2l5J46o8KL2j1J02r0M2l9j00
2634i9J69j72J21o5K5J2p8K1J19j09L3L6OPk7k3M3K7J22k71J38k2j8Q2r8mJ4J08
2662I7k15J34J22j31J9K0p5qJN8n8J05N4o2n3P3j11k1Q4O3j26Pn8N0J65j67K3
2689a0Q9l0k8q4J17n9M5Qj88J19k7M7K5Qjo7Q3j6J4j4o9Q9q6m8K8q8N1J14l4o
2719a8P1j43J23L8m2Qq0N7Ql3l0P1nM2n2kJJ9j4K7l4j05N3M5m7P4o8J32j49J34
2749H1j80R1lo7J60Oj13oM8p9K36j77lo8J2N4K1j3J7p0O5R7j70N3j53J30M2Jo
2778Fj0J20k10J41o0m4J53r3j10P4nLO8J1o8p8L4K5P2J5j9L1j02K5L1p5J01j6
2806B0rl5L6O1J0n1j26J09L9q8J04k2L5n4J0J9j07L9M4l1k6k4M7j9p0kP4M4k4
$$ y = [12, -17, 3, -4, 26, -13, 42, -86, 118, 144, 20, -52, -8, -5, 107, -41, -8, -80, -115, 31, -37, -35, -3, -14, 88, -2, 40, 1, -99, 70, -102, 19, -46, -21, -9, -87, -66, 53, -56, -23, 13, 19, 26, -1, -24, 19, 46, 168, -103, 35, 13, -5, 77, -21, -25, -11, 97, -118, 16, 138, 7, 26, 46, -29, -37, -36, 22, -36, 69, 123, 61, 8, 81, -30, -51, 33, 96, -30, -23, -81, -31, 134, -33, -10, 79, 49, 21, -63, 54, -5, 40, 48, -140, -21, -48, -1, 24, 32, 31, -36, 47, 31, 45, 31, -38, 51, -35, -83, -55, -143, -92, 22, -12, -18, 53, -90, 33, 71, 29, 37, -43, 14, 22, -11, -41, 30, 25, 67, 15, 13, 14, 33, 19, 46, 12, -93, -40, 5, -42, 32, -36, 96, -53, 81, -99, -8, -11, -78, 82, 88, -25, -31, 17, -62, 174, -3, -6, -74, -62, -8, 13, 0, 17, -53, 12, 109, -61, -8, -161, -31, 11, 12, 6, -4, 116, -94, 47, -13, -57, 96, 3, -107, -33, -38, -35, 33, 44, -24, -102, -68, -43, 29, 44, 25, 56, -46, -21, 10, -65, 36, 20, 11, -24, 12, 73, 83, 32, -94, 15, 54, -34, 70, 48, 83, 29, 39, 58, -49, -10, 34, 3, -23, -47, 0, -19, -89, -91, -17, 27, 3]
2835CMPo8j2J15J1k15J76l5j7K9K3l7O7m3Q4n1o4j1k5O4q0O1m8O2k8P2o1N6j54
2865a15J31OO0j20lJ21j50L1Q3l1j2%j5r2M5j5l5N4rN9m2M8j9J63k10n0R6O3q5
2894d3m0J6pJ12N0m4q8M9j5O9o0J08j5K2l3j67M0j8L6J01q2k1P8K5j12J47j74
2921f6m1J36k7k1M8j40J11Q5j46J00N3j44K29j89m0N5n2L8J54j48J14r0M1o5P
2946Bn4J2M3p7N5J30j08m3K2N1J7j45K00j51J91j32M9n8j17J62M9p1PM5o9rj4
2973a3J6OR2l3j42J62J0L8n8j7j00n4M5J26j24J32M3r2q9j4OM7Qk1Q2k5ROj58
3002a12P0J02J0nk1j51J41j2J5p7kk5L3J13N0j78L4J4q8N9J02j16j3J4M2J1j86
3029a76J95j28J10J4j51J11P0j73R9P0j7K3m3J0J6p2P6p9L4J25j41M0k3oJ01L
$$ y = [3, 7, 14, -54, -66, 49, 60, -155, 21, -14, -31, -2, 21, -16, 51, 8, 92, 41, -23, -34, -59, 5, -75, -14, -62, 0, -28, 44, -17, 39, -115, 16, 22, 82, -38, -41, 80, -70, -39, 44, 13, 1, 1, -14, -106, -61, -76, -111, -57, -66, -7, -49, -1, -20, 143, -67, -117, -21, 42, -43, -83, -67, -74, 38, 88, 44, -44, 5, -10, 59, -1, 107, 92, 114, 81, -86, -46, -64, -28, 73, -9, -30, 48, 73, -39, 108, -66, -107, 29, 2, -19, 29, -111, 0, 85, -61, 39, 92, -52, 177, -12, -52, 3, -49, -11, 143, -5, 109, 19, 60, -5, 2, -52, -40, 3, -74, -19, 111, 3, -40, -18, 33, 50, -95, 105, -46, 145, 13, 62, 4, -113, 49, 98, 27, 34, 79, 10, 1, -13, 3, 9, 101, 68, -74, 88, 98, 136, 78, 61, -39, -93, -48, 78, -46, 86, 129, 37, -52, -66, -60, -13, -5, -26, 56, 31, 40, 46, -112, -42, 60, 70, 65, 44, -107, 34, 22, 37, -40, -42, -67, -34, 79, 129, -49, -15, -1, -89, -30, 72, -44, -57, -43, -1, 10, -176, 19, -109, 1, 15, -136, -25, 45, -128, -29, 41, 24, 47, 4, 14, 30, -42, 34, -45, -11, 114, -27, 13, -10, -16, 85, 88]
3055H8n6j45J19mKk4qKK2Rj2k9J55p1m0jq8L7J26j22q2J17J23j27M6Oj3r7J91
3084A24j43kL4p0Q3j28l5J29l0J23m3n0M9J6p4J8Q3p2j1J6O1j41J65j05J4j7k5
3111c1K6M7j7q1Q3r4O2%M2mj2j3mol5j0J02K6j43J30k8o1L5N4Jp9J4mj61K16n9
3142dn9J98q7n8O8p2k5J50p5o4J68n4l3l9m7Q8m5qk9k5L2j12J34o0N9NN4o7l0
3171c7M0J30k42J33r6j6J73r5q6K3N4R7j52J45O0j72N4m0qj03J88l1L7m0N1j41
3197g4L2N8j10J80j29mP5q6Q9l2mko2O0J08j04p1N6N5J01j65J25k8k02J11Q1r1
3224c3jQ9m5j4M3j7j52J95k2o4J4q6Q1K5n4m1P7OJ7M0j27J66p5K0n1k0Q8j36K07
3253A30j70qR0j13P7j0o0PO4O7j22j0J64j64J45j74O6J02K1j6k8k31K91j11MK8
$$ y = [88, 32, -113, 6, 2, 4, -20, -28, -26, -4, 5, -7, -36, 119, 48, 8, 7, -81, -44, 82, -40, -122, -5, 118, -9, 37, 43, 30, -67, 124, -19, -21, 13, -57, 26, -102, -137, -8, -38, 85, 42, -8, 41, 57, -17, 1, 84, 12, 1, 17, 78, -63, 102, -3, 11, -6, -31, -5, 42, 25, -56, 27, -67, -5, -5, 37, 33, 21, 8, 4, -2, -37, -47, 55, 81, -62, 68, 40, -21, 14, 68, 69, -10, 4, 0, -161, 55, -4, -63, 135, 48, -10, 58, -14, -39, 111, 36, -28, 140, 86, 53, 14, -33, 55, 10, 2, -27, -52, -20, -132, 2, -58, 1, 6, 60, -7, -37, 3, 133, -109, 24, -72, -88, 85, -10, -96, -73, -19, 78, -74, 71, 131, -41, 13, -27, -35, -138, 50, 19, 56, 16, 67, -74, -42, 16, -94, 86, -43, -47, 28, -58, 31, -1, -5, -7, -69, -9, 99, -5, -76, -20, 35, 136, -29, 96, 68, -134, -23, 58, -33, -34, 55, 10, -4, 39, 22, -130, 65, 43, -21, -7, -93, -12, 13, -41, -82, -5, 1, 18, 58, -69, 97, 22, 42, -9, -29, 59, -77, 130, -40, -48, 42, -71, 6, -4, -64, -57, 7, 74, -48, -58, 106, -58, 87, -87, -21, 81, 102, 86, 58, -173, 118, 7, 11, 39]
3279C9m2q3J3L9J9M9n8P2j0M4Oj15n4J07j54J83j45J8L4Q4l4m3P4k29J28m8K19
3306A13k01K09j80o3J69M0M0m2J7%J4j70J14M0p0o5L5J3j09J92j7q7ln2J26j17
3332e4M3j5jP8j2m2l2J0J6qP0L5p7J04l5j07K0p1N3N2j20J28R3k5q0L6Jl2p5J10
3362F3p0J18l9l4N4j16k9N4J9K1j7o0L5J17j35J73j53K0rO7j8j36J8L6J5N9l8
3389A5N5j48J23j45R4L1m7p1O1l4J21q5O5n1k0Q9m7mL3kj4j43j1J89J1j20M8O6
3417E9l19K45o5O5j2K0j1K2qj8j4J16j19L4oL5l3l1Q3mm9J2k9K6%M4j4on3l6l0
3448i6R3pJ37j22J13j73LP5J06p0l6j3N4k0j73J54N7j30Jn1J35%q2P0lpNNp7N
3478d7M4k8Q1k69K76l6Q4j35P6P4o3m7m2J01j19J05J6j03N7j2K5l3J1K4K9j7j06
$$ y = [39, -3, -86, -73, -34, -15, 34, -24, 48, 38, 82, 88, -27, -81, 26, -128, 55, -90, -72, -38, 46, 12, -31, 43, -186, -58, -106, 113, -88, 121, -59, -122, 47, 87, 127, 85, 102, 102, 116, -54, 60, 100, 30, -35, 0, 13, -96, 96, 79, -8, -11, -63, 63, -54, -11, -26, -27, 51, 39, -3, -35, -25, -9, -17, 53, 88, 11, 115, 80, -27, -7, -78, -25, 27, -93, 35, 128, 103, 23, 59, 60, 28, -47, 63, -7, 111, 72, 38, 92, -24, -53, 1, 20, 41, 24, -36, -1, 116, -19, 154, 1, 21, 12, 79, 61, -75, -57, -21, -6, 53, 15, 70, -78, 45, -100, -6, 25, -22, -93, -32, -66, 55, -30, 35, -16, -36, 53, 6, 2, 35, 33, 19, -124, -135, 54, 65, -55, -7, 59, -260, -15, -80, -15, -27, -7, -18, 4, -4, -22, -36, 80, -39, -5, -11, 24, -9, -40, 43, 39, -10, 2, -27, -1, -1, 43, 29, 23, -30, -66, -96, -3, -10, 127, 5, 118, -55, -52, 23, 129, 59, 23, 10, 64, 44, -129, 25, 82, -48, -47, -98, 37, 37, -45, 25, 22, 15, 20, 25, -52, -47, -3, -31, 50, -219, 57, 21, 105, -30, 46, 120, 57, 10, -32, 69, -50, 55, 71, -32, 25, 13, 38, 5, 16, 40, 69, 52, -54]
3505e4J29j68MJ46o7J4k3m0L8J6M9k5K8j1n4KN7l5r4K14j04r7n3O6N1lQ8j01M7
3534B0j9p8J01q5J6j6m2Q7LN0j3R6r4L7o5P2q9kj0rP2k4m0p0K38j81L1L7n4j4
3564d5J37p0Oj3J6J1j03J19Q9j05N5o1j63J44n7n9J68j17P5j51J41k0K5J6q9K
3590d9Q0J7j47K26k13J40o6Rk4J1LN6k0j43J52NO2o5JNkm8J45j76l0L7L0J21j36
3619a9j04M7J4J9M9Qr4J51j48j1Q8L7J2l7l0M6r3M4Jk8p4K00r7l9N4L7J6l7J6
3648B8j59J16N5j9L9p8l1P2r2Q0o6nL3N9l6j9J7m2J55j72O3N7p0j01Q0m9J14k9
3676@N3o7n7M4k8J18p8l3j16K53k4q5K5m4K2k2M4M1l4j9o4R2j2J0l2n1J43j20
3704d1n9J31p7L6N7pj17N8M1j24J73r6qM0L6j29N5Q8r2M1q2J22o5J49j58n3J01
$$ y = [-54, 75, -93, -89, 57, -10, 4, -19, -59, -21, -5, 44, 19, 47, 36, -18, -16, 41, 6, -88, 126, 22, -75, -128, -62, -11, -14, 74, -27, 20, 1, -77, 24, -61, -45, -61, -103, -16, -13, 37, 24, 120, 26, 63, -2, 70, -19, -21, -31, -40, 32, 8, -32, -102, 136, -45, -14, 23, -31, -45, 92, 22, 28, 15, 31, 42, -61, 58, 147, 42, 97, 36, -127, 17, -40, -99, 69, -48, 27, -124, 17, -3, 22, 38, -51, -49, 31, 48, -99, 127, -86, 54, -12, -3, -27, -16, -13, 43, 23, -120, 32, 37, 99, 34, 35, 40, 38, -10, 135, -41, -71, -34, -4, 117, -19, -123, -76, -62, -43, 6, 14, -80, 71, -77, -88, 0, 37, 49, 12, -18, 28, -65, -21, -20, -48, -122, 78, -19, -58, -4, 33, 49, 12, 28, -131, -15, 40, 21, 60, -18, -49, 23, -69, 11, -55, -60, -27, 32, -4, -23, -6, -48, 107, -65, -2, 55, -15, -116, -36, -85, 29, 0, 53, -14, -71, -27, -55, 63, -15, -48, -164, 89, 65, -20, 5, -39, -17, -39, 5, 46, 12, -7, -71, 21, 9, 19, -13, -64, 79, -41, -100, 31, -46, -10, 47, 40, -77, -19, 22, -102, 71, -25, -33, 7, 43, -86, -31, 57, -35, 6, -76, 46, -19, 130, -28, -81, 20]
3731B0M1P3p7N5j11J5l0J7L5l5l0q7N8J25j15k3M4M4K3L7j40P0j3J2m3l7LN9J15
3760A05j20R7m7l7nJ62o1qj52J1N7j4J11r1R0p2p9Q6K1Q0oj27M9m3j01J3J31P7
3788A27j43m2m0L1K2K5j07K35j86J21j2J3j18J7RMJ0J4K9O5k3pj4j28J47j02N2
3815am3J05qM1k6J1j47J58o5q2K3K7l7M7r9Q3J8O0o0oj9M0M9l1P1j27LO6p7RJ7
3846@J63k03J60j02N1L9j66R7K9p8K6K3r4L5L8m0j19O8J75q1q7J02r5l0P5j01
3872a15J99p5J5m4M8N3k7n1KO4n2M4r1Q7k5R3l0r4NN1m3m5J9O1rK2K1j14k1Lj1
3903f0j00R7J14n6l3N2O2r4n9J36j5p5j0o9Q6O1j34P3k6L3Q1j25R2j3m2J26j05
3930cj00J66k2O8k01J40k0q5K18n3j0m5Op1L8j26J82n3o9J24j19Q7p8Q4j54J48
$$ y = [20, 61, 134, 57, 112, 1, 16, -14, 3, 38, 3, -27, -114, -56, 69, -46, -69, -25, 19, 42, 79, -61, 9, -4, 8, -35, -72, -69, -10, 105, -15, 82, 35, -2, -7, 155, 94, 86, -66, -55, 2, -12, 99, 8, 98, 26, -53, 33, 54, 134, 128, 1, 50, 7, -94, -81, 50, 127, -16, -58, -98, -67, -45, -20, -127, 108, -78, 43, 31, 44, -74, -57, -48, -44, -34, -20, 9, 74, 51, 44, 30, -98, 49, -53, -1, -44, 61, 53, 94, 68, 79, -68, 90, 25, -57, -34, -7, -44, 3, -96, -13, 5, 65, 5, -1, -20, 20, 69, 38, 109, -18, -15, 51, -26, -17, 0, 163, -40, 120, 18, 69, 108, -58, 39, 68, -10, 16, 39, -55, -20, 18, -22, -141, -73, 102, 21, -66, 36, -59, -89, -14, -115, 84, 9, 24, -20, 28, 81, 54, 3, 5, 69, 17, 61, -30, 57, 32, 125, 95, 1, 6, 57, 14, -31, -12, 49, 40, 62, 83, -31, -52, -49, -60, -160, -63, 51, -5, -38, 14, 76, -18, -77, 59, 44, -31, -41, -110, -24, 37, -97, -24, -50, -17, 64, -61, 31, 18, -24, 102, -3, -103, 63, 41, 109, -92, 48, 28, -57, 161, 108, 98, 53, 59, -12, 26, -100, 82, 29, -40, 84, -35, 52, -26, 58, -96, 52]
3956E2n5q5R6r8L7M7M1Rj09O5M4k5K8k9P5r8j6M4rL6K5p4J0m7Q6k71K18n0J02
3985D9n9L3O3M2k17P4p2J41j55JJ16j17Q0J04o6Rq2Q8l0L6j18P2O9K3j01n6J03
4012C0k7q8m4J00J34k25J28pN2n8J0L8j21J27Qn5q0K5J6lN9l6K0K4m3O0k3pJk1
4042fkj8N3J7o5M3l3qQ9j34n4J76q0O0O2j16N2k6L9o1P1j9q7k5N8J39j53j1O3
4071B4k3q2J5J37j42K2M9l9K0J1Ol2k5O7l6J96j84o1J44j77J44p1j5L8N9n2L4
4098B7m9j7M2jQ8j09J5n2J39J2m4j4l8l0J8o7P3j12J56o2j21K16j56M4Q7j10J42
4125G7r0l6J2R2p6J1k2K3J11j94J27j6q4J15j6K1j49M2K14k36J19l8LK1O9k04
4151a04J40L2j18NJ9P8j85J81k4l0q9L7Q1l9O0L0n2r1N0L9q6J29j02L9Pj13J45
$$ y = [52, -3, -88, 8, -90, -53, -6, 35, 44, -65, 0, 44, 19, 47, 18, 93, -5, -21, 23, 14, 50, 75, 1, 11, -36, 50, -221, -3, -53, 49, -10, 23, 86, 128, -89, -15, -87, 54, -101, -100, 16, -101, -21, 83, 17, 26, -56, 32, 2, 38, -80, -8, 61, 84, -17, -73, 30, 3, -85, -129, -29, 105, -120, 8, 1, 53, -5, 5, 43, -78, 49, 57, 2, -78, -53, -37, -40, 19, -17, 3, 27, -16, 44, 21, 14, 15, -6, -8, -26, 27, 44, -21, 22, -11, -19, 70, -64, -118, 58, -22, 38, 100, -16, 36, 10, 49, -12, 59, 40, -47, -72, -14, 125, -28, -39, 24, 1, -81, -66, 71, -71, -49, 0, -39, -19, -8, -2, -34, -59, 8, -28, 168, -16, -77, 67, -110, 34, -37, -52, -14, 45, -7, 27, -22, -39, 3, 2, 90, -19, -4, -56, 83, 95, 51, 37, -1, -31, -13, -80, -7, -119, 37, -25, -146, 70, -86, -42, 45, -65, 77, -13, -49, -37, 55, -21, -10, -32, -9, 102, -92, 35, 19, -65, 50, 34, 55, -94, -52, 162, -74, 45, 7, 10, 31, 100, -104, 36, 68, -50, -45, -26, 52, -133, 48, 24, -6, -95, -58, 23, -16, 44, 74, 22, -69, -19, 20, -66, 63, -39, 0, 7, -106, 39]
4178C9L6ml1r8J42k5J6m2n2R5r4K2L6o3N8k3j6Q4j44L4rM1K1k3L3n7L9ln8K7k3
4209d2J01j12k7N3k3P8M4M0o4m0N5m0M1p5qM9qMm7R0p7jJ1R4j30J9J4m6O9K8j05
4240e5q2J94r9J11j43N4r6J45L1q8J3r1L7J15m9L6l8O3l9P1k57Q0J00m1M4Q3o9
4267C0J7j49J31J4r0K7n8J2J00k1o1l4Q9m1k1N6O5n9p7O8j24M9J28Ro4M4j4j7
4295Im7m2O5O8N8k5O5j58K4o6L6O9l8K0l7J03o8m9P7L1j03L2M1qJ9n5j7JMr3M
4326h0P3q0M8K1q7NN3Q4j25Q9l4l0L7L0P9o3K3j52J10J2Mo3q4J51j1M1j13J85
4354A23r8n9K8Lm7J26M1j8o0k3pR7j65N4j0J84r9j32j20J65L3l6p1J22r4R7o0
4381b6R6q9R5o2O7j6p3n7m5Q3k3n0K09o7o4K4o8O1L2RRL5q0J24j23J5P1j04n8
$$ y = [39, 75, 71, 40, -58, 84, 59, 75, 33, -19, 76, -18, 4, 40, -23, 35, 12, -4, 80, -64, -30, -39, 2, 23, 0, 33, -24, 15, 12, -46, -19, -42, 59, -53, -80, -27, -50, 28, 72, 112, 48, 8, 63, 23, 64, -11, -19, 30, 22, 26, -21, 69, -8, -9, 2, 96, -34, -15, -1, -47, 22, 50, -55, -137, 57, -42, 69, -74, -20, -116, 29, 60, -28, -15, -106, -69, 46, -3, 33, -5, 58, 19, 90, -167, -87, 13, -28, 16, 99, 30, 47, -102, 29, 43, -47, -20, -78, -66, 34, 13, -48, -82, 7, -34, -55, 1, 66, 7, -70, -2, -126, -77, 51, 60, -4, 40, 26, 9, -38, -80, -15, 53, 111, 86, 151, -7, 17, -49, -13, 56, 18, 38, 1, 104, 36, -13, 64, 95, -8, 24, 65, 57, 76, 21, 4, 5, 9, -84, -80, -7, -87, -39, -18, -105, -100, -47, 37, -88, 1, -33, -63, -26, 4, 83, 20, 43, -109, 1, 13, 17, -46, -130, 21, 10, 51, -62, 123, 25, -34, -6, -3, -50, 76, 117, 99, 39, 16, 9, 106, -59, -5, -15, 169, 70, -62, -182, -17, 16, -20, -91, 31, -63, 34, -26, 70, -19, 76, 14, 81, 65, -8, -65, -110, -27, -50, -100, 109, 42, -22, 2, -66, -5, 27, 36, 45, 80, 0, 124, 1, 16, 87, -17, -75]
4410g5J17Rq0n2J83j51j5J19j24L5k6j5R1k2nN0l7M3q4L2N1m1M1J6j8p9l9P5K6
4439B5kK6no0K3k9N9p3L3n5O0M0j24J27l5l9NLOLn4M1p4Q3J30k7nj60J74j13K0
4470Cm7J32rj21L9J1Rk2K%j02J05K3k1Lo1M9M8m1q7J17m6lL8l7L5J00j32j6O1
4500C0k8o7mJ17j05q7M2J44m4n0J6P3K3n2M9j07Q3j7q9J55o6O1j67O0J21j31N1
4527A1N2p8OmJ22k02K5N2L8kk5j3P1k2j29J04KM9m6K5K1j11N2J4r6J73m4o0l9
4556e4P9l6rM2Q0j15P7j40K12j11M7j46P6O7j57N7M5l7n9K7K3J26j36P8L7k8k9
4583A6q4Q6j5QN4m1J13j10j12J56m8nmj11J31Lr9O9j4N3m9jN0M2Ko7rR2K4j31
4613aO9Mr1n6M0RM2k33J52Q4k8J4O6j71P3Q9o1L8loL1q0k1L2m5N2o6L0J59L3j74
$$ y = [-75, 42, 51, -29, -81, 102, -49, -64, 55, -69, -34, -60, -75, 16, -6, -11, 39, 2, 45, -39, -7, 44, 3, 44, 60, 42, -37, -76, -1, 25, 23, 49, 44, -16, 7, -22, 37, -36, -3, -58, 2, 42, -82, 45, 10, -29, -24, -21, -15, -12, -66, -25, -99, -16, 114, 87, 82, -78, 96, -17, 3, -44, 88, 79, -42, -3, 8, 17, -5, -3, -3, -105, 0, 23, 2, 5, -56, -7, 41, 0, -87, 30, -16, -19, 19, -18, 17, 117, -15, -31, 30, 2, -65, -69, 48, -57, -144, -102, 42, -2, -52, -36, 37, 60, 8, 57, -50, 33, 16, -73, 82, 16, 77, -90, -30, 91, -40, 11, 63, -15, -9, -13, 109, -93, -68, -16, 22, 20, -5, -18, 53, 31, -98, 6, 8, 57, 11, 36, 57, -54, -2, 12, -84, 89, 45, -15, -54, 25, -11, -20, 22, 102, -13, 64, -76, 136, 25, 72, -74, 2, 69, -88, -31, 14, -23, -82, -55, -32, 94, -42, 36, 73, 45, 16, -68, 18, 3, 11, 65, 24, 137, 27, -85, 71, 23, 18, 14, -97, 34, 37, -62, 7, -7, 46, -3, -4, 46, 88, 90, 23, 14, 106, 130, -1, 68, 72, -19, -75, -35, -26, 16, -217, -65, 19, -9, 5, 71, -100, -27, 62, 1, 39, 36, 30, 61, -19, -40, -8, -53, -1, -67, -37, 122, 155, -19]
4644a9J14Nj74J85m6q4J00J7j25O5l0O7l3lP5k5q6L9j08J19n1KJ09j14L5mm4M8
4672C4K3J0P6j66jJ8K7MJ05o3J1J1o0o7J5%N0j3J5k1n0J16q9Q0l7m3N3p7J65j13
4702A3j8P0p5J03j68K9L8k4j0P2j8r2n8K05j13O7M9r2N8M1M4k36Q0l7J71r4n6
4729e1R1o7N4J13j20o5N0M8q0pM0j25J11L6q3N4j81J43LL4l1k5J23j17J38l4l2
4756B0n7j4N0k8P3p6n3J64q9J15n9j32P4K9l6M3j19J22q6J11j9L8L7j31M2j30
4782a11J41o9k0j5N4L0j1j7N5j9K6JK1j04M2jnr4J31j5r6J43q5K0O2j06P4j31
4810i9N7M0M1N8j90N2K8n5L4M8J8Kk8P2Pl1q9P5n1O9M5r6n1o3M6O6l4J09m1m2
4840cM8j66R1p4J32lm3M8q7L1N3N7p5J6N7j4n9j5l8O9o1M0l1P0J8r3l8N5o0P5
$$ y = [-19, 95, 100, -74, 111, 65, -19, 81, 98, -27, 38, 8, 75, 42, 39, 114, 89, 3, 42, -66, 53, 2, 4, 113, -1, 34, 30, -14, 34, 57, 67, 143, -23, -24, -6, 21, 25, 130, 67, 78, 89, 29, -38, -23, -23, 27, 14, 29, 8, -42, 74, -15, 65, 28, -15, 38, -39, 126, 13, -5, 65, -10, 93, -75, -46, -8, -32, -42, 30, 12, -80, -138, 67, -46, 21, 70, -22, 36, 77, 121, -115, -35, -72, 99, 5, -51, 40, -27, 27, 140, 20, -45, 5, 53, -27, -34, 6, -119, -8, 28, -55, -1, -182, -39, -36, -2, -33, -58, 65, -52, 86, 52, 20, -37, -51, -1, -29, 44, -32, -85, 79, -10, 105, 46, -86, -12, 17, -19, 24, -95, 27, -59, 52, 33, 71, 108, -23, 19, -111, 30, -39, -59, -74, -20, 10, -1, -18, 37, 18, 44, 45, 66, -38, 4, 3, -2, -96, 35, 20, -76, 67, -18, 2, 64, -42, 32, -99, -42, -2, 39, 97, -93, -41, -13, -68, -34, 14, 32, 34, 6, 78, 85, 54, -35, 40, -11, 58, 103, 7, -44, -107, -61, 5, -29, 80, 39, -3, 45, -121, -30, -104, 28, 25, -18, 30, -57, -26, 27, 84, 9, 25, 82, 68, 9, -6, -44, 25, -36, 4, -27, 43, 61, -32, -70, -15, -75, 0]
4870@k6k0J05j63l7J94l3r0o0J00K7k2m4M1j5O8j1j48NN4J01l8K5j4j26R2n7J46
4898E4j04L4K8k7O7j38O3K6J18k13N2J14L1r2m4j18J04O2k5k0j3Q1QK1o4PR1j98
4926i5R1OR9j96K53k3k38O0J15p8n1j7R5j3l3M1n4L5kmj5j2Kn6J36J5r9L4l2L7
4956Ar4J43M8j49K9l4M5J5L0o1m9P1j1j6R0r1Q0o4K7K5J04k07R8n0J12r1P5j4
4984F2K1m0n5m5J27n0k9J1K1k1L5J5j07J16o3j6L5j15J14O4k7j58R7K2m4P5j19
5011g4J74j57M7k3O3l3J5pL5o6R1j3J2j8j67O9J03l2L6L3j52J15l3j13K16o8q0
5038b7N0k0R1q6Pq3J49n5N4j24N1J16m9o7pJ5K6m7o7R8J6j85J36J09j77J00j36
5065a12R9P0M2o7o5l0J84r5j9j4m4O5j03J22n4o1O3k4N9q2J32j10R6l3k1Km8J3
$$ y = [0, -26, -46, 59, -104, -141, 53, 20, -70, -130, -30, -3, -25, -69, -28, -43, 25, 14, -134, -129, -75, 26, -12, 13, -1, -127, -35, -92, 54, -50, -16, 12, -15, 52, -86, -23, 3, 121, -92, -40, 74, 105, 13, -31, -149, -45, 17, -8, -28, -41, 40, 48, 69, 5, 12, 103, -95, -4, 2, 101, -95, 158, 135, -103, -43, 72, -6, -57, -74, 21, 8, -25, 16, -38, -3, -5, -9, -24, -36, -34, -90, 46, 61, -38, -4, -36, 1, -93, 50, 98, -51, -22, -56, -11, 4, 34, -27, -76, -5, -16, -32, 58, -33, 47, -17, 10, 35, 139, -68, 30, -20, 92, 1, 76, 62, 83, 43, -12, -57, 70, 20, -9, 2, 23, 2, 37, 52, -55, 61, -2, -18, 17, -98, 16, 80, 53, -105, -8, 14, -30, 45, -74, 100, -57, -10, -33, 30, -3, 12, 5, 40, -26, 65, 52, 64, 46, -121, -52, 51, 19, 55, 88, -64, 51, 18, -95, 121, 53, -27, 23, 3, 94, 8, 15, -68, 81, 26, 80, -44, 7, 123, 74, 7, 0, 15, 41, -6, -73, 25, 41, -144, -8, 101, -76, 24, -112, -13, 57, 99, 32, -33, -63, 121, 26, 7, -7, -51, 14, -89, 33, -21, -82, -19, -43, 16, -66, 66, -44, 52, 19, -2, 0, -48, -35]
5093c5K0J49q0n3k4P1k8K1n5O4j04M8m2L4K7qp1L3L6j20J72k3n4P4q1K1j2j14
5121a34J63p7R8j4M2q2j03J45J5Nk8rM7p1k7N7j26R5n1L9L2l8j3R7l8L9l9O4q2
5150Fn4K5jo0N6J35j68N3L2L8r0R7O0n9m8j51O8J0ll2J76rj08k4k5J04n5R8q5
5179a4K01r2q5P6n1J8k5Nl4L1K5Qj00K0M5P4q9m7K2l0M4k8Q4M2m1j27J5q5J20
5208a8o1J99j76o9J79k3k6N8j06J45j10N2Ml2l9J5M6Mr5R2J2l1N5j52l1L7P4P5
5236G8k0q2j05M4j0J96j46P1q4P1j8m6P3k3n2l9J15K9Jl6m9Q0k5l4N2q7P9q0J12
5265F5j07R1k2l0N0n5N0j18Q9J7l9K4M9Mj88O5L9N3k2lK7kMm1K9K8r4O7n9J3N
5296a1p2P6LR3p4M1j21O9R3k06K06o5P0n5j7j0k1J20j05N1k03J16J22r3mj9J14
$$ y = [-35, -15, 134, 54, 1, -23, 48, 20, 41, -14, 50, -54, -6, -48, -14, 13, 5, -66, -33, 3, -117, 55, 32, -22, 52, -29, -8, -20, -134, 29, -48, 50, 36, 78, -4, -107, 38, 53, 58, 30, 21, 68, -3, -30, 27, -99, -4, -55, -16, 16, -22, -35, 62, 24, 63, 24, 88, 6, -48, -23, -24, -84, -28, 107, -61, -8, 24, 62, -28, 69, 129, 70, 22, -129, -61, -51, -54, -86, 90, 81, -27, -51, -76, 28, -27, 71, -14, 187, 95, 10, 86, 35, 53, 28, 33, -1, 30, 55, 63, -37, -17, 28, 102, 13, -34, -12, -42, 2, -26, 58, 100, 59, -68, -53, -138, -18, -79, 120, -56, -125, 54, 31, 5, 63, -43, 102, -8, 44, 48, 16, -23, -8, 38, 42, -53, 39, 51, 20, 75, -77, -108, -71, 3, 78, 58, -24, -129, -85, -95, 101, -45, 26, -58, 13, -5, -51, 22, -1, -53, -92, 23, 52, 53, 17, -32, 48, 23, -11, 41, -46, 33, -47, 65, -42, 49, 27, -3, 47, -8, 42, -76, 13, 30, -9, 15, 64, 68, -120, -55, -16, 37, 15, 12, 39, 37, 41, 0, 29, 57, -37, 30, -29, -16, -11, -83, -7, -4, 89, 15, 56, -65, 4, 97, -109, 97, 32, 102, 47, 30, 20, -1, 119, 14, 65, -138, -22, 100, 7, 3, -16, 98]
5323I8j24J07j57qM6k0J61j12J27o1q8l8K9M7Q9j90P6m5J61j83O3L3O2j36R9n4
5349a8M6K7j67J60j19J55l3m0p3j5J37r8M0j32R6Q7j15L3L4K4n6M0r4J18j46O9
5375d0J23j37k2J7O5n4K2M3P2q6L9j8m1O2k7NP7j07l9j0k4J03j46K38o1q3o7L4
5403f2O4K8p6Q4j16J38j1K2p3l5J20j02m8KL2rQ8p2M7J3J29j80M7q6L3L3j17J43
5431C6l5pj11J67J17j69k3J29k07R8q7q7K24n6m4M8JL2k7j44J32n4Q0qj6J12J
5458A02j74J2J99j27J5K0q4J11r6M3k6R6j22j2J8M7j13O1R5j18R1j4K0k7K6n8
5484a5R2j13L5Jj39K00k9n9K2Q2q7mJ1jnm6Q0j40M4nM4Q9o2krJ44j37J15j60J09
5514E5o2J20j15q9N5J0j0N0J18j65J25K2k33J09Q9r9L3j56J7J65n2K4J6K6j25
$$ y = [98, -26, 81, -76, -84, -38, -58, 103, -9, 118, 57, -31, -69, -40, 7, 96, -94, -18, -63, 98, -85, -22, 11, 73, -63, 36, -18, 28, 55, -112, 48, -71, 84, 51, 11, -62, -77, 60, -38, 2, -130, -34, 53, -62, -29, 5, 29, -27, 13, -81, 37, -109, -40, 83, -54, -76, -59, 6, -48, -26, 17, 89, 3, 42, 24, -17, 45, 18, 23, 100, -7, -46, -56, -80, 23, -123, 115, 54, -29, -96, -62, 2, 30, -46, 38, -78, 60, 49, 71, -2, -37, 83, -19, -67, -65, -33, -42, 46, -26, 21, 34, 163, -17, 30, -56, -23, 10, -107, 36, 1, -6, -117, 50, 167, -2, -25, 104, -103, -5, -92, -179, 45, -11, -55, -7, -6, 26, -1, -145, -13, -67, 13, 5, -11, 101, 102, -72, -60, 139, 12, 27, 47, -37, 74, -22, 21, -5, 91, -31, -43, -25, 22, -91, -30, 65, -53, 38, 24, 44, 17, 43, -15, 77, -36, -1, 0, -139, 61, 32, -27, -5, 77, -10, -14, -3, -4, -9, -55, 25, -115, -71, -76, -32, 57, -5, -7, -16, 128, -9, 106, -54, 55, -7, 113, -2, -91, -36, -26, -36, 14, 132, -33, 92, 114, -119, -10, 79, -20, 13, -143, -126, 39, -13, 11, 27, 53, -72]
5539g2J53j12K2l4J61p1j21J56qp3j1M1l4O7L3k0J8m8j02O5J28p7j00L3j02M9
5565e9N8m7k8J03L7J0q8R4q4n7Q8pJ0L8k0O5o8j8j04JJ67n6r0l3Q1M5q4O7O1j04
5595b2j8L9oJ9l9nkN2n7n1J17j7j00L3R1p7N6l5N5o0o5j7Q2NJ14j15J51o4L9j3
5625I0j50K6P6j32P6q2K22r9l1J17p9L4j58PJ0J49j20J23l3q6J48j18K2q1K9j9
5651e9k4J28l2nn8KJ63j54M6P0l0nQq1NL1MO2j5p4Jj5O1j0P7q9N4o5l0Q6j4O9
5683A07q8M0j23L7J4k2J01M7j14O5j06P6k1K7n8PJ0J2n2M5N9o0q2k6L5J05p0J12
5711G7o9J8l0J7O4k54J66j04J21NK0M1j80J83N7j21p2J01j09J51l5j23R6m7L4
5736GP2oj1o6Q0o6P8N4j24kq3n0N6L8P8r2rj8J62j02L5m9j0M3n6j5p2J86l1n6
$$ y = [-72, 81, -31, -9, -43, 118, 47, -74, 82, 74, 1, -10, 31, -3, 64, 97, 77, 95, 47, -55, 10, 138, 61, -39, -6, -108, -59, -1, -48, -76, 27, 64, 74, -14, 80, -4, -61, 27, 20, 30, 68, 48, 113, 45, 27, -77, -76, 91, 35, -55, -88, -7, 38, -46, 21, 82, -22, -40, -1, -7, 12, -27, -32, -34, 18, -39, -90, 27, 10, -90, -57, 34, -43, 13, -22, 33, -27, -92, -109, -27, -22, 92, -23, 128, 64, 103, 90, -60, -34, 42, -90, -14, -96, 126, 27, -4, 113, 34, 68, -90, -83, -73, 76, -44, 79, 46, -40, 108, -10, 12, -69, -40, -59, -83, 45, 13, 8, -50, -48, 115, -39, 7, 77, 47, 42, 50, -31, -26, 5, 9, 71, 56, -18, -17, -32, 29, 19, 96, 7, 61, -4, -34, 52, 38, 107, 19, 59, -64, -27, -13, -35, 66, 113, -1, 64, -42, 34, 13, 40, -18, -11, -1, 11, -41, 4, 63, 3, -79, -105, -70, 35, -35, 77, 8, 26, -4, 13, 77, -177, -11, -115, 6, 11, 31, 72, -108, 75, 132, 11, -61, 40, -69, 82, 47, -76, 20, -27, 7, 79, 73, 62, -4, 76, 10, 88, 142, 18, 16, -67, -117, -61, -23, 55, -37, -46, -64, 98, -4, 31, -18, -28, 15, -41, -56, -128, 58, 27, -29]
5766b9M8j4p0J23j26M8M9ML4j72J38n6J06j28J07lk4l5l2Jj0K7L1J15j10o6k3
5793f7J10Q2m6r0o7J05k7Q9j00q9J34Nl6M5j01Q9J3Q7j53J3M5M0J8J8j79O7n4
5820d9k4l7J65q7J09q5J8L2j23J30n7J24j71kM9J06p8ol2M6o1J11p3o5l8M8Q8
5847C8R1j18jM7j34R0J1j1J31j96J31j06J0O8j01M1j03J42l1l0l3N4pmQ7Oj40
5874f8P4J1K8j18K16j68N1r4J14n7M2M0j79J59n9l2l3Q1m3J9m2O2K2O5j29M3k0
5901a5J42j88JQ0Mop4J19m0r1k5J51Lm8m9N0kp9M2L3q8O7J07k04R1n0NQl7J28
5931C5Ll7mJ5j5Op7Q5oJ4j14J80j51l1M9P5o4m2m1P8R3qR4k72J39Lj01Q8j2J0
5961hm8N8N9j01%N7p3kJ25j08P6M5j67P6k5Q3j4j1j2J26k42J19lN2m6Nk2j05O5
$$ y = [-29, 19, 5, -65, 58, -68, -20, 29, 33, 67, -105, 33, -23, 83, -45, 62, 59, 35, 0, -32, -31, -41, -14, 17, 132, 22, -44, -67, 43, 125, 79, -11, -78, 27, 0, 89, -11, -100, 34, 39, 3, 48, -53, 36, 49, 136, -17, -4, 41, 81, 99, 117, -62, 5, -49, -73, -110, 55, -32, 77, -8, 10, 42, -81, 49, -8, 116, -55, -57, -8, 98, 20, 14, -18, 28, -33, 78, 5, -60, -98, -50, 38, 129, 11, 10, 57, -77, 13, 24, 13, 144, -52, 79, -27, -17, 51, -50, -9, -112, 30, -1, -31, -64, -10, -17, -21, 66, 72, -68, 6, 17, 45, -73, 143, -25, 26, -68, 46, -11, 31, 71, -108, 51, -8, -40, -73, 8, -35, -16, -58, 4, 26, 91, -38, 5, -15, 127, -61, -60, 20, 24, 18, -56, 63, 23, -68, -93, 58, 61, 13, -36, 14, 12, -67, -25, 8, -80, -13, 94, -110, -19, -69, -64, -56, -93, 35, 38, 1, -3, 12, -3, 3, -74, 11, 5, 19, -95, 85, -66, -97, -48, 27, -37, -79, -120, -42, 51, 43, 137, -135, 4, 7, -94, -6, -18, -8, -56, 2, 61, -40, -40, 17, -56, -58, 67, -41, 35, 80, -87, -11, -36, 47, 33, 22, 10, 136, -106, 13, 10, 62, 16, 21, -1, -106, -41]
5990d1O2m8K8jj28QJ11r6J83o9m3J08j42Q4m6pL5M1q9J30q4J08r0m1N3k0J4m7
6018b7N1m5n0J05p1NK5K4O1M0p2m2o8J40q2J05q0j43J33o2l7R3k9L9l5K3J9n8
6046c8jp0J80q9pJ46J5j29J5J6n8kj2Kl7P5n7j8K04m8j38k3K08j80R8Nj06O1k2
6075a0J45k06N7J66p3j45K1P1J8l1L8k3P2r4P6r7M9q2P6r1J29m5JK0r9J34r0M7
6103C4j2N5m3j46J38j4K9n3M0m7J10j73R9r8Q1l9J1N8k9NK2l7Mr1oJ25j08J00
6131A5J9Lm9O7r1L4l9J21j0m6pn7L5q1J96j03J09qn9r2Q1m1r4j1L0O9L6K0k0k8
6161ak4M8O3q8lm7J91k34R8N1J47j86L9j18J16rjq9J09j89R8J82n3n7j73J28m
6188fM3j65J26j21J00j3K0n0L0M4pL6K1l0N3r3r1K1J68j96O4O5JKN6p1p9M1J56
$$ y = [-41, 21, -27, 1, 0, -128, -120, -9, -105, 78, 9, -34, 74, -68, 16, -30, -37, -2, 39, -50, 80, -4, 104, 14, -27, 26, 6, 20, -27, 24, -21, -71, 34, -37, -32, -7, 17, 78, 118, 46, 4, -64, 76, -6, 99, 19, -124, 9, -53, -90, 3, -26, 13, -22, 1, 20, -38, -39, -109, 71, -18, -25, 121, 136, 7, 22, 38, -20, -22, -34, -32, -69, 6, -51, -69, 135, 87, -51, -74, 134, -46, 52, 57, -49, 12, -10, 135, -71, -14, 152, 79, -66, -45, 26, 44, 13, 51, 28, 100, 6, 82, -15, 34, -48, 28, -63, 66, 21, 22, 42, -57, 77, -13, 34, 22, 77, 34, -112, 26, 12, 41, -12, 28, -19, 91, -82, 17, -81, 0, -39, -28, 30, 1, 6, 28, -9, -5, -96, -102, 23, -85, 15, 34, 37, -12, 55, -36, -2, -41, 80, 70, 24, 17, -40, -5, -86, 110, 7, 116, 108, 49, -43, 38, -3, -97, -108, -78, -9, 27, 47, 27, -1, -25, 23, 86, -2, -5, -52, 139, -95, 3, 54, 201, 15, 54, -64, 52, 43, 42, -47, 62, -127, -29, 153, 100, 43, -130, -2, -6, 37, -128, -2, -123, -23, -36, -16, -66, -36, 8, 1, 37, 58, 28, 81, -12, -103, -82, 86, -110, -46, 19, 20, 22, 78, 7, -72, -31, 125]
6217A25j47J22p3K1n2j7K1kj7l6k9N5L8K3l0J2n4q1K31m0k4p3p9K9R7J4l0J06
6245A10j41l7J0J4K51j96o7k0J7J07ok0l6ok7O3Qj3m6j3j8O3L8J15j09j00l1P0
6273b0j1N3r5M5K4P8j46N7K2k7Q3o0r8Q4M4j12K06r7n7l4J32K0k3m2m1MPp0J14
6302D0ro8R8j48K3J09r8P7m9O9k3p1J05j4m0L5l3L1r2L9L7l6L7qqj7n6q3J09l5
6332g9J3J92j67J86j16N0j35k8J03r1J39j60J34l4m8L7nm3J53p6m8P0mj02O4N4
6358E9l0K0mPm7j4J00p0j00P9o9L5J09n9p5J9N8qjkJ2L7j54om0J31O8J0j8l7N1
6389F1j18J65o1l8NL0l1%r7P2J8R5j18O7J5j32J01K5n1lRo1J1NoJ3l1k3N7jL5
6420A3K8l8j3L5j09j9M8N3p4J1L2l0R4q0K7L8q0K3J42p0j2o2K6n9O1K7Rj0j7j49
$$ y = [125, -22, 100, 27, 48, -4, -21, 0, -2, -19, -55, -84, -29, 9, 32, 2, 14, -40, -121, 110, 70, 46, -27, -106, -77, 20, 34, 4, 110, -31, -68, -58, -44, 207, 11, -56, -76, -59, 48, 42, 22, -14, -20, -47, 16, 24, 11, -35, -48, -66, -3, 35, 150, 41, -59, -90, -20, -31, 22, -73, -28, -4, 74, -72, -15, 7, -20, 63, 3, -95, -11, 33, -79, 127, 30, -27, -61, 71, 91, 68, 26, -15, -11, -4, -74, 40, 31, -37, 61, -87, -64, 45, -53, 24, -25, 44, 21, -50, 55, 41, 1, 36, 3, 34, -58, -19, 18, -18, 19, 11, 3, -14, -70, -153, -44, -79, -66, 126, -41, 145, 29, 79, -56, -84, 19, -72, 67, -93, 41, 7, -41, -4, -9, -52, 101, 25, -23, 47, 43, -59, 5, 59, 29, 49, 45, 52, 5, -9, 91, 21, -79, 0, -69, -34, 75, 16, -59, -40, 18, 10, 9, 7, 19, 56, -98, -104, -144, -13, 55, 65, 47, 10, 61, -57, 108, 47, 9, 14, 44, 13, 13, -84, -12, 6, 101, -17, 50, 65, -67, 34, 59, 8, 5, 14, -47, -36, -31, -37, -24, -55, -78, -21, -22, 13, 41, 3, -10, 25, -84, -103, -55, -2, -76, -65, -33, -63, 31, -49, -22, 16, -64, -41, 101, 31, 19, -43, -17, -76, -15, 12, 21, 11, -6, -155]
6450a55K1J38j9j2M5Qq3J24j54J08j3M0p7q4Q9NN4q2R7K2j8o1J11o1l9K1m7P7
6478E5q6R7o8pN6r9Ln5J39j10l6J89p9P7jj11P8M8j45l0J01Ol9K9N1M2j10P2l9
6507B8ro0L8mN8j06J40K6j15J8m5K3Q1m1l8J3j15O7J01l0M4j8J6j28kJ67j06P0
6535G3j40N2L8m8p6N6J2k9Q7n8J3m3N7n7j5R6k7j1N4k3l1p3J41j13ON1P0j36J32
6564E8m9j10R2l5N1N7om6qj4J44k52J24%k6K5Rm4J1P6K3m4N0j08N7r6P4j11L7
6593f1kP7j1Q8j15P7p5J7m3R4M7j29J42j86lJ30n2N7n8l6M1n4q8J70k7J13j55
6620d2L9L5r4L6j5J49j44J72j42J9K2j6l9J02j16P5p5J60k11J08po1j6J1J9NN6
6647C0rj4kJ1o8K9l3K7J26nj02N1Nq3L3Q6m3j40J91k5j82J61j07R3RR0k14P9M0
$$ y = [-155, -134, 4, -15, -27, 18, 26, -57, 67, -87, 21, 8, 48, -29, -113, -24, -19, 35, -47, 50, 72, 54, -7, 104, 43, 4, 25, -22, 55, -31, 66, -2, -9, 47, -52, -49, -104, 35, -75, -111, 78, -1, 76, 75, -36, 42, 90, -55, -85, 16, 22, -17, 12, 63, 105, -5, 67, 28, 19, -41, -3, -7, 51, -55, 85, 111, -4, 14, -31, -8, 73, 32, -6, 7, -108, -41, 60, 30, 74, 56, 72, -56, -58, 109, 3, 73, -67, -15, 23, -25, -101, -45, -33, -62, 25, -33, -20, -63, -6, -63, -78, 18, -9, -20, 34, 11, -20, -93, 48, -65, -59, -8, 62, -74, 58, 9, -101, -9, -44, 7, 64, 58, 12, 4, -10, 134, -118, 6, 6, -20, 5, 14, -30, -19, 57, 80, 36, 86, -22, 35, -61, 13, -98, -61, -63, 14, 3, 91, -24, 53, -22, -5, -48, 46, 93, -36, 106, -80, -83, 47, -5, 52, -6, -42, -1, -55, -143, 27, 0, 113, -42, -3, 32, -62, -26, -41, 108, -36, 136, -6, 13, 35, 19, -20, 82, -34, 41, -34, 126, -85, 23, 16, -45, -61, -50, -31, -26, 30, 21, 7, 5, 16, -52, -23, -56, -29, 97, 92, -10, 41, 46, -37, -4, 82, 39, -101, 90, 65, -117, 44, -63, 30, 39, 129, -85, -6, 34]
6676C4l3P9j43KL0%n5J70q7l0J18j72J31n9k6K7J1j6l3L5M8n0n0J01j03L7M3q
6704Al5K6j08J83n0R8j04K4J59j35n9l9O6L1p6k7pJ12j16M9O2Ll5J0j34J33m0
$$ y = [34, 1, 80, -63, -61, -31, -31, -86, 84, -3, -33, 85, -87, 44, -15, -41, -14, -3, -19, -52, -17, 31, -19, -69, 32, -71, -34, 9, 1, -34, -8, -116, 67, 17, 115, 11, 35, 194, 59, 0, -39, 27, 58, -18, -45, -52, 60, -56, -7, 55, 58, 23, 33, -101, 32, -8]
$$ [...]
8191d
##END NTUPLES=NMR FID
##END=
