##TITLE=1H_Pr 53-A
 200.13MHz,aceton
 8 sc
 
 5.12.2025
##JCAMPDX= 6.0         $$ Bruker NMR JCAMP-DX V2.0
##DATA TYPE= NMR FID
##DATA CLASS= NTUPLES
##ORIGIN= UXNMR, Bruker Analytische Messtechnik GmbH
##OWNER= pz
$$ XWIN-NMR		Version 3.5
$$ Fri Dec  5 14:44:44 2025 Russian Standard Time (UT+4h)  she@DPX200
##.OBSERVE FREQUENCY= 200.1313
##.OBSERVE NUCLEUS= ^1H
##.DELAY= (6, 6)
##.ACQUISITION MODE= SIMULTANEOUS
##.ACQUISITION SCHEME= undefined
##.AVERAGES= 8
##.DIGITISER RES= 18
##SPECTROMETER/DATA SYSTEM= spect
##.PULSE SEQUENCE= zg30
##.SOLVENT NAME= Acetone
##.SHIFT REFERENCE= (INTERNAL, Acetone, 0, 14.3821)
##AUDIT TRAIL= $$ (NUMBER, WHEN, WHO, WHERE, WHAT)
$$ ##TITLE= Audit trail, XWIN-NMR		Version 3.5
$$ ##JCAMPDX= 5.01
$$ ##ORIGIN= Bruker BioSpin GmbH
$$ ##OWNER= she
$$ F:/spectra/data/she/nmr/H-C/1/audita.txt
$$ ##AUDIT TRAIL=  $$ (NUMBER, WHEN, WHO, WHERE, WHAT)
(   1,<2025-12-05 14:43:05.34 +0400>,<she>,<DPX200>,
      <created by zg, POWCHK disabled, PULCHK disabled
       configuration hash MD5:
       00 E9 B6 7A A2 85 ED C7 34 08 36 98 17 FE 4E 26
       data hash MD5: 16K
       08 0E 2C 30 C8 AA 30 65 2E 22 A2 B1 47 88 44 B1>)
$$ ##END=
$$ 
$$ hash MD5
$$ 64 8B 6E 4E 8D 71 22 55 00 01 D3 4B 4C B5 1B F9
##$RELAX= 
##$RELAX= 
##$RELAX= 
##$RELAX= 
##$RELAX= 
##$RELAX= 
$$ Bruker specific parameters
$$ --------------------------
##$DU= <F:/spectra>
##$EXPNO= 1
##$NAME= <H-C>
##$PROCNO= 1
##$TYPE= <nmr>
##$USER= <she>
##$AMP= (0..31)
100 100 100 100 100 100 100 100 100 100 100 100 100 100 100 100 100 100 
100 100 100 100 100 100 100 100 100 100 100 100 100 100 
##$AQSEQ= 0
##$AQ_mod= 1
##$AUNM= <au_zg>
##$AUTOPOS= <>
##$BF1= 200.13
##$BF2= 200.13
##$BF3= 200.13
##$BF4= 200.13
##$BF5= 200.13
##$BF6= 200.13
##$BF7= 200.13
##$BF8= 200.13
##$BYTORDA= 1
##$CFDGTYP= 0
##$CFRGTYP= 5
##$CHEMSTR= <none>
##$CNST= (0..31)
1 1 145 1 1 1 1 1 1 1 1 1 1 1 1 1 1 1 1 1 1 1 1 1 1 1 1 1 1 1 1 1 
##$CPDPRG= <>
##$CPDPRG1= <>
##$CPDPRG2= <>
##$CPDPRG3= <>
##$CPDPRG4= <mlev>
##$CPDPRG5= <mlev>
##$CPDPRG6= <mlev>
##$CPDPRG7= <mlev>
##$CPDPRG8= <mlev>
##$CPDPRGB= <>
##$CPDPRGT= <>
##$D= (0..31)
0 0.7 0 0 0 0 0 0 0 0 0 0.03 0 0 0 0 0 0 0 0 0 0 0 0 0 0 0 0 0 0 0 0 
##$DATE= 1764931384
##$DBL= (0..7)
120 120 120 120 120 120 120 120 
##$DBP= (0..7)
150 150 150 150 150 150 150 150 
##$DBP07= 0
##$DBPNAM0= <>
##$DBPNAM1= <>
##$DBPNAM2= <>
##$DBPNAM3= <>
##$DBPNAM4= <>
##$DBPNAM5= <>
##$DBPNAM6= <>
##$DBPNAM7= <>
##$DBPOAL= (0..7)
0.5 0.5 0.5 0.5 0.5 0.5 0.5 0.5 
##$DBPOFFS= (0..7)
0 0 0 0 0 0 0 0 
##$DE= 6
##$DECBNUC= <off>
##$DECIM= 32
##$DECNUC= <off>
##$DECSTAT= 4
##$DIGMOD= 1
##$DIGTYP= 9
##$DL= (0..7)
0 120 120 120 120 120 120 120 
##$DP= (0..7)
150 150 150 150 150 150 150 150 
##$DP07= 0
##$DPNAME0= <>
##$DPNAME1= <>
##$DPNAME2= <>
##$DPNAME3= <>
##$DPNAME4= <>
##$DPNAME5= <>
##$DPNAME6= <>
##$DPNAME7= <>
##$DPOAL= (0..7)
0.5 0.5 0.5 0.5 0.5 0.5 0.5 0.5 
##$DPOFFS= (0..7)
0 0 0 0 0 0 0 0 
##$DQDMODE= 0
##$DR= 18
##$DS= 0
##$DSLIST= <SSSSSSSSSSSSSSS>
$$ [...]
##$SUBNAM0= <"">
##$SUBNAM1= <"">
##$SUBNAM2= <"">
##$SUBNAM3= <"">
##$SUBNAM4= <"">
##$SUBNAM5= <"">
##$SUBNAM6= <"">
##$SUBNAM7= <"">
##$SUBNAM8= <"">
##$SUBNAM9= <"">
##$SW= 18.0517328524113
##$SWIBOX= (0..15)
0 0 2 0 0 0 0 0 0 0 0 0 0 0 0 0 
##$SW_h= 3612.71676300578
##$TD= 16384
##$TD0= 1
##$TE= 0
##$TE2= 300
##$TE3= 300
##$TEG= 300
##$TL= (0..7)
0 120 120 120 120 120 120 120 
##$TP= (0..7)
150 150 150 150 150 150 150 150 
##$TP07= 0
##$TPNAME0= <>
##$TPNAME1= <>
##$TPNAME2= <>
##$TPNAME3= <>
##$TPNAME4= <>
##$TPNAME5= <>
##$TPNAME6= <>
##$TPNAME7= <>
##$TPOAL= (0..7)
0.5 0.5 0.5 0.5 0.5 0.5 0.5 0.5 
##$TPOFFS= (0..7)
0 0 0 0 0 0 0 0 
##$TUNHIN= 0
##$TUNHOUT= 0
##$TUNXOUT= 0
##$USERA1= <user>
##$USERA2= <user>
##$USERA3= <user>
##$USERA4= <user>
##$USERA5= <user>
##$V9= 5
##$VALIST= <valist>
##$VCLIST= <CCCCCCCCCCCCCCC>
##$VD= 0
##$VDLIST= <DDDDDDDDDDDDDDD>
##$VPLIST= <PPPPPPPPPPPPPPP>
##$VTLIST= <TTTTTTTTTTTTTTT>
##$WBST= 1024
##$WBSW= 4
##$XGAIN= (0..3)
0 0 0 0 
##$XL= 0
##$YL= 0
##$YMAX_a= 438978
##$YMIN_a= -440988
##$ZGOPTNS= <>
##$ZL1= 120
##$ZL2= 120
##$ZL3= 120
##$ZL4= 120
##$ABSF1= 10
##$ABSF2= 0
##$ABSG= 5
##$ABSL= 3
##$ALPHA= 0
##$AQORDER= 0
##$ASSFAC= 0
##$ASSFACI= 0
##$ASSFACX= 0
##$ASSWID= 0
##$AUNMP= <proc_1d>
##$AZFE= 0.1
##$AZFW= 0.1
##$BCFW= 1
##$BC_mod= 2
##$BYTORDP= 1
##$COROFFS= 0
##$CY= -3
##$DATMOD= 1
##$DC= 2
##$DFILT= <>
##$DTYPP= 0
##$F1P= 0
##$F2P= 0
##$FCOR= 0.5
##$FTSIZE= 0
##$FT_mod= 4
##$GAMMA= 1
##$GB= 0.15
##$INTBC= 1
##$INTSCL= 1
##$ISEN= 128
##$LB= 0.25
##$LEV0= 0
##$LPBIN= 0
##$MAXI= 10000
##$MC2= 0
##$MEAN= 0
##$ME_mod= 0
##$MI= 1.114404
##$NCOEF= 0
##$NC_proc= 0
##$NLEV= 6
##$NOISF1= 3.799351
##$NOISF2= 2.8
##$NSP= 1
##$NTH_PI= 0
##$NZP= 0
##$OFFSET= 14.38212
##$PC= 1
##$PHC0= -3345.451
##$PHC1= 8.992341
##$PH_mod= 1
##$PKNL= yes
##$PPARMOD= 0
##$PSCAL= 0
##$PSIGN= 0
##$REVERSE= no
##$SF= 200.129724274929
##$SI= 16384
##$SIGF1= 3
##$SIGF2= 2
##$SINO= 400
##$SIOLD= 16384
##$SREGLST= <1H.CDCl3>
##$SSB= 0
##$STSI= 0
##$STSR= 0
##$SW_p= 3205.1282051282
##$SYMM= 0
##$S_DEV= 0
##$TDeff= 0
##$TDoff= 0
##$TI= <>
##$TILT= no
##$TM1= 0
##$TM2= 0
##$TOPLEV= 0
##$USERP1= <user>
##$USERP2= <user>
##$USERP3= <user>
##$USERP4= <user>
##$USERP5= <user>
##$WDW= 1
##$XDIM= 8192
##$YMAX_p= 0
##$YMIN_p= 0
$$ End of Bruker specific parameters
$$ ---------------------------------
##NTUPLES= NMR FID
##VAR_NAME=  TIME,          FID/REAL,        FID/IMAG
##SYMBOL=    X,             R,               I
##VAR_TYPE=  INDEPENDENT,   DEPENDENT,       DEPENDENT
##VAR_FORM=  AFFN,          ASDF,            ASDF
##VAR_DIM=   8192,          8192,            8192
##UNITS=     SECONDS,       ARBITRARY UNITS, ARBITRARY UNITS
##FACTOR=    0.0002768,     1,               1
##FIRST=     0,             0,               0
##LAST=      2.2672688,     0,               0
##MIN=       0,             -440988,         0
##MAX=       2.2672688,     438978,          0
$$ Real data points
##PAGE= N=1
##DATA TABLE= (X++(R..R)), XYDATA
0@%%%%%%%%%%%%%%%%Nj3J6j6J6j6K0k8L2l3M0m7M9n7O7p5Q4r5J06j17J32j48J64
$$ 0 0 0 0 0 0 0 0 0 0 0 0 0 0 0 0 0 5 -8 8 -8 8 -8 12 -16 16 -17 23 -24 25 -32 35 -40 44 -51 55 -62 70 -78 86
39H6j83K02k23K48k75L03l32L66m05M47m91N39n94O55p25Q04q93R97j118J262
$$ 86 -97 105 -118 130 -145 158 -174 192 -213 234 -257 282 -312 343 -382 422 -471 526 -592 670
59F70j437J655j930K292k787L503m617O546j0496K1474j05097l50764L50201M50278
$$ 670 -767 888 -1042 1250 -1537 1966 -2651 3895 -6601 14873 -90224 -440988 -90787 359491
73C59491j91524l93782M8335K62327L2875r9948k3708m4543o2602J18108J90652
$$ 359491 167967 -225815 -177480 84847 117722 17774 -5934 -50477 -113079 5029 195681
84A95681j04135k97376J8999L46338R1112l24002j90028K35369K33678j12079
$$ 195681 91546 -205830 -186831 159507 250619 -73383 -263411 -28042 205636 93557
94I3557k05830O469J22426N7920j4007o7827r0196L2518J55425K3311j70435o4473
$$ 93557 -112273 -105804 16622 74542 60535 -7292 -97488 -64970 90455 113766 -56669 -121142
106a21142J45375P3011j05797n1988O6621P414m1428N0336M3125r5103o3795J16464
$$ -121142 24233 97244 -8553 -60541 6080 13494 -27934 22402 65527 -29576 -93371 23093
118B3093Q5671j21868j04511J21247J20225j18555j30222J16597J33163j23487
$$ 23093 108764 -13104 -117615 3632 123857 5302 -124920 -8323 124840 1353
128A353j36613J32776J46702j32182j50062J24097J41117j15262j22950J06286
$$ 1353 -135260 -2484 144218 12036 -138026 -13929 127188 11926 -111024 -4738
138d738R5085j03797o0829J14662L1780j35146j8327J53440J8872j62335k9689
$$ -4738 90347 -13450 -74279 40383 72163 -62983 -81310 72130 91002 -71333 -101022
149a01022J58180M8633j36955o1124J04491N7234p5463m0716N5527J5645m7595
$$ -101022 57158 105791 -31164 -92288 12203 69437 -6026 -46742 8785 24430 -23165
160b3165J3797N3484l7598o9208M9788Q2053m9493q3041M4918P3858m0153n8233
$$ -23165 -9368 44116 6518 -62690 -12902 69151 19658 -63383 -18465 55393 15240 -42993
172d2993L6315L6396l9580j5725M9481K962n7108K469N9416n877n7303Q782N2812
$$ -42993 -6678 29718 -9862 -25587 23894 26856 -30252 -27783 31633 25756 -31547 -22765 30047
185C0047j2794m5377K0592M0501l1036m1768L7416M5158l9519m9474M0514N1694
$$ 30047 17253 -28124 -7532 32969 1933 -39835 -2419 42739 3220 -46254 -5740 45954
197D5954l8814m6963L7946L6921m3222k3450N2176J1842o4051l252P5554o60q5260
$$ 45954 7140 -39823 -1877 35044 -8178 -31628 20548 32390 -31661 -34913 40641 39981 -45279
210d5279q74Q8273N565q4126q111P7156P626o8935m727O1219j821n5854J0216
$$ -45279 -46153 42120 47685 -36441 -44552 32604 40230 -28705 -33432 27787 25966 -29888 -19672
223a9672N4047j7045n5791K1732N7227k4861n9877K7637O3012k8477o3723K7511
$$ -19672 34375 17330 -38461 -16729 40498 15637 -44240 -16603 46409 17932 -45791 -18280
235a8280O3311k5579o1287K1694N6051j7335m6444J3557L3482j1630j9930J2193
$$ -18280 45031 19452 -41835 -20141 35910 18575 -27869 -14312 19170 7540 -12390 -197
247a97R019j6877j568K3519M03k8888m271L0782J0110k7142j6132J8007J8311
$$ -197 8822 -8055 -9623 13896 14299 -14589 -18860 11922 22032 -5110 -21242 -3235 15076
260A5076p109j2793l865J683J1017J2930j2152k6846P656L6942Q97m1750r422
$$ 15076 7967 -4826 -8691 -7008 4009 16939 4787 -22059 -14403 22539 23436 -18314 -27736
273b7736L9871J3973l3174j2527K4347O120j7910M277J5197j5556j7914K5559
$$ -27736 12135 26108 -7066 -19593 4754 10874 -7036 -2759 12438 -3118 -21032 4527
285D527K4211l0482l2188L0525L9941k5439m5845J7698M7250r947m4918M513L8873
$$ 4527 28738 -1744 -33932 -3407 36534 11095 -34750 -17052 30198 20251 -24667 -20154 18719
298A8719j910l1286M241K4150r656j9113J6867J6528k3893j8016K9129K1419l0132
$$ 18719 16809 -14477 -10236 13914 4258 -14855 2012 18540 -5353 -23369 5760 27179 -2953
311b953k5709K6617K9599k0884k9316J2083K7105m798k0640j336J3569L161p133
$$ -2953 -28662 -2045 27554 6670 -22646 -10563 16542 11744 -8896 -10232 3337 6498 -635
324f35p45J911l374q2Q211N48j1284l352J2005O892j0287q116N493P922j69m970
$$ -635 -1380 531 -2843 -2925 5286 5834 -5450 -8802 3203 10095 -192 -8308 -2815 5107 4938 -32
340c2n613Q62R628L594j1877p457J2539J0222j1762j1689J0399J1587q790j0176
$$ -32 -5645 -4783 4845 8439 -3438 -10895 1644 11866 104 -11585 -1186 10401 1611 -8565
354h565P196Q495n845o791N972M699p488l660R564M000j2415n653J5525Q572j7278
$$ -8565 -1369 7126 1281 -5510 462 5161 -2327 -5987 3577 7577 -4838 -10491 5034 13606 -3672
369c672j2567J7891J5177j5804j6969J2898J6417r569j3981P135J0249p207n252
$$ -3672 -16239 1652 16829 1025 -15944 -3046 13371 3802 -10179 -3044 7205 -2 -5254
382e254P402L466r779k551J1035M773j1557q687J0806J1596p265j4067L785J4620
$$ -5254 2148 5614 -4165 -6716 4319 9092 -2465 -11152 -346 11250 3985 -10082 -6297 8323
396H323p52j3864j154J1762J049q427n28O816m57n833O46N137Q9n571l88N125
$$ 8323 7571 -6293 -7447 4315 5364 -3063 -3591 3225 2768 -3065 -2419 2718 2807 -2764 -3152 1973
412A973L030n646n836N549P918n614r962O079J2285n135j3989K804J4454r74j3086
$$ 1973 5003 -643 -6479 -930 6988 1374 -8588 -2509 9776 4641 -9348 -6544 7910 6936 -6150
427f150j774J0751M330o283o190K861N094j104l693K935K508o843k075J1496N528
$$ -6150 -7924 2827 7157 874 -5316 -2455 2639 1535 -2158 777 3285 -3558 -5633 5863 11391
442A1391j6162j1381J6164J7953j1925k1632L902K1644N949j7153j3870P423J5987
$$ 11391 -4771 -16152 12 17965 6040 -15592 -11690 9954 15903 -1250 -15120 -7697 8290
455H290J635j0603n669L564K771L022N433o657j7928L535K8401Q821l0857k3307
$$ 8290 9925 -678 -6347 -2783 -12 3010 8443 1786 -16142 -12607 15794 24615 -6242 -29549
469b9549K2721L2903p554l5340r549K8611K4562j3690k9666k682K1662J1723o438
$$ -29549 -6828 26075 18521 -16819 -26368 2243 26805 13115 -16551 -19233 2429 14152 7714
482G714r493r435j379J8287J9399j5494l6801o94M3657K1893l5265l9969J5956
$$ 7714 -1779 -11214 -12593 5694 25093 9599 -27202 -27896 15761 37654 2389 -37580 -21624
495b1624M9367R152m4857l1704K6629L9992l662l1790j1451J4006J3661P033m062
$$ -21624 27743 36895 -7962 -39666 -13037 26955 23293 -8497 -19948 -5942 7719 14752 10690
508A0690k3290j6550K4885L9755q596n0319j7765M4444M0656k6023n4493L14N4822
$$ 10690 -12600 -29150 -4265 35490 26894 -23425 -41190 3254 43910 17887 -36606 -36292 18530
521A8530K4786l9136l7010J5558L0159L280j2952q446p094J563K1888J5836k3436
$$ 18530 43316 4180 -32830 -17272 12887 16167 3215 -5231 -12325 -10762 11126 26962 3526
534C526l6094Q065M7567J6080m3786l8893K8837N2912o279n3511j5227L8272K5401
$$ 3526 -32568 -24503 23064 39144 -4642 -43535 -14698 38214 31935 -21576 -36803 1469 26870
547B6870j8168j9565L225N439J262J1491M364k4408k0869K4366M0962p910n0442
$$ 26870 8702 -10863 -7638 -2199 -937 10554 14918 -9490 -30359 -5993 34969 27059 -23383
560b3383j5826M6131L4666l2992m5299J3809M5578N078l1611j4243J1077Q072
$$ -23383 -39209 6922 41588 8596 -36703 -22894 22684 27762 -3849 -18092 -7015 1057
572A057L316N547n937j8574j132K7676J6318k7028l3737J2738M3956P482m1539
$$ 1057 4373 9920 3983 -14591 -15723 11953 28271 1243 -32494 -19756 24200 31682 -9857
585i857k4683K9918L5367j3588l5736l067K4705J1621r946q443k3J09K733R853
$$ -9857 -34540 -4622 30745 17157 -18579 -21646 3059 14680 4734 -3709 -3732 -3623 -890 8963
599H963M66j8385j2199J9814K7501j0347l6133l218L6475J3360l1566k1284K2992
$$ 8963 9429 -8956 -21155 -1341 26160 15813 -20320 -23538 12937 26297 -5269 -26553 -3561
612c561K4736j1680j9873M191J0024m363l680Q304J966j2057k629J6423O233j8503
$$ -3561 21175 9495 -10378 -6187 3837 -526 -4206 4098 6064 -5993 -8622 7801 14034 -4469
626d469j3578J6284J7502j0600j7583O631J5557k540j3004l69Q750L55n485K92
$$ -4469 -18047 -1763 15739 5139 -12444 -5813 9744 7204 -5800 -6169 2581 2936 -2549 -2257
640b257M444J315l678k461J696K090p61k935J31M456K567l895l269J750J297k388
$$ -2257 2187 3502 -176 -2637 -941 1149 388 -2547 -2416 2040 4607 712 -2557 -807 490 -1898
656a898m93M950J659n982k977P766L979j0070q223J0367J2381p189j3012M334
$$ -1898 -2391 2559 4218 -1764 -4741 3025 7004 -3066 -11289 -922 11459 4270 -8742 -4408
670d408J1084k782r049J891N517k147k180N269J843r195l740J0786O770j0938
$$ -4408 6676 3894 -5155 -3264 2253 106 -2074 3195 5038 -4157 -7897 2889 9659 -1279
684a279r112Q965J0737n189r695K141N581j246j270J626j920l347M073O755l601
$$ -1279 -10391 -1426 9311 4122 -5573 -3432 2149 903 -367 1259 -661 -4008 65 6820 3219
699C219r865M87R699K450p428k920M175K769r61j003j640k932J795P382R0q990
$$ 3219 -6646 -6159 3540 5990 -1438 -4358 -183 2586 1625 622 -1018 -3950 -2155 5227 5317 -3673
715c673k842Q631M769p026o478M988N944k003l335N15m41n03L116J808n305l820
$$ -3673 -6515 2116 6885 -141 -6619 -1631 4313 2310 -1025 -510 -951 -1454 1662 3470 -1835 -5655
731e655O261O301n396q118L998Q028k284p567J159O122l70m369J304K526l420
$$ -5655 606 6907 1511 -6607 -2609 5419 3135 -4432 -3273 2849 2479 -1890 -586 1940 -1480
746a480q05M956k81o682N04Q675P75r715k515R566L370q167l898O108M009m020
$$ -1480 -2285 2671 2390 -4292 -3788 4887 5662 -4053 -6568 2998 6368 -1799 -5697 411 4420 400
762D00l040K304N07j313J823K171l644l813M532N838m026p641K464Q192o19p448
$$ 400 -2640 -336 171 -1142 681 2852 -792 -4605 -73 5765 1739 -5902 -3438 4754 4135 -3313
778c313r51N988J196l151o50L65l03P76K572j732l945J151M718m22m359r87L729
$$ -3313 -4264 1724 2920 -231 -881 -516 -819 -43 2529 797 -3148 -1997 2721 2299 -2060 -3047 682
795F82J981k717j613J685O36n76K20K8j218j51K128J091l972q62M375J601m898
$$ 682 2663 -54 -1667 18 654 78 298 326 -892 -1043 1085 2176 -1796 -2658 1717 3318 -1580
812a580k106N025K307m992j831M441J796m512m67L808p65l617J660L841j984m879
$$ -1580 -3686 1339 3646 -1346 -3177 1264 3060 -1452 -1919 1889 1124 -2493 -833 3008 1024 -3855
828c855K352N578j770o368J035O315Kn756o74M862J016m190m19L557r54l162K343
$$ -3855 -1503 4075 2305 -4063 -3028 3287 3289 -2467 -3141 1721 2737 -1453 -1872 1685 731 -2431 -88
845h8L182l066l961L537M284k943m454K322L545j336k281Q14J012o92n17J621
$$ -88 3094 28 -3933 -396 3888 945 -3509 -1187 2358 1022 -1259 -445 567 -125 -642 979
861I79j53k322K38K696N13l064p60K280J600j975j340J292J77o80J282J41k138
$$ 979 826 -1496 -1258 1438 1951 -1113 -1873 407 2007 32 -1308 -16 161 -519 763 904 -1234
878a234n10L091R20l431j596L512J593k800r11J481J29q58J652O63l570r29M950
$$ -1234 -1744 1347 2267 -1164 -2760 752 2345 -455 -1366 115 244 -614 1038 1701 -1869 -2798 2152
895B152J780n689l745O046N228n296n733M027O135l310n417L265L462m109k132
$$ 2152 3932 -1757 -5502 544 5772 476 -5257 -1230 4905 1595 -3822 -557 2905 -1204 -3336
910c336O660J764r840k018J1797M262j4078n944J3529Q923j1470j0752Q815R657
$$ -3336 3324 5088 -4752 -6770 5027 9289 -4789 -10733 2796 11719 249 -10503 -1688 7969
924G969n842p798M159M564l849j295N426M09q731r87J0750L991j1575p891J0252
$$ 7969 2127 -5671 -1512 3052 -797 -2092 3334 3743 -4988 -5975 4775 8766 -2809 -10700 -448
939d48J0995o192j1332J37Q977M375m734o347p52O737N477m727p549J139O543
$$ -448 10547 4355 -6977 -6840 2137 6512 1778 -4569 -5321 1416 6893 2166 -5383 -4244 2299
954B299p8k879K136q00n580J840J1492j589j6795k828K0765R141j9955j5329J7050
$$ 2299 2221 -658 1478 678 -4902 -3062 8430 6841 -9954 -12782 7983 17124 -2831 -18160 -1110
969a110J8304j3482j8365R263J6728q398j2258J0801R351j5528r769K0310J2128
$$ -1110 17194 3712 -14653 -5390 11338 2940 -9318 1483 10834 -4694 -14463 5847 17975
982A7975k3392j5760K2730K1327j8970k3249J1910K1608o585j7286K930J2592
$$ 17975 -5417 -21177 1553 22880 3910 -19339 -7429 14179 7594 -9692 -6762 5830
994E830k031o736L614M216q486n455J0950Q772r339j1180N859J2067q22j0811
$$ 5830 3799 -2937 677 4893 -3593 -9048 1902 10674 1335 -9845 -3986 8081 7259 -3552
1008c552o552N859J1678K804j2138j0196J0131J4039p242j6225M942J5000l323
$$ -3552 -10104 -4245 7433 10237 -1901 -12097 -1966 12073 4831 -11394 -6452 8548 5225
1021E225j1323N369Q935j0573r663J5062J2619j8444j7325J9844K4041j7675k8722
$$ 5225 -6098 -729 8206 -2367 -12030 3032 15651 -2793 -20118 -274 23767 6092 -22630
1034b2630J2901K9396r651k8006P820K5538o298k1518Q327J7691j2770j7933J5356
$$ -22630 -9729 19667 10016 -17990 -10170 15368 9070 -12448 -4121 13570 800 -17133 -1777
1047a777J9554j5271j9270J3864J9989j1612k0786O866J8646l488j2664K607Q825
$$ -1777 17777 2506 -16764 -2900 17089 5477 -15309 -8443 10203 6715 -5949 -3342 5483
1060E483l324o751L591L721m517j755O950J319o108j051M050j954k986N375K037
$$ 5483 2159 -4592 -1001 2720 -1797 -3552 3398 4717 -1391 -2442 1608 -346 -3332 2043 4080
1075D080q862m73J2686K62j5653p11J6214L97j6903R25J7623n79j7723J466J7640
$$ 4080 -4782 -5255 7431 7693 -7960 -8671 7543 7940 -8963 -8038 9585 9006 -8717 -7251 10389
1090A0389l627j9871M110K1489k197k1489J884K1761k804k2878K513K1509k517
$$ 10389 6762 -13109 -8999 12490 10293 -11196 -9312 12449 9645 -13233 -10720 10789 8272
1103H272j8653N214J8126p850j8485Q024J7263q860j5329R928J5087r378j3909
$$ 8272 -10381 -5167 12959 5109 -13376 -5352 11911 3051 -12278 -2350 12737 3359 -10550
1116a0550P864J0963p976q411Q606P159q787n421J0190L226j1136k996J1778J793
$$ -10550 -2686 8277 301 -8110 496 7655 -1132 -6553 3637 6863 -4273 -7269 4509 6302
1130F302j1632L11J2083j731j1871K643J1022n780j0653Q041J1345q799j0013
$$ 6302 -5330 -5019 7064 5333 -6538 -3895 7127 1347 -9306 -1265 10080 1281 -8732
1143h732R567Q310j1707p704J2090P268j1216n622J2455M388j4260m460J3859
$$ -8732 835 9145 -2562 -10266 1824 9092 -2124 -7746 4709 9097 -5163 -9623 4236
1156D236M135j3263l003J4218K075j4681j454J4352n31j4326K668J4792l898j4613
$$ 4236 8371 -4892 -7895 6323 8398 -6283 -7737 6615 6084 -8242 -5574 9218 5320 -9293
1170i293N126J3979o365j4033P575J2568p377j0945Q098R556q675r259R693P507
$$ -9293 -4167 9812 3447 -10586 -3011 9557 2180 -8765 -667 8889 214 -9045 648 8155
1184H155j0218o616J1528O194j1520n792J1012M570j1656l352J2292K640j2016
$$ 8155 -2063 -8679 2849 9043 -2477 -8269 2743 7313 -4343 -7695 4597 7237 -4779
1197d779o84J0884p18j1768K395J1343k970j0414M696J0002o064r839O260Q885
$$ -4779 -5463 5421 4703 -7065 -4670 6673 3703 -6711 -2015 7987 1923 -7916 -1656 7229
1211G229o834p750P703P273q218o490Q137N747r221m439R835L889j0228l026J0876
$$ 7229 395 -7355 348 7621 -597 -7087 1050 6797 -2424 -6863 2972 6861 -3367 -6393 4483
1226D483K312j1872j290J1488M42j0902J81J0836j274r994K274Q882l192q786
$$ 4483 6795 -5077 -6367 5121 5563 -5339 -5158 5678 4404 -5590 -3316 5566 2374 -6412
1240f412M421Q819n190q073N179P897n990p584O297O683n940n560O212M345o689
$$ -6412 -1991 6828 1638 -6435 -1256 6641 651 -6933 -636 6047 107 -5453 759 5104 -1585
1255a585l595P478K588q063j359Q462M57q393J00Q049m38q061J142P467j891o821
$$ -1585 -5180 2298 4886 -3177 -4536 3926 4383 -4010 -3910 4139 3701 -4360 -3218 4249 2358 -4463
1271d463L042O151l897n978M476O094n013o062N707N547n542n648O345M417o576
$$ -4463 -1421 4730 833 -5145 -669 5425 412 -5650 57 5604 62 -5586 759 5176 -1400
1286a400l821P086K982p200k423P557K147p908j757P722J232p554p45P431N3p063
$$ -1400 -5221 1865 4847 -2353 -4776 2781 4928 -2980 -4737 2985 4217 -3337 -4082 3349 3402 -3661
1302c661O07P129j075o679J335O157q48o916J699O266k237n198J947N151k647
$$ -3661 -3054 4075 3000 -3679 -2344 3813 2965 -3951 -2252 4014 1777 -3421 -1474 3677 1030
1317A030m327K675L833l057l176K930L189l366k083K766J834l001m13J906j26
$$ 1030 -3297 -622 3211 154 -3022 -92 3097 -269 -2352 414 2248 -753 -1166 740 614
1332F14j712N12K125j752j656K073K034k806j959L378J982l917j609M096J171
$$ 614 -1098 -586 1539 -213 -1869 204 2238 -568 -2527 851 2833 -1084 -2693 1403 2574
1347B574m651j052N429O25n336j374O957N57o860r34P283P27p004p86O764P44
$$ 2574 -2077 -3129 2300 2925 -2411 -3785 3172 3729 -3131 -4065 3218 3945 -3059 -3845 2919 3663
1363C663p036k65O787J92o748R4O683J40o795j57O459K70n960p52N445J369n217
$$ 3663 -3373 -3638 3149 3341 -3407 -3313 3370 3510 -3285 -3442 3017 3287 -2673 -3425 2020 3389 -1828
1380a828j111M489Q12l830n55L498n1l053M70K375K0k403M68J781k26j084o95
$$ -1828 -2939 1550 2362 -1468 -2023 1475 1424 -1629 -1159 1216 1236 -1167 -699 1082 856 -228 -923
1397i23Q81K21N42q52p17L57J734j45j792q55K101P53j529j177K044O47k029j12
$$ -923 -42 179 721 -131 -848 -491 1243 1098 -694 -1549 552 1305 -224 -1401 643 1290 -739 -851
1415h51J754j36k100N0L231n36l550O33L764q56l650N85M010j161l373J829K515
$$ -851 903 767 -1333 -1283 1948 1412 -2138 -1505 2259 1403 -2247 -1662 2348 1187 -2186 -357 2158
1432B158j780k566K512K219l105k784L647L575l842l940L903M343m539m089M264
$$ 2158 378 -2188 324 2543 -562 -3346 301 3876 34 -3906 -3 4340 -199 -4288 -24
1447b4M736m466m747M902M265n836m480O473N080o667m801O728M906o158n951
$$ -24 4712 246 -4501 401 4666 -1170 -5650 823 5903 -764 -5565 1163 6069 -89 -6040
1462f040N117O202m306o183M114O344l865o121L303O013l042o447K947O928k250
$$ -6040 -923 5279 973 -5210 -1096 5248 1383 -4738 -1435 4578 1536 -4911 -1964 4964 2714
1477B714o627J144O442m10o641q10N988K622m746l749L901M444l711n668L315
$$ 2714 -3913 -2769 3673 3263 -3378 -4188 1800 4422 -324 -4073 -172 4272 561 -5107 -1792
1492a792O680k274p182J976Q171k406r219R99J0559N3j0586j320J1533K422j2198
$$ -1792 4888 2614 -4568 -2592 5579 3173 -6046 -5047 5512 5565 -5021 -6341 5192 7614 -4584
1507d584m341J2364N587j2263o274J2898P460j3610q305J3381Q576j3877q652
$$ -4584 -8925 3439 9026 -3237 -9511 3387 10847 -2763 -11068 2313 10889 -2988 -11640
1520a1640J3491J0018j3121j0151J2386J0258j1567j1431J0623J1685q502j2168
$$ -11640 1851 11869 -1252 -11403 983 11241 -326 -11757 -1134 10551 2049 -10119
1532a0119Q268J2279p856j2982O518J2677n523j1174N233J1162m061j1633K503
$$ -10119 -1851 10428 2572 -10410 -3892 8785 3262 -7912 -2679 8483 4422 -7211 -4708
1545d708J0160j370q577O02Q448P64p608l393O492M345n985n047N672O595m405
$$ -4708 5452 4082 -4495 -3893 4555 5319 -2289 -5682 810 5155 -830 -5877 -205 6390 1985
1560A985p837L149Q111k332r099J563R806L31j0383j018J0590K223j2474l350
$$ 1985 -5852 -2703 5408 3076 -6023 -4460 5346 5677 -4706 -5724 4866 7089 -5385 -8735
1574h735J2768M948j3258m755J4249N336j4881o450J4041P170j4522n967J4673
$$ -8735 4033 8981 -4277 -9032 5217 10553 -4328 -10778 3263 10433 -4089 -10056 4617
1587D617P047j4894q029J3959P527j3835p204J3882Q728j3392r318J2525Q536
$$ 4617 11664 -3230 -11259 2700 10227 -3608 -10812 3070 11798 -1594 -10912 1613 10149
1600A0149j2442q729J2600R069j1422q380J1048O845j0690p099J0041O914q754
$$ 10149 -2293 -11022 1578 10647 -775 -9155 1893 8738 -1952 -9051 990 7904 -850
1613h50n820P990N175o878n677N454N211l993m975L936M411k243m301O47L316
$$ -850 -6670 1320 6495 -383 -6060 -606 4605 612 -4363 -427 3984 1741 -2560 -1913 1403
1628A403k92k612m02K755J840j524l204K17L871n26n131N10P321K71p895o71Q315
$$ 1403 1111 -1501 -1903 852 2692 1168 -2036 -1819 2052 1526 -3605 -3095 4226 4497 -3398 -4069 4246
1645D246K77j0292k84J1803J176j2020j006J2105N91j2933j539J3465J961j3427
$$ 4246 4523 -5769 -6053 5750 6926 -5094 -6100 6005 6596 -6337 -7876 5589 7550 -5877
1659e877j575J4061J580j4654k282J5192J819j5292j643J5787K059j5905k087
$$ -5877 -7452 6609 8189 -6465 -8747 6445 8264 -7028 -8671 7116 9175 -6730 -8817
1672h817J5930J169j5484j407J5129J857j4254j017J3215P66j3345r41J2058J663
$$ -8817 7113 8282 -7202 -8609 6520 8377 -5877 -6894 6321 7087 -6258 -7199 4859 6522
1686F522j1275q98J0972P16j0696j297R305J485p884j363P743P96o281j349M627
$$ 6522 -4753 -5651 5321 6037 -4659 -5956 3349 4834 -3050 -4413 3330 4126 -2155 -3504 1123
1701A123J028l430n09K303R61q10j387k85J039J464j571k307K326L060j851m771
$$ 1123 2151 -1279 -1788 515 1476 666 -721 -1006 33 1497 -74 -2381 -55 3005 1154 -3617
1717c617K635N018k679o396K858P496k799p949K660R056l128j0110L264J0830
$$ -3617 -982 4036 1357 -5039 -2181 5315 2516 -5433 -2773 6283 3155 -6955 -3691 7139
1731G139l091j1529L847J2184m373j2703M097J2866m202j3002M301J3658m609
$$ 7139 4048 -7481 -3634 8550 4177 -8526 -4429 8437 4235 -8767 -4466 9192 4583
1744D583j3224L847J3490l997j3350L930J3418l455j3625L597J2784l402j2296
$$ 4583 -8641 -4794 8696 4699 -8651 -4721 8697 5242 -8383 -4786 7998 4596 -7700
1757g700K915J2250k999j1356K491J0950k456j0313K212R202j357q533J071P696
$$ -7700 -4785 7465 4466 -6890 -4399 6551 4095 -6218 -4006 5196 3839 -4694 -3623 4073
1771D073p83o448l4N984j9m905n98M077J195l276j700K665J800j488k279Q96K500
$$ 4073 3290 -3158 -3192 2792 2773 -2132 -2730 1347 2542 -734 -2434 231 2031 543 -1736 -840 1660
1788A660N62l529j117L643J909l833k956M047L867m443m336M701M731m962n341
$$ 1660 2222 -1307 -2424 1219 3128 -705 -3661 386 4253 -190 -4526 175 4906 -56 -5397
1803e397N411N838n975n863N454O870n904p028N828P452o056p638N996P742n667
$$ -5397 14 5852 -123 -5986 -532 6338 434 -6594 -766 6686 630 -7008 -1012 6730 1063
1818A063q239O233P867n807q007N986P690n541q012N885P443n446p343N297P181
$$ 1063 -7176 -943 6924 1117 -6890 -904 6786 1245 -6767 -882 6561 1115 -6228 -931 6250
1833F250n141p135N115O512m442o525L954O170l254o286L225N893k867n553K551
$$ 6250 1109 -6026 -911 5601 1159 -5366 -1412 4758 1504 -4782 -1557 4336 1469 -4084 -1533
1848a533N304k147m860J603M719j154m486P71L622N43l656q63L181J115k821k032
$$ -1533 3771 1624 -3236 -1633 3086 1932 -2554 -1783 1839 2382 -1274 -2137 1044 2159 -662 -2694
1864b694K802K500k295l052K002L546j619l755R85M653r42m856K4N488J98n639
$$ -2694 108 2608 313 -2739 -737 2809 1190 -2565 -1580 3073 2131 -2725 -2701 2787 2985 -2654
1880b654q11O186J224o639j452O547J738o695k279P287K651p325k956P132L772
$$ -2654 -3465 2721 3945 -2694 -4146 2401 4139 -2556 -4835 2452 5103 -2222 -5178 1954 5726
1895E726p660l713P271L971p186m196O836M674o230m786N772M947n333n054M734
$$ 5726 -1934 -5647 1624 5595 -1591 -5787 1049 5723 -507 -5293 479 5426 93 -4961 -227
1910b27N231m966m931M440N206l864n751L549N587k735m990J642N318j617m754
$$ -227 5004 38 -4893 -453 4753 889 -4862 -1313 4274 1539 -3451 -1809 3509 1892 -2862
1925b862Q83L862K64l882n46L702R94l173j652K909K005k679k225K181K857j749
$$ -2862 -1979 1883 2147 -1735 -2281 1421 2415 -758 -2410 499 2504 -175 -2400 -219 2638 889
1941H89l351J206L590q21l789M78L772K55m116m04L897P72m230j123M681J172
$$ 889 -2462 -1256 2334 1513 -2276 -1798 1974 2229 -1887 -2291 1606 2378 -1852 -2975 1706 2878
1957B878m320j580M629J565m660j541M192J810m196j867M048J978l332k189K589
$$ 2878 -1442 -3022 1607 3172 -1488 -3029 1163 2973 -1223 -3090 958 2936 -396 -2585 4
1972DK453k950j957K898K169k802k043K490J701k551j753K645J792k221j261J592
$$ 4 2457 -493 -2450 448 2617 -185 -2228 262 1963 -588 -2341 304 2096 -125 -1386 206
1988B06N93j422l83J402l0p08L17P80l20p00j4N06m92l41P09O68q73m74J140K58
$$ 206 799 -623 -1006 396 366 -342 -25 755 435 -265 -279 227 -265 -606 103 771 -102 -576 564 822
2008H22j496n43J984J84k136M94J901K54k786M36J699o64j488Q75J794o33j475
$$ 822 -674 -1217 767 951 -1185 -691 1210 1464 -1322 -886 813 149 -1339 -464 1330 697 -778
2025g78N02Q98q54q59R61R08n32m73N85J68j321m6J177L50j068K29J772r32k184
$$ -778 -276 622 -232 -1091 -130 778 246 -227 358 526 -795 -841 336 686 -382 -153 1619 687 -1497
2044a497O81J936j136j797K027J999k356k155K682J853k943j983L031K091k766
$$ -1497 -816 1120 -16 -1813 214 2213 -143 -2298 384 2237 -706 -2689 342 2433 -333
2059c33k177L621J442l386j988L181K019l272j718L608K491l768k653L696J590
$$ -333 -2510 1111 2553 -833 -2821 360 2379 -893 -2611 997 3488 -280 -2933 763 2353
2074B353l825j671M617J749l824j651L230R52l668o13L296J125k687j47J835J69
$$ 2353 -1472 -3143 1474 3223 -601 -2252 978 1930 -1738 -2351 945 2070 -617 -764 1071 1240
2090A240k834N2K181j22q21K4J080l22j054L35Q54o95n98J430L16j923L76J871
$$ 1240 -1594 -1542 639 517 -304 -280 800 478 -576 -241 613 -82 -680 750 1066 -857 -481 1390
2108A390p31k672J021L042j800k214K444K414k473k965K559K266l322k019L691
$$ 1390 659 -2013 -992 2050 250 -1964 480 2894 421 -2544 15 2281 -1041 -3060 631
2123F31K984l533k433K487K503l167l151L652L567l370k881L401K622m199k730
$$ 631 3615 82 -2351 136 2639 -528 -3679 -27 3540 170 -2711 690 3312 -887 -3617
2138c617M090K879l975k091M299J210m413j322M244P87l591l91L434L68l019k85
$$ -3617 473 3352 -623 -2714 1585 2795 -1618 -2940 1304 2091 -1500 -1891 1543 1911 -1108 -1393
2154a393K468o32k157R54K180j043j982J379K040j718j992K038J576k535p62K637
$$ -1393 1075 443 -1714 -760 1420 377 -1605 -226 1814 96 -1896 142 1718 -817 -1579 1058
2170A058J195l398o42K966K09l653M67M390n04m111Q25L499j272l667J080M223
$$ 1058 2253 -1145 -1787 1179 1388 -2265 -1798 2592 2088 -2023 -1198 2301 1029 -2638 -1558 2665
2186B665j338l655J670L228j734l939K092L567k101l057J950L534k393l222K427
$$ 2665 1327 -2328 -658 2570 836 -3103 -1011 2556 455 -2602 -652 2882 489 -2733 -306
2201c06K862k987j874K788J853l040j142K696J206l593n75L232N20k919L50K799
$$ -306 2556 -431 -2305 483 2336 -704 -1846 850 2056 -1537 -2112 1120 1640 -1279 -929 1870
2217A870q42k641N28K716r64k885J635K992j921k805K063K492k407k619K850K589
$$ 1870 1028 -1613 -1085 1631 667 -2218 -583 2409 488 -2317 -254 2238 -169 -2788 62 2651
2233B651k679k455L303J758l941j509L890J552l433j507L820N88l542p78L512
$$ 2651 -28 -2483 820 2578 -1363 -2872 1018 2570 -863 -2370 1450 2038 -1504 -2282 1230
2248A230L65l262M9L698k99l436N28K963q40l306J348K961j161k906J786K309
$$ 1230 1595 -1667 -1618 2080 1781 -1655 -1127 1836 996 -2310 -962 1999 838 -2068 -282 2027
2264B027j942k413K412J891k476j639K825J293k938r07L059M41k946l09L142J14
$$ 2027 85 -2328 84 1975 -501 -2140 685 1978 -960 -1867 1192 1633 -1313 -1622 1520 1634
2280A634l106j52L211J53l914M64L565k27l517O80L217r60l176J061L159j560
$$ 1634 -1472 -1624 1587 1740 -2174 -1710 1855 1628 -1889 -1209 2008 1048 -2128 -1067 2092 532
2296E32k634J497K728j916k235K055J965k164j660K034J523k042j140J862R91
$$ 532 -2102 -605 2123 207 -2028 27 1992 -172 -1832 202 1725 -317 -1457 405 1396
2311A396k211k75K032N4k102P1K608o42k618J369J973q56k583J302K556j776k193
$$ 1396 -815 -1090 942 996 -1106 -1035 1573 931 -1687 -318 1655 799 -1784 -482 2074 298 -1895
2328a895J642K344k109j951J913K474k503k099K429J759k279j856K729J321k208
$$ -1895 -253 2091 -18 -1969 -56 2418 -85 -2184 245 2004 -275 -2131 598 1919 -289
2343b89j572K436J188k300j200K428O81k154m60K108L61k103k38K091j04j906
$$ -289 -1861 575 1763 -537 -1737 691 1372 -782 -1242 866 1227 -876 -1114 977 873 -1033
2359a033O29J413n14j695J160J163j107j182J515Q22j630j057K214O20k014m53
$$ -1033 -404 1009 495 -1200 -40 1123 16 -1166 349 1171 -459 -1516 698 1318 -696 -1149
2375a149J748Q27k064l82J918N06k271l87K552mk436N8K359Q8k751r1K490J28
$$ -1149 599 1426 -638 -1020 898 1404 -867 -1254 1298 1294 -1142 -1084 1275 1363 -1388 -1479 1011 1139
2393A139k017m01K056K05j874J76J564m85j395P21J003n72o48K26Q19k88j011
$$ 1139 -878 -1279 777 982 -892 -716 848 363 -1032 -311 692 120 -528 -302 517 229 -782
2410g82N52L92J97j23j74j04m73P59N68j039q91J186R99r94j426J380J127j482
$$ -782 -230 162 359 236 62 -42 -515 244 812 -227 -1118 68 1067 73 -1353 27 1154 -328
2428c28o89J467Q76j506j233J926J210k194j257K430R17j678j584J953J389k131
$$ -328 -1017 450 1326 -180 -1413 513 1723 -471 -1728 702 1619 -59 -1643 310 1699 -432
2444d32j585K216J566j457k058J785J644j259k034J667J621j579j208Q34J566
$$ -432 -2017 199 1765 308 -1750 35 1679 420 -1614 53 1674 95 -1113 -279 1287
2459A287q30j331L55J172m79n89J18P46J91p79l33O05M55p40n66M82R68n96o90
$$ 1287 457 -874 -519 653 174 -415 -297 449 640 -139 -472 133 588 -152 -718 -236 732 136 -554
2478e54L75P99N9j010n71J368O79r13j290J440Q93j383j462J626J210j370j390
$$ -554 -179 620 679 -331 -902 466 1145 232 -1058 382 1275 -108 -1570 56 1266 -104 -1494
2495a494J648J328j392j547J179J879j665j540J023J972o70j743M53J997q98j664
$$ -1494 154 1482 90 -1457 -278 1601 -64 -1604 -581 1391 721 -1022 -569 1428 530 -1134
2511a134N35J470j40j760P90J334o10j769L11J562j66o60L2O74j04n46l94N52
$$ -1134 -599 871 731 -1029 -239 1095 485 -1284 -973 589 423 -237 -205 469 365 -181 -575 -23
2529b3RJ63k4J64j95Q1l32k59L49K62j14j93J00L43k63q61M68J218n49j309L61
$$ -23 -14 149 125 289 94 175 -157 -416 -67 195 81 -112 -12 331 68 -793 -325 893 344 -965 -604
2550f04J419K22j722J75J408o07j314P50J153m94r70O62J169q75j553N95J286
$$ -604 815 1037 -685 -510 898 291 -1023 -273 880 386 -584 78 1247 372 -1181 -586 700
2567G00N1j027R0J097n76j177P9J276n57l73P30O03r07q77Q09M84j113o7J385
$$ 700 751 -276 -186 911 335 -842 -763 513 -44 -417 313 916 9 -868 -59 425 -688 -755 630
2586F30k26p37K01Q24r48o63O76R08m61q07O78J030j159r29O14J202r08j058J106
$$ 630 404 -333 -132 692 -256 -919 -243 665 204 -603 75 1105 -54 -983 -369 833 -75 -1133 -27
2605b7J236o87j808J471R51j802j094K100J194j986n38J793M93k148q19J926O44
$$ -27 1209 522 -1286 185 1136 -666 -1760 340 1534 -452 -990 803 1296 -852 -1671 255 899
2622H99j300j0J066n8r72q7N53J53j054M75J120r9q42k94M52j27n67P86P59j329
$$ 899 -401 -411 655 597 -375 -462 91 244 -810 -335 785 686 -156 -450 2 -125 -692 94 853 -476
2642d76L5J066J96j716r4J622M2j918N69J693l58j608N85J788j326j683R01J924
$$ -476 -441 625 821 -895 -989 633 675 -1243 -674 1019 661 -947 -362 1426 100 -1583 -682 1242
2660A242q15j704J193J529j449k223J105K403m67k263R70K240j302k240J405J453
$$ 1242 427 -1277 -84 1445 -4 -2227 -1122 1281 814 -1449 -479 1761 459 -1781 -376 1077
2676A077j038j059J087J275j406j046J357N57j308m86J557K44j105m16J181J39
$$ 1077 39 -1020 67 1342 -64 -1110 247 804 -504 -990 567 811 -294 -710 471 610
2692F10j128k1J264n30r56N65J205q24j373J242J246j686j149K209P35j656q53
$$ 610 -518 -539 725 195 -761 -196 1009 185 -1188 54 1300 -386 -1535 674 1409 -247 -1100
2709a100K011K88k099k68J803R79k526k50K222J11k570J84K534k17k080j01K327
$$ -1100 911 1199 -900 -1168 635 1614 -912 -1162 1060 1171 -1399 -1215 1319 1102 -978 -1079 1248
2726A248K5k232j98K387l67j869L78J887q48j342J101J095j433j048J520R96j428
$$ 1248 1273 -959 -1157 1230 863 -1006 -628 1259 411 -931 170 1265 -168 -1216 304 1300 -128
2743a28j251J951O31j613p70J744K9j282o3J759k67j909N92J787p71j975R16K328
$$ -128 -1379 572 1203 -410 -1180 564 593 -689 -752 1007 740 -1169 -577 1210 439 -1536 -620 1708
2761A708r99k231R49K113r19k281J126K069j338j603J352J534j509j297J550J137
$$ 1708 709 -1522 -573 1540 621 -1660 -534 1535 197 -1406 -54 1480 -29 -1326 224 1361
2777A361j630r70J797P85j652j041J874P38j567j019J320J075j131q09J449J18
$$ 1361 -269 -1239 558 1343 -309 -1350 524 1262 -305 -1324 -4 1071 -60 -869 580 698
2793F98j312K89R76n61r77N31J561j224j294J267J408j510j334J577P50j043q72
$$ 698 -614 -325 651 90 -887 -356 1205 -19 -1313 -46 1362 -148 -1482 95 845 -198 -1070
2810a070J452P13j566m30J756L6j751k69J952J57j733n93K365K37j885m72J860
$$ -1070 382 1095 -471 -901 855 891 -860 -1129 823 980 -753 -1346 1019 1256 -629 -1101 759
2827G59L04j939L25J445m02j536N64J732n34j639O15J229p35q62M40J215j081
$$ 759 1063 -876 -551 894 492 -1044 -480 1252 718 -921 -306 923 188 -674 -234 981 -100
2844a00n46J040K34r28n26J160J03r10n7J027k20r91N5J726n67j474M72J620p98
$$ -100 -646 394 628 -300 -826 334 437 -473 -530 497 277 -714 -659 1067 500 -974 -502 1118 320
2863C20j373N14J764r24j379O99J753j217j638J452J002j155r12J614Q41j446
$$ 320 -1053 -539 1225 301 -1078 -379 1374 157 -1481 -29 973 -182 -1094 520 1361 -85
2879h5j225J675P86j313j027J370R62j180j037J348N63r89n62R23K34o82k33O22
$$ -85 -1310 365 1151 -162 -1189 181 1143 -37 -1074 274 837 -152 -714 209 443 -239 -472 150
2897A50k6n38rQ77k60m90L38L71K6q28O13j2l08j08O80j07n74l24J112j29p75
$$ 150 124 -414 -423 454 194 -296 42 413 439 -389 224 212 -96 -204 476 369 -205 -529 583 454 -321
2918c21L1O44L00j116K53R83j04j372K24J100j53j178K88J200k45j117J51Q95
$$ -321 -290 354 654 -462 -209 774 670 -702 -478 622 469 -709 -421 779 534 -583 -432 463
2936D63k32q90N52R13n69r00M52R12p10l29jM04J47o13L58N44p76pM35K00o46
$$ 463 231 -659 -107 806 237 -663 -211 701 -9 -338 -339 65 212 -401 -43 501 -275 -282 153 353 -293
2957b93M0Q27l39p56O64J58n50j60M08O41o47n43Q16M05r13p56N54J254o21p38
$$ -293 -253 574 235 -521 143 301 -249 -409 -1 640 -7 -550 266 671 -242 -998 -444 810 189 -549
2977e49N25P53m33j170J030N93p98p24R34P41r54n87K93J246p50j082N52R10r6
$$ -549 -24 729 296 -874 156 749 -49 -773 161 902 -52 -639 -346 900 150 -932 -380 530 434
2996D34o98k6M69M57o76k71J94O11m19l03K60M24o68k10L37L93k21n50K79P13
$$ 434 -264 -290 179 636 -40 -311 -117 494 75 -228 32 456 -212 -422 -85 308 87 -463 -184 529
3016E29j03j141k64J144N40p15q35J392L34o15j024Q46P51q79r61R96Q47q50r19
$$ 529 426 -715 -979 165 705 -10 -845 547 881 266 -758 88 839 -40 -1001 -5 842 -8 -927
3035i27R02J031p88j235L78J661m60j393M62J335k95j350K97J175l67j154N96
$$ -927 -25 1006 218 -1017 -639 1022 562 -831 -369 966 671 -679 -382 793 426 -728 -132
3052a32J218n81j418O08R23l80q65J45J046K56j107n65P89N87n47o69P93L80l84
$$ -132 1086 505 -913 -305 618 238 -627 -482 564 820 -287 -852 -63 524 -23 -692 101 481 97
3071I7n08L76L27n14l70N40O62m96m65J42M43k4p28j73Q55M47q38n7N71M74j051
$$ 97 -411 -35 292 -222 -592 -52 610 114 -351 -209 234 210 -518 -691 164 611 -227 -284 287 761 -290
3092b90j92O51L16p96j96J074J18j033l16R22K77q82o05J174Q97r64o02M14N62
$$ -290 -482 169 485 -311 -507 567 685 -348 -664 258 535 -347 -952 222 1119 155 -447 -33 529
3111E29r40m89P28J009j016o83J515J18j182m66J169M96j036n69R07Q19q98p62
$$ 529 -411 -900 -172 837 -179 -862 653 771 -411 -877 292 788 -248 -817 90 909 11 -751
3129g51R34K63p49k01R56L53r64p28J052Q37j096q18R88P64o59n94M50K15k02
$$ -751 183 446 -303 -504 452 805 -159 -887 165 1002 -94 -912 76 840 181 -413 37 252 50
3148E0j054R59N22j0j065O23N90l82o90j20Q54J36q20r0R24J57p15r15J027O88
$$ 50 -1004 -45 477 467 -598 25 615 233 -457 -577 277 413 -407 -497 427 584 -131 -1046 -19 669
3168F69p10m84L21J215o85j157J95J451l55j115O2J648k56j712j15K384p43j876
$$ 669 -41 -525 -204 1011 326 -831 -636 815 460 -655 -593 1055 799 -913 -1028 1356 613 -1263
3186a263K86J953R0k038P8K146j6k566N1K314K72k332J64J710M78k091p74K297
$$ -1263 -977 976 1066 -972 -894 1252 1236 -1330 -1279 1035 1307 -1025 -861 849 1327 -764 -1538 759
3204G59N54k061o72K369N19k255q40J933J139k229m58J728Q08j270j110J300N42
$$ 759 1313 -748 -1420 949 1468 -787 -1627 306 1445 -784 -1242 486 1294 24 -1086 214 756
3221G56m55j228R20Q78o61q55M93R08m25j084M61Q94k1j414k1J516L16j281p23
$$ 756 301 -927 -7 871 210 -645 -152 756 331 -753 -292 602 581 -833 -854 662 978 -303 -1026
3240a026R70J073r48j226R49J072n83j528J108J346q07j659J087J486q00j784
$$ -1026 -56 1017 69 -1157 -208 864 281 -1247 -139 1207 400 -1259 -172 1314 514 -1270
3256a270N18K013n78k028M60K014j38k280K89K133j01k526M95K174l49k245M90
$$ -1270 -752 1261 683 -1345 -885 1129 991 -1289 -1000 1133 1032 -1494 -999 1175 826 -1419 -929
3273i29K202o72k213M47K423p2k703M95K291m55j834K07J835k39j772J68J707
$$ -929 1273 601 -1612 -1165 1258 1186 -1517 -1022 1269 814 -1020 -813 1022 783 -989 -821 886
3290H86kj620Q4J076L91j299k74J467o7j021j35O24L67n97k28J35M95k02m71J77
$$ 886 884 -736 -652 424 815 -484 -758 709 642 -379 -514 110 477 -120 -348 -213 282 80 -391 -214
3310b14K29J62k98k56P46R4r12j80J004K57j023l11O21R32q61r65J078O87j049
$$ -214 15 177 -121 -377 369 463 -449 -629 375 632 -391 -702 -81 851 -10 -975 103 790 -259
3329b59p98J433Q06j342j135J370J335j604j412J710J556j725j419J371J688j291
$$ -259 -1057 376 1182 -160 -1295 75 1410 -194 -1606 104 1660 -65 -1484 -113 1575 284
3345B84j793J385J556j330j494J190J711j706j311J270J663j302j621J316J715
$$ 284 -1509 -124 1432 102 -1392 -202 1509 -197 -1508 -238 1425 123 -1498 -182 1533
3360A533j098j901R47J844j027j270O11J327n72j431K62J626m77j175L49J156
$$ 1533 435 -1466 -519 1325 298 -972 -361 966 394 -1037 -775 851 374 -801 -452 704
3376G04j61q99n09J265K56j158m53R28O72l70p23M39O81n50r14L98R70o2j508
$$ 704 543 -356 -865 400 656 -502 -955 -27 645 275 -448 -9 672 122 -792 -394 576 514 -994
3395i94M92J088n9j183j06J490k67j266r4J536K94j468m57J783J63j411p59J664
$$ -994 -502 586 527 -656 -762 728 461 -805 -899 637 931 -537 -994 789 952 -459 -1218 446
3413D46P61j749o89J762N82j597q14J907L69j433r46J438J033j176j132J273J447
$$ 446 1207 -542 -1231 531 1113 -484 -1298 609 978 -455 -1401 37 1070 -106 -1238 35 1482
3430A482j502j085J002J047n90j681P93J540r68q57M39J249q11q34N06R59m53
$$ 1482 -20 -1105 -103 944 354 -1327 -534 1006 38 -819 -380 869 58 -776 -270 689 236
3447B36r53J68J000o9j278N47Q04J30j010k50J021L07p21j95J93O03o53m22M67
$$ 236 -717 -549 451 382 -896 -349 455 585 -425 -675 346 653 -68 -263 -70 533 -120 -542 -75
3466g5N44l26r83P62O68n55p13M40R59m70r89N31Q52j48r99J03P89j51p70J3R02
$$ -75 469 143 -840 -78 590 35 -678 -238 721 251 -738 -207 645 497 -502 -399 390 239 -531 -518 384
3487C84l5j118J51J471k66r54j38J152M8j067k45J146L37j144k39J011M68j422
$$ 384 349 -769 -618 853 587 -367 -505 647 695 -372 -617 529 866 -278 -517 494 962 -460
3505d60L7J049o1j002k28Q67K46q96j57R15L22q69m44P67P43j017m98J087M5n31
$$ -460 -423 626 565 -437 -665 202 448 -448 -605 310 632 -237 -681 86 829 -188 -686 401 446 -85
3525h5n38M67R14q12n57O01O36m56q37M76O53J2j391O92P32jq43j80J310m63m36
$$ -85 -623 -156 758 -54 -611 -10 626 170 -667 -191 462 474 -917 -225 507 506 -337 -517 793 330 -106
3546a06k47N32J66l11o41N79Q88q47p79Q34M99q23m77P39P32n96o97K94N79j5
$$ -106 -353 179 345 34 -607 -28 860 13 -766 68 567 -256 -733 6 738 142 -555 -261 318 303
3566C03o92R4O92l24p19K45Q37O6j093P3R00K99j174p5J017Q9q89j73J106p9r22
$$ 303 -389 -295 397 73 -646 -401 436 502 -591 -518 382 681 -493 -568 449 538 -351 -524 582 503 -419
3587d19J1P46M1m41n30R06Lo29j9L45M52l16l24K14L64l12n92M05M03n0m44L44
$$ -419 -408 338 379 -62 -592 314 317 -312 -331 14 466 150 -174 40 404 92 -500 -95 308 258 -186 158
3609A58R3k95j10P3J59K10k43j86K18J69n95O8L49J32j60k84N03L6K9m68j33N01
$$ 158 251 -44 -154 -81 78 288 45 -141 77 246 -349 -281 68 200 40 -244 259 295 324 -144 -277 224
3631B24r8l71J95K43K98j038O15o0K1j18j16L37K4l75M7P22n94k88Q8M93j03l27
$$ 224 126 -245 -50 193 491 -547 68 8 29 -89 -205 132 156 -219 -172 550 -44 -332 -244 249 146 -181
3653a81J24J44j01k28J72M04m96K19L25J3o04k91N05J59l40j93L15M0l5m6r7L15
$$ -181 -57 87 -14 -242 -70 334 -162 57 382 395 -209 -500 5 164 -176 -369 -54 -14 -49 -95 -192 123
3675A23j25J5m4L10n83O8N08j61l10J59Oj72K13J42j54r8K66k96K26qj24O5j9
$$ 123 -2 13 -31 279 -304 -236 272 111 -199 -40 -34 -206 7 149 -5 -103 163 -133 93 85 -39 26 7
3698G%N0J00l09K48j4q6l2L1%J75l4k23L9M01k32n75N14K77k31n22N19K42n28
$$ 7 7 57 157 -152 96 82 -4 -36 -5 -5 170 136 -87 -48 353 121 -454 60 337 106 -416 103 345 -183
3722a83l2M60Q8m01k72J99L89m60J63k04M81n58J19M09n8j92k15M36J19m96q2
$$ -183 -215 245 333 -68 -340 -141 248 -212 -49 -253 228 -330 -211 198 140 -52 -267 169 288 -208 -290
3743b90L76O2m17J23L89l06k82K05K25j3k9k68N38l21j51l2K92M6k18j69L44j75
$$ -290 86 148 -269 -146 243 -63 -345 -140 85 72 43 -225 313 -8 -159 -191 101 147 -71 -240 104 -71
3765g1j33KR0K25l06J35K85k91P2k13J08k58L46K03m36J75m3J96j23j83L18L33
$$ -71 -204 -202 -112 113 -193 -58 227 -64 8 -205 -97 -355 -9 194 -242 -67 -110 86 -37 -220 98 431
3787D31m50k76K57L77m86J18j19K51j77n0o0N79l72j94M6K30l24J99K69p4o3j19
$$ 431 -19 -295 -38 339 -147 -29 -148 103 -74 -124 -184 395 23 -171 -125 105 -219 -20 249 175 112 -7
3809gM13m82M1QJ03p8k41K28J99o5k05r8L28j75k98J63M4m74M68J05K03k23j20
$$ -7 406 -76 -35 -27 76 -2 -243 -15 184 119 -86 -184 144 -31 -329 -166 -122 -596 -128 -23 180 -43 -163
3832a63K18Lm38L42J86o6k37K80J23r2l09k7L99j48j74j95N99M2n11qN14k37m16
$$ -163 55 58 -380 -38 148 82 -155 125 248 156 -153 -180 219 71 -103 -298 301 343 -168 -176 338 101 -315
3855c15KL35R0m11K52L43j62l04L33Q9k44j07j3K92l56p7J64L99k4o66M60M9p2
$$ -315 -313 22 112 -299 -47 296 134 -170 163 252 8 -99 -112 180 -176 -253 -89 310 286 -380 80 129 57
3878E7J3K67k52j88K83l87J03O1j20K24K40m44J11N08l70m15M63Oj19j16J13J90
$$ 57 70 337 85 -103 180 -207 -104 -43 -163 61 301 -143 -32 476 106 -309 154 160 41 -75 38 228
3900B28L4p11P11j94k61J72j2J95l42m5L23j8j60J06J44j08l79K62L11k82j7r3
$$ 228 262 -449 262 68 -193 -21 -33 162 -180 -225 98 80 -80 26 170 62 -317 -55 256 -26 -43 -136
3922a36L35L0l99K00j14N7J39j79J27J74l03l32L31M32n86j00L76l12K04L09L0
$$ -136 199 229 -170 30 -84 -27 112 -67 60 234 -69 -401 -70 362 -224 -324 52 -260 -56 253 283
3943B83q0j59qn6k22N6N48j81m21L59k19K63j79p4K27J30j82j01K46j11l86J25
$$ 283 203 44 36 -20 -242 -186 362 181 -240 119 -100 163 -16 -90 137 267 85 -16 230 119 -267 -142
3965a42L62l49R6J79j3k96k30L62J20k47m9J91q0J08j24M6J89k83J65l9L15o06
$$ -142 220 -129 -33 146 133 -163 -393 -31 89 -158 -207 -16 -96 12 -112 -66 123 -160 5 -34 281 -325
3987c25L7L43J31m16M1L04j51L5q8M45k32j95L0p4J39R9j90O4K74n26K47O9k8
$$ -325 -288 55 186 -230 -189 115 -36 -1 -89 356 124 -71 -41 -115 24 123 -67 -3 271 -255 -8 61 33
4010C3k28L18J62l74l35L97k7j02o1L91k8j88j7q7L67j20l39K26J3L20k38J42
$$ 33 -195 123 285 -89 -424 -27 -54 -156 -217 174 146 -42 -59 -146 221 101 -238 -12 1 321 83 225
4032B25k71p8K79j27k1J02M4j52r3j00J26J44p7l26L25J19n1J43k77L08j20m51
$$ 225 -46 -124 155 28 7 109 153 1 -92 -192 -66 78 1 -325 0 119 68 211 -66 242 122 -329
4054c29L64J10k60J14j5K44m85J86o9L00p7l9K4k23j9J88j49K36p9k48O2L17M9
$$ -329 35 145 -115 -1 -16 228 -257 -71 -140 160 83 44 68 -155 -174 14 -135 101 22 -226 -164 153 202
4077B02m72L19J76k31j04J53m17J64J10o3K56R2M6j9l49J20L2O5M2o1j17J23l59
$$ 202 -270 49 225 -6 -110 43 -374 -210 -100 -163 93 185 231 212 -137 -17 15 80 122 61 -56 67 -292
4100b92J57K38j67P3O1J89j94j92J29l45K60n2K77l19J67lM0k51K95j29o8o0J24
$$ -292 -135 103 -64 9 70 259 65 -127 2 -343 -83 -135 142 -177 -10 -13 27 -224 71 -58 -126 -186 -62
4123f2M0ML84m90K48o1j72K34k25o0M2M2K96k12p5q2MJ46n9J41J21r0M9k44J20
$$ -62 -22 -18 366 -124 124 63 -109 125 -100 -160 -118 -76 220 8 -67 -149 -145 1 -58 83 204 114 163 -81 39
4148C9O6m6K6J6K5r3QM2K72k86r5J5k60J29J96j9k69J94K0K95m49M74j78j21q4
$$ 39 105 59 85 101 126 33 41 83 355 69 -26 -11 -271 -142 54 35 -234 -40 -20 275 -174 300 122 1 -83
4173h3l5J90J53k39m73M41J81M9l42K48j62K27l41L13j8j72NJ93L87q15K99k3
$$ -83 -118 72 225 -14 -487 -46 135 184 -158 90 -72 155 -186 127 109 -63 -58 135 522 -293 6 -17
4195a7N5K80k59J25J8l31L01l50Q6L2OL16m04rK69j9J09l64J0J07J73l11J18m8
$$ -17 38 318 59 184 202 -129 172 -178 -92 -60 -54 262 -142 -151 118 99 208 -156 -146 -39 134 -177 -59 -107
4219a07J90r8J54j43Q0r3m4L53l39Q1j8M5o7PJ58j6L2lr3n2j31jJ99j89P6k40
$$ -107 83 -15 139 -4 76 -17 -61 292 -47 34 16 61 -6 1 159 143 175 172 79 27 -104 -105 94 -95 -19 -259
4245b59M16l64r8M08j37K5R3k02K26k90R3J28k06L08O5k35P3Jk53L86j79o5k16
$$ -259 157 -207 -305 103 -34 -9 84 -118 108 -182 -89 39 -167 141 206 -29 44 45 -208 178 -1 -66 -282
4268b82K62K80l09O2K01o5o9J84j22k64N6l8K14l64R2L23J5K5q1j23J15J88m52
$$ -282 -20 260 -49 13 214 149 80 264 142 -122 -66 -104 110 -254 -162 161 176 201 120 -3 112 300 -152
4291a52P4Q8j03J18k97L65L1k45Q0k0J00j45K96j39k20%J60j31M8N5l3J28J08
$$ -152 -78 10 -93 25 -272 93 124 -121 -41 -61 39 -106 190 51 -169 -169 -9 -140 -92 -37 -70 58 166
4314A66l09J99j6m7J91k42m1pQ6Np2K32k47J27n42M58P3k5N5j73K3J49k31J34
$$ 166 -143 56 40 -7 184 -58 -99 -106 -20 -15 -87 145 -102 25 -517 -59 14 -11 44 -129 -106 43 -188 -54
4338e4j9j02P5q7L43L9l00j39J17K38PJ12l77J61m6K5n5p0k9K53J83l23QNn5J75
$$ -54 -73 -175 -100 -187 156 195 -105 -244 -127 111 118 230 -147 14 -32 -7 -62 -132 -161 92 275 -48 -40 -35 -90 85
4364H5r3l54O07k57R9K96n23q8J69J54o9J56j13p9n1Nj6n6J06J52m2j18O8k48
$$ 85 -8 -362 245 -12 87 383 -140 -228 -59 95 26 182 69 -10 -61 -56 -72 -128 -22 130 88 -30 38 -210
4388b10L8J56L5p8K2J03k5j14J71J91j96k17R3J07p2j65N12j22k63M8P7m24K74
$$ -210 -172 -16 19 -59 -37 66 41 -73 98 289 93 -124 -31 76 4 -161 351 229 -34 14 91 -333 -59
4411e9K6J36l13m0L10q6M4n4K4k87J58K88j52J08O1k50j6K15p9rJ45j71K7o6n5
$$ -59 -33 103 -210 -250 60 -26 18 -36 -12 -299 -141 147 -5 103 164 -86 -102 113 34 25 170 -1 26 -40 -95
4436i5J29lO6L8p8O0J00M2j78j7l0J61j23n3j55M30j36j64J31M3j59K3j63K62
$$ -95 34 31 97 135 57 117 217 259 81 64 34 195 72 19 -136 294 158 -6 125 168 9 32 -131 131
4460A31L0O7jk71J65l0m28L63M5k2K01n88L19k01L64j5j48K87m22k19M42R3k73
$$ 131 161 228 227 -44 121 91 -337 26 71 49 250 -338 -19 -220 144 129 -19 268 -154 -373 69 162 -111
4483a11O2J92j05K06k18j9j1J42j20o5Q9l6N5j57M9Q7j68L49l99N2R2J17J23k69
$$ -111 -49 143 38 244 26 7 -4 138 18 -47 42 6 61 -96 -47 40 -128 221 -178 -126 -34 83 206 -63
4507f3j47K15J07j22k8o6J0k07M56j45J70R1J95l60k91K75J06k80K10j38P8n2
$$ -63 -210 5 112 -10 -38 -104 -94 -301 155 10 180 271 466 106 -185 90 196 -84 126 -12 66 14
4529A4Ol33K80O6J16j61j26o1R3J02J24k16J21J05j42K00m25L44k10J79k00QJ90
$$ 14 20 -313 -33 33 149 -12 -138 -199 -106 -4 120 -96 25 130 -12 188 -237 107 -103 76 -124 -116 74
4552G4Q0k55K4J98r8N9l46N17q4j96J22k34RL25m26K37j51J84Q5N0k19Q9j71J83
$$ 74 154 -101 -77 121 23 82 -264 253 169 -27 95 -139 -130 195 -231 6 -145 39 124 174 -45 44 -127 56
4576E6L9qj44J7Q7lJ8Rj89J32m7J81l35L2L39l3k96J05J86o8o8M1J70j34j0k61
$$ 56 95 87 -57 -40 47 44 62 71 -118 14 -33 148 -187 -155 184 151 -145 -40 146 78 10 51 221 87 77 -184
4602a84J67j49K03k31j4K86k50J91k11K5O26m38m47L87l4K82k00j47n6k17M19
$$ -184 -17 -166 37 -194 -208 78 -172 19 -192 -167 459 21 -426 -39 -73 209 9 -138 -194 -411 8
4623HK31l14J06j37j68L45p2q0k1M37k78j2j79J61J46k20L0k50M70l65J68J87
$$ 8 239 -75 31 -106 -274 71 -1 -81 -102 335 57 45 -134 27 173 -47 -17 -267 203 -162 6 193
4645A93j87j96J44j82J85J78j42rk3n5J70k0J02m96N07k86Q3K4J52M3j34l6K70
$$ 193 6 -190 -46 -228 -43 135 -7 -16 -39 -94 76 56 158 -338 169 -117 -34 -10 142 185 51 15 285
4668B85l35J20k67n3K05r0J81j13nj5n2J3M6K27q4J0J01k97J49Q2j2L1j58K18
$$ 285 -50 70 -197 -250 -45 -135 46 -67 -72 -87 -139 -126 -80 147 63 73 174 -123 26 108 96 127 -31 187
4692A87J5l69L4N6N6J91k6j27J37j23J41k50J78k20Q2J08k87L35j39j13R5M4k30
$$ 187 202 -167 -133 -77 -21 170 144 17 154 31 172 -78 100 -120 -38 70 -217 118 -21 -134 -39 5 -225
4715b25K85k15K24r4J00r7l44P17j76K0q7k54J93n2m5J45r7J56j50M8J65J1k63
$$ -225 60 -155 69 -25 75 -22 -366 351 175 195 108 -146 47 -5 -50 95 -2 154 4 52 217 228 -35
4738c5J33J40k09j2p4Q9J9j52J06p0J89j88N4j5L02l41J97J16j95L5j48p1J66
$$ -35 98 238 29 17 -57 32 51 -101 5 -65 124 -64 -10 -25 277 -64 133 249 54 89 -59 -130 36
4761C6k2Q4l16J96J56j92K7j20J0L19j05j54m4L69k58l0j3j84N3K44Nj34j7J60
$$ 36 14 98 -218 -22 134 -58 -31 -151 -141 178 73 -81 -125 244 -14 -44 -57 -241 -188 56 61 -73 -90 70
4785G0JJ06j85J35l25J21J15o1rK21j74J69l09J85k93M08nkl32%L72n6k5k91J20
$$ 70 71 177 -8 127 -198 -77 38 -23 -32 189 15 184 -125 60 -233 175 170 168 -164 -164 208 152 127 -164 -44
4810d4Kj12j25L13j02l3K15P5n2O9k26K2K92j94j91m1M36k21J82m63M13j52l8
$$ -44 -42 -154 -279 34 -68 -101 114 189 137 206 -20 2 294 100 -91 -132 304 83 265 -198 215 63 25
4833B5KK07j80m9J3K20o2j32K1k06K84j38jk58K96k6j14j65M39K6l26P2k01M52
$$ 25 27 234 54 5 18 238 176 44 65 -141 143 5 4 -254 42 16 -98 -263 176 202 -124 -52 -253 199
4857A99l08j26J61K19j45L03r6J25k47n2J45J71n90J81L39m31J32k5N8j10J43
$$ 199 -109 -235 -74 145 0 303 207 332 85 33 178 349 -241 -60 279 -152 -20 -45 13 -97 46
4878D6J16M7k20q9J38k67L05m8L3J54q1k4l08K34J13j14mk05K34J6J29p8j47R8
$$ 46 162 209 -11 -100 38 -229 76 28 61 215 134 110 -198 36 149 35 31 -174 60 76 205 127 -20 78
4902G8j11lj6l5M2K95k2k6j98k51M32lk62J08j18L12k15k8J36l60J91l84M32O5
$$ 78 -33 -36 -52 -87 -45 250 228 202 4 -247 185 182 -80 28 -90 222 7 -21 115 -245 -54 -438 -6 59
4926E9J98l00o3K47n5q2j45L88k16k62J64J4J65k65J30j81O78m47k0J55k54k9
$$ 59 257 -43 -106 141 86 4 -141 247 31 -231 -67 -53 112 -153 -23 -204 474 27 7 162 -92 -121
4948a21j8K79j36r2lJ29J39N0k91N8K13m73J9J76K14l66l5N60n72K49j52J69l8
$$ -121 -139 140 4 -88 -91 38 177 227 -64 -6 207 -266 -247 -71 143 -223 -258 302 -270 -21 -173 -4 -42
4971d2J33l21J78lJ09l29M6K16k13J50J1K00p5K5l25K59p5j36R3PK70j53j3K0
$$ -42 91 -230 -52 -55 54 -275 -229 -13 -226 -76 -65 135 60 85 -240 19 -56 -192 -99 -92 178 25 12 32
4995C2j16p9n5M66L1l15k2O2M4j40K8j1L08k68j84K73k04J87m82O09j15N41p62
$$ 32 -84 -163 -218 248 279 -36 -58 4 48 -92 -64 -75 233 -35 -219 54 -150 37 -445 164 49 590 -172
5018a72M56p1j23K1l24J73K23k41j36M95ml67k10L34L21m26L8n9q2M14l68o3n
$$ -172 284 213 90 111 -213 -40 183 -58 -194 301 297 -70 -280 54 375 -51 -13 -72 -154 260 -108 -171 -176
5041a76N3M5K22j93R3k02O1kJ20j07kJ84k77K27l42O6L11m4k63J64k29M6J82J94
$$ -176 -123 -78 144 -49 44 -158 -97 -99 21 -86 -88 96 -181 46 -296 -230 81 37 -226 -62 -291 -245 -63 131
5065A31J44k21R0j21k9J29O2l46K46p4R9L5n0J40m20K97oj98j44K86k7l0j71K98
$$ 131 275 54 144 23 -6 123 185 -161 85 11 110 145 95 235 -185 112 106 -92 -236 50 23 -7 -178 120
5089A20K43k32j60j83M04l26j53L53q2m6q7L45j53j81J69M7k90N11o64M12K9j76
$$ 120 363 131 -29 -212 192 -134 -287 66 -16 -62 -149 196 43 -138 31 78 -212 299 -365 47 76 -100
5111a00K09j54o7J75k97j68O55m3J21j67L1r6M1k56J13M2r5J9J01J41r1m44L39
$$ -100 109 -45 -112 63 -234 -402 253 210 331 164 195 99 140 -116 -3 39 -56 -37 64 205 114 -330 9
5134Iq7K44j75O2j91K71p7J33K41m58j60J8M29L6j95j33J07j23M02j74j76O4J6
$$ 9 -78 166 -9 53 -138 133 56 189 430 -28 -188 -170 259 295 100 -33 74 -49 353 179 3 67 83
5157H3J25J68k31j68l09L66J47k43N5j64o6J92j5L3K20r6k35R2L02l69L59j29
$$ 83 208 376 145 -23 -332 34 181 -62 -7 -171 -237 -45 -60 -27 193 97 -138 -46 256 -113 246 117
5179A17k12J12p0K95k43J60j58K60l68J12m6k88M54l90L69l3K37j74l23q7J98
$$ 117 -95 17 -53 242 -1 159 1 261 -107 5 -41 -329 125 -265 104 71 308 134 -189 -276 -78
5200g8K30k74R4M3K03k67N2L6J52k07p2J78m17L10J54k36K3R7K8r7j12M13l56
$$ -78 152 -122 -28 15 218 -49 3 39 191 -16 -88 90 -327 -17 137 -99 -76 21 49 -48 -160 253 -103
5223a03M23m17J34m7l4K92k65J40n89O89k59j14K36N6J37n00K66p5J7k74K43L46
$$ -103 320 -97 37 -10 -44 248 -17 123 -466 223 -36 -150 86 142 279 -221 45 -30 -13 -287 -44 302
5245C02J00o30J70q1K59k34k57M12O0Q6l29M01J02l54J1j37L5K27R0J35m27n9
$$ 302 402 -228 -58 -139 120 -114 -371 41 101 187 -142 259 361 7 18 -119 -84 143 233 368 -59 -118
5267a18j31J24J40N3k13K1L46k62m5J91r8j22J4Q2K0R0l91J33O8J83l54N2k37
$$ -118 -249 -125 15 68 -145 -124 222 -40 -85 106 8 -114 -100 -18 2 92 -299 -166 -98 85 -269 -217 -454
5290d54K63J77j3j0K76k30j07L90l40l0J0R3L16k45j4k48J40L1l6j42P1K74k84
$$ -454 -191 -14 -27 -37 239 9 -98 292 -48 -78 -68 25 341 96 82 -166 -26 5 -31 -173 -102 172 -112
5313a12j7K22J10l89L89k86J65k15J16O1k09l5J49J99k27R7k39M54k62l4q8L95
$$ -112 -129 93 203 -186 203 -83 82 -133 -17 44 -165 -200 -51 148 -79 18 -221 233 -29 -63 -151 244
5335B44k48p2JJ50j32m6J88k67K66k31J91K07m59J39j19K25j41L52l24k13J94
$$ 244 -4 -76 -75 75 -57 -103 85 -182 84 -147 44 251 -208 -69 -188 37 -104 248 -76 -289 -95
5356i5K7n0K78K7j93O9J13j91ko5Q9l7K1n0P6k83K95N3k83mp4L73m30O31l25R2
$$ -95 -68 -118 160 187 -6 63 176 -15 -17 -82 7 -30 -9 -59 17 -266 29 82 -201 -205 -279 94 -336 295 -30 62
5382F2k03j32L73oj82OK08j64j3K24j57j20r1L07k9q6J37L0k98K23m74K02N38
$$ 62 -141 -273 100 94 -88 -82 126 -38 -51 173 16 -104 -195 112 83 -3 134 164 -134 89 -385 -183 355
5405C55k46l30o7L28l16M26q1r8J38J3L1q7n4kk48J78J34L0k84K42k27Mj4J87
$$ 355 109 -221 -288 40 -276 150 69 -29 109 122 153 66 12 10 -238 -60 74 104 -180 62 -165 -161 -175 12
5429A2j76K67j3m10Q4J51J5n0K75M5Jl04k32N17Q9k95J98j92J09k91K55K5k76
$$ 12 -164 103 90 -320 -236 -85 -70 -120 155 200 201 -103 -335 182 271 -24 174 -18 91 -200 55 80 -196
5452a96rM08k72J39j47M7m0m8O6J2Rj36K90k30J55L1J6o4j92K70r0j12K13j89
$$ -196 -205 203 -69 70 -77 -30 -70 -118 -52 -40 -31 -167 123 -107 48 79 95 31 -161 109 19 -93 120 -69
5476f9R6%J11k63O4J36k23K12j36k11K18j26J18K60j12j99%j68K62K09j68j4r3
$$ -69 27 27 138 -125 -61 75 -148 64 -72 -283 -65 -191 -73 187 75 -124 -124 -292 -30 179 11 -3 -96
5499i6K13lk75K19l79J69j6K28N2k29N7J37J2k43j9K23l11Q1J91M6N5Nj16P2k49
$$ -96 117 114 -161 58 -321 -152 -168 60 112 -117 -60 77 89 -154 -173 50 -261 -180 11 57 112 117 1 73 -176
5524a76K56J6k00J35rm41K25q5K35P6j20R7m5k0M03l46K6l10L36j33K16m9k39
$$ -176 80 96 -104 31 22 -419 -194 -279 -44 32 -88 9 -36 -56 347 1 27 -283 53 -80 136 87 -152
5547a52M44l21J97l49K19J91k18j23K46O1m3j51K3l20J79l6K76J4Q9l52J9K84
$$ -152 292 -29 168 -181 38 229 11 -112 134 195 152 1 24 -296 -117 -153 123 137 226 -126 -107 177
5569A77k04O4K47j57p7k9M0m7j40J35J66Qj09j7j0o2k96J55M39o11N28j61l29
$$ 177 -27 37 284 127 50 21 61 14 -126 9 175 183 74 57 47 -15 -311 -156 283 -328 200 39 -290
5592b90K97o4Q1J08j54M8O9k05j42M47j22j01k6J8K00l38K59j76NJ86j17K37n17
$$ -290 7 -57 24 132 -22 26 95 -110 -252 195 73 -28 -54 -36 164 -174 85 -91 -86 100 -17 220 -297
5615b97J84M5K02j6o6m5oK30n1m24K54k41OK61K53m84R2j0j26L53k57o7M7Q7j83
$$ -297 -113 -68 134 118 52 7 1 231 180 -244 10 -231 -225 36 289 -195 -103 -113 -239 114 -143 -210 -163 -76 -259
5640b59L99n45R45o55J48j51L08m19J90J52k31J8K79k9k19J85k38j44Q3J4M4L49
$$ -259 140 -405 540 -115 33 -118 190 -229 -39 113 -118 -100 179 150 -69 116 -122 -266 -183 -169 -125 224
5662B24k05r5J0J05n0k0L2j28L10J63m20J42j6m5m4l7j28pK11J03k7J0N9j97k11
$$ 224 19 -76 -66 39 -11 -31 1 -127 183 346 -74 68 52 7 -37 -74 -202 -209 2 105 78 88 147 -50 -261
5687b61L21N0J76o05N13p6l36O7J25J81m13J22O4M20l72j65L62j6J15k56k8p7
$$ -261 60 110 286 -319 194 118 -218 -151 -26 155 -258 -136 -72 348 -24 -189 173 157 272 16 -12 -89
5709h9J96j92K22l8j81J38q3r7m6N5K04J13k68j23K32r5J21J19l06l5K82j07j82
$$ -89 107 -85 137 99 -82 56 -27 -124 -170 -115 89 202 -66 -189 43 -52 69 188 -118 -153 129 22 -160
5732a60N6J98o9j01J12l63L03J52j70J79O3r5k08K75j18mJ9j52L97k98J3j47J7
$$ -160 -104 94 25 -76 36 -327 -24 128 -42 137 200 105 -103 172 54 50 69 -83 314 16 29 -118 -101
5755a01L6j4N5K40j32O4k61M67n53K15j45O8L3j40N2p9Q8N0j65J8M09k07qk33
$$ -101 -65 -79 -24 216 84 148 -113 354 -199 16 -129 -61 -28 -168 -116 -195 -107 -57 -222 -204 205 -2 -10 -243
5779b43L33j78Q6l3l2K2J77O1q8Ok26L92l68O3pK1L32j94L5N6k67P2Ok97L45j67
$$ -243 90 -88 -2 -35 -67 -45 132 193 105 111 -115 277 -91 -28 -35 -14 318 124 159 215 -52 20 26 -271 74 -93
5805i3j37J22J25K28k81K05j89l3L65m53K91m20K19q9J10J53j27q9K07k54P2J95
$$ -93 -230 -108 17 245 -36 169 -20 -53 312 -141 150 -270 -51 -140 -30 123 -4 -93 114 -140 -68 127
5827A27k15J46j6J32l92K01J26J41J21l93R0l47L01q1OJ27L7J37j41l02Q2M4K92
$$ 127 -88 58 42 174 -218 -17 109 250 371 -22 68 -279 22 -59 -53 74 111 248 107 -195 -113 -69 223
5850B23j22q8j88N7J79j16k05M09M4q4m6L39n33L10j14j87M6J33j91J72J02J31
$$ 223 101 13 -175 -118 61 -55 -260 149 193 109 63 402 -131 179 65 -122 -76 57 -134 38 140 271
5872B71m29O8L52l90j13M15k16k63K05m5O8J15j84K09L6l5j77N0j58J66l1J48
$$ 271 -158 -90 262 -128 -241 174 -42 -305 -100 -145 -77 38 -146 63 99 64 -113 -63 -221 -55 -86 62
5894F2j96l8J16o4K52l09Q0K70k06J07j53J4p3K69J93m37K87J38m38j34M51j75
$$ 62 -134 -172 -56 -120 132 -177 -97 173 -33 74 -79 -65 -138 131 324 -113 174 312 -126 -260 191 16
5916A6j37m2K68q1J8n3L6L5J18r3o3k5K06j26r0k1K44j80P3j03k55K54l31K39
$$ 16 -121 -163 105 24 42 -11 25 60 178 85 22 -3 203 77 -13 -34 210 30 103 0 -255 -1 -332 -93
5940i3J01p9P3O8l9K57Pm90M13j96j06J72J24j85l1K86k6l98J18Q7j04m3pJ31
$$ -93 8 -71 2 70 31 288 295 -195 218 22 -84 88 212 27 -4 282 256 -142 -24 63 -41 -84 -91 40
5964D0J41n0p0k32j11M24K4Qk89K00j99J22q1J66j53q3R2j5p0L4J59J62m66L23
$$ 40 181 131 61 -171 -282 142 166 174 -115 85 -114 8 -73 93 -60 -143 -51 -66 -136 -102 57 219 -247 76
5988G6r9p6Qj05J43K50r1J19k08n1j47N0J09l6K41qn46L08K85k40m1j17p6K08
$$ 76 -23 -99 -91 -196 -53 197 106 225 17 -34 -181 -131 -22 -58 183 175 -371 -63 222 -18 -59 -176 -252 -44
6012d4L90l62k5J83k01Q6o9n0K00k14k1J48R8k78Q3J92j96j39K19n5J20n4j50
$$ -44 346 -16 -41 142 -59 27 -42 -92 108 -106 -127 21 119 -159 -76 116 -80 -219 0 -55 65 11 -139
6035a39Q4J75p1K23j74L4j12k6O8j60J13qO0r8o2O1n2J38j67M4j0J22l4n5j27
$$ -139 -55 120 49 272 98 132 20 -6 62 -98 15 7 67 -31 -93 -32 -84 54 -113 -69 -79 43 9 -46 -173
6060a73K19Q9k18N8J22R2j45j57P5j60k12N62l13J36O0r9K77l0l57L07R2p5k51
$$ -173 46 135 -83 -25 97 189 44 -113 -38 -198 -410 152 -161 -25 35 -64 213 183 -174 133 225 150 -101
6083a01J86k94J40p8K92M3k97K78l46K32qO7j1k6l7p7L27l09j64r1N36k1r1l5
$$ -101 85 -209 -69 -147 145 188 -109 169 -177 55 47 114 103 77 40 -37 290 -19 -183 -274 262 241 150 115
6107A15l2l8k0Q5J4p4J07j37j42qk4N37l94j72J7J07M1P0N8Pq8J79l54L1J05O1
$$ 115 83 45 25 110 124 50 157 20 -122 -130 -154 383 -11 -183 -166 -59 -18 52 110 117 29 208 -146 -115 -10 51
6133E1R4m13P1p0K46Pl10K38Q8o0J74P9k18K9l8J15l35L49m3o3k03K15n3j14N0
$$ 51 145 -268 -197 -267 -21 -14 -324 -86 2 -58 116 195 -23 6 -32 83 -252 97 54 -9 -212 3 -50 -164 -114
6158a14L0m1L1O3J78k32k09K12K3J56k05P8O4l4rRj95J46J5J64k09Q8KK01k45
$$ -114 -84 -125 -94 -31 147 -85 -294 -82 -59 97 -108 -30 34 0 -9 0 -195 -49 -34 130 -79 9 11 212 -33
6183c3j33P6J46k12L27j36J80n37K56K18l37K10q2J01q7R5k60j57N03j29J97k68
$$ -33 -166 -90 56 -156 171 35 215 -322 -66 152 -185 25 -57 44 -43 52 -208 -365 138 9 206 -62
6205f2J20r4L16m74K55j17L84m22J66o5K5l16L05Lj19M00k83J26l86M37n14K56
$$ -62 58 -36 280 -194 61 -56 328 -94 72 7 32 -284 21 24 -95 305 22 148 -238 199 -315 -59
6227e9J03o0J2Q4K66n44L09j66k2O3L9J36r8j19K27J13k5j40l2n1p4J14J6l2o0
$$ -59 44 -16 -4 80 346 -198 111 -55 -77 -14 25 161 63 -56 171 284 259 119 87 36 -38 76 92 60 0
6252@K44l43l12N53k45M30m62J1J53r9J93l75lK47N9jj32K5K88m2k46k5j79J82
$$ 0 244 -99 -411 142 -103 327 -135 -124 29 -70 123 -252 -255 -8 51 50 -82 -57 231 189 -57 -82 -261 -79
6276g9J23K14nL9k60k25J03J49j14L9J3K2k07J96L6k15J63K21j26j09j67l5J49
$$ -79 44 258 253 292 32 -193 -90 59 -55 -16 -3 19 -188 8 44 -171 -8 213 87 -22 -189 -224 -75
6299g5K85l00J46j03l1j24K92k26N2K35k45J09p5P0J95p3j7k91R7J30N8j84m6
$$ -75 210 -90 56 -47 -78 -202 90 -136 -84 151 -94 15 -60 10 205 132 115 -176 -79 51 109 -75 -121
6322a21L5l8J6P8N5m8r4K77Kq0j64L75k15j24J40o8Qr1L11l4j80%l55K89j90K5
$$ -121 -86 -124 -108 -30 25 -23 -117 160 162 82 -82 293 78 -46 94 26 34 -57 254 220 40 40 -315 -26 -216 -191
6348a91P1K0O3m4J90k33j32J51K68n2l22K57j09l8K80k3j16j43K23l03j08M41
$$ -191 -120 -100 -37 -81 109 -124 -256 -105 163 111 -211 46 -63 -101 179 156 40 -103 120 -183 -291 150
6370A50k96K10P7k38R2q1P0m8K84m96L30r5K86k44k9P2k25K13L9l5l7o7J28l8
$$ 150 -146 64 141 -97 -5 -86 -16 -64 220 -276 54 -41 245 1 -28 44 -181 32 71 36 -1 -68 60 22
6394B2n4J51o3k49K30K13k57k96L83Q7l03R4l3K38k24J10O1J60m50L01N1l63K26
$$ 22 -32 119 56 -193 37 250 -7 -303 80 167 -136 -42 -75 163 -61 49 110 270 -180 121 172 -191 35
6417C5O8Nkk10J32k00J9K99l80r2O58l18Q4j78J83q7q5J06j3j07j02J34J45L17
$$ 35 103 108 106 -104 28 -172 -153 146 -234 -326 332 14 98 -80 103 16 -69 37 24 -83 -185 -51 94 411
6441D11J07n72r8J61M07k62j45PL02l40k4P8Lm1k07K99Q8M4l81J38M2L1O9m03
$$ 411 518 -54 -152 9 416 154 9 16 318 -22 -46 32 35 -6 -213 86 174 218 -163 -25 17 48 117 -286
6465b86M45j73k04L05p9K09m10K19j95j19K81K07J80k16k30K13L2j50l2k59K09
$$ -286 159 -14 -218 87 8 217 -193 26 -169 -288 -7 200 380 164 -66 147 179 29 -3 -262 -53
6486e3q3K08J83k01N5j10K50k02p6q6Q7j57O2n0K23k1J08k27n1J58o9o7J67O0
$$ -53 -136 72 255 54 109 -1 249 47 -29 -115 -28 -185 -123 -173 50 29 137 -90 -141 17 -52 -119 48 108
6510A08j47MP1j46L1K00p6n7N5m9k91M27n9k25K66L5j7r5N8J66J16m97J07n7J28
$$ 108 -39 -35 36 -110 -79 121 45 -12 43 -6 -297 130 71 -154 112 147 130 35 93 259 375 -122 -15 -72 56
6535E6r6K35l04K64n8j14J39j81J51n9N4l4N01m25m85L24j59K01n3M1K36n36J50
$$ 56 -40 195 -109 155 97 -17 122 -59 92 33 87 53 554 129 -356 -32 -191 10 -43 -2 234 -302 -152
6558a52L5J25Q4J02l11P5j10J42R3k64R6k30M58m0Rp8r2M2jk01K52K1L9j14J23
$$ -152 -117 8 92 194 -117 -42 -152 -10 83 -181 -85 -315 143 103 112 34 -58 -16 -17 -218 34 55 94 -20 103
6583A03M1k32j5L36l70p0K35q1J16J39m78J77j24K14J21j50N1l44J86J03k11L31
$$ 103 144 -88 -103 233 -137 -207 28 -53 63 202 -276 -99 -223 -9 112 -38 13 -331 -145 -42 -253 78
6605G8k33L2M7M05k95l2J04J41l17j63L66j26j42J83J14K68l83n8O7j30K11j04
$$ 78 -155 -123 -76 329 34 2 106 247 -70 -233 133 7 -135 48 162 430 47 -11 56 -74 137 33
6627C3k61L57l00J20MJ49K09k35k21K00J21l62L07p7mj05K08k49J97J6l81J60
$$ 33 -228 129 -171 -51 -47 102 311 76 -145 55 176 -186 121 44 40 -65 143 -106 91 107 -274 -114
6649a14K44n33N95k10R9k20J86q6J24j37ko9K82j06k07j83K11J57o4j39J53k31
$$ -114 130 -403 192 -18 81 -139 47 -39 85 -52 -54 -123 159 53 -154 -337 -126 31 -33 -172 -19 -250
6671b50M9K38k2L71m54J70J01r0O3k03J65k34J0J5J62j64l3K84q3J69m54J61P2
$$ -250 -201 37 15 386 -68 102 203 113 176 -27 138 -96 -86 -71 91 -73 -106 178 95 264 -190 -29 43
6694D3J51n07M76j63J32j23M2l39K86p8n8m9K88k47N2m9J65j75j01K44K00n21
$$ 43 194 -313 163 0 132 9 51 -288 -2 -80 -138 -187 101 -146 -94 -143 22 -153 -254 -10 190 -331
6716c31J45r2J47J07j51Q2J59j25K34j75K11l34J2j2J73j7L4J07r0Lj82k02J33
$$ -331 -186 -278 -131 -24 -175 -93 66 -59 175 0 211 -123 -111 -123 50 33 67 174 84 87 -95 -297 -164
6739a64J18o4J66r0K32k89J70N2k08J25l20L25%r6j48K75j18k46J00J87K33k00
$$ -164 -46 -110 56 -34 198 -91 79 131 -77 48 -272 53 53 -43 -191 84 -34 -280 -180 7 240 40
6761D0P3j45O6P9l43K04J74m0j42j10L19j57j94M5O8m5K20j40o8J37k72M22r5
$$ 40 113 -32 34 113 -230 -26 148 108 -34 -144 175 18 -176 -131 -63 -108 112 -28 -96 41 -231 191 96
6784I6J16j18r6J21k00K97k56j27M55m44q6M10k93R8j45L71j90K16l23J87K19
$$ 96 212 94 -2 119 -81 216 -40 -167 288 -156 -242 168 -125 -27 -172 199 9 225 -98 89 308
6805C08n00N4m8M40j83J84k00n1j22N0j01L01k83k47M33n6K0Pk01L73k59J57j09
$$ 308 -192 -138 -186 254 71 255 55 4 -118 -68 -169 132 -151 -398 35 -21 -1 6 -195 178 -81 76 -33
6828c3j31J40j63K69p5k4p3Km4M22l58J32j82L52j07m32L45n3j37kJ04J31o1k63
$$ -33 -164 -24 -187 82 7 -17 -90 -88 -132 290 -68 64 -118 234 127 -305 40 -13 -150 -152 -48 83 22 -241
6852b41L74r2k39o2L49km5k25M65k12Q3k93J4K65l12J75q9PK19k00K29%p52M77
$$ -241 133 41 -198 -260 89 87 42 -183 282 70 153 -140 -126 139 -173 2 -87 -80 139 -61 168 168 -584 -107
6876a07q6L6J98j59K7J85j25Qk3N2L25k50j79o2L95l12j06K4L32j55Nj28J35O4
$$ -107 -193 -157 41 -118 -91 94 -31 -23 -46 6 331 81 -98 -160 235 -77 -183 -159 173 18 23 -105 30 94
6900I4R5rl13Q5lJ86M1m39L2P4kK65k33J51j62N7j11M4j52M01j14l10L00j44L22
$$ 94 189 180 -133 -48 -51 135 176 -263 -231 -157 -159 106 -127 24 -138 -81 -192 -148 -300 101 -13 -323 -23 -167 155
6925A55l17J77R3k91K76N1j34m0qL7j83K21r5N0J49kk07p1K49M2k70NK03k10Q7
$$ 155 -162 15 108 -183 93 144 10 -30 -38 -1 -184 37 -58 -8 141 139 -68 -139 110 152 -118 -113 90 -120 -33
6950c3Q8J19l8J67k69r7J82k12J68j8L9j11J16j51N8J72j75Qj49M12k56K6K6l8
$$ -33 55 174 136 303 34 -63 119 -93 75 57 96 -15 101 -50 8 180 5 13 -136 276 20 46 72 34
6974C4k56J72j22J50J7K19J8j51j3k35K25L4m06K35K68k50J09j6J0q4L30m02J39
$$ 34 -222 -50 -172 -22 -5 214 232 81 68 -167 58 92 -314 -79 189 -61 48 32 42 -42 288 -114 25
6997B5R9l9k49K73M0k56M23j20k46J27J3m20J95j15L83k22J0Q0j63K77k37p9J22
$$ 25 124 85 -164 109 149 -107 316 196 -50 77 90 -330 -135 -250 133 -89 -79 1 -162 115 -122 -201 -79
7020g9O3j32k7J24j77L85j19N9Q7l84K09n4j37J18K56l46J8K94l15J84N1j51n
$$ -79 -16 -148 -175 -51 -228 157 38 97 184 -200 9 -45 -182 -64 192 -154 -136 158 -157 27 78 -73 -78
7043g8qM19k04k93n4K25r2Om5K59k29O5J68j97L4N9K12l09J55q1k7m7P6k53K71
$$ -78 -86 333 129 -164 -218 7 -85 -79 -124 135 -94 -29 139 -58 -24 35 247 -62 93 12 -15 -62 14 -239 32
7068C2j61j39L93j56P5J05k93PK8K05m1j29KJ27OQ0k13J09q5M25k90n8O2n5J34
$$ 32 -129 -268 125 -31 44 149 -144 -137 -109 96 55 -74 -72 55 61 141 -72 37 -48 377 87 29 91 36 170
7093A70k40K87l57j46L91j75k12K25j39M65j40k04J63J85j10m02K85K2J41l81
$$ 170 -70 217 -140 -286 105 -70 -282 -57 -196 269 129 -75 88 273 163 -239 46 68 209 -172
7113a72K64pl82M28q0Ml73K65J7K93l23L1L1QJ54j31K23k33M8Mj5O9l20K06j72
$$ -172 92 85 -297 131 51 55 -318 -53 -36 257 -66 -35 -4 4 158 27 250 17 65 69 54 123 -197 9 -163
7138a63L4L88l02J52K7j67j50j6L77j70j55K38K0k03K08k47l1J19J2K14j44q2
$$ -163 -129 259 -43 109 136 -31 -181 -197 180 10 -145 93 113 -90 118 -129 -160 -41 -29 185 41 -41
7160d1N1j79L2K11L2k16K9O8J9L76m57MJ33j68j51J84n4J16k6K77k40q1J37j10
$$ -41 10 -169 -137 74 106 -110 -81 -13 6 382 -75 -71 62 -106 -257 -73 -127 -11 -37 240 0 -81 56 -54
7184e4K90j56j10j7J06M8j51J17k02K54j57K2kj23J34O1l76J70M0J51k59K94j81
$$ -54 236 80 -30 -47 59 107 -44 73 -129 125 -32 -10 -12 -135 -1 60 -316 -146 -106 45 -214 80 -101
7207a01J95r3K5l7o4J53O3l8N9k63J04NL1l3n8p6n6L54j5j48k1J75m5l85K50L3
$$ -101 94 1 26 -11 -75 78 141 103 162 -101 3 8 39 6 -52 -128 -184 170 155 7 -14 161 116 -269 -19 14
7233A4K4l8J29l15N7J08n2J22o2Q1k53L38j35Q8rM2K1M3N6j09k01K70k32L5l3
$$ 14 38 0 129 -186 -129 -21 -73 49 -13 68 -185 153 18 106 97 139 160 203 259 150 -51 219 -13 22 -11
7258a1K61k79P7O4k7l1j01K21k14k3K70q9j72K99k75N14l85j14j33J69n7J45k23
$$ -11 250 -29 48 112 85 54 -47 174 -40 -63 207 118 -54 245 -30 484 99 -15 -148 21 -36 109 -114
7281a14L8NL50l3k82J43j12R2j35j57L47j41q4J79l04L25k00J80J67l94p7L74
$$ -114 -76 -71 279 246 -36 107 -5 87 -48 -205 142 1 -83 96 -208 117 -83 97 264 -130 -207 167
7303A67r6j16j41J22kJ65l19L39k36K48r2J24j51j39m1jQ8J74l11Q8L93k87k00
$$ 167 71 -45 -186 -64 -66 99 -220 119 -117 131 39 163 12 -127 -168 -169 -81 93 -218 -130 263 -24 -224
7326b24Q8J07k41M10j08k61M26l96J06P3J62l29K61j93J18qP1j48J15Lj71J71
$$ -224 -136 -29 -270 140 32 -229 197 -199 -93 -20 142 -187 74 -119 -1 -9 62 -86 29 32 -139 32
7348C2k15K11k40J52J15j20j15J11P2o1L17m63M03K5j55j5q8Q1o0J65o3O9M7m85
$$ 32 -183 28 -212 -60 55 -65 -180 -69 3 -58 259 -204 199 224 69 54 -34 47 -13 152 89 158 205 -280
7372b80K47J62m1k10J64J4k26K40m18L79k37N17m24J16P4J6k06P0J34k61L30l47
$$ -280 -33 129 88 -122 42 56 -170 70 -348 31 -206 311 -113 3 77 93 -113 -43 91 -170 160 -187
7394a87L13k81K51m2lj39Ll2j31L48j79J53j49n6J81J70m1l46J06K84k13J58j21
$$ -187 126 -155 96 54 51 -88 -85 -117 -248 100 -79 74 -75 -131 50 220 179 -167 -61 223 10 168 47
7417D7mJ74n61M19p8mop7O6Q0l26K29l0r1J60L5j49J31o4K67j17k60L17j59N6
$$ 47 43 217 -344 75 -3 -7 -13 -90 -24 56 -270 -41 -71 -162 -2 33 -116 15 -49 218 101 -159 158 -1 55
7442E5J25J19m08N9j3M2J2J03k45M03j91l12M4J98k49K97P2O9k2l16K56J34j5
$$ 55 180 299 -109 -50 -63 -21 -9 94 -151 252 61 -251 -207 -9 -258 39 111 180 158 -158 98 232 217
7465B17k28N8k4J9j98L21j2n85M17M1k1j22J34l01N78j77K0j25K32k05j13J5j39
$$ 217 -11 47 23 42 -156 165 153 -432 -15 26 5 -117 17 -284 294 117 137 12 244 39 -74 -59 -198
7488a98j6K43K01k93p7k3n0K57n6L26j04j91p4LJ24k60L68J79k57K7l04K42j36
$$ -198 -214 29 230 -63 -140 -163 -213 44 -12 314 210 19 -55 -52 72 -188 180 359 102 129 -175 67 -69
7511f9O6M0N8k91J24L6M5J57l01O3K84j22m2j53NJ10M6K48j30j76J49j65j84M02
$$ -69 -3 37 95 -196 -72 -36 9 166 -135 -72 212 90 48 -105 -100 10 56 304 174 -2 147 -18 -202 200
7535B00l13o1K92M4n4p4J76j8k40K7J33k35Q7K55n35L74k9K2j09j58L44m05L97
$$ 200 -113 -174 118 162 108 34 210 192 -48 -21 112 -123 -36 219 -316 58 29 51 -58 -216 128 -277 120
7558A20k47N4K05k02o8L88l14J84j65m0Nk7L17j68q7m2L26l32R6m7P1R4K3k7R4
$$ 120 -127 -73 132 -70 -138 250 -64 120 -45 -85 -80 -107 210 42 -45 -87 239 -93 3 -44 27 121 144 117 211
7583B11l8n42M23K00k27j43k18J42K47J08j99j23J86k65L0L08J02j85r4j44J49
$$ 211 173 -369 54 254 27 -116 -334 -192 55 163 -36 -159 27 -238 -208 100 202 17 -77 -221 -72
7604g2J25k44J92K2K6OK69j43L0j95k96L77n3j45j05O5L39l13K27O6j71K20J36
$$ -72 53 -191 1 23 49 55 324 181 211 16 -280 97 44 -101 -206 -141 198 -115 112 178 7 227 363
7627C63l45j92P9J55L2k68L09j36j53K23R8k23J48P5l19L19q4j38J38m8o1n1M70
$$ 363 18 -174 -95 60 92 -176 133 -3 -156 67 165 -58 90 165 -154 165 81 -57 81 33 -28 -79 391
7650C91n22L33m7k12N0oP3l5p5j23K78K5J8k55J24k3q2J46j25K2p5K33K51l98
$$ 391 -131 202 155 -57 -7 -13 60 25 -50 -173 105 130 148 -107 17 -6 -88 58 -67 -45 -120 113 364 -34
7674c4N0j04j86L67J11k10O2k14J22p8R4P6L18n12N8m4J29m1k23M06k06J16m0
$$ -34 16 -88 -274 93 204 -6 56 -158 -36 -114 -20 56 374 -138 -80 -124 5 -36 -259 147 -59 57 17
7697A7j49N8Q1q3L1l4J18j18NK38l96O92n82J83J5j35J15o5r7L34l17J98J65j84
$$ 17 -132 -74 7 -76 -45 -79 39 -79 -74 164 -232 460 -122 61 76 -59 56 -9 -106 228 -89 109 274 90
7721I0o6QR7o4Q2j55j28k48N40j97J62k70jM03j77j66l85J99L62l71L73j41J08
$$ 90 24 32 129 65 147 -8 -136 -384 156 -41 121 -149 -150 253 76 -90 -475 -276 86 -285 88 -53 55
7744E5ql1j80K12K5j67J11jo3J20n8l9j36L52m94L03n1j18M11j27j61K52l85M
$$ 55 47 16 -164 48 73 -94 17 16 -47 73 15 -24 -160 192 -302 1 -50 -168 243 116 -45 207 -178 -174
7768a74L99k92j41J65Q6J26k80J0K70l51J85k39L05q4m4J21j15J20j44R8qO3Q1
$$ -174 225 -67 -208 -43 43 169 -111 -101 169 -182 3 -236 69 -15 -59 62 -53 67 -77 21 13 76 157
7791A57k97J03P2j4m4j57J38o4J49K00k72M1J46j45J61n5j75o6%rJ21O1J35l88
$$ 157 -140 -37 35 21 -23 -180 -42 -106 43 243 -29 12 158 13 174 119 -56 -122 -122 -131 -10 51 186 -202
7815b02P9J71J04qpl74K11k9j58J01J56J10k27J91j16L70o73J18m7o9L10R4j76
$$ -202 -123 48 152 144 137 -237 -26 -55 -213 -112 44 154 -73 118 2 372 -301 -183 -230 -299 11 105 -71
7838g1M99n90K95p7k88J81P4l72M31K12k92K36k06J59m27J95j58L04k92l6K5K79
$$ -71 428 -162 133 56 -232 -51 23 -349 82 294 2 238 32 191 -236 -41 -199 105 -187 -223 -198 81
7860H1l91K63m1q1K67Q1j87M6j22n8K68r1j05J51k33L21k18j86J61j51J18K33
$$ 81 -310 -47 -88 -169 98 179 -8 38 -84 -142 126 35 -70 81 -152 169 -49 -235 -74 -225 -107 126
7882A26K0M2k91N4m3Q9J8j35K43L1j83M7j81J59R3j46L7N5o7L85r7n05K16P0R6
$$ 126 146 188 -103 -49 -92 -3 15 -120 123 154 -29 18 -163 -4 89 -57 -20 35 -32 353 256 -249 -33 37 133
7907A33q5L0j66L4K7R6j69J23j1k62N12o29K72JL02k69J38j07j06L12m05J48J27
$$ 133 48 78 -88 -54 -27 69 -100 23 12 -250 262 -367 -95 -94 208 -61 77 -30 -136 176 -229 -81 46
7930D6N8k35j29J98J76k0j15k62K49O2J54Q9l59o9O6q2L35l79P7M31k09j71L45
$$ 46 104 -131 -260 -62 114 94 -21 -283 -34 28 182 271 -88 -157 -91 -173 162 -217 -140 291 82 -89 256
7953B56j91j38P5L07l15l3K31l23j41L91J09J1j12k01P6l7p4J11J71k89L37j73
$$ 256 65 -73 2 309 -6 -39 192 -131 -272 119 228 239 127 -74 2 -35 -109 2 173 -116 221 48
7975D8J06k72l9J87R4r4R3l7L7l73J27L25m88L77m9k19R5J65n7k5j24o7Q4J67
$$ 48 154 -118 -157 30 124 30 123 86 123 -250 -123 202 -286 91 42 -177 -82 83 26 1 -123 -190 -106 61
7999F1o1j09Q8R0k18K53M2k26RK7J34j83J37o9o5j09M07l66J95J65j35P4l41K51
$$ 61 0 -109 -21 69 -149 104 146 -80 -71 -44 90 -93 44 -25 -90 -199 208 -158 37 202 67 141 -200 51
8023E1k35O8K17k4m48N01j05j6P4p1L10k70J33m10J44M02m82L16j18M7j95L84
$$ 51 -184 -116 101 77 -371 130 25 9 83 12 322 52 185 -225 -81 321 -161 155 37 84 -111 273
8045B73l01m3L40m17P6M5n9nK44j80J57o9j9n3K0L6r2j45J76p3K4M60k34r4o0
$$ 273 -28 -71 269 -148 -72 -27 -86 -91 153 -27 130 61 42 -11 9 45 -47 -192 -16 -89 -65 395 161 67 7
8070GJ82n98M18j06j04K78J07Qj95J73l13Q3J61k37Q8K21k26N5r5L47n0k12%R3
$$ 7 189 -409 9 -97 -201 77 184 192 -3 170 -143 -60 101 -136 -48 173 -53 2 -93 254 204 -8 -8 85
8094H5q9p1j44L17j06Q8m96M00K55L3k79K37k52K42k33k5M1j85K58j24O0l3P4
$$ 85 -4 -75 -219 98 -8 80 -416 -16 239 272 -7 230 -22 220 -13 -38 3 -182 76 -48 12 -21 53
8117E3n1J44R3k79L68k14j10M9j21J31jkj96K02N5j87L0j84M34k76J35On6r5L9
$$ 53 2 146 239 -40 328 114 4 53 -68 63 62 60 -136 66 121 -66 -36 -220 214 -62 73 79 23 -72 -33
8142c3N14n14p2J73J03J9j43jJ53k59q3K71p2l22K23J15j16j33L0J75L09l08J41
$$ -33 481 -33 -105 68 171 190 47 46 199 -60 -143 128 56 -266 -43 72 -44 -177 -147 28 337 29 170
8165A70k60j13K41L14k46k66R9j3L01k26k36M11l35K70m5l02k7J35n2p7p7K80
$$ 170 -90 -203 38 352 106 -160 -61 -74 227 1 -235 176 -159 111 66 -236 -263 -128 -180 -257 -334 -54
8187e4J65j50Q5k
$$ -54 111 -39 46 44
8191D4
$$ Imaginary data points
##PAGE= N=2
##DATA TABLE= (X++(I..I)), XYDATA
0@%%%%%%%%%%Qj6J6j6K4l2M0n0N8p2Q9j06J29j54J79k10K44k84L30l78M32m94
$$ 0 0 0 0 0 0 0 0 0 0 0 8 -8 8 -8 16 -16 24 -26 32 -40 49 -57 72 -82 97 -113 131 -153 177 -201 231 -263
32b63N62o38P21q12R14j025J147j281J428j590J763j951K162k391K640k912L208
$$ -263 299 -339 382 -430 484 -541 606 -675 753 -837 926 -1025 1137 -1254 1386 -1526 1682
49A682l536L896m291M728n216N762o372P061p853Q770r841J1116j2667J4594j7067
$$ 1682 -1854 2042 -2249 2479 -2737 3025 -3347 3714 -4139 4631 -5210 5906 -6761 7833 -9234
64i234K0381k5069L2260m4801P2805k48271J21784N19123l17500m00053Q7056
$$ -9234 11147 -13922 18338 -26463 46342 -201929 -80145 438978 121478 -278575 -191519
75a91519L54319j4729j66527n2702L1312k2238J02182J19220j13734k57338P1600
$$ -191519 162800 148071 -18456 -71158 -39846 -62084 40098 159318 45584 -211754 -140154
86a40154L24527M0720l47027j39883K82435K22788j78362k25314N2873J71479
$$ -140154 184373 225093 -121934 -261817 20618 243406 65044 -160270 -107397 64082
96F4082L0208o7384p0310l9319N3141J29112p415j68875m7602J62806P3352j25230
$$ 64082 94290 26906 -43404 -82723 -29582 99530 92115 -76760 -124362 38444 111796 -13434
108a3434o6101Q5812L1400n0943K0882L8563p6371n1522J08789P5200j20398r5676
$$ -13434 -79535 6277 37677 -13266 7616 46179 -30192 -81714 27075 102275 -18123 -113799
120a13799J22082J12846j19761j26075J16458J32464j19467j34391J29142J41787
$$ -113799 8283 121129 1368 -124707 -8249 124215 4748 -129643 -501 141286
130A41286j33691j49269J28456J46503j19881j33262J09735J09835j03425p7936
$$ 141286 7595 -141674 -13218 133285 13404 -119858 -10123 99712 -3713 -81649
140h1649J08168M5495j24265k3132J45383J6491j59842k2828J62280L8707j49932
$$ -81649 26519 72014 -52251 -75383 70000 86491 -73351 -96179 66101 104808 -45124
151d5124n6241J21341O1095q8860n0086O4492K9110n0499r78M8353k6862o0781
$$ -45124 -101365 19976 81071 -7789 -57875 6617 35727 -14772 -15750 32603 5741 -55040
163e5040M6185P6697n0394q3683M6701P9498m3223o6962L7655M7666l6478k5121
$$ -55040 -8855 67842 17448 -66235 -19534 59964 16741 -50221 -12566 35100 -1378 -26499
175b6499M4108Q420n3208n5N8664m467n8606P011N5228j0297m9155J6320M2283
$$ -26499 17609 26029 -27179 -27234 31430 26963 -31643 -24632 30596 20299 -28856 -12536 29747
188B9747k5815m0258L4936M3042l9141m7341M0425N0478l9016n0396L8252M2674
$$ 29747 3932 -36326 -1390 41652 2511 -44830 -4405 46073 7057 -43339 -5087 37587
200C7587l9756l0376M6967J6997n8030o845O9702P25q1190P50Q8274K922q6782
$$ 37587 -2169 -32545 14422 31419 -26611 -33456 36246 36971 -44219 -43469 44805 47727 -39055
213c9055o806Q0445P948p3501o377O5380J610n8521O334N4638j3769n4918J9605
$$ -39055 -45861 34584 42532 -30969 -37346 28034 29644 -28877 -22543 32095 18326 -36592 -16987
226a6987N6686k3514n8669K6755O1148k8222o3691K8114O4033k6613o2886K3727
$$ -16987 39699 16185 -42484 -15729 45419 17197 -46494 -18380 45653 19040 -43846 -20119
238b0119N9428j9978n1763J5270M0604j2137k6686J1616J4313j4630m581K0670
$$ -20119 39309 19331 -32432 -17162 23442 11305 -15381 -3765 10548 -4082 -8663 12007
250A2007p17k6556j739L0705O766k9334j3404K2963J7985j2664j6179R81Q024
$$ 12007 11290 -15266 -17005 13700 20466 -8868 -22272 691 18676 6012 -10167 -9186 -1162
263a162P912N755j2312k0206J0566L2433l588m0253n327M1113J2258l6604j4016
$$ -1162 6750 12505 193 -20013 -9447 22986 19398 -20855 -26182 14931 27189 -9415 -23431
276b3431K8626J0210k0558j491J6043r979j5965K1019K0465k8702k8157L1072
$$ -23431 5195 15405 -5153 -6644 9399 -580 -16545 4474 24939 -3763 -31920 -848
288h48L6463k8347m3246K1802M7123j3804m6892P098M2582l158l5172K769K7552
$$ -848 35615 7268 -35978 -14176 32947 19143 -27749 -20651 21931 18773 -16399 -13630 13922
301A3922o728k0949J2898J7491k0522j6990K6681J9143k9988k3279K8786K8232
$$ 13922 7194 -13755 -857 16634 -3888 -20878 5803 24946 -5042 -28321 465 28697
313B8697k4211k9614J6229K8344p602k4569J584J7008K425j0083k264M047r19
$$ 28697 4486 -25128 -8899 19445 11843 -12726 -11142 5866 8291 -1792 -4056 -9 -928
326i28o64O101n2j0220j973J2003N576j1632p703Q098Q467l213o685k719L000
$$ -928 -1592 4509 4457 -5763 -7736 4267 9843 -1789 -9492 -1394 7073 3860 -2825 -5544 -2544
341b544Q076P36j0656n509J2497Q815j1870j1064J0637J2118r752j0875P923R259
$$ -2544 5532 6268 -4388 -9897 2600 11415 -455 -11519 -882 11236 1484 -9391 -1468 7791
355G791o614p508N982N958o844m164Q192L951j1245m388J3814P069j6543j0800
$$ 7791 1177 -6331 -349 5609 -1235 -5399 2793 6744 -4501 -8889 4925 11994 -4549 -15349
369a5349J7773J4328j6967j6363J4478J6816j1101j5597Q104J2485p074p443P053
$$ -15349 2424 16752 -215 -16578 -2100 14716 3615 -11982 -3878 8607 1533 -5910 1143
382A143M332q950k446J0250L428j1210o660J0961J0651r194j3154N580J4580j971
$$ 1143 5475 -3475 -5921 4329 7757 -3453 -10113 848 11499 2305 -10849 -5269 9311 7340
396G340j4624l76J2906J293r858j079P372L10o638P07N622n21n313k05N417J776
$$ 7340 -7284 -7660 5246 6539 -3319 -4398 2974 3284 -3354 -2647 2975 2454 -2859 -3064 2353 4129
412D129n748m236N863O658n132r399O049J1233n579j3754M009J4412k056j3589
$$ 4129 -1619 -5855 8 6666 1534 -7865 -1816 9417 3838 -9916 -5907 8505 6449 -7140
426g140j59J1812L332r021n334M412O152k142m256J959K631m256j740Q547L334
$$ -7140 -7299 4513 7845 -1176 -6510 -2098 4054 1912 -2344 -385 2246 -2010 -3750 4797 8131
441H131j4184q099J6845J4890j4263k0455Q167K1977J210j9862j0891J2848J6150
$$ 8131 -6053 -14152 2693 17583 3320 -17135 -8968 13009 14219 -5643 -16534 -3686 12464
454A2464k851j3943m518P419M671K26O24n505j1288O144K3978K005l1370j6447
$$ 12464 9613 -4330 -8848 -1429 3242 3468 4092 -1413 -12701 -6557 17421 19426 -11944 -28391
468b8391K8090K9069j6127l4566j136L2767J8231k1900k8926N095K7259Q470j4200
$$ -28391 -301 28768 12641 -21925 -23061 9706 27937 6037 -22889 -17794 9465 17935 3735
481C735j2522j544N479J4569R868j8354k9148Q853M2317J0749m1219l1689K6492
$$ 3735 -8787 -10331 -4852 9717 19585 1231 -27917 -19064 23253 34002 -7217 -38906 -12414
494a2414M6424l568m9434k1588L7325L8133j4554l8056n129K3351J3926l008j0708
$$ -12414 34010 30442 -18992 -40580 -3255 34878 20324 -17732 -22861 490 14416 11408 700
507G00j6260n048K6247K8800j8604m6853m687M9427L0199l6403m8640J3347N6585
$$ 700 -15560 -20608 5639 34439 15835 -31018 -35705 13722 43921 7518 -41122 -27775 28810
520B8810J2987m8682l3101K7065L6182n159k2470p125K806O520J5392N793k4208
$$ 28810 41797 -6885 -39986 -12921 23261 18102 -4368 -11493 -8687 -2167 13225 19018 -5190
533e190k6347J7642M3327L645m7501k7991L7350M7343j7790n5570n334M7585K2768
$$ -5190 -31537 -13895 29432 33077 -14424 -42415 -5065 42278 24488 -31082 -36416 11169 33937
546C3937k8357k4476R269J3302K42L102j15j8563j1419K6199L1317j7534m7981
$$ 33937 5580 -18896 -9627 3675 3917 7019 6904 -11659 -23078 3121 34438 16904 -31077
559c1077l446M9725K6005m0180m1146K3921M7733m244m0136j1969K1443J2737
$$ -31077 -34523 15202 41207 1027 -40119 -16198 31535 27291 -12845 -24814 -3371 9366
571I366k496j524n849j2653L665K4159P576k9169k5378K1869L9968k541m4070
$$ 9366 6870 5346 -503 -13156 -9491 14668 22244 -6925 -32303 -10434 29534 26993 -17077
584a7077j6739L6416L1103k2247l7041M744L1061Q996j6780j1508L735M773K532
$$ -17077 -33816 2600 33703 11456 -25585 -20841 10220 19216 2436 -9072 -5337 -564 1968
597A968M736k331j4502n340K0595J9920j6221l2903L287L7182Q745l4101j7794
$$ 1968 6704 4373 -10129 -15469 5126 25046 8825 -24078 -20791 16391 25136 -8965 -26759
610b6759K8070K3661j7378k3247O569J5020l438o015O322K422r973j964J3694
$$ -26759 1311 24972 7594 -15653 -9084 5936 2498 -3517 2805 5227 -4746 -6710 6984
623F984M222j7950j0048J8475J5924j3965j7818Q644J6658m593j4565J020J0999
$$ 6984 11206 -6744 -16792 1683 17607 3642 -14176 -5532 11126 6533 -8032 -7012 3987
636C987M43o619j19M695O76m304j728K258K123p53k250K23L898J410m735l380
$$ 3987 4430 -2189 -2308 2387 3063 -1241 -2969 -711 1412 659 -1591 -1368 2530 3940 -795 -4175
652d175K739K658j687p41L844J459n949k635O729L263q826o011J0522J0817q844
$$ -4175 -1436 1222 -465 -1206 2638 4097 -1852 -4487 2242 5505 -3321 -9332 1190 12007 3163
667C163j3323N353J2318l272j0136K106P340j357l923L715J743p821k837J0484
$$ 3163 -10160 -4807 7511 4239 -5897 -3791 3549 2192 -1731 1984 3727 -4094 -6931 3553
681C553N196j1099p624J0375R884p256j0524L207P439o01l324Q86k75k657L294
$$ 3553 8749 -2350 -9974 401 10285 3029 -7495 -4288 3151 2550 -774 112 -163 -2820 474
696D74N249m080r096K610J0530P60q980k967O325K546k659k055k15j164K569N340
$$ 474 5723 1643 -7453 -4843 5687 6447 -2533 -5500 825 3371 712 -1343 -1558 -2722 -153 5187
712E187j397q274j744R235L858q048n866O481O327l502m625Q09J590q14K077J304
$$ 5187 3790 -4484 -6228 3007 6865 -1183 -7049 -568 5759 2257 -2368 -1559 31 -783 1294 2598
728B598m234k733N723N238o261p029M762P881l077p956J760P068o83n432J087
$$ 2598 -1636 -4369 1354 6592 331 -6698 -1936 5945 2868 -5088 -3328 3740 3057 -2375 -1288
743a288L140k650j118L952K81n733M77P677jr434j181R404L010q660l888P234
$$ -1288 1852 -798 -1916 2036 2317 -3416 -2939 4738 4737 -4697 -5878 3526 6536 -2124 -6012 1222
759A222M005n072l808L333J854j820O92J623k834k899M145M581m138o937L412
$$ 1222 5227 155 -3653 -320 1534 -286 406 2029 -805 -3704 441 5022 884 -6053 -2641
774b641Q208j469q608J12O768Q36m004j193J951k48Q28J160j179l172J063M603
$$ -2641 5567 4098 -4510 -4398 2370 3206 -798 -1991 -40 -288 540 1700 521 -2651 -1588 3015
790C015n79m611n87L976J425k980j919K024J351r60n30L26o03O9J636N61l085
$$ 3015 2436 -2175 -2762 1214 2639 -341 -2260 -236 1115 155 -375 -49 -652 -583 1053 1614 -1471
807a471j207M455J211m785j422M978J667m767k084M665J832m355q84L553J44l391
$$ -1471 -2678 1777 2988 -1797 -3219 1759 3426 -1341 -3425 1240 3072 -1283 -2167 1386 1530 -1861
823a861R52L485j819l936K155M979k074o089J203O721n24n992p60N685Q43m415
$$ -1861 -909 2576 757 -3179 -1024 3955 1881 -4208 -3005 3716 3192 -2800 -3560 2125 2968 -1447
839a447p05M034q19l410K033L064l033l114L144M172l417l987K332L819j509k898
$$ -1447 -2152 1882 1063 -2347 -314 2750 -283 -3397 -253 3919 502 -3485 -1153 2666 1157 -1741
855a741R81J458m42n88R12k21j696K26K886k49k897n06K434J627k151j609J353
$$ -1741 -760 698 256 -332 580 359 -1337 -1111 1775 1526 -1371 -1877 557 2184 33 -1576 -223
872b23J006o66L3K93j572l09K728P61l529j329L748J679l488j424K350Q67j127
$$ -223 783 117 150 443 -1129 -1438 1290 2051 -1478 -2807 941 2620 -868 -2292 58 925 -202
889b02P54K70k312o00M081J612n385l313O094M371n480n611M725O081l321n948
$$ -202 552 822 -1490 -2090 1991 3603 -1782 -5095 999 5370 -110 -5721 -996 5085 1764 -4184
905d184K979M466l496k820N385J520p822j961J0879L096j3190m921J3812P885
$$ -4184 -1205 3261 -235 -3055 2330 3850 -3972 -5933 4946 8042 -5148 -10069 3743 11628
919A1628j2936j0026J0475J0109p076q867M563O103l537k857M717K08o997l59
$$ 11628 -1308 -11334 -859 9250 2174 -6693 -2130 3973 436 -2421 2296 2504 -4493 -4852
933d852R860K628j1492n848J1338R227q369j1487K837J0845K367o896o011K238
$$ -4852 5008 7636 -3856 -9704 1634 10861 2492 -8995 -6158 4687 7054 158 -5853 -3615
947c615O580L532n976p235L031P493j94m499M80Q09l886J872Q517k154j4522K7
$$ -3615 2965 6497 521 -6714 -3683 3810 3616 -883 -403 406 -3480 -1608 6909 4755 -9767 -9740
963i740J9448N795k1102j2328J8716J6819j4852j8689J0975J7742q615j3949R056
$$ -9740 9708 15503 -5599 -17927 789 17608 2756 -15933 -4958 12784 4169 -9780 -724
976g24J0271j2944r195J8006J0576k1631j3871K3311J8579k1206k2539J5218K2942
$$ -724 9547 -3397 -12592 5414 15990 -5641 -19512 3799 22378 1172 -21367 -6149 16793
989A6793q955j9614M564J4979k093r541K158N085o126m198R963P212j0295j0147
$$ 16793 7838 -11776 -7212 7767 5674 -3867 -1709 3376 -2750 -6948 3015 10227 -68 -10215
1003a0215Q092J1447l454j2029l056Q854R613j606j2473o853J1307J2780r106
$$ -10215 -2123 9324 5870 -6159 -9215 -361 9252 7646 -4827 -11680 -373 12407 3301
1016C301j5628O401J5803l511j3488L899R748p686r313J3185J0837j6793j4688
$$ 3301 -12327 -5926 9877 6366 -7122 -3223 6525 -1161 -10474 2711 13548 -3245 -17933
1029a7933J9553K0771j9413k6618J5491K9272j1020k8831Q713K6530o210k3795
$$ -17933 1620 22391 2978 -23640 -8149 21123 10103 -18728 -10015 16515 10305 -13490
1041a3490O656J9144j0286j7478J4500J8834j5709j9510J4669J9778j3527k0387
$$ -13490 -6834 12310 2024 -15454 -954 17880 2171 -17339 -2670 17108 3581 -16806
1053a6806R919J9760n063j5123K161J0781l129p493K947N393l675k809N990J516
$$ -16806 -6887 12873 7810 -7313 -5152 5629 2500 -4993 -2046 3347 -328 -3137 2853 4369
1067D369o829r49M897q93l336M166K379o912r50J0340q6j4239k57J5620R92j6321
$$ 4369 -2460 -3409 1488 595 -2741 1425 3804 -3108 -4058 6282 6196 -8043 -8300 7320 8312 -8009
1083h009L72J7077q84j7797R59J7506k698j8635M070K1359k854k2135J612K1399
$$ -8009 -7637 9440 8556 -9241 -8282 9224 6526 -12109 -8039 13320 10466 -11669 -10057 11342
1097A1342k411k1862K713K2137j618k0550L694J8165o728j8712Q189J8502q376
$$ 11342 8931 -12931 -10218 11919 10301 -10249 -6555 11610 4882 -13830 -5641 12861 4485
1110D485j6369R005J5513r810j4685Q545J2537q004r418Q576P512q986n720Q808
$$ 4485 -11884 -2879 12634 2824 -11861 -3316 9221 1217 -8201 375 7887 -1099 -6819 1989
1124A989M249j0525k890J1876K202j1102j194J1779j113j2175J964J1484m050
$$ 1989 6238 -4287 -7177 4699 6901 -4201 -5395 6384 5271 -6904 -4940 6544 2494
1137B494j0593P200J0901q534j1089R220Q814j0249q087J2283P654j1687o617
$$ 2494 -8099 -899 10002 1468 -9621 -401 8413 -1836 -9923 2360 10014 -1673 -8290
1150h290J1343N114j3472m653J4533M711j3527l674J3703K467j4827j800J4308
$$ -8290 3053 8167 -5305 -9958 4575 9286 -4241 -7915 5788 8255 -6572 -8372 5936
1163E936R51j4200J751J4589l379j4808M108J4401n679j3922O943J3224p052j1838
$$ 5936 6887 -7313 -5562 9027 5648 -9160 -5052 9349 3670 -10252 -3309 9915 2863 -8975
1177h975P663J0197q513r836R433Q610j0048o541J0668O590j1982o127J1082N545
$$ -8975 -1312 8885 372 -9464 -31 8579 -1469 -8010 2658 9248 -2734 -8861 2221 7766
1191G766j1182m093J2055L208j1915j999J1311p02j0746J610J1599k574j0997
$$ 7766 -3416 -7509 4546 7754 -4161 -6160 5151 4449 -6297 -4687 6912 4338 -6659
1204f659M081R645n171r867O302R235o585q235P524P451p992p298Q200O381q720
$$ -6659 -2578 7067 1896 -7971 -1669 7566 981 -7254 270 7721 -271 -7569 631 7012 -1708
1219a708n271R192M858r951l645J0398K378j1088j753J1534J037j1077k98J0934
$$ -1708 -6979 2213 7071 -2880 -6525 3873 6251 -4837 -6590 4944 5981 -5096 -5394 5540
1233E540r77j0113J676R596k736r137M035Q870m844q502N159Q010n946p365O037
$$ 5540 4563 -5550 -3874 5722 2986 -6151 -2116 6754 1910 -6592 -1433 6577 631 -6734 -697
1248f97P239n928o061N795N107o627l838O926K969p427j734P858O01q293m25Q479
$$ -697 6542 614 -5447 348 5455 -1172 -5010 1916 4885 -2542 -4276 3582 4183 -4110 -4535 3944
1264C944j28p982P10P750j505p140K466O756l516o299M031O253m783o040N130
$$ 3944 3816 -4166 -3456 4294 2789 -4351 -1885 4871 1355 -4944 -913 5340 557 -5483 -353
1279c53N998n908n514O226M905o216m281O333L918o883k997P151K407p946j438
$$ -353 5645 -263 -5777 449 5354 -862 -5143 1190 5108 -1775 -4772 2379 4786 -3160 -4598
1294d598P495J313p486q20P596J90p617P04O887p88o807J104O822j724o164J505
$$ -4598 2897 4210 -3276 -4096 3500 3690 -3927 -3223 3664 2876 -3931 -2827 3995 2271 -3893 -2388
1310b388O151j950n375K075N061k358m575K451M227k825l478K867L073l062k514
$$ -2388 3763 1813 -3562 -1487 3574 1216 -3359 -908 3319 494 -2984 -117 2956 -106 -2620
1325b620L056J825k812r46K128M95k084J68K338j330j938J874J829k397j872K906
$$ -2620 436 2261 -551 -1497 631 1126 -958 -790 1548 218 -1720 154 1983 -414 -2286 620
1341F20J965l163k092M012J717m982q66M823J079n661r23O394Q20o714p58P098
$$ 620 2585 -578 -2670 1342 3059 -1923 -2789 2034 3113 -2548 -3471 2923 3743 -2971 -3729 3369
1357C369O45p184m91O705Q42p276l43O702N82p046j94O995J93o761j88O543K87
$$ 3369 4014 -3170 -3661 3044 3886 -3390 -3733 2969 3551 -3495 -3689 3306 3499 -3262 -3450 3093 3380
1374C380o186n56N804P82n599p11M846J057m517n09L903R8l264L37K570m69k128
$$ 3380 -2806 -3362 2442 3224 -2375 -3086 1760 2817 -1700 -2209 1694 1792 -1472 -1135 1435 966 -1162
1391a162L93J958n16j565PJ243j25J76k63j016M80J359k7j704k84J885O54j941
$$ -1162 -769 1189 673 -892 -885 358 233 409 146 -870 -390 969 942 -762 -1046 839 1493 -448
1409d48j064J897J051k010o40J898L76k223N3K855n78l157L58L929q97l822R23
$$ -448 -1512 385 1436 -574 -1214 684 1060 -1163 -1110 1745 1167 -1990 -1632 2297 1400 -2422 -1499
1426a499L644p83l423J069L049j537l051K604K327k951k290L388L211m097l645
$$ -1499 2145 1362 -2061 -992 2057 520 -2531 73 2400 -551 -2841 547 3758 -339 -3984
1441c984L725M206l884m130M032M534m521m421M663M320n098m924O614M276o366
$$ -3984 -259 3947 63 -4067 -35 4499 -22 -4443 220 4540 -558 -5482 1132 5408 -958
1456i58m728O560N022o173n834N789O010m840o183M495N944l679o499L749N723
$$ -958 -5686 874 5896 -277 -6111 -322 5688 848 -5335 -840 5104 1425 -5074 -1325 4398
1471D398l060o215L278O691k687p003J809O631q47o574l17O446J691n194l224
$$ 4398 1338 -4877 -1599 5092 2405 -4598 -2789 3842 2995 -3579 -3896 2550 4241 -953 -4177
1486d177M007L898l261n206L753O071k597o785J899P321k097q655J833R878o78
$$ -4177 -170 3728 467 -4739 -986 5085 2488 -4297 -2398 4923 2826 -5829 -3996 5882 5204
1501E204j0357m87J0797J693j1908l321J2270N339j2715n772J2569O962j3393
$$ 5204 -5153 -5640 5157 6850 -5058 -8379 3891 9230 -3485 -9257 3312 10274 -3119
1514c119q046J3711Q345j3325q821J3760R239j3231r732J2036J0148j1833j0872
$$ -3119 -11165 2546 10891 -2434 -11255 2505 11744 -1487 -11219 817 10965 -868 -11740
1527a1740J1355J1686r471j2050Q306J1858p795j2653P131J3126n914j1987N334
$$ -11740 -385 11301 1830 -10220 -1914 9944 2149 -10504 -3373 9753 3839 -8148 -2814
1540b814J1250m945j1664L610J0864j947r261J068Q682J35q449k775P526L840
$$ -2814 8436 3491 -8173 -4563 6301 4354 -4907 -3839 4843 4978 -3471 -6246 1280 5120
1554E120n543m810N797N564n137p379M036P928k872q378K028R817r99r973r45
$$ 5120 -423 -5233 564 6128 991 -6388 -2352 5576 2704 -5674 -3646 6171 5172 -4801 -5746
1569e746J0560J531j1824k298J2529M311j2842m952J3316N212j5212n611J4730
$$ -5746 4814 6345 -5479 -7777 4752 9063 -3779 -8731 4585 9797 -5415 -11026 3704
1582C704O963j4105o442J4240O731j4939p788J4523P683j3530p349J3996P782
$$ 3704 10667 -3438 -9880 4360 11091 -3848 -11636 2887 10570 -2960 -10309 3687 11469
1595A1469j4003q947J2816R135j2371q678J2896Q679j2075q999J1438P710j1392
$$ 11469 -2534 -11481 1335 10470 -1901 -10579 2317 10996 -1079 -10078 1360 9070 -2322
1608b322o552J0414O991r437o210Q235N446p555n787O508N549m538n183M056M677
$$ -2322 -8874 1540 8531 -906 -7116 1119 6565 -990 -6777 -269 5280 742 -4441 -385 4292
1623D292k875m593J031L914l87k630k7K570J281k241k569P75L429q94l784O36
$$ 4292 1417 -3176 -2145 1769 1382 -1248 -1275 1295 2576 335 -2234 -1459 1970 1076 -2708 -2072
1639b072O327n47p649q98Q487O47r291l98J1133J056j2122r85J1516J271j2827
$$ -2072 4255 3708 -3941 -4839 3648 4295 -4996 -5394 5739 6795 -5327 -6312 5204 6475 -6352
1654f352j157J3682J599j3362j727J3471J800j4547k235J5220J948j5026j945
$$ -6352 -7509 6173 7772 -5590 -7317 6154 7954 -6593 -8828 6392 8340 -6686 -8631
1667h631J6002J885j6293k190J6145J561j5846r95J5327J589j4822j279J3507
$$ -8631 7371 9256 -7037 -9227 6918 8479 -7367 -8362 6965 8554 -6268 -7547 5960
1680E960P75j2824j373J3145J317j1930j060J1007Q55j0996q50J0089J399q673
$$ 5960 6735 -6089 -7462 5683 7000 -4930 -5990 5017 5872 -5124 -5974 4115 5514 -3159
1694c159j255Q062N97p050j237N606J361l903o64K572O53j703j095L40J327R08
$$ -3159 -4414 3648 4245 -2805 -4042 1564 2925 -978 -1642 930 1583 -120 -1215 -875 452 1360
1710A360j558j816K107L124k706l982K448M815k519n838K929O721k687p402K493
$$ 1360 -198 -2014 93 3217 511 -3471 -1023 3792 1273 -4565 -1636 5085 2398 -5004 -2511
1725b511Q300k584j0109L371J0536l208j1078L713J1428l956j2240L980J2937
$$ -2511 5789 3205 -6904 -3533 7003 3795 -7283 -3570 7858 3902 -8338 -4358 8579
1738H579m043j3133M157J3484m695j3407M350J3521l976j3746M378J3435l967
$$ 8579 4536 -8597 -4440 9044 4349 -9058 -4708 8813 4837 -8909 -4531 8904 4937
1751D937j3243L452J2698l224j2487L337J2107l035j1889K699J1311k410j0378
$$ 4937 -8306 -4854 7844 4620 -7867 -4530 7577 4542 -7347 -4648 6663 4253 -6125
1764f125K022R839j777q888J119Q356q85p439N17O285k7n488k42M612R48l923
$$ -6125 -4103 5736 3959 -4929 -3810 4546 3661 -3778 -3261 3024 2997 -2491 -2733 1879 2827 -1096
1780a096j299L021J319k146j716J229K703m02k986j053L827J159l599k423L956
$$ -1096 -2395 626 1945 -201 -1917 -688 2015 1613 -1373 -2426 1401 2560 -1039 -3462 494
1795D94L603m542m063M860M382m853n297N359N898n558o144N416O701n986o783
$$ 494 4097 -445 -4508 352 4734 -119 -5416 -57 5841 283 -5861 -445 6256 270 -6513
1810f513N573P666n902p624N830P666n616p838N798P937o230p613N791P567n219
$$ -6513 -940 6726 824 -6800 -970 6696 1080 -6758 -960 6977 747 -6866 -1075 6492 1273
1825A273q013N828P399n409p542N193P658n280o822M491P022m430o804M064O558
$$ 1273 -6740 -912 6487 1078 -6464 -1271 6387 1107 -5715 -1224 5798 1368 -5436 -1372 5186
1840E186l528o578L690N792l056n935K744N619k109n271J688M839j336m289O24
$$ 5186 1658 -4920 -1230 4562 1506 -4429 -1685 3934 1825 -3446 -1758 3081 1745 -2544 -1920
1855a920M214l7m136r2L247J102l307j268K641J967k347k703J964L400j634l744
$$ -1920 2294 2257 -1879 -1971 1276 2378 -929 -2197 444 2411 64 -2639 -675 2725 1091 -2653
1871b653J407M126j109m850Q36M854J63n628m36N881R31o347j198O694J521o390
$$ -2653 -1246 2880 1771 -3079 -2243 2611 2774 -2854 -3290 2591 3522 -2825 -4023 2671 4192 -2198
1887b198k206O938K470p336k820P120L560p801l502P682L689p395l837O827M511
$$ -2198 -4404 2534 5004 -2332 -5152 1968 5528 -2273 -5775 1907 5596 -1799 -5636 1191 5702
1902E702o475m888O021N152n936m975N594M915m775n354M555N360m140n391L601
$$ 5702 -773 -5661 360 5512 -424 -5399 195 5110 335 -5019 -464 4896 756 -4635 -1034
1917a034N534k844n744K445N413j989m715J002M281N2m217o47M094Q83l564j565
$$ -1034 4500 1656 -4088 -1643 3770 1781 -2934 -1932 2349 2401 -1816 -2463 1631 2514 -1050 -2615
1933b615L394J795l030j981K932K503k558l539K203L456j087l907J009L542j05
$$ -2615 779 2574 -456 -2437 495 2998 440 -3099 -896 2560 1473 -2434 -1425 2117 2012
1948B012l976k33L843R54m076j348M918P09m560j019M311J360m540j581M527J636
$$ 2012 -1964 -2197 1646 2600 -1476 -2824 2094 2803 -1757 -2776 1535 2895 -1645 -3226 1301 2937
1964B937l973j775L899J944l713k216L040K404k912k128L209J866k575k321K566
$$ 2937 -1036 -2811 1088 3032 -681 -2897 143 2547 -365 -2493 716 2582 7 -2314 252
1979B52J604k423j533K877J195k090j713J830R30j617k98J590J1q77K06N85l42
$$ 252 1856 -567 -2100 777 1972 -118 -1831 -1 929 -688 -986 604 615 -262 -56 529 187
1996A87p93M43M19m64R4N72N11r01q83J262J80j476m46K235K77k077n9K053q9
$$ 187 -606 -163 256 -208 -114 458 969 68 -815 447 627 -849 -1295 940 1217 -860 -919 1134 1045
2015A045k197j55K070k03j575J055J288p16j809O45J125o61r21J402P97q61r00
$$ 1045 -1152 -1307 763 560 -1015 40 1328 612 -1197 -552 573 -88 -1009 393 1190 329 -571
2032e71O08l8o95j38R83N57j184J02J270n02j757N38K089q31j937J839J564j782
$$ -571 37 -1 -696 -834 149 706 -478 -376 894 392 -1365 -827 1262 431 -1506 333 1897 115
2050A15k460K413J893k588j628K966J874l005j939L004J970l519j711L218J819
$$ 115 -2345 68 1961 -627 -2255 711 2585 -420 -2359 645 2615 -904 -2615 603 2422
2065B422k991j769L357K110l792k683L747K102l250k005M071K097m271k144L668
$$ 2422 -569 -2338 1019 3129 -663 -3346 401 2503 -747 -2752 1319 3416 -855 -2999 669
2080F69J314l540r20L919P95l054n29K298j19k290J80K226M97j791k0J106m19
$$ 669 1983 -1557 -2477 1442 2237 -817 -1346 952 833 -1457 -1277 949 1446 -345 -365 741 322
2097C22j322N50P42l20m89J143L91j582j56J803n79k390J099K563j131k656K071
$$ 322 -1000 -450 292 -28 -517 626 1017 -565 -721 1082 503 -1887 -788 1775 644 -2012 59
2114E9K473k500k885K932K305k881k130L553K499l748k787L154K643l417k532
$$ 59 2532 32 -2853 79 2384 -497 -2627 926 3425 -323 -3110 44 2687 -730 -3262
2129c262L852K887l463k835K913K735l775k794M385K724l862k181M009J381m627
$$ -3262 590 3477 14 -2821 92 2827 -948 -3742 643 3367 -495 -2676 1333 2714 -1913
2144a913j079M095J420l786o10L636r2k872k84K488J1k650J154J999q64k065J129
$$ -1913 -2992 1103 2523 -1263 -1873 1763 1671 -1201 -1485 1003 1014 -1636 -482 1517 653 -1412 -283
2161b83J700j441j778J746J797j703j594K625R57l179p17K824N68l392L55M181
$$ -283 1417 -24 -1802 -56 1741 38 -1556 1069 2026 -1153 -1870 954 1522 -1870 -1515 2666
2177B666o04m196N20L806r32m015J541M144j419m112J460L781k061l385J730L889
$$ 2666 2062 -2134 -1614 2192 1260 -2755 -1214 2930 1511 -2601 -1141 2640 579 -2806 -1076 2813
$$ [...]
8191d8
##END NTUPLES=NMR FID
##END=
