##TITLE=1H_Pr 5037-E
 200.13MHz,CDCl3,
 8 sc
 
 11.11.2025
##JCAMPDX= 6.0         $$ Bruker NMR JCAMP-DX V2.0
##DATA TYPE= NMR FID
##DATA CLASS= NTUPLES
##ORIGIN= UXNMR, Bruker Analytische Messtechnik GmbH
##OWNER= pz
$$ XWIN-NMR		Version 3.5
$$ Tue Nov 11 16:00:48 2025 Russian Standard Time (UT+4h)  she@DPX200
##.OBSERVE FREQUENCY= 200.1313
##.OBSERVE NUCLEUS= ^1H
##.DELAY= (6, 6)
##.ACQUISITION MODE= SIMULTANEOUS
##.ACQUISITION SCHEME= undefined
##.AVERAGES= 8
##.DIGITISER RES= 18
##SPECTROMETER/DATA SYSTEM= spect
##.PULSE SEQUENCE= zg30
##.SOLVENT NAME= CDCl3
##.SHIFT REFERENCE= (INTERNAL, CDCl3, 0, 14.3821)
##AUDIT TRAIL= $$ (NUMBER, WHEN, WHO, WHERE, WHAT)
$$ ##TITLE= Audit trail, XWIN-NMR		Version 3.5
$$ ##JCAMPDX= 5.01
$$ ##ORIGIN= Bruker BioSpin GmbH
$$ ##OWNER= she
$$ F:/spectra/data/she/nmr/H-C/1/audita.txt
$$ ##AUDIT TRAIL=  $$ (NUMBER, WHEN, WHO, WHERE, WHAT)
(   1,<2025-11-11 15:59:22.04 +0400>,<she>,<DPX200>,
      <created by zg, POWCHK disabled, PULCHK disabled
       configuration hash MD5:
       00 E9 B6 7A A2 85 ED C7 34 08 36 98 17 FE 4E 26
       data hash MD5: 16K
       B5 E8 8E DB 98 AF 43 29 8C E8 53 91 99 57 3D A1>)
$$ ##END=
$$ 
$$ hash MD5
$$ 52 75 82 7B 07 8C E8 CC 91 5F E2 F9 8F 1A D5 E0
##$RELAX= 
##$RELAX= 
##$RELAX= 
##$RELAX= 
##$RELAX= 
##$RELAX= 
$$ Bruker specific parameters
$$ --------------------------
##$DU= <F:/spectra>
##$EXPNO= 1
##$NAME= <H-C>
##$PROCNO= 1
##$TYPE= <nmr>
##$USER= <she>
##$AMP= (0..31)
100 100 100 100 100 100 100 100 100 100 100 100 100 100 100 100 100 100 
100 100 100 100 100 100 100 100 100 100 100 100 100 100 
##$AQSEQ= 0
##$AQ_mod= 1
##$AUNM= <au_zg>
##$AUTOPOS= <>
##$BF1= 200.13
##$BF2= 200.13
##$BF3= 200.13
##$BF4= 200.13
##$BF5= 200.13
##$BF6= 200.13
##$BF7= 200.13
##$BF8= 200.13
##$BYTORDA= 1
##$CFDGTYP= 0
##$CFRGTYP= 5
##$CHEMSTR= <none>
##$CNST= (0..31)
1 1 145 1 1 1 1 1 1 1 1 1 1 1 1 1 1 1 1 1 1 1 1 1 1 1 1 1 1 1 1 1 
##$CPDPRG= <>
##$CPDPRG1= <>
##$CPDPRG2= <>
##$CPDPRG3= <>
##$CPDPRG4= <mlev>
##$CPDPRG5= <mlev>
##$CPDPRG6= <mlev>
##$CPDPRG7= <mlev>
##$CPDPRG8= <mlev>
##$CPDPRGB= <>
##$CPDPRGT= <>
##$D= (0..31)
0 0.7 0 0 0 0 0 0 0 0 0 0.03 0 0 0 0 0 0 0 0 0 0 0 0 0 0 0 0 0 0 0 0 
##$DATE= 1762862361
##$DBL= (0..7)
120 120 120 120 120 120 120 120 
##$DBP= (0..7)
150 150 150 150 150 150 150 150 
##$DBP07= 0
##$DBPNAM0= <>
##$DBPNAM1= <>
##$DBPNAM2= <>
##$DBPNAM3= <>
##$DBPNAM4= <>
##$DBPNAM5= <>
##$DBPNAM6= <>
##$DBPNAM7= <>
##$DBPOAL= (0..7)
0.5 0.5 0.5 0.5 0.5 0.5 0.5 0.5 
##$DBPOFFS= (0..7)
0 0 0 0 0 0 0 0 
##$DE= 6
##$DECBNUC= <off>
##$DECIM= 32
##$DECNUC= <off>
##$DECSTAT= 4
##$DIGMOD= 1
##$DIGTYP= 9
##$DL= (0..7)
0 120 120 120 120 120 120 120 
##$DP= (0..7)
150 150 150 150 150 150 150 150 
##$DP07= 0
##$DPNAME0= <>
##$DPNAME1= <>
##$DPNAME2= <>
##$DPNAME3= <>
##$DPNAME4= <>
##$DPNAME5= <>
##$DPNAME6= <>
##$DPNAME7= <>
##$DPOAL= (0..7)
0.5 0.5 0.5 0.5 0.5 0.5 0.5 0.5 
##$DPOFFS= (0..7)
0 0 0 0 0 0 0 0 
##$DQDMODE= 0
##$DR= 18
##$DS= 0
##$DSLIST= <SSSSSSSSSSSSSSS>
$$ [...]
##$SUBNAM0= <"">
##$SUBNAM1= <"">
##$SUBNAM2= <"">
##$SUBNAM3= <"">
##$SUBNAM4= <"">
##$SUBNAM5= <"">
##$SUBNAM6= <"">
##$SUBNAM7= <"">
##$SUBNAM8= <"">
##$SUBNAM9= <"">
##$SW= 18.0517328524113
##$SWIBOX= (0..15)
0 0 2 0 0 0 0 0 0 0 0 0 0 0 0 0 
##$SW_h= 3612.71676300578
##$TD= 16384
##$TD0= 1
##$TE= 0
##$TE2= 300
##$TE3= 300
##$TEG= 300
##$TL= (0..7)
0 120 120 120 120 120 120 120 
##$TP= (0..7)
150 150 150 150 150 150 150 150 
##$TP07= 0
##$TPNAME0= <>
##$TPNAME1= <>
##$TPNAME2= <>
##$TPNAME3= <>
##$TPNAME4= <>
##$TPNAME5= <>
##$TPNAME6= <>
##$TPNAME7= <>
##$TPOAL= (0..7)
0.5 0.5 0.5 0.5 0.5 0.5 0.5 0.5 
##$TPOFFS= (0..7)
0 0 0 0 0 0 0 0 
##$TUNHIN= 0
##$TUNHOUT= 0
##$TUNXOUT= 0
##$USERA1= <user>
##$USERA2= <user>
##$USERA3= <user>
##$USERA4= <user>
##$USERA5= <user>
##$V9= 5
##$VALIST= <valist>
##$VCLIST= <CCCCCCCCCCCCCCC>
##$VD= 0
##$VDLIST= <DDDDDDDDDDDDDDD>
##$VPLIST= <PPPPPPPPPPPPPPP>
##$VTLIST= <TTTTTTTTTTTTTTT>
##$WBST= 1024
##$WBSW= 4
##$XGAIN= (0..3)
0 0 0 0 
##$XL= 0
##$YL= 0
##$YMAX_a= 216199
##$YMIN_a= -252568
##$ZGOPTNS= <>
##$ZL1= 120
##$ZL2= 120
##$ZL3= 120
##$ZL4= 120
##$ABSF1= 10
##$ABSF2= 0
##$ABSG= 5
##$ABSL= 3
##$ALPHA= 0
##$AQORDER= 0
##$ASSFAC= 0
##$ASSFACI= 0
##$ASSFACX= 0
##$ASSWID= 0
##$AUNMP= <proc_1d>
##$AZFE= 0.1
##$AZFW= 0.1
##$BCFW= 1
##$BC_mod= 2
##$BYTORDP= 1
##$COROFFS= 0
##$CY= -3
##$DATMOD= 1
##$DC= 2
##$DFILT= <>
##$DTYPP= 0
##$F1P= 0
##$F2P= 0
##$FCOR= 0.5
##$FTSIZE= 0
##$FT_mod= 4
##$GAMMA= 1
##$GB= 0.15
##$INTBC= 1
##$INTSCL= 1
##$ISEN= 128
##$LB= 0.25
##$LEV0= 0
##$LPBIN= 0
##$MAXI= 10000
##$MC2= 0
##$MEAN= 0
##$ME_mod= 0
##$MI= 1.114404
##$NCOEF= 0
##$NC_proc= 0
##$NLEV= 6
##$NOISF1= 3.799351
##$NOISF2= 2.8
##$NSP= 1
##$NTH_PI= 0
##$NZP= 0
##$OFFSET= 14.38212
##$PC= 1
##$PHC0= -2621.365
##$PHC1= 7.392366
##$PH_mod= 1
##$PKNL= yes
##$PPARMOD= 0
##$PSCAL= 0
##$PSIGN= 0
##$REVERSE= no
##$SF= 200.129724274929
##$SI= 16384
##$SIGF1= 3
##$SIGF2= 2
##$SINO= 400
##$SIOLD= 16384
##$SREGLST= <1H.CDCl3>
##$SSB= 0
##$STSI= 0
##$STSR= 0
##$SW_p= 3205.1282051282
##$SYMM= 0
##$S_DEV= 0
##$TDeff= 0
##$TDoff= 0
##$TI= <>
##$TILT= no
##$TM1= 0
##$TM2= 0
##$TOPLEV= 0
##$USERP1= <user>
##$USERP2= <user>
##$USERP3= <user>
##$USERP4= <user>
##$USERP5= <user>
##$WDW= 1
##$XDIM= 8192
##$YMAX_p= 0
##$YMIN_p= 0
$$ End of Bruker specific parameters
$$ ---------------------------------
##NTUPLES= NMR FID
##VAR_NAME=  TIME,          FID/REAL,        FID/IMAG
##SYMBOL=    X,             R,               I
##VAR_TYPE=  INDEPENDENT,   DEPENDENT,       DEPENDENT
##VAR_FORM=  AFFN,          ASDF,            ASDF
##VAR_DIM=   8192,          8192,            8192
##UNITS=     SECONDS,       ARBITRARY UNITS, ARBITRARY UNITS
##FACTOR=    0.0002768,     1,               1
##FIRST=     0,             0,               0
##LAST=      2.2672688,     0,               0
##MIN=       0,             -252568,         0
##MAX=       2.2672688,     216199,          0
$$ Real data points
##PAGE= N=1
##DATA TABLE= (X++(R..R)), XYDATA
$$ [...]
1694C8p2N8j19R9O7k7j9o1Q8J90l79L23j75m6j46J69K94l02j21J11N6M4m1k06
1718a77R4L4j1K06J32l92Q9J64j78J1J86Lk3l56K38j6O9k15M9J55J9k4L3k0k3
1743D7j10l2N5K1j69Q8J04n5O5M5J56k91J51O4j46o7J6j31L32j34p2j18M5J13
1767b3j09L52l78J30LM1q8J0J69j58O1j52K58k6M4m1l9L09l25j76J03J65j62Q9
1791E7K5k76M09j72l1J20j65J80Q6j99N4q3on4q8P0R3j29l3K56L1q4k2j59L49
1816B29k92p7J46r7J04k22K73l7j20q7K33o9j29J98J5j5j16k2K49j36j46j68K79
1839gj02P3j15K58K3l9l4r2J78j97K05k71K2J9K18k12n4J2OJ64k3J26j0j29K39
1864B58j11p0q4k33J81K46k37L9p4J70j26m0J48k80J86P5J7J74m30J94j3J05p8
$$ plain form
1694 38 -34 24 -95 4 71 44 25 -36 52 242 -137 186 11 -35 -181 -12 282 -20 -141 -30 26 70 29 -177
1718 -177 -83 -49 -60 146 278 -114 -25 139 -39 -28 158 161 138 -218 20 4 73 -142 -93 62 81 57 90 70 47
1743 47 -63 -95 -40 -19 -188 -100 4 -51 14 59 215 -76 75 139 -7 -74 -58 -189 143 9 -63 -181 -136 -23
1767 -23 -132 220 -158 -28 -25 16 -72 -62 107 -51 10 -142 116 90 134 93 54 363 38 -138 -35 130 -32 57
1791 57 82 -194 215 43 12 132 -33 147 233 34 88 5 -1 -55 -143 -73 20 -109 -142 114 145 61 39 -120 229
1816 229 -63 -140 6 -91 13 -209 64 27 -93 -180 53 -16 -145 53 68 53 -63 -85 164 28 -118 -286 -7
1839 -7 -109 -36 -151 107 130 91 57 -35 143 -54 151 -120 -98 -79 139 -73 -127 -115 -109 55 32 158 148 19 258
1864 258 147 77 -7 -240 -59 187 -50 -11 -85 85 -41 -81 67 -213 -27 48 65 239 -191 3 -10 95 17
1887A7j91J66j6p5J77m1n4r2Q9J19j32N0j27L69m09K96j69P0K9p7K07j27j02J3
1911a0Q8j21J01K81k07k40L27j21j10J83PJ5l14q2J87p5J40l13O1K50n8J0N0O9
1935A18j33lj24K56j70o3J61j97kJ79O9o3J28k81O8P4j92L86j53m5J98k06p6l9
1959a10J94Rk18l5J1O9R2j57J21M9L1j75P8J3L7J47k03r9L19j84J62r9k00J28
1983b0l6k20K83n9j30J74j19K05qOL2k13j19L53K37m47K31k45K00j58J51o1Rn6
2007a0K0j75O5J01J2l4J30r3j43O6J20k7j43J45J3J77k31j93K80l7q1J93k33P5
2031cJ75k38J12j96J96R0M8k84J55p9l5j3J88j97O4k15J19L21k3j16r7RN0j03
2055g2L6J04j09k08L80J10l24O5j27K02o0j28K05p4j32J03N1K18n50M37k4j1o0
$$ plain form
1887 17 -174 -8 -24 -99 78 37 -17 -109 -20 99 -33 17 -110 259 -150 146 -23 47 76 -1 206 79 -23 -10
1911 -10 78 -43 58 339 132 -108 219 98 -12 171 178 193 -121 -203 -16 -91 49 -264 -203 47 -11 -1 49 118
1935 118 -15 -18 -142 114 -56 -119 42 -155 -157 22 91 28 156 -125 -57 17 -175 211 58 13 211 5 -71 -110
1959 -110 84 93 -125 -160 -149 -80 12 -145 -24 25 56 -119 -41 -28 9 156 -47 -146 173 -11 151 52 -148 -20
1983 -20 -56 -276 7 -52 -182 -8 -127 78 70 76 108 -105 -224 129 366 -81 150 -95 105 -53 98 37 46 -10
2007 -10 10 -165 -100 1 13 -21 109 16 -127 -61 59 32 -111 34 47 224 -7 -200 80 43 -38 155 -78 -3
2031 -3 172 -66 46 -150 46 136 184 -100 55 -24 -59 -72 116 -81 -17 -232 -113 208 185 69 -28 -19 31 -72
2055 -72 -36 68 -41 -249 131 241 -83 -18 -145 57 -3 -131 74 0 -132 -29 22 240 -310 127 103 92 32
2078C2q0n7J07q3j36J80J75k07J2K29j99M3l1j78J66p0J44L2p7OP4j69K29qR4
2103B28q9q7J3k67K47m3L9l6K8M8k21n5K68J19k22J00O7j62O0l6kj8K22j80l2
2128a1n0J19j39K02j31l8Rr0J47l58L33J94k75q3N0j2J62j12P7J28k47LL5%J14
2153B7m5J77j41o1j05L7L6L4L1n9J87k40m0K44j85O3j0N8Ppj22q4J15R5P1M2j49
2180b4j95K14l9k7O6J7K8l3M3r1OR8J6l59K47j77K07q8O2O4k0K8J3%k23L13q2
2207F4k02J43k12R5L8J79j47j25l1J79j2K33k54J5q2J58qQ5P2l05K10K07n20L7
2231a83K52k38J60J34k38J12M2j88J67Lj34J34Ln5j20J35Q0l1j76L45p5J10l11
2254g2J6J32o7j66L5j03N4K16m4O3o1m2K1Q5o8n4J3j9j01J12J7P4k1J8j02j77
$$ plain form
2078 32 -48 -105 2 -81 -217 -37 138 -69 -57 172 -27 16 -15 -193 -27 -97 47 79 2 8 82 -87 142 134 228
2103 228 139 52 65 -202 45 2 41 5 33 81 -140 -195 73 192 -30 70 137 -25 35 -1 -3 -21 201 21 -11
2128 -11 -61 58 -81 121 -10 -48 -39 -129 18 -340 -7 187 -88 -171 -121 -133 29 -83 -6 122 -125 -122 -87 -87 27
2153 27 -18 159 18 -43 -148 -111 -75 -41 -10 -69 118 -122 -162 82 -103 -40 -50 8 15 8 -114 -198 -83 12 83 125 -24
2180 -24 -219 -5 -44 -71 -5 12 40 7 50 -41 -35 63 79 -280 -33 -210 -3 -91 -29 35 15 43 56 56 -167 146 64
2207 64 -138 5 -207 -112 -74 105 -42 -167 -198 -19 -31 202 -52 -37 -119 39 31 116 188 -117 93 300 -220 -183
2231 -183 69 -169 -9 125 -113 -1 41 -147 20 23 -111 23 26 -29 -149 -14 66 35 -141 204 129 239 -72
2254 -72 -56 76 9 -157 -122 -225 -171 45 1 64 3 -39 -18 67 -1 -55 -42 -61 -162 -50 -33 41 20 38 -64 -241
2280b41L84j85K00k48M3L2Oj37J27K02l26K22j73Q2K5L3m23L94K7m0j12j83P3
2303b18K84p6K7k23K99j96K02j28K65n6j28j10q6N3N6R6R3j08m1k43J52o0K72
2326A26k13l3J18j36J64J37p3o6L7O7j14k21J84J03r4j21J50k21R4N2L4K18k60
2349f8J46p8J9q4M2j92K26k07J57J67j73k99K70J28J07R7k70j81L21j37M9J1j27
2372g6o6K17k25K40r9l5q8J17m6J04K3P9J2j60j1m8o4J79q6r0R5J04j90K34l83
2397b63M19k15m1K83j16k14K06n3M3Q1m1k67K48j44L9J72k99J13j06k71J59J54
2419a13J78k15PQ7J21j13J67J6k03j28J45K74j20j38J21j06r1o3J69rjO8q4J46
2443A15k33J71l9l5J17j71qMR3k43L52j88j91K83J9k8L9Nk18K95k57J74k17Q5
$$ plain form
2280 -241 143 -42 158 -90 -47 -15 -9 -146 -19 183 -143 79 -94 -12 13 46 -377 17 44 4 -108 -291 -218
2303 -218 66 -10 17 -206 93 -103 99 -29 236 180 52 -58 -144 -91 -35 61 154 46 5 -238 -86 -146 126
2326 126 -87 -120 -2 -138 26 163 90 24 61 128 14 -207 -23 80 -14 -135 15 -206 -112 -60 -26 192 -68
2349 -68 78 0 19 -65 -23 -215 11 -196 -39 128 -45 -344 -74 54 161 258 -12 -193 128 -9 40 51 -76
2372 -76 -142 75 -150 90 -9 -44 -132 -15 -61 43 66 145 157 -3 -14 -62 -126 53 -33 -123 -28 76 -114 120 -263
2397 -263 156 -59 -100 183 67 -147 59 6 49 130 89 -178 70 -74 -35 137 -162 -49 -155 -426 -267 -113
2419 -113 65 -150 -143 -56 65 -48 119 135 -68 -196 -51 223 103 -35 86 -20 -111 -174 -5 -14 -15 53 -31 115
2443 115 -118 53 14 -21 96 -75 -83 -79 14 -229 123 -65 -256 27 46 18 57 62 -156 139 -118 56 -161 -76
2467g6n7K35p9K91k60j3j70P0Q6o3l7J26k04K01j32J92k45J40j03K45j36j68K2
2490a35P5R6J86k91J51k42r3J23m9J66j15L93k76m6j18J33p8M6PJ17k8N6n5j25
2514a02J01Pj12K31q8j2q1j35K41M5j15Jl7J9m6K63j32k36J38J15P3j59j1N2j16
2539i6n5J70P5nj17j06j12K67q8o1L4Q9N1Ok88R5J12j2L25j42j24rJ14j26J42
2564A39j73M8j85J7L00l16J52r8MK45q3J46l76K86n6j63J28J65j11O8j42j16j03
2587b24J61J41k79M33l36J39K9l7J86l45N1K08O3j32k54K21L3j01j21K15R8j18
2609C1j10J3qJPp0K02k9k23L88l41K94o4o9j10J11qm8J29j00J17l74K61j47J44
2634cn5J72l03K54j49n3N2j0J41q5j60R2J35j64P3j81L24o7l6K4P9J35l16J38
$$ plain form
2467 -76 -133 102 23 314 54 41 -129 -59 27 -36 -73 53 -151 50 -82 110 -135 5 -98 147 11 -157 -135
2490 -135 -60 36 222 -69 82 -160 -253 -130 -179 -13 -128 265 -11 -57 -175 -42 -120 -74 -67 50 22 78 23 -102
2514 -102 -1 6 -106 125 37 25 -56 -191 50 95 -20 -19 -56 -37 -83 180 48 -188 -50 65 138 -21 -32 20 -96
2539 -96 -151 19 94 89 -28 -134 -246 21 -67 -128 -94 -5 46 52 -236 -141 -29 -41 284 142 18 9 123 -3 139
2564 139 -34 14 -171 -154 146 -170 -18 -116 -112 133 50 196 -180 106 50 -113 15 180 69 137 -5 -121 -224
2587 -224 -63 78 -201 232 -104 35 64 27 213 -132 -81 127 190 58 -196 25 58 -43 -164 51 149 31
2609 31 -79 -66 -74 -73 -66 -136 66 37 -186 202 -139 155 91 22 -88 23 15 -33 96 -4 113 -261 0 -147 -3
2634 -3 -58 114 -189 65 -84 -137 -85 -95 46 -39 -199 -107 28 -136 -63 -244 80 13 -23 1 80 215 -101 37
2658C7o8N5J53p6k13K01j21k3K79j46n5R7mK3k7j16n5l0qK67j3k11J11n4q3J41
2684F1j51J2k8J63o0p0K51Pj66N6k98N0K83j23r1K18n2k03Q1K67k21j22q5J74
2708d7j3pJ59m3j20L0j19J85Q3j89J31r0r9N3o0K09j34k8R4R4j08j42K74j17J84
2733A80k33k16J91K56j09k43Q9J05J06k03P1J68j55j03R1L7P8j76NM9j1j29J35
2756a7L7j56O6P3o7O3M3k71K78q8P3n1O3J25k53Q1j31J00j98K23M2L2KP1j06j49
2782a15J99k35K87N1o9l37K32m1j25k6L29k98N2n0J6J22J34j68R0j2q0J61p2J54
2806A99l90L54j15%q4n3K58l57P9J57j27J03j7j4Rj7M3P9p2k5r6J14P3O8k28o6
2832a25K54k36q1Q8J47l38K35l8j0L07k20J14j05Q8j72K48k13J71Rk3j85J33k48
$$ plain form
2658 37 -31 24 177 101 -112 89 -32 -55 224 78 23 120 116 139 112 -4 -59 -89 -97 170 157 -54 57 3 -80 61
2684 61 -90 -78 -106 57 -3 -73 178 185 19 75 -223 -173 110 -13 -104 114 62 -141 -60 207 -14 -136 -221 -47
2708 -47 -60 -67 92 49 -71 -41 -160 25 108 -81 50 -40 -139 -86 -146 63 -71 -99 -5 89 -19 -161 113 -4 180
2733 180 -53 -269 -78 178 69 -174 -85 20 126 -77 -6 162 7 -96 -5 32 110 -66 -61 -12 -23 -152 -17
2756 -17 20 -136 -70 3 -64 -1 42 -229 49 -39 34 -17 46 171 -82 -1 -132 -32 -230 -7 35 67 69 140 34 -115
2782 -115 84 -151 136 187 118 -219 13 -28 -153 -179 150 -148 -96 -146 -130 -8 126 -42 48 36 -44 117 45 199
2806 199 -191 163 48 48 -36 -89 169 -188 -109 48 -79 24 7 -7 2 -15 28 107 35 10 -86 28 101 169 -59 -125
2832 -125 129 -107 -188 -100 47 -291 -56 -94 -104 203 -17 97 -8 80 -92 156 -57 114 123 100 -85 48 -200
2855b00K00k26Q3%O1lN0J61k54J15P9O0OJ52k76j53J43j31J81p3rj35J75j44n8
2880a96J58m0r9J93k76M6K22L7o6K99q4k09L0m0L6N1q2J1J05k58L08j14p1j3j25
2905a77L6K12o8K7k9J62k33N1N3q8j45K67J02j83m0J30q4l0P3j21J93j80o7J86
2929D7m1J65j47k7R4q4o5P3K04k46K16l4k10K68l01R4j84q9K24o9L25j39j64M5
2953d5K14l32J65p1K29j62j38j05L65k24J33M2k45J01L0L7l5j47K16r4J47r7k19
2976b35M01j73J18j26J75j89J66r4p7K9K1j4j91N0J44%j27Q5L0o5L42k41j16J21
3000C4j88M7R1K30m56K71k25L81j73j37J04%O1j8k57L93j37n4j04K09j21K02m7
3023A06o0j77J6L99k34l5j64J93o9J20j90J48j66J78j43P1q4L25j39m0M0j92J3
$$ plain form
2855 -200 0 -226 -143 -143 -82 -85 -35 126 -128 -13 66 126 132 284 8 -145 -2 -133 48 -25 -34 -169 6 -138 -196
2880 -196 -38 -78 -177 16 -260 -214 8 45 -21 278 194 -15 15 -25 11 62 -20 -9 96 -162 146 32 -39 -52 -177
2905 -177 -141 71 3 30 1 163 -70 -19 34 -54 -199 68 170 -13 -53 77 -7 -37 36 -85 108 -72 -139 47
2929 47 6 171 24 -3 91 7 -58 15 219 -27 189 155 -55 213 -88 6 -178 -267 -43 -112 213 74 -90 -45
2953 -45 169 -163 2 -69 160 -2 -140 -245 120 -104 29 71 -174 -73 -43 -6 -41 -188 28 -66 81 -16 -235
2976 -235 166 -7 111 -15 160 -29 137 43 -34 -5 16 2 -189 -139 5 5 -122 -37 -7 -72 270 29 -87 34
3000 34 -154 -107 -16 214 -242 29 -196 185 12 -125 -21 -21 40 22 -235 158 21 -33 -137 72 -49 153 106
3023 106 46 -131 -115 284 50 15 -149 44 -25 95 -95 53 -113 65 -78 -7 -91 234 95 55 95 -97 -84
3046h4r7K67k77J74k9j5l1k45K39J41k0Qr2k26K90j40%OJ48l4q9K33j33K13k6
3071A81k3r3J08k38L1p5L3LPJ97j58n9K55l74K49P9p2n7q1K7O3j03K7M3K01j82
3097a1P6R2j39O1j91J80k44K8R7J52j90lR8k3P2R0p4Q8j46n5L6J3Q3j22O0o9J59
3124A18p3p0j51L30j72k06l2M02%j58J48j14P3R9l42J58n5N5q3j3o1J29o0j62
3148b40M71j96J76m22K90k31J69p6J34JJ6j67p9J08P0L7j48N0Q1J10l92M46l59
3171a51J80m1m8K45j60n4K07R3o5l22L86m76J13p0K33p5K32k08p6j02j8J14J35
3194G2j46L1K51l60l3L05j99K5Q5j16J21j44R0L9j76J44j60J75l7R5J8r1N3l0
3218A2J13l67K82j5Oo5K74k3k48J74j41j37J64Rj30J48k6p6k9J21Oj77K3o7K1
$$ plain form
3046 -84 -181 86 -191 -17 -46 -61 -92 -337 -98 43 23 31 -61 -287 3 -137 -137 -131 17 -17 -106 127 -6 207 181
3071 181 158 65 173 -65 -34 -109 -76 -73 -66 131 -27 -86 169 -205 44 123 51 -6 -87 -60 3 -100 -73 -30 171 -11
3097 -11 65 157 18 79 -112 68 -176 -148 -51 101 -89 -92 6 -17 55 145 71 159 13 -42 -6 7 90 -32 28 -41 118
3124 118 45 -25 -176 154 -18 -224 -256 146 146 -12 136 22 95 194 -148 10 -45 10 -73 -86 -147 -18 -78 -240
3148 -240 231 35 211 -211 79 -152 17 -59 75 76 92 -75 -154 -46 24 61 -87 -37 44 154 -238 208 -151
3171 -151 29 -12 -60 185 25 -29 178 271 206 -116 270 -206 -93 -163 70 -5 227 19 -57 -159 -177 -63 72
3194 72 -74 -43 208 -152 -185 120 -79 -54 31 -85 36 -108 -18 21 -155 -11 -171 4 -33 62 80 -11 42 12
3218 12 125 -242 40 25 31 -34 240 217 -31 143 2 -135 29 38 -92 56 30 -46 -75 46 52 -125 -102 -169 -148
3243a48J89j21P8m7k8K02k49J33k51N57m35J24k8p7j5R7o1m7J93k4L5M0k02P6
3267ij07J68R1k04K87j70j02Q0k2M9j67J17j15J04K3r7J87j46J0j13n1k5J14k6
3291a24K38j45M0O3k3M8q1o7M9j60m0L69k29q9Q7n3jR2j0j0J99l34J26Q0M5o3
3317GP7Q2j67O7LK0q9l18K34j22L13k29O8j87J75j7nj43L14j83K59j00o2j68J21
3342e0J49M3k02Q8R6j77o7J14p7J42j4K06k07p7J18j0r1K0R6j7j30J51n8r2J48
3367A02j75Q3m0p9k4J83j55Q1R3J0j77L19m6j32l6J22l8q0m7R6j12j49K54o6k1
3392c4l6J46M7k45J03K38j75j44J10L4m8J8k6j1R5j69j59j4J72J32k18K44o6l8
3416d4k4M0q2J64n2J4K29l71J21r4K3M6O0K1L1q4r5J16O1j30K00k46J00j19J28
$$ plain form
3243 -148 41 -80 -2 -49 -77 125 -124 9 -242 315 -120 4 -24 -101 -116 -19 -80 -127 66 42 77 117 -85 -9
3267 -9 -116 52 143 -61 226 56 -46 34 12 61 -106 11 -104 0 23 -74 113 -33 -23 -136 -187 -212 -98 -124
3291 -124 114 -31 9 72 49 97 16 -51 -2 -162 -202 167 -62 -151 -64 -117 -118 -26 -36 -46 153 -181 -55 25 70 7
3317 7 84 166 -1 66 69 89 0 -318 -84 -206 107 -122 -54 -241 -66 -83 -88 -231 83 -100 159 59 -3 -171 -50
3342 -50 99 142 -60 28 124 -53 -120 -6 -83 59 45 251 44 -33 85 75 -16 4 100 83 -47 104 46 -46 102
3367 102 -73 10 -30 -109 -133 50 -105 -24 69 79 -98 221 175 43 7 129 91 11 -36 60 -52 -201 53 -13 -34
3392 -34 -70 76 123 -122 -19 219 44 -100 10 44 -4 14 -12 -23 72 -97 -256 -270 -98 34 -184 60 -6 -44
3416 -44 -68 -28 -110 54 2 16 245 -126 -5 -99 -76 -30 30 51 82 -2 -97 19 80 -50 150 -96 4 -115 13
3441A3J77j46k7j44K43j72pJ40k85L06K0n87L75K15O3k53k8K83o8j08m5p0l6J94
3465E3o6J21P4m3j59k30L06q6m2J37j09k6K16l4j14r1K17R2k11k4p0K32Q2l31
3489a06J01j33K24K8m1q4K82k78P9k53j21L55p2Q6N7o9p1J61pk72R2lK82l29J03
3514A1k8M0q6P5J05q0K3r7r9j0M3J16j04l4M8P6k50r4L20L30j55j7j78J10j08
3539d3L9l44K68P0k33J69j12K31Q9j34RJ42k72L0Q8Q2k7P7j22pj98K92r7L1J26
3564A54k91QR0M3R8r9M1o4J37J41l08K57j82M4j33M2K66k29N9lQj59J42j86J37
3589A3J08o5o8J82j04k26N1J54j38j9N5J55O0l56J98Mr2M6J20j66J81P8j69J4
3613A6l6r3P5L6j47K85j26J44l55J59o7K01n2L8k02n2L75p4q3j50J95P8k8j49
$$ plain form
3441 13 190 44 17 -127 116 -56 -63 77 -208 98 118 -469 -94 121 184 -69 -97 186 118 10 -35 -105 -141 53
3465 53 -13 108 182 139 -20 -250 56 -30 -72 65 -44 -70 146 112 -2 -93 124 216 5 -19 -89 143 225 -106
3489 -106 -5 -138 86 114 73 -11 271 -7 72 -181 -302 53 -19 67 124 55 -16 145 138 -134 -42 -45 237 -92 11
3514 11 -17 23 -63 12 117 37 60 -37 -136 -146 -103 13 -91 -125 -77 -1 -251 -345 -25 305 150 133 -45 65 -43
3539 -43 -4 -348 -80 -10 -243 -74 -186 45 134 0 9 151 -121 -91 -3 79 52 129 7 0 -198 94 -3 28 154
3564 154 -137 -129 -39 4 102 3 44 -20 117 258 -50 207 25 69 -64 -22 244 15 74 71 79 -80 62 -124 13
3589 13 121 56 -12 170 66 -160 -109 45 -93 -112 -57 98 158 -198 0 4 -88 -42 78 -88 93 171 2 16
3613 16 -20 -113 -38 -2 -149 136 10 154 -201 -42 -109 92 40 78 -124 -176 199 125 42 -108 87 165 137 -12
3637a2j95J47j42M29l48J98o0J23j77m7O6M0q5k5K38n4o6j35J49KR7k60J02J47
3661A32j73k1J03L1P2k45K01j32q8K87N3k92J6J12N3j92j10P4K6lL5J88J05m84
3685b52J98K19q5P5o9j40J03j53L05k22p0J04q3K3O1O2m0J06l03o4K75j60J18
3708HK23l02p2k0L3K03q5J88p4j56j53J35j6K51Lj47m2K5K80j82j27j19N6J04
3732A4J17n2n4r1m3K32j43j28L3j3K92j65J36r2J02n2j4j95J08j11J94j81J25
3755A9K2P2j91m4K31k16Q5Q9j92J23n1o0K73m0k28J39r7K7O9k9k3K23k77K36m73
3780c13M13J18k00j5j37P3K51j25k57J16J25r4M9K69k80p3N8K74m59L09j0J49
3802B41l38J30M4j3k3j59K7J40j2k16K18m0P3k56K42N0l10O6J74L4q4j2J5L3J1
$$ plain form
3637 -12 -207 -60 -202 227 -121 77 17 140 -37 -84 -18 22 -63 -88 150 96 30 -105 44 46 143 -117 -15 132
3661 132 -41 -62 41 72 144 -101 100 -32 -120 167 220 -72 -56 56 109 -83 -193 -119 -93 -96 -61 127 232 -252
3685 -252 -54 165 80 155 86 -54 49 -104 201 -21 -91 13 -70 -47 14 76 36 142 -161 -225 50 -110 8
3708 8 231 -71 -143 -163 -130 73 -12 176 102 -54 -207 -72 -88 163 166 19 -23 2 282 100 -27 -146 -90 14
3732 14 131 79 25 -66 -109 123 -20 -148 -115 -128 164 -1 135 43 145 93 79 -116 -8 -119 75 -106 19
3755 19 41 113 -78 -122 109 -107 -22 67 -125 -2 -53 -113 160 120 -108 31 -66 -39 30 1 -22 201 -76 160 -313
3780 -313 100 218 18 3 -134 -61 190 65 -192 -76 49 -45 4 273 -7 -80 -22 252 -207 102 92 241
3802 241 -97 33 77 64 41 -118 -91 49 37 -179 39 -1 72 -184 58 108 -202 -136 38 72 -12 -24 -9 24 35
3827C5K8j33J53k11K07j15j55K01k50J00P8K3P1j62M3P9qp7K74j68n0J88j38j19
3851a06K63l80K65p8O5M3M3k28J35N5j42J19j3j3L3M9k99J62J0j9J95o4J35l55
3875a25k6J2J01RP2l42J64K74j96Q3l4M7%l6J13l8r8L34n21J47j3Q3P4oj2j23
3901e7L1J60j42j16R2jK12l41J98m5J68l16J35j8JM5r5l1RR8j8J8j86M3J35K28
3927B07k46k9J33qN1j8j18j5j20J88NO5j6j32r4L63J67l62k11O4M0NO1m7lQ7j49
3954a32O8P6K0j27Mq4L73m8l13K22J00j19k12K04J91j99j17JL6J24p9j0N7j03
3978f7J84j2j36q7R2Jj49J87J5nj31J21m9J19o2n0J61k87J62J44j03k55J58R7
4002D8J8j0r6K8J69n2o0k87L15j3p1K8j13O1J59j61j07J69N9j79J34L1Mj80J4
$$ plain form
3827 35 63 -70 83 -128 79 -36 -191 10 -240 -140 -62 -39 32 -130 -87 -8 -16 -93 181 13 -37 151 13 -106
3851 -106 157 -223 42 -36 29 72 115 -113 22 77 -65 54 41 28 61 110 -189 -27 -17 -36 159 95 230 -125
3875 -125 -151 -139 -38 -29 43 -299 -135 139 -57 26 -8 39 39 3 116 78 -20 314 -207 -60 -73 10 84 78 66 -57
3901 -57 -26 134 -8 -124 -32 -33 179 -162 36 -9 159 -157 -22 -40 -39 6 -89 -120 -111 -13 -31 -13 -199 -156 -21 207
3927 207 -39 -68 65 57 108 90 -28 -43 -163 25 30 95 79 -53 -147 216 383 21 -190 -126 -86 -81 -20 -67 -70 17 -132
3954 -132 -64 12 32 -95 -91 -175 198 150 -163 59 159 40 -172 32 223 24 -93 -92 -56 68 -11 -21 36 -67
3978 -67 117 105 -31 -118 -26 -25 -174 13 28 23 -108 13 -36 83 21 -29 132 -155 7 151 48 -207 -49 48
4002 48 66 56 -40 -12 157 105 45 -242 73 60 -11 17 -96 -35 124 -37 -144 25 84 -95 39 70 74 -106 -92
4027i2K47J1k96J34J22j34o5K6LJ1j42K02j30M7n0J06K0K24j02m8jm0k24P1M4
4052e6P0J20k43J19j39m3K23j69J9J54r0K2p7J5q1K11J64k93pJ48k53K02m5j60
4076a89L07k46l9K08r9o9Q3k6J03j01PJ68p2M8j58m5J87k18K50l9o4J00m17J05
4100b16K43m1R0j30qM23l31q1j87M19o6q7o9M8J64j83N0R2p5O4j04j11Qm6Q9Q1
4126C6j49J38J05j00k6l1J20Q1j97L5n8j09J50J23k06L03j27J2r1K0m5Mk31N0
4150a93J82o5J09O3j46L5K40j71l33Q8j20K38m2J16mq8K3R3j49n0J50L6j49J85
4174D8Mr5K35k04j86R3R0J4L3J20l00J08K98k35j34J27J6K1j44N2j22Q2K42k81
4198a18K83k99J01j27m2K49P4o5m2K99m56j62P1L38K6rj65R1J35r5j89J35k56
$$ plain form
4027 -92 155 166 -130 4 126 -8 -73 -47 -44 -33 -175 27 -103 -56 -106 0 20 244 142 94 93 53 -171 -100 -56
4052 -56 14 134 -109 10 -129 -172 51 -118 -99 55 -35 -13 -90 -75 -156 55 219 -74 -81 67 -186 16 -29 -189
4076 -189 118 -128 -167 41 -58 -127 -44 -70 33 -68 -61 107 35 83 -75 -120 67 -151 99 60 -4 96 -321 -216
4100 -216 27 -14 76 -54 -62 361 30 -51 -238 181 115 28 -41 7 171 -12 38 130 55 119 15 -96 -88 -134 -45 36
4126 36 -113 25 130 30 4 -27 93 174 -23 12 -46 -155 -5 118 -88 215 88 100 9 29 -16 -12 -243 -193
4150 -193 -11 -76 33 96 -50 -15 225 54 -279 -191 -311 -73 -115 1 -3 -91 -68 25 -124 -174 -24 12 -137 48
4174 48 52 -43 192 -12 -198 -105 -15 -1 32 152 -148 -40 258 23 -111 16 32 53 -91 -39 -161 -79 163 -118
4198 -118 165 -134 -33 -160 -202 47 121 56 14 313 -143 -305 -234 104 130 121 -44 47 182 87 -102 33 -223
4221b23L25j25J81l2k09P2J3O7j87J92r3O6J34l11pP5L50j41k21J95m17K97K2
4244B3k68K44J0j36J34j68K18%j68k9K38o7J8J12k39n2j7J70j85K81j9j80Pq2
4268a55K79j01p6J12l4r0Rn1L8kR2Q4K2j52p8J68N6Po7k3j51K4J47j14K42k47
4294f1j12L89l43P8J79Kk28q3L01l6j32L0Nr1J28j75L74k15j8P3j64K63p5q7k3
4319b1K02l12K18k9J7j42pK93l38lJ84k63K7J26q2L27j94p8j17J63k5n7N1J5l6
4344h1m1L49l68J90j91L07k94K54l8k47J95r3J59p6j80P0j63J88j60J98K05j31
4366E2K2l03J36J20J69j11j19jN4J47j52k38J58j41M27n15M31j36N7J40l41mK26
4389G8N5j19K16j56Q4j59j73K38j9K8k19K14k7J95k53q7j8J07k14L25j19L3N2
$$ plain form
4221 -223 102 -23 158 126 -83 -11 2 69 -118 74 -19 47 181 -130 -137 -62 288 147 -74 121 -296 1 23
4244 23 -245 -1 9 -127 7 -161 57 57 -111 -140 98 31 49 161 -78 -130 -147 23 -162 119 100 -80 -73 -155
4268 -155 124 23 -53 59 25 -65 -56 -107 -69 -71 21 105 127 -25 -103 65 121 128 61 38 -113 -89 58 -56 186 -61
4294 -61 -173 216 -127 -49 130 132 -96 -179 122 86 -46 -16 -11 -102 26 -149 225 10 -8 65 -99 164 89 2 -21
4319 -21 181 -131 87 58 75 -67 -74 219 -119 -122 62 -201 -174 -48 -130 197 3 -75 -192 -29 -54 -111 -60 -45 -81
4344 -81 -122 227 -141 49 -142 165 -129 125 87 -160 35 -58 101 25 -155 -85 -248 -60 -220 -22 183 52
4366 52 74 -229 -93 27 196 85 -34 -35 19 166 14 -224 -66 -207 220 -295 136 0 57 197 -144 -148 78
4389 78 133 14 230 74 158 -1 -174 64 45 73 -146 68 41 236 -17 -104 -122 -15 -229 96 -23 10 62
4412F2J05k31N1J40j92o7J02J15J05r6p6j53o8K40j81M47l63R3kk3r0K20k92J05
4436d9q7Q8j61K80J5J3j31K63p5q6m2q6P3J13J30k71R7l09L82k09J34m6J96j94
4460C8p5K8k3k58M32n6Q8r4J5k10K21l00J94K7L7j75L42k18k3J75l27K71j40p
4484c8l1m1n6P7O7k8N7q0p0J09M7J50k65J44j26N1J05J1l0J49j49j66J35J10k23
4509i1o9K75r5j60J37J96j77j02K94o7k50M4J49p5J69k36M5M1j83R9J86j67j29
4532a66N6J84R6Q5k00k51J24j22K63k10N1J64p7o5J39j77R6j01J34j17L33j58
4554H1r5R0N9q3k88J68k6P6J40l7o9j09K18n3j39J31J7l2k27J20J06j15p5kJ86
4579D2n3k4R4o3M8j32J33P5K2L7j47L7k5j59R6K33j10l1K23k22o9nJ81m55L21
$$ plain form
4412 62 167 -64 -13 127 -65 -132 -30 85 190 94 18 -135 -203 37 -144 303 -60 33 31 8 -82 138 -154 -49
4436 -49 -136 -48 -209 71 86 99 -32 231 156 70 28 -58 15 128 258 -13 84 -225 157 -52 82 36 232 38
4460 38 -37 -9 -32 -290 142 86 174 80 95 -115 106 -194 0 27 64 -111 231 13 -10 165 -162 109 -31 -38
4484 -38 -69 -110 -166 -89 -22 -50 7 -73 -143 -34 13 163 -102 42 -84 -33 72 83 53 202 53 -113 22 132 -91
4509 -91 -160 115 20 -140 -3 193 16 -86 208 141 -109 -65 84 9 178 -58 -13 28 -155 -56 130 -37 -166
4532 -166 -110 74 170 255 55 -196 -72 -194 69 -141 -90 74 -3 -68 71 -106 -10 -111 23 -94 239 81
4554 81 -14 76 135 52 -236 -68 -94 -18 122 85 16 -93 125 72 -67 64 81 49 -178 -58 48 -67 -142 -144 42
4579 42 -11 -35 59 -4 44 -88 45 120 142 179 32 69 44 -115 -19 214 104 73 296 74 5 0 181 -274 47
4604D7J36o0j63J56q3l2J02QoO2m10L50k42J52N1m9L5j01K43k65O1k1P0n8P5M9
4630A07k28J60k02J66P1k60K05j20J65j1k20K53k35P0K42j91M8j2n2J24j13J23
4652I0r4M5R0k22N8J4qJ26M2M2j94J23k85J55N6j91J59m9K59k26Qj91L28j31R7
4677A01j18p1J68L3j30O6m2M8J0k21J82r8J12p5J03k68L69o0j28J9J17m9j77J81
4701G2k39K76p9l6j16K04j00q0o9N5K2J28j73L6j65K96o7J15j80K00K6j29JN0
4725D8k6k7Q0O9j90l8K83j30j52n4J84j34j06O2L04Lk71K53k80J5J68J6j76K09
4749A10%p6q6J06k7k27L32q1j43J72nk81K67J43j57o1lO1k39M06k10j30O0Q6j18
4774a01j47J67l0P2N4R5j52K06m7k12J68n7j28L0l7J0K27j22J2K87k77J5p7R1
$$ plain form
4604 47 183 123 -40 116 33 1 103 111 105 167 -243 107 -135 17 68 19 54 -47 196 -69 -8 -29 41 -17 58 107
4630 107 -121 39 -163 3 74 -186 19 -101 64 53 -167 86 -149 -79 163 -28 20 8 -44 80 -33 90
4652 90 -4 41 131 -91 -33 -19 -27 99 141 183 -11 112 -173 -18 38 -153 6 -43 216 -10 -2 -193 135 4 101
4677 101 -17 -88 80 113 -17 49 7 55 65 -156 26 -72 40 -35 68 -200 169 109 -19 0 117 68 -109 72
4701 72 -167 109 30 -6 -122 82 -18 -98 -167 -112 -90 38 -135 -99 -264 32 -35 80 -100 100 126 -3 -2 48
4725 48 22 -5 75 144 -46 -84 199 69 -83 -137 47 -87 -193 -131 173 176 -95 158 -122 -107 61 77 -99 110
4749 110 110 34 -52 54 27 -200 132 51 -92 80 75 -206 61 204 47 -14 -17 44 -195 211 1 -129 -69 17 -101
4774 -101 -248 -81 -111 -39 15 110 -42 164 117 -95 73 16 -112 -82 -119 -109 118 -4 8 295 18 33 -44 47
4798D7j83O5J86kk55J68r4J15k38L3J52k9O3K01k09j74K47J30l26P5K96k43PN8
4822I0p3Jk25M48j61l2K6k58L32l43L7K12m4J46k64J72r8k4q4J89J6k01J93m3
4846A2O3r4J61r8p4J57m5j0m2k31K18j56K8L3R8l8j58L00r7J19j10P1l3J33k22
4871a5O1l71J27K24j38K15j9j82J29R5m8j09K9NK2n9J68p2O7j90r3M8j41k3K54
4896a6P7l1r5p3J32M3m2l6lQ5N2k67K89k59K00j00O1J59j49q8Q7J41l28K51k29
4921a39Q7K08k97N1K0J07j9K1L2j02n3P0O1r6J23r9K13k13J44o4j11P6k51K66
4945C5K33l20K6R6M1j29L4M7J23l28J94R1j60J98m2j00q2q3J2K96k11j52K38J4
4969G1k31K2Q3M9O4j82J02q9J22l9J6O9N8k46J86j8k26L88l39J45l5Q4k9j18P2
$$ plain form
4798 47 -136 -71 115 113 -142 26 -68 47 -191 -158 -6 -35 28 229 20 -154 93 223 -103 -28 268 25 32 90
4822 90 17 18 -207 241 80 48 74 -184 148 -195 -158 54 10 156 -108 64 -34 -58 -142 47 63 -138 55 12
4846 12 75 -19 142 44 -30 127 82 72 30 -201 17 -139 -111 -78 20 -18 -176 124 27 146 36 107 74 207 -15
4871 -15 46 -325 -198 26 -112 103 84 -98 31 126 78 -31 -2 3 25 -34 134 62 129 -61 -154 -106 -247 -270 -16
4896 -16 61 30 -65 -138 -6 37 -5 -41 -44 41 93 -174 115 -144 56 -44 17 176 27 -61 26 167 -161 90 -139
4921 -139 -52 156 -141 -90 -70 37 18 39 71 -31 -84 -14 47 -49 74 -25 188 -25 119 55 -56 20 -231 35
4945 35 268 -52 -26 70 111 -18 16 63 186 -142 52 143 -17 181 139 39 -43 -126 -114 182 -29 -181 57 71
4969 71 -160 -138 -55 -6 58 -124 -22 -111 11 -28 -12 57 115 -131 55 37 -189 199 -140 5 -30 54 25 -93 -21
4994b1N8J1j08J60j16O4j45J46P1j10M4j21j22L15k46K11j04k39M47k62L8n6K58
5017A73n03M17k2n8R7l61K35Jj18J28J25j61J68j69j3M9J14j25J42N4p6n5J23
5040A65k38j5k2j80K86o3k2K63k03M4K7J60k65L0OK24m6k44L9k11J72J77k8l9
5064A7J64j64J4r2M5m5N2k69K63J79q3j72J45J59m17K84n0j18r6M9O9Q5J09j12
5088A6n9k3Q3K9RJ01j13j1r9J8L3l2Q3M2l21N07k07j02J42j27k6%J79K3j97j89
5114b41M26l01L91r2l25J64R7j39O6j32m3J16K4K54m27J52p5r7L00j02j27K90
5136A79l93L61p1rj5M1L3r4k02K47q7j12n2r3L10Q2j13j10L09l04P6M2J6k02K60
5161I9j72J68J1m1j93J27R8r1J77j50r7n4PL14m0j23J2j27j89K32J49l5p3N6J23
$$ plain form
4994 -21 37 48 -60 100 -16 48 -97 49 120 10 54 -67 -189 126 -120 91 -13 -252 195 -67 -29 -85 173
5017 173 -330 87 65 7 104 -257 -22 -21 -139 -11 114 -47 121 -48 -61 -12 102 -23 119 173 97 42 165
5040 165 -73 -88 -110 -290 -4 -67 -89 174 -29 15 42 202 -63 -33 -27 197 151 -93 -54 -265 -93 84 56 17
5064 17 181 17 31 -61 -16 -61 -9 -278 -15 164 81 -91 54 213 -204 80 30 -88 -184 -135 -66 19 128 16
5088 16 -43 -66 17 46 55 156 43 32 -67 -49 -16 -48 35 77 -244 263 56 -46 96 -31 -57 -57 122 145 -52 -241
5114 -241 185 -116 275 183 -142 22 119 -20 46 -86 -129 -13 11 265 -162 -10 -85 -182 118 16 -111 179
5136 179 -214 147 76 67 52 93 126 32 -170 77 -10 -122 -174 -267 43 125 12 -98 211 -93 -17 25 41 -161 99
5161 99 -73 95 106 65 -128 -1 97 6 183 33 -64 -118 -111 203 163 40 52 -75 -264 -32 117 82 9 65 188
5186A88j52kj49J30J07j63P9M8L8q6Ko3J0oJ5k83L61l3k20K18o3q6J73%j00p1
5212a08K55l28n6L22J17k38Nl0k9K18n2k26L70l33J45J42j47m6j51J17K25k34
5234f2l1l6J75k7J4L4p0P9j84M0O4j7K75k47j75Q7Q5l7J98j65pk04K16q5m2L0
5260i2J61k03K4m9Q6j5%L53k30k91J56K56Q2l23J80p7N7r0m1N8j16J86J0R6k09
5285c1P2j55J90l05K52K25l14L76k42j64O3j27K50J4j36j37K65QNj98R2J23j72
5308d6M9K0J53k7j4j71K50k34J59l16J81r8L01j83j71M1j7J34J69k86J16K2L7
5331F9j46J48n9M9j21l1k0kK65l13J46j04K27k81J8j08K96Q6j30n8K87k52N4J7
5355C7j30K13j17o3m0J61j01J32k51L80k66k33L26m0j61K64l31L00o3o0O3j1j02
$$ plain form
5186 188 36 34 -115 15 122 -41 38 86 124 38 40 -23 -13 -19 -4 -287 74 41 -179 39 -24 -110 63 63 -37 -108
5212 -108 147 -181 -237 85 202 -36 -31 -61 -90 128 76 -150 220 -113 32 174 27 -19 -170 -53 172 -62
5234 -62 -93 -129 46 19 33 67 -3 76 -108 -68 -4 -21 254 7 -168 -81 4 -33 165 0 -7 -211 5 -80 -122 -92
5260 -92 69 -134 -110 -159 -73 -88 -88 265 35 -256 -100 156 238 -85 95 18 75 -15 -56 2 -114 72 82 178 -31
5285 -31 41 -114 76 -229 23 248 -66 310 68 -96 -33 -160 90 104 -32 -169 96 104 109 -89 3 126 -46
5308 -46 3 23 176 149 135 -36 214 -20 139 -177 4 -94 207 24 -147 -106 -123 11 180 -106 10 32 69
5331 69 -77 71 12 61 -60 -91 -111 -113 152 -161 -15 -119 108 -173 -155 -263 33 119 -11 -69 218 -34 20 37
5355 37 -93 120 3 -60 -100 61 -40 92 -159 221 -45 -278 48 8 -153 111 -220 80 17 -43 20 9 -93
5378i3K04j25J61k42J11q2m4J52j34j30QK39Pk2n6J9q7L44k76P1km8O8o4j2K36
5404B03k01j5J2r2K6Qk2J86j3j89k3J22p3J24n4L4J5q5p6lN3K5J4J17p9O7k29
5431a48P9J38p3k16J37K13j25j14K41j80J73l31J16K03j71O0KJ4j28rL99j83k66
5454a69pQ2K94j09j76K50j12j8O3k87R5N8l4m3L47k76Q9j4j3J19j36J08p1j92
5478a52L46j84k1L5j3L1J51k73K34j15K14l04N2O0j89L76l95L25j16p7O7n7J18
5501A13j55Q4k4o8O8j06n9o2J50J60k09J11K9J32Lk39J64j33NJ93j61K81j22l12
5525a57M41l16j71K60M2l0j53J4j07J92q4q3K64K0p0Mj2l29J83J46Q5o5q7O6l9
5550A4j41P2J62l7r6q9LK11K0j94J74Kj60J35N2m4J09k08R8q1j81J03LJ61J18
$$ plain form
5378 -93 111 -14 147 -95 16 -66 -110 42 -92 -222 -214 25 32 10 -46 -27 -114 230 -46 25 23 -25 43 -21 -33 203
5404 203 2 -13 -1 -93 -67 -59 -81 105 92 -97 -120 2 -71 53 -1 33 48 -37 -113 -116 -63 -38 -24 93 14 81 -148
5431 -148 -69 69 -4 -220 -83 130 5 -109 132 -48 125 -206 -90 113 -58 2 4 18 -110 -119 280 97 -169
5454 -169 -176 -94 200 91 -85 165 53 35 98 -189 -94 -36 -70 -113 234 -42 47 33 20 139 3 111 40 -152
5478 -152 194 10 -11 24 11 42 193 -80 154 39 253 -51 1 61 -128 248 -147 178 62 -15 52 -5 113
5501 113 -42 42 18 -50 18 -88 -147 -209 -59 101 -108 3 32 164 167 -72 92 -41 -36 157 -4 277 155 -157
5525 -157 284 -32 -203 57 99 69 -84 -70 -177 15 -69 -152 112 132 62 66 54 -275 -92 54 139 74 -13 53 14
5550 14 -127 -55 107 70 -26 -115 -112 99 119 -75 99 101 -59 76 128 84 193 -15 83 2 -179 -76 -73 88 206
5575B06O5l08q7L50j30j1j53K3L49k77j73J30lj44K84k03L4L15l81N7J67q8j54
5598a32L64o8p2j24R2j15j8k08L02o7K26l01J3J32J7mk8J30j80j4J81r8k23R4
5622a01J81j53J55j59N1O9k7j9r6K54n8J82l32J16k08pK46j86J18m6k69J61r7
5645b25K83k51K60J0j18j08j9L55l28J06K07l27N8L06j78K3j81O2R4j00J92j5
5667A06K9n3L6o4k6j88J83J28k51pJ76J74k91J71j42J08o6k7mJ55q6j67J64Kj02
5692d2J32l8k35K13K40l01O7k3J36k69J5J03J21j21L1q2L2J78j69l2ro7o1R2R0
5717AK8j10K28j4j97P2J74j81q8N9rp6NK15j09l8j28J27j37R5K6K15j36R6j28
5742a0j97K87N2k25N0R6k6K9J4j45J96m4r4L4p4j13K87p4N7j64o1jK09r7q7J89
$$ plain form
5575 206 271 -37 -124 226 96 85 -68 -45 304 27 -146 -16 -19 -163 121 -82 -48 267 -114 -57 110 22 -132
5598 -132 232 164 92 -32 60 -55 -73 -281 21 -46 180 -121 -108 24 41 37 9 139 -41 -55 126 28 -195 -101
5622 -101 80 -73 82 -77 -26 43 16 -3 -99 155 97 279 -53 63 -145 -152 94 -92 26 -20 -289 -128 -225
5645 -225 58 -193 67 77 -41 -149 -168 187 -141 -35 172 -155 -97 209 31 54 -127 -65 29 -71 121 106
5667 106 135 82 118 54 28 -160 23 151 -100 -107 69 243 -48 123 -19 89 23 -4 -8 147 61 -106 58 60 -42
5692 -42 90 52 -183 30 270 -31 36 13 149 -120 -105 -2 119 -2 29 -53 -21 157 -12 -44 -53 -120 -181 -89 1
5717 1 29 -81 147 133 -64 8 182 1 -87 -28 -37 -113 -108 107 -2 -40 -168 -41 -178 -83 -57 158 22 118 -10
5742 -10 -207 80 132 -93 -43 53 27 56 70 -75 121 77 -17 17 -57 -170 117 43 100 -64 -125 -126 83 -14 -101 88
5768H8L8j87K37q2l80J71K63q0q2J00k90K14j4K00j26m7Q6pj5k64j05L04j15J1
5792h2N5M0N1r6Or8r0K52j09J12j91L52O0m08J06j7O7j18r7J74O6M8K17l54q5
5817a39J26MP3k91O5J27pJ57m0l31M14k61J80K8j34J97j49j15J27m3L1N4l2N9
5841A00r3J18l2l7j86K00p1L5j30K09J7j59J4L3O9j26l5J83o1rk28J43J03j7L2
5866G2j10PJ53q9P9k10J30l1j23k0L00r3k7Q5j92o3J20M8j49K7r9L05M0j68P6
5891F8N1N1k09j10K27M7j09j35J53L3K13j58j26oJ33r5jo8J74m4lp1m6K6J16j14
5917cj94Q7RJ25mJ31J8l89N4K70k8j67K47q4J67n0j63R9k35M7j22J21kP3j7P2
5943F2k06J84j03N8J53P6m16K58k15R0J29j48Q1O8rk09K75j9k82L56k07j9n9K7
$$ plain form
5768 88 126 -61 176 94 -286 -115 148 68 -14 86 -204 10 -4 196 70 23 109 102 87 -177 -282 22 -93 -82
5792 -82 -27 13 64 -32 -26 -124 -214 38 -71 41 -150 202 262 -146 -40 -57 10 -108 -205 -31 35 83 300 -54 -139
5817 -139 -13 -9 64 -227 -162 -35 -42 115 75 -256 158 -103 77 105 -29 168 19 -96 31 -12 19 73 41 100
5841 100 7 125 93 56 -130 70 -1 34 -96 113 130 -29 -15 18 87 -39 -74 109 48 39 -189 -46 57 40 72
5866 72 -38 -31 122 33 112 -98 32 1 -122 -142 158 65 38 123 -69 -132 -12 36 -113 -86 -185 120 160 -8 68
5891 68 119 170 -39 -149 78 125 16 -119 34 67 280 122 -4 -10 123 28 27 -41 133 89 86 15 -31 -5 111 -3
5917 -3 -197 -110 -101 24 20 151 169 -220 -166 104 76 -91 156 72 239 189 26 125 -110 -63 -185 -64 -66 7 -10 62
5943 62 -144 40 -63 -5 148 224 -192 66 -149 -59 70 -78 3 71 62 -147 128 109 -173 183 -24 -43 -102 -75
5967g5l9R6j6n6J00j06Q6m5j44M3J75L3o5J17j7j55M18l29J37p7Q0L0j75j1PQ9
5993A01k6m6m3q4J19J1j50J0K70j38J62j26k2p6K93k40J35j02M4j33R8k0j22O0
6017b5k32K47R9j55R4k06L92m54K72J01q4j52p2K77p3K55k86j33K10m3j08p4J37
6040a3j32N0J8O5P7m1l4o9J60J76n7k97K56j10n4L2j08Ko2M0K09k40k0j0J59p4
6066g7J24J1m4j26J95k10l4K61QJ77l97J62J08l9q5j15J76l00K30k05Q3K9qK7
6090d9l3J29j1J8k12JJ21kN7K9N5j37J03j13N4J98j50l1r3N8J14k02mJ08j25J13
6116dr0K6%J12M5j8k6M7j60K09j20K2m4k3J79j11j12J10M2J4N9j68K11k91j74
6141b65K68N0o6j22K4J89Kl8Q4k39k5J12o2J26J57l31J33jJ42j77oLJ58q4N4l1
$$ plain form
5967 -75 -114 -18 -34 -90 10 -96 -10 -55 -199 -156 19 52 -13 104 87 -68 350 21 158 81 161 191 16 5 12 101
5993 101 75 29 -14 -98 21 32 -118 -108 162 24 186 60 38 -38 255 15 150 48 92 -41 57 37 -85 -25
6017 -25 -257 -10 89 -66 28 -178 214 -240 32 133 49 -103 -175 102 29 284 -2 -135 75 32 -76 -150 -13
6040 -13 -145 -95 -77 -12 65 24 -10 -79 81 257 200 -97 159 49 -5 27 -81 -79 -141 -101 108 -132 -152 -162 -3 -77
6066 -77 47 58 14 -112 83 -127 -161 100 108 285 -112 50 158 119 34 -81 95 -205 25 -180 -97 -68 -76 -49
6090 -49 -82 47 36 54 -158 -157 -36 -38 19 48 103 -34 69 -44 10 208 58 27 -66 -8 106 -96 -100 8 -117 -4
6116 -4 -94 -68 -68 44 89 71 45 92 -68 141 21 43 -1 -24 155 44 -68 42 84 98 157 -11 200 -91 -265
6141 -265 3 53 -13 -135 -111 78 80 42 126 -113 -138 -26 -88 38 195 -136 -3 -4 138 -39 -45 -42 116 32 86 55
6167E5j92J3J27j12nQ0k8L07n46L76p6q0K85l14K43j12M3q2L9j36R3Q2rk03Q6
6192f6Qj09L6j7L00k10L6M1m8P5j38J11O9r9k9j00L59l5j82P6j30k5J61j18J07
6217G3M0k07J13Mk2L7O2k81J54L1J60p4k37L55k13K37j52k60r9L07pj80J4P9J41
6242G5L2N9L4l07R5k3J73j5k43L2l2K31K22m10L7J9J49k20J78j7j98J74j60L54
6266B39j74N9k6r3j21P6M3J08j96J66j88M7J38j47n1J02MM3k9R2j86M4J06J08
6290A64j79l5O1J81l95L24j05j35N2J24k6m0m1J59P7j0j53j63K46j96o7O1lJ54
6314E5r9M3j10J80J71j92j09J09j13M8p6K85l04J19J9j29K25k91K29J23J6j88
6336A1j24L3J2J00j08K21k77J61j92K98j92J31Pj66K2K4J71n6O9j14m2J13j01
$$ plain form
6167 55 -137 -124 3 -109 -114 -34 -62 245 -301 75 -1 -81 204 -110 133 21 64 -18 21 -115 -22 60 51 -152 -66
6192 -66 -58 -167 -131 -148 152 -58 -22 19 -29 46 -92 19 88 -11 -40 -140 219 184 2 78 -52 -77 84 -34 73
6217 73 113 -94 19 23 1 38 100 -181 -27 4 164 90 -147 208 -5 232 80 -180 -279 28 21 -159 -145 -66 75
6242 75 107 166 200 -107 -12 -35 138 123 -120 -88 -120 111 333 -77 -40 -21 128 -92 86 69 -129 45 -115 239
6266 239 65 124 98 5 -116 -40 3 111 -85 81 -107 -60 78 -69 -120 -18 -14 29 0 92 -94 -50 56 164
6290 164 -15 -50 11 192 -203 121 16 -119 -67 57 31 -9 -50 109 186 176 23 -140 106 -90 -157 -96 -99 55
6314 55 -44 -1 -111 69 240 48 -61 48 -65 -17 -93 192 -112 7 26 -103 122 -169 60 183 199 11
6336 11 -113 -80 -68 32 -76 145 -132 29 -163 135 -57 74 81 -85 -63 -39 132 76 145 31 -11 102 1
6359AJ17l25J39J08j56K65j52J07k4l1Jj40r6J90J78j05Qp9K05j52J10j96L1L8
6383D2j34N7J34J3j07K32j81j16J27m0j1j47j85K73M5N0L6J8O4k7l9m1j05N8R8
6408A14n0j57K1j7O3o4J66j2N7j57J32j90rJ45P5j45J12l19J02L28k28J31r6p2
6432g0k03K41n1J01M1j28k8O9J29l08K3K59j72q8K59k1n6P7qRk76J13J31j13Q2
6457A2r3R1o3K25m5k14%K16j08r7j6mK31k77J41M7J04q9j11R6P9j18Kk21L61k87
6483a38L26o6j59j5K5J25j0q2M4l8O7pj88K60j13k58M57m47K01j8K9P1L7J27j74
6508E6j06J1P5M0j15M3k8L0r0P9K38l21O7qJ0J08j61J0o7J65j37J68k84K30Nj34
6534a16R0O9N9o9j4L7j74J12J41l31L28Q2o0lj00o8O0K53k76k0P2J73l08K01J66
$$ plain form
6359 1 118 -207 -68 40 -116 149 -3 104 80 49 50 -90 -186 4 182 77 85 6 211 59 169 -27 4 42
6383 42 -92 -35 99 112 5 237 56 -60 67 27 16 -131 -316 -43 2 52 88 106 170 143 104 63 -42 16 114
6408 114 64 -93 -72 -89 -26 -90 76 64 121 -36 96 -94 -103 42 117 -28 84 -235 -133 195 -33 98 2 -70
6432 -70 -273 -32 -83 18 59 -69 -97 -28 101 -207 -184 75 -97 -185 74 53 -3 74 66 75 -201 -88 43 -70 12
6457 12 -81 10 -53 172 127 -87 -87 129 21 -76 -92 -96 135 -142 -1 46 150 61 -50 46 125 7 9 -212 149 -138
6483 -138 188 122 -37 -52 -27 98 88 6 50 12 79 72 -116 144 31 -227 230 -217 -16 -34 -5 66 103 230 56
6508 56 -50 -39 36 76 -39 4 -24 6 -84 -5 233 -88 -21 -29 -19 89 -72 -62 -129 36 -101 67 -217 13 18 -116
6534 -116 -26 43 102 33 19 56 -118 -6 135 -196 132 214 154 151 51 -17 43 296 20 0 72 245 -63 138 304
6559C04j31p0k26J93j00K8J13j87J28P5K7l30p4J66N5O4J22j64kL5J21j33J17
6582A31j82qL9k5j09J89J00k55L6L8j24J58J44j80J14k88K95r0O0j21K21j8L0
6605A55j71L1J15r9j38m4J98o3J74k01J87k62K67l60K45P4k8j12o4M9J26j89j16
6628b26K31K3l6N5j58m4J66k5km8k7K12K94m27KMk2o6qJ11m0j00J02R0k08Q3K5
6655c9P0P3p9O1k7m14M44n9K5p0N4l4J37j82L5O8J2j08k1N6K19j65j78R8J45j03
6681A8MNj56k7J01L74m71J08r2K64Kl14K59r0O4mm1P5o1J25k12m9J23j27K25j55
6707e2K9L9Q8j16PK2N0k99j04L39J47j22J95j92lk4l3K3k17J79o1K42j49j3K47
6732B22k45j94J36O3qj55K9L21k65J15J40o1j01l1j6K10l57K8K07j72rJ46p8p0
$$ plain form
6559 304 173 103 -123 70 -30 -2 111 -76 52 127 154 -176 -250 -84 -29 35 157 -7 -9 26 147 14 131
6582 131 -51 -59 -20 -45 -154 35 135 -120 -84 -46 -170 -12 132 -48 66 -222 73 -17 43 -78 143 125 155
6605 155 -16 15 130 31 -107 -151 47 -16 158 -43 144 -118 149 -211 34 108 80 -32 -96 -47 79 -110 -226
6628 -226 5 28 -8 47 -111 -155 11 -14 -16 -64 -91 121 415 -12 -10 -6 -28 -94 -102 9 -31 -131 -29 61 -147 -64 -39
6655 -39 31 104 25 86 59 -355 89 30 55 -15 39 5 142 -40 -5 63 75 -33 -54 2 221 56 -122 -24 121 18
6681 18 22 27 -129 -156 -55 319 -152 -44 -136 128 130 -184 75 -15 49 45 4 79 18 143 -69 -118 5 -122 103 -52
6707 -52 -23 16 104 -12 -5 17 67 -232 -336 3 150 28 223 31 28 4 -29 -6 -223 -44 -105 137 -12 -25 222
6732 222 -23 -217 -81 -18 -26 -181 -152 169 -96 19 159 98 -3 -34 -50 160 -197 -169 38 -134 -143 3 -75 -145
6756a45J85n2r6J99J0O0j98o9L4J94n2j99m7J09M4PJ38l44K44m4L7P7j69n0J79
6781E2n2K8K2j58o7K27P4j24k1K00N1j74o2j75K54j33K03k57J52l2J98m12K93
6804H7J08k49Q6P2j39j68J89J21j74m0N2l2K30k2K1j73oN6j4m4j30L44jk0k90
6829a36J53k9J17k73L16k08J11j43J67l4k9j30J11k26J6J80L0o6K57k76J35r7
6851e4L3J09j72lO9Qj46K58p9J38q4o5K00l58r2K25J57k81J94K0k4m8J64k50J30
6876D9K1K8r6l9l8P7n3j56J79j58K70N7j76%K6k51M05l92J42Q0K40k02M3O8j38
6901a4k3j29O5j69J54p6P3K12n8Ro4j6n8oR7j1o2J58j76L9N5K6l1N9L5k41O2J18
6929B8k06QJ58l7J07l5J08k3j15O9j04Q5K5J23k13K48j10N4j39p8j54K08k8J01
$$ plain form
6756 -145 40 -12 -108 91 101 161 -37 -106 -72 122 70 -129 -176 -67 -23 -16 122 -222 22 -22 15 92 -77 -127 52
6781 52 0 28 50 -108 -175 52 126 2 -19 181 232 58 -4 -179 75 -58 145 -112 40 8 206 -206 87
6804 87 195 -54 32 104 -35 -203 -14 107 -67 -107 -55 -87 143 121 142 -31 -37 19 5 -39 -169 175 174 154 -136
6829 -136 17 -12 105 -168 148 -60 51 -92 75 41 12 -118 -7 -233 -217 -37 -7 -73 184 -92 43 -54
6851 -54 -21 88 -84 -87 -18 -10 -156 102 23 161 77 12 212 -146 -238 -13 144 -137 57 77 53 5 169 -81 49
6876 49 70 98 2 -37 -75 2 -51 -207 -28 -186 84 141 -35 -35 -9 -260 145 -247 -105 -25 215 13 56 124 -14
6901 -14 -37 -166 -101 -270 -116 -192 -119 93 35 44 -20 -36 -94 -100 -3 -14 -76 82 -94 -55 0 26 -5 54 89 -152 -90 28
6929 28 -178 -170 -12 -49 58 23 131 108 -7 62 -42 43 68 191 -22 226 116 170 31 -47 -201 7 -21 80
6953H0j85r3J81mL2J6j41n8K42Jl87K31J26K06l11P6J04k84K54j37K43k68K39
6976A63l15K17o2n2M21l36j51K34j83K5n8m4K17K8j05l4p8KK8P1JJ45j49J10j26
7001c1M5L3r3p8K44j57P2j12J74k8p2k05J36K83n01M63k31O2O3q3J69k08R0j51
7025a16K23L4j60J7K3j80K95Kp7k56J50J4M1j16J6j58K13J22k15J43Q3l2j33P1
7049DN3q9j32J56k1J05k07J97J17k29K3q4M0J37j02P9jp8J02o0%m0L74m25J96
7074A15j77M5r8J21l2j49K52j34J40j55J53Q7r5k24RO2k11K76J04n3j08Q4o3J66
7098A15n6J6J07l18J46l7j85J53J31k0O1m8N1k30J8K30J14r1j34m3Q3j98J84o6
7122a7o9K7N0J72j50O3j48n5Q8j22Q5J02L4k5k6J48k90J85qj52K86k95K22P0n9
$$ plain form
6953 80 -105 -198 -17 -21 11 27 -114 -172 70 71 -316 -85 41 247 -64 12 116 -168 86 -51 192 -76 163
6976 163 -152 65 3 -49 372 36 -115 119 -64 -39 -97 -141 76 104 -1 -35 -113 -111 -83 -12 -11 134 -15 95 -31
7001 -31 14 47 -46 -124 120 -37 35 -77 97 69 -3 -208 -72 211 -290 173 -58 4 67 -16 153 -55 35 -116
7025 -116 107 141 -19 -2 21 -159 136 138 61 -195 -45 -31 10 -106 -90 -248 -35 87 -128 15 98 66 -67 4
7049 4 57 -32 -164 -8 -29 76 -131 66 183 -46 -23 -107 -67 70 -32 47 46 -32 70 10 10 -30 344 -81 115
7074 115 -62 -17 -115 6 -26 -175 77 -57 83 -72 81 168 73 -151 -142 -80 -291 -15 89 36 -72 12 -51 115
7098 115 59 75 182 -136 10 -27 -212 -59 72 52 113 65 116 -114 -96 134 248 157 23 -20 63 -135 49 -17
7122 -17 -86 -59 -9 163 13 76 -72 -127 -39 -161 -76 26 60 35 9 157 -133 52 44 -108 178 -117 105 175 116
7147A16L9k37j10J74J5O9n0n9J94j3l54K35O6l4k55K95pN0l4j26Ko5N1o5P2J10
7173G9O8k45J77k83J35L86l01L33j10m21J73J19j36m8K01q7j4j46P5Q6j20J77
7195I8o6M6j62J68j35Q6j90L5L86j85k56K67l56M14j21L1Pn0K6L0k4k7J16j19
7219A9RJ5k37M29j92j01K4K49k98J13o2rj09J80J15q7j63o3K55k21J6J71j14J76
7243A15k33j56L91j25m7N1k88K31N2P8j30J65n8j11N7L6n5M9j83j8K00K32j48
7266A05j45Q3j23J80j62J30n1l74K98j12K49j43l5J24r0j1J92r6%k12J95kQ3l38
7290b55L31l2M2j58j2K26l16K87k99J75k4P8Q9o6P1j49oj31J58K04O6k45L5k32
7314a63J93q7k4J16K7k03k6K15O6k46J64r8J27l00K65J5r0L0J08k41K22j59J51
$$ plain form
7147 116 155 -82 -192 -18 -3 66 16 -43 151 138 -216 19 85 51 -204 91 84 134 100 -26 -24 -89 -38 -103 -31 79
7173 79 147 -98 79 -204 -69 317 16 349 239 -182 -9 110 -26 -74 127 40 26 -120 -45 41 -79 98
7195 98 32 78 -84 84 -51 35 -155 -120 266 81 -175 92 -264 150 29 60 67 17 43 73 49 22 138 19
7219 19 28 43 -194 235 43 -58 -34 215 -83 30 -32 -41 -150 30 145 58 -105 -168 87 -134 -118 53 -61 115
7243 115 -118 -274 117 -8 -55 -4 -292 -61 -9 69 -61 104 46 -65 -8 28 -27 22 -161 -179 21 253 105
7266 105 -40 43 -80 100 -62 68 17 -357 -59 -171 78 -65 -100 24 -66 -77 115 19 19 -193 2 0 83 -255
7290 -255 76 44 86 -72 -84 142 -174 113 -186 -11 -35 43 132 66 137 -12 -18 -149 9 213 279 34 69 -163
7314 -163 30 -57 -81 35 62 -141 -167 48 114 -132 32 -66 61 -239 26 41 -49 -19 89 -152 70 -89 62
7337F2m3j09JJJ51k0L7k22K39k09J42Q5m8N0L1j41l5Q6M3k14J61j45K01j22L28
7362C10l30K28n8m5p1p2J36l8J92k73j22K95j6p8l5q2J88r4j37N0K14Qm1m5j27
7387d3l9K7R6r5j46M38k49l04K71N4k98K70k06K63p2J36p3l2p9J70j43j31L44
7410A59m00L62O0j01l36N0J31R3j81j16L27k71R1R0L4j72K25m6j38R6k07J85J11
7433D6j22J16j8j97K57k32J93NJ2J9n2Q4j88J82nj19J33j17j14J46l4j29R6j77
7457b15J43R5nM4J40l50J08P6j5q4J41L5k51J88J62l94J91Q8j9rj15j16J66N2
7481E6Oj65K61j19J36j67N6j60O9Q9j8j24K5J13Q4K6Jj71r3J09Ok13K96l02K57
7506E8Q0j58K15j54j97J05P3p1K9m8k00J39J91nJ03l38j6K35n1Q9K7pj99k2J73
$$ plain form
7337 62 19 -90 -89 -88 63 43 80 -142 97 -112 30 115 67 117 148 7 -28 58 101 -113 48 -97 104 -18 310
7362 310 -20 208 150 105 34 -38 98 60 252 -21 -143 152 136 58 23 -59 129 35 -102 -52 162 170 129 84 -43
7387 -43 -82 -55 41 -54 -200 238 -11 -315 -44 10 -288 -18 -224 39 -33 103 30 -2 -81 89 -54 -185 159
7410 159 -241 121 181 80 -256 -206 -75 18 -163 -279 48 -223 -132 -42 -8 -180 45 -1 -139 -43 -250 -65 46
7433 46 -76 40 22 -175 82 -150 43 48 60 79 27 111 -77 105 100 -19 114 -3 -117 29 -5 -134 -38 -215
7457 -215 -72 23 18 62 202 -148 -40 36 21 -63 78 113 -138 50 212 -182 9 97 78 69 -46 -162 4 56
7481 56 62 -103 158 39 175 8 64 -96 -27 62 44 -80 -55 58 142 168 169 -2 -95 14 20 -193 103 -199 58
7506 58 138 -20 195 41 -156 -51 22 -49 -20 -68 -268 -129 62 57 160 -178 -194 41 -10 79 106 99 -100 -122 51
7531E1k30K63O2k63J17k46K56J8N4j62K36O2j85j92J90J84l84J67Jj61J36J52
7553A26j72J97j08j80k9K09Q8j30J49k31J93q0J40j46J31p1o1n1K4L6Q5j0k26
7576a17R0M4J4O6P0k10J37O8k9m7j31J1Q6K2j38j29J77p0J01j67N1J03r6J23J52
7601A81l09J77Q2k19J32m1k34K42j67K79L5k43l5L4J55o1j46l2K73j32K99k08
7623F2k78J64l2K42j89P8M3N9p4j04J28j49j3m1m5qK21m8OP2j55K00o7r5l7J2
7649d8K7K24k41P0o9J19j25L6O1P9q4j34j32l2J79q3L9l5R7j42K37J02j30j63
7673a48J92J5j67o3L07j39n7K89l36J27Q7j08o3j54M2M13j63j18O1j23J54j83
7695a35L33j20k0K23j57j59r6J39K30m00K2J14j08J22m5o0O3J30K1k98L00j25
$$ plain form
7531 51 -179 84 146 -117 0 -246 10 28 82 -80 156 218 33 -159 31 215 -169 -2 -1 -162 -26 126
7553 126 -46 151 43 -137 -166 43 131 1 150 -81 112 32 172 26 157 86 25 -26 -2 34 119 109 -117
7576 -117 -27 17 31 97 167 -43 94 162 133 86 -45 -34 52 74 -64 -193 -16 -86 15 -152 -101 2 -94 29 181
7601 181 -128 49 131 -88 44 3 -231 11 -156 123 158 -85 -120 -86 69 8 -138 -170 103 -29 270 62
7623 62 -216 -52 -84 158 -31 47 90 149 75 -29 99 -50 -63 -104 -149 -157 64 16 22 94 -61 139 72 -23 -60 -48
7649 -48 -21 203 -38 32 -37 82 -43 -7 54 133 49 -85 -217 -249 -70 -153 -114 -149 -52 -194 43 145 15 -148
7673 -148 44 59 -108 -171 136 -3 -60 229 -107 20 107 -1 -64 -218 -176 237 74 -44 17 -106 48 -135
7695 -135 198 78 58 281 124 -35 -131 8 238 -162 -140 -26 -134 -12 -57 -117 -54 76 97 -201 99 -26
7717b6ol5j38o8L01j16J90j29M3L2m7K5J7O7j22O6P5N8j16m1MJ72m04J45J71J12
7743B30l51J79K32l14J63nk32J49qOk49J49N2O4O3k3k81J11O0J65O0k11j03P2
7767b2j04o7L67k29j6O9N6m5p4J27p2p0J2j66L27m1p4KJ59K0k26L33k78J12N4
7792A54j04R9k25O6O5j29R3o7OQN5j99J69J00j75J45r3N1L2m0N7j02J77r6pj0
7818C0J81j39k34J08j1J20KL0p8K6J64p2j54Q3k9k18K76k30J15J28J4q1m8p1J40
7843E2N8qn2M7l75K44J17o6O9j23J19j83k8K9J07J3o9n1J01k15K67k9q6q4J71
7868B5J06m62J69N3J75j04R1j40q2J56L0j14J21J90k24q7k08K54k2j42M15k05
7890eJ12k7j30J18q8j9J32j53Q2N8J03j55r8O9M6J03j83j50R4J58J6j53K52j43
$$ plain form
7717 -26 -32 -67 -205 -273 28 -88 102 -27 16 48 1 26 43 110 -12 54 129 187 71 30 34 206 -198 -53 118 230
7743 230 -121 58 290 -24 139 134 -98 51 43 49 -200 -51 1 65 128 105 -176 -65 -5 160 220 9 -94 -22
7767 -22 -126 -193 174 -55 -71 -2 54 9 -65 62 -10 -80 -68 -234 93 52 -22 -20 139 159 -67 266 -12 100 154
7792 154 50 149 -76 -10 55 -74 19 -48 -42 -34 21 -178 -9 91 -84 61 -32 19 51 11 68 -34 143 47 40 30
7818 30 211 72 -162 -54 -65 55 57 87 9 35 199 127 -27 56 27 -191 85 -145 -30 98 112 31 -17 -88 52
7843 52 110 102 50 97 -278 -34 83 17 86 -37 82 -101 -129 -100 7 20 -49 -100 1 -214 53 24 -62 -146 25
7868 25 131 -331 -162 -109 66 -38 53 -87 -169 -13 17 -97 24 214 -10 -97 -305 -51 -73 -215 200 -5
7890 -5 107 80 -50 68 -20 -39 93 -60 22 80 183 28 -70 -1 45 148 -35 -185 -91 67 83 -70 182 39
7914C9l6%p9O3j9j39J28K5q7K15k27J70j66K15k17J57j75j0K94j19j20K01j63
7937e0J56k51J6j8J21J90k28j43K18K10j90m1P6%k50j8K49j54k4J77k01L08k02
7960d9MqJ54J1Mj70J33q8O3j89P0K83m17R6K9J31k48J54M5o2J48k98K57r1j06
7985a44k1K31K11k64Qj03J63j14k8K35j82r8K19k45M6N1J68k46L2J68P7R6l6m94
8009b70L44N2m7j3J00j29m4j63K83r9j40P9J29o5j08l1K75k56L44k26L9k95J09
8032a32J49r8J05q4N2k26N5K95R1m62K32KJ71k15N2o0R9J1k33K72J0j22k1O9J46
8057A58k35P1j81L52o1K3q0j15P0l3J8P9q6J03l0j03m5r0K29j53K34q7m1jj94
8082a98K55k35J82J06k19J86j26J6K42k58k7J71j04K11j13j80O7lo6NJ11J95m63
$$ plain form
7914 39 3 3 -76 -13 -32 -171 -43 -18 -105 110 -117 53 -113 102 -115 42 -133 -143 151 32 -88 113 -50
7937 -50 106 -145 -129 -147 -26 164 -64 -207 11 221 31 -10 66 66 -184 -202 47 -107 -131 46 -155 153 -49
7960 -49 -45 -53 101 112 116 -54 79 -9 54 -135 -65 218 -199 -103 -74 57 -191 -37 8 -54 94 -204 53 -38 -144
7985 -144 -165 66 277 13 21 -82 81 -33 -61 174 -8 -106 113 -132 -86 -35 133 -113 -81 87 164 260 224 -270
8009 -270 74 126 79 66 166 37 -7 -170 113 14 -126 -47 82 17 -91 -122 153 -103 241 15 54 -241 -132
8032 -132 17 -81 24 -60 -8 -234 -179 116 207 -255 -23 -21 150 -65 -13 -73 26 37 -196 76 86 -36 -57 12 158
8057 158 -77 -6 -187 165 104 127 47 -68 2 -31 -13 66 -20 83 53 -50 -95 -185 44 -109 125 38 -3 -4 -198
8082 -198 57 -178 4 110 -109 77 -49 -33 209 -49 -76 95 -9 202 89 -91 -24 -27 -93 -88 23 218 -245
8105b45L10l2N5J7k50R8J80r5j5K65j78j12m1J9J20q7P1l7q0J43j78J39j54O5
8129b2J17J2j49M7p7k35K73j21M6K98q4N1l5j80N0mK97m15J92J1n4K4lo6%L7P7
8156H7j74J0k0J16M2J4j21K56l44J78j01P7kj83K12K7j27J23L1n2M7J73k76q4
8180i1n2K04k46J10O6n7m3K50l50J88k02
$$ plain form
8105 -245 65 33 88 105 -145 -47 133 38 23 288 110 -2 -43 -24 96 9 80 43 -37 106 -72 67 -87 -22
8129 -22 95 107 -42 5 -72 -307 -34 -155 -109 189 105 156 121 -59 -9 -13 284 -131 61 72 18 42 39 -27 -27 10 87
8156 87 -87 -77 -97 19 61 75 -46 210 -134 44 -57 20 18 -165 47 74 -53 70 101 49 96 269 -7 -91
8180 -91 -143 61 -185 -75 -9 -66 -109 141 -209 -21 -223
8191b23
$$ Imaginary data points
##PAGE= N=2
##DATA TABLE= (X++(I..I)), XYDATA
0@%%%%%%%%%%%qJ6j6J6j6K4l2M0m8N6o6P4q8J04j25J49j74J98k24K59k99L41l86
34b05M36m91N52o19O92p74Q62r59J065j178J304j442J594j757J935k134K352k590
52a357K852l147L475l843M261m738N292n940O711p648Q815j0317J2330j5184J9580
67A1142k7283M4644j55356L8578L04474j39528k04304K8838J94570j7910j32974
78e5109l1636O8259J2188L8563M6655m2489j08996J3021J09793N134j30313j1050
90h5980J31270N1669q2065n5565J4367J1397r889L5930K7703n1048k0738Q4843
102E1894K8720j02724p4019P2472R0514l3796o0530L1867L1056l2383j7911P654
114g186k1272j4382N7634O1893n6663q2138N4304P2641p1603q1872P4337J06172
$$ plain form
0 0 0 0 0 0 0 0 0 0 0 0 0 -8 8 -8 8 -8 16 -16 24 -24 32 -34 40 -48 56 -69 80 -94 104 -120 139 -160 181 -205
34 -205 231 -260 292 -327 365 -409 453 -506 559 -619 685 -757 837 -920 1015 -1119 1233 -1357
52 -1357 1495 -1652 1823 -2020 2241 -2497 2795 -3145 3566 -4082 4733 -5584 6746 -8438 11142
67 11142 -16141 28503 -126853 -88275 216199 76671 -127633 -98795 95775 77865 -55109
78 -55109 -86745 -18486 -6298 32265 78920 36431 -72565 -59544 50249 55383 -74930 -85980
90 -85980 45290 96959 14894 -40671 -26304 -14907 -24796 11134 38837 -12211 -32949 51894
102 51894 80614 -22110 -96129 -23657 66857 33061 -27469 4398 35454 3071 -14840 -7186
114 -7186 -28458 -42840 14794 76687 20024 -62114 -7810 64831 -6772 -88644 -14307 91865
126I1865n2869j02099N7650R2525q3988j12975O7829J22898l0849j06129K3861
137c2281R3305l0495r0085J0200N8928O747j3303J7859O854m1457j1810M4279
149A8741o505n5458J7648P2026N126o5390k1164M5417r17n1534J4007N6309m086
162B4220l6358Q270K8823k2835m5117K1977M7159j1658j9692K0691R123k8166
174c563j9771J8309R432k4062J0781M4033j2504m5627N698L1334j6918l9706K8123
187a4441O3544k2131o1659K4508N5829k8657p0344J1765Q1522J2271o4833j4906
199b7532M0000P821k9159j8467Q726J6662J4349J6016j6173m3441P820M6635m049
212A9208m7139l946N6761K8399m7890l5613K3987J4529j5224k297J4672L464j2443
$$ plain form
126 91865 38996 -63103 -5453 87072 3084 -109891 -42062 80836 49987 -56142 -32281
137 -32281 61024 30529 -59556 -49356 9572 16319 3016 20875 27729 -13728 -25538 18741
149 18741 12236 -43222 -25574 46452 51578 -13812 -34976 10441 9524 -42010 -28003 28306 24220
162 24220 -12138 -3868 24955 2120 -42997 -21020 26139 14481 -5211 15480 24603 -3563
174 -3563 -23334 -5025 4407 -19655 -8874 35159 22655 -22972 -17274 14060 -2858 -42564 -14441
187 -14441 49103 26972 -34687 -10179 45650 16993 -53351 -41586 39936 52207 -12626 -27532
199 -27532 12468 20289 -8870 -27337 -18611 -1949 12400 28416 12243 -31198 -23378 23257 19208
212 19208 -27931 -31877 24884 53283 5393 -30220 -6233 8296 -6928 -9225 5447 8911 -3532
225c532N888J6733k5324l3964K2259L9250k280k5482j994K2487N14k2076l649
238a1170L804J71J8630J7139j7165l0369J104L2237j529m2115N23M7196J3793
251C2249l2209k2282J6814J6462j7083r219J9547P379m634K705j109j1885j2190
264a5455P885J7229o836j0501J4556O038j6198j0408N760O992o595m50K1962L785
278A7764k3881m120J6214K151j6804o102K3782J4756j9189j2902P439J342n603
291e153l299L955O001QN273J972j7274p632J5094Q095o982n162J1082J3295j3458
306E815j7211O829O621m454J63O207M417p485p788O801r52j2332L802J4151M175
321H759n187n677M190J749r740R42P434m11K672M210k498q072p819N194P821q178
$$ plain form
225 -3532 2356 19089 -6235 -40199 -17940 21310 19030 -6452 -8446 14041 14555 -7521 -11170
238 -11170 -7366 -7195 11435 28574 11409 -18960 -17856 14381 12852 -29263 -28740 18456 32249
251 32249 40 -22242 -5428 11034 -6049 -15268 4279 11658 7024 9729 8620 -3265 -15455
264 -15455 -7570 9659 2823 -7678 6878 12916 -3282 -13690 -7930 -938 -7533 -7983 13979 17764
278 17764 -6117 -10237 5977 8128 -8676 -14778 9004 23760 4571 -8331 -892 450 -5153
291 -5153 -8452 -4497 1504 1512 6785 8757 -8517 -16149 -1055 7040 58 -5104 5978 19273 5815
306 5815 -11396 -4567 2054 -2400 -2237 3970 8387 902 -6886 -85 -1037 -13369 -9567 4584 8759
321 8759 3572 -2105 2085 3834 -5906 -4964 2470 2059 4731 8941 6443 -1629 -9448 -4254 3567 -4611
337d611l268J1530N320p182r407q7Q701j546m028P822L733k169p00l000k917j846
353c655K55P769J3o314L515K141n323n226j474N911M362k276K940K525o084j861
369b782K572L72k17j544N056P248o303p868L16L53K235k74k743K853K121J075
385B470N32q512m697Q375O987k60n526j464Q417J833r899m307K103O020N287m259
401C100m760n08j8K603q90o908J299P261M589l75q420l253O648L121j830k618
417i59j319O638M562o433o169k058L431N528k833l221K701L37j14m70l542M61
433c460J349J970N693r19n227L71Q40J062o01k807K071J648j701K699l73p703
449e088l353N063Q668l96j1676j240J3768M034r839j0694M254J5196K429j1202
$$ plain form
337 -4611 -7879 3651 8971 1789 -7618 -7705 996 -550 -4578 3244 6977 4808 4108 1108 -1809 -3655
353 -3655 -3400 4369 4382 -1932 1583 3724 -1599 -6825 -8299 -2388 1974 -302 2638 5163 -921 -2782
369 -2782 -210 162 -55 -1599 3457 10705 4402 -3466 -3150 -2797 -562 -836 -3579 -726 1395 2470
385 2470 3002 -5510 -10207 -1832 5155 4895 -631 -2095 6322 8155 -1744 -6051 -3948 2072 7359 3100
401 3100 -1660 -2168 -2186 417 -473 -7381 -6082 1179 5768 5393 -3027 -6280 368 3489 1659 -959
417 -959 -2278 4360 8922 2489 -3680 -5738 -2307 3221 388 -2833 -132 205 91 -379 -3921 -3460
433 -3460 -2111 -141 5552 4633 -594 -223 617 1679 1078 -1729 342 1990 289 2988 2615 -5088
449 -5088 -8441 -3378 5290 4894 -6782 -8022 5746 9780 -59 -10753 -6499 8697 11126 -76
463g6m665L459N672J005p068m752J936M996O907k814j1963k371Q922Q297l484
478D001j3476P33J6344O120j1300j2645K739J4825K709j1741m996N999O596j261
492D647q140k747K870J688M408R75o532k555N412N643k346j0378R73J2865J863
507H646r454l372N472M007o980n052Q675L858q818l013P086N758p189j0852O624
522d604J2319k387q701j205O224M471m560m217J886J65J601M186j560o230m332
537f944M699R363l116j2984O5J2212P891q624j4639L633J5942K789j0926p604
551h243N874J1212j521r999l196K779M987L934l986o631j931O641Q355n661j3553
566a0939K476J5120M345j1437r756Q329J1403n509r092J700O332J371m257j457
$$ plain form
463 -76 -4741 -1282 4390 5395 -1673 -6425 -4489 507 7414 4600 -7363 -9734 -812 7485 4001
478 4001 -9475 -8742 7602 13722 2422 -10223 -7484 7341 10050 -1691 -6687 -688 5908 4647
492 4647 -3493 -6240 -3370 -1682 2726 3701 -2831 -5386 26 5669 3323 -7055 -6082 6783 8646
507 8646 -808 -4180 1292 5299 -1681 -6733 1942 5800 -3018 -6031 1055 6813 -376 -11228 -4604
522 -4604 7715 5328 -3373 -4578 1646 6117 1557 -2660 -774 -609 992 5178 3618 -2612 -6944
537 -6944 -2245 7118 4002 -8982 -8917 3295 11186 2562 -12077 -8444 7498 10287 -639 -8243
551 -8243 -2369 8843 7322 -2677 -5873 -3094 1893 5827 1841 -4790 -6721 -80 8275 2614 -10939
566 -10939 -8463 6657 11002 -435 -10191 -1862 9541 4032 -5060 -3360 2972 4343 86 -1371
580a371K371k726k338M632K382m085l555K886O383j571p586N94N756K010k388
595A394k819J246K838k196j065J449p30q40n56J694K264k777m291J848M085J057
611B601l404l583M010M983k231m001o91K313L027o22k476j229m60K752K841m323
627d93m526J597O125K302o725m984N867N682l012n215O1N810J963m099j956J329
643b74J001M20n38j140L1m25J352J344l041j680K079J544M26j875r94K439R57
660A626j051r12r87J897J562j462j236M11P65O13j705j368J570O60o78k12n40
677a047P79R43j066l02O60M91J247q09j752J177R08m37j094j075J871J418k201
694b89j324P76Q55N10j576l6J439N4k56O0k98J51J05j65P38k92n31L31O2j99j48
$$ plain form
580 -1371 1000 -1726 -4064 568 2950 -1135 -4690 -1804 4579 3008 -4578 -3984 1772 3782 1394
595 1394 -1425 -179 2659 463 -602 847 117 -723 -1279 415 2679 -98 -4389 -2541 1544 2601
611 2601 -803 -4386 -376 4607 2376 -1625 -2316 -3 3024 2402 -74 -1303 -1763 989 3830 -493
627 -493 -5019 -3422 2703 5005 -1720 -6704 -837 4845 1833 -3382 -3321 2489 4452 353 -1603 -274
643 -274 727 1147 609 -531 -500 -925 427 1771 -1270 -2950 -871 673 1099 -776 -1770 669 1626
660 1626 575 -337 -1324 573 2135 673 -563 -152 613 1226 -479 -1847 -277 383 -295 -507 -1047
677 -1047 -268 675 -391 -693 -33 458 1705 896 -856 321 1229 792 -302 -1377 494 1912 -289
694 -289 -1613 -837 18 528 -1048 -1084 355 409 153 213 -85 66 171 6 744 452 -79 252 314 115 -33
715c3p12L19M90r9o1m85m55J327P6r51J57N01M10M51j168K69O56n88J05l89rO48
737D59k17o24K31m19O2N45m99J64K15j24L59m9j81N19l80j06R47k71o50PJ50J37
759B75k33o31K72N04k39n2n48J56Q73n31l11M18J51L49r7m98O17j74N5k30n08
780c82L71N71m30m35m1M3L84m82o3M54K30o2J95m64J58J79Q3J75k09j51J19j10
802A33k33J13j36j96M56n59K77J05l77L30K12n52M41L31j20o0j08J78J51k81j9
823H6O3j5L8j01m31K11K46j74o6P8OJ47k64P2n6J19L29j57j81L96J11j24l03j87
847a57J33J61k76K88k13n9K60l76rL54k44j82M37K6J43k82m8J9K74q1N3Kj25J65
871B63k64j9k24k6L59o0k42mJ95P2M5j84j00J80J75m2K23o02M08J60k52r9k23
$$ plain form
715 -33 -745 -426 64 -35 -96 -581 -1036 291 367 -584 -427 74 484 935 -233 36 692 104 209 -180 -189 459
737 459 242 -382 -151 -570 -508 37 -462 -298 -83 -207 152 103 -78 441 61 -45 902 631 -19 -12 138 275
759 275 42 -589 -317 187 -52 -104 -652 -496 377 -154 -465 -47 104 453 356 -142 475 301 356 126 -382
780 -382 -11 560 130 -305 -346 -303 81 -401 -464 -10 220 158 353 -111 47 226 309 484 275 124 243 133
802 133 -100 13 -123 -319 137 -422 -145 -40 -417 -87 125 -427 14 345 225 165 57 235 386 105 86
823 86 149 134 172 71 -360 -149 97 -77 -143 -65 -59 88 -176 -104 -160 -41 288 131 -50 346 457 333 30 -157
847 -157 -24 137 -139 149 -64 -123 137 -239 -248 106 -138 -320 117 143 286 4 -44 -25 249 168 221 223 98 263
871 263 -1 -20 -244 -270 89 29 -213 -217 -22 50 95 -89 -189 -9 166 124 347 -255 153 313 61 -38 -261
894b61K77J75k28k12K02k27J28N1j16K85k94L24L89m36j66K88J67k03j39RJ89
915B02q5k40K44k35n7L9K01k16J37l30K92m9K3R8K4j17M9J53K1j54j66L32M6l35
939a23r6K39Lj21J7K4P1j20J73M07m36m6L9L21k77o9l77P31o8l18k6N9j91N0K7
964a07p9Q3J03J52l6k03j17J55R8J23j43q2Q3qk4j09j59L97o8j45O1j24J12k19
988b56R8k7K69k52L62l79K67j28P0P9k0k0L4k2k2J35l79n6J22K60k42J79on0j50
1013a34q3K56j60K0L33J40l09k7kRK48m05J59k9j1K0j28J44k42J60K5n9L5q1L2
1038h9M4K00j42O6n1q2j30K51j05K83p9k58q4M52j35l0j70J37J48j44k45L77j27
1061H7j4m2J32k25r9kL38k03ON8k07J80q4J02J88K09n50J22M7nj38p9L13M2j33
$$ plain form
894 -261 16 191 -37 -249 -47 -274 -146 -95 -211 74 -220 104 493 57 -109 179 346 143 4 13 202
915 202 117 -123 121 -114 -171 -132 69 -147 -10 -340 -48 -97 -74 24 48 -69 -20 133 154 0 -166 166 212 -123
939 -123 -219 20 23 -98 -81 -57 14 -106 67 474 38 -8 31 352 75 6 -371 360 292 -26 -52 7 -184 -134 -107
964 -107 -186 -103 0 152 116 -87 -204 -49 49 172 29 -53 30 22 -2 -111 -270 127 59 -86 -25 -149 -37 -256
988 -256 -158 -185 84 -168 194 -185 82 -46 24 103 83 63 97 75 53 188 -191 -247 -125 135 -107 72 66 16 -134
1013 -134 -217 39 -121 -101 232 372 63 36 34 43 291 -114 45 16 5 25 -103 41 -201 -41 -16 -75 -40 -121 -89
1038 -89 -45 155 13 79 28 -54 -184 67 -38 245 166 -92 -176 276 141 111 -59 78 226 82 -163 214 87
1061 87 73 31 163 -62 -161 -163 175 -28 -22 36 -171 9 -75 27 215 424 -126 -4 43 38 -100 -179 134 176 43
1086D3k66K42K0K25k21j32P0N2K29j99j10R2K8n0N1j59M6p3J99j41M9K2J53k62
1110i2M7K94l02J02J67l16K6J00NL2k70J43L09l81J01J59p9j58J74r4M2p2l6K68
1134A69J3k07J01M0M2l1q6J0k0l25M8L16J31l84k3J56L9l10L42K81l08n5L5K33
1158B07J76n67J84N0NL3k49K40J77rk63K9p6k1L12k15j31J81j25P0l75K64k5Q7
1182d1J06q0J17n9M5J41K6j86k54L35j64J0r3n2K6J36Q8k32K23k89J61L7J03j49
1206d5n2K03Q2k73J16O6j22K4p0J83k02j72L30j30L9j31Q4K09j9j67j04K18o4
1229Cj58J08J82j34j39L14J11k73J17r0l9J51k63K14j17%L8k8P2j4m6k32K28L
1253HJ31j14R6k89K25j70J68K0J2o7n8k24K77N0r4K48m44L66l15J93m1n5K40o6
$$ plain form
1086 43 -223 19 39 264 43 -89 -19 33 262 63 -47 45 73 23 74 -85 -39 -112 87 -54 -5 17 170 -92
1110 -92 -45 249 -53 49 216 -100 -74 26 31 63 -207 -64 245 -136 -35 124 45 -113 61 -33 9 -63 -99 169
1134 169 182 -25 76 116 158 127 41 51 31 -294 -246 70 201 -183 -206 -50 -11 -321 21 302 -6 -61 -26 207
1158 207 383 -184 0 50 55 88 -161 79 256 247 -16 13 -63 -84 228 13 -118 63 -62 8 -367 -103 -128 -41
1182 -41 65 -15 102 43 88 229 255 69 -185 150 -14 -4 -97 -149 -123 13 101 -131 92 -197 -36 1 104 -45
1206 -45 -97 106 188 -85 31 97 -25 -1 -71 112 -90 -262 68 -62 -23 -154 -70 139 120 -47 -151 67 3
1229 3 -155 -47 135 1 -138 176 287 14 131 41 2 153 -110 104 -13 -13 25 -3 69 55 9 -223 5 8
1253 8 139 25 121 -168 57 -113 55 75 87 20 -38 -262 15 65 -29 219 -225 141 -174 19 -22 -77 163 97
1277I7J03k53R6J5j02K8k69M05N0j27j58q6J37K22l93K64J91p5k68J37J28j64
1299b2J20j13q4R8K7J7q5L8J19k72J5N9OK03j57j9L6J22k5j36M4QJ39p5J5k42
1325a64J39j03K06K8m32R1J97j9J7J49k09K7OJ55o9O8q6J15k4L9l4j67K36j9k3
1350A24j46K07l06J26j26K29j40r3J27R9k4j92J41l3N9k66Q8rK69j25r6N7J24
1373I4K7j83K7J81k82J31M6J80Lj86J36j92j5j02J68j00N0lK4L6J3o0k6L31j53
1398A45n9k39K51m8j69J08J67l3j22J28j25p0P5P1k03J21j0r3K26l0r4j23J55
1421B9j15K0R6j03j06J57M4o6P4l3J14p6J26k16Q3O1k00K60j00P3j46r4j4K13
1445H1n8j59J40j48K99k62K02k54K47k8q3J71q0j82J79%J21l77J03Q5j95K2M23
$$ plain form
1277 97 200 -53 43 58 -44 -16 -285 120 170 43 -115 -201 -64 158 -235 29 220 145 -123 14 142 -22
1299 -22 98 -15 -99 -1 26 43 -42 -4 115 -157 -142 -83 -77 126 -31 -50 -14 108 83 -53 -9 -1 138 63 78 -164
1325 -164 -25 -128 78 106 -326 -235 -38 -57 -40 109 -100 -73 -67 88 19 87 1 116 92 131 97 -70 166 147 124
1350 124 -22 185 -121 5 -121 108 -32 -125 2 101 77 -115 26 -7 52 -214 -126 -135 134 9 -87 -30 94
1373 94 121 -62 -35 146 -136 -5 41 221 224 38 174 -18 -33 -135 33 -67 -17 -20 4 40 53 -7 -33 298 145
1398 145 86 -153 98 50 -119 -11 156 123 1 129 4 -66 9 80 -123 -2 -12 -105 121 91 -3 -126 29
1421 29 -86 -66 30 -73 -179 -22 22 -44 30 -3 111 35 161 -55 28 89 -111 149 49 122 -24 -118 -132 81
1445 81 23 -136 4 -144 155 -107 95 -159 88 60 -23 148 68 -114 65 65 186 -191 -88 -3 -198 -176 247
1468B47j17j58J16k56K30o1J27l49L46k65O0J01n9J05om7o1r1M2o5J29R1n1k5
1492a7k0K39k53n7M0J57k37N8J90jj73Q5j38K88K3r3q7J42j73j33J32K19m42K26
1516b5l1R2N3n2j2j92n1L08m4O0k08M1k62n8K57J4K6J08j26K38k98K51m2j5P4
1541A06k05n1K69p9n2J42j48K7J8R0k55N6N2K25k11o1J82k4l57L22r3O6J38k17
1565f0j13J91k2j81K78o9K2r2j02j4L63k00J1J23k55J6K20m0L4j04j88J70j07
1588a19K0NL1LJ05n1P0l58M16m4q9QN9r5q3O3R7j39L8k3J62j82J69o3K35l07m0
1615a12j16J96n8j48K86M1j48K01l6j84N1J32n2q9Q3k8k2o1j8o6K14J37j41j01
1639c9oO0J3j26J23K52q1l73J99N1j18J21J37k96K85l98M46l27N8M7j17j29L61
$$ plain form
1468 247 130 -28 88 -168 62 1 128 -221 125 -140 -80 21 -38 67 61 14 -47 -138 -96 -161 -32 59 8 -17
1492 -17 -37 202 -51 -108 -68 89 -148 -90 100 99 -74 11 -127 161 184 91 4 146 -27 -160 -28 191 -251 -25
1516 -25 -56 36 89 37 25 -167 -218 90 46 106 -102 -61 -323 -381 -124 -110 -84 24 -102 136 -162 89 47 32 106
1541 106 -99 -150 119 40 -12 130 -18 9 27 117 -138 -82 -30 195 -16 -77 105 81 -276 46 -47 19 157 -60
1565 -60 -173 18 -4 -185 93 24 46 -46 -148 -162 201 1 12 135 -120 -104 116 76 110 6 -182 -12 -119
1588 -119 -99 -94 -63 -60 45 -6 64 -294 122 78 -11 -3 56 -39 -122 -59 38 -101 -63 -86 76 -106 63 0 235 -72 -112
1615 -112 -228 -32 -90 -238 48 89 -59 142 106 -78 -27 105 53 -36 47 19 -3 -64 -82 -148 66 203 62 -39
1639 -39 -45 15 28 -98 25 277 196 -177 22 73 -45 76 213 -83 202 -196 250 -77 -19 28 -89 -218 143
1662A43k57L5N9qj24J86m6O9j8Q5J23j35J28l24JJ66j91K13j11j20J28N1K03l46
1686i0J13J16k55K41k81J38p0j74M04j70k50L75l24K20m7J47j73j01R5J95m0J6
1708H5n7k5p5j42K14J3n9n1R4K0O9n1O4q4q3q3L80m99K32k3J17n8p5J89j62n3
1734a03L1J5K45k54N8J5R8Nk30J00N2mp4j61J45J50j90M8J59P4m09J59kO3M0j03
1760g3M0L8M4l1J0n8J7p3K29k72O2k%L5Q9j0L5j96n4K90n3o1n7K69k39%j17q7
1788b25L18k37J32N7nl5j38o6L37k00O8j05kL07K68k58m18K11N8m1k26K84M1k72
1812a47M8qL8J12R4j46Lj55K00P4j32J02l61L80j35J0m6L31m76P1J07m0M0q9M
1837a21K38k31M4M3Q2k07K70p0P9j07m4ML0o9J32K0j8q1j23K02n7L2j43J26n1
$$ plain form
1662 143 -114 -79 -20 -28 -152 34 -12 57 39 124 247 112 240 -84 -83 83 -108 105 -6 -126 2 53 256 -90
1686 -90 23 139 -116 125 -156 -18 -88 -262 142 -28 -278 97 -227 -7 -54 93 -80 -181 -86 109 69 85
1708 85 28 3 -72 -214 0 13 -46 -97 -3 17 86 35 99 15 -68 -151 229 -270 -38 -61 56 -2 -77 112 -50 -103
1734 -103 -72 -57 188 -66 -8 7 105 110 -120 -20 32 28 -46 -207 -62 88 -102 -54 105 179 -230 -71 -73 -10 30 -73
1760 -73 -33 5 49 18 28 -30 -13 -86 143 -129 -67 -69 -69 -34 55 45 80 -116 -170 120 67 6 -51 218 -21 -21 -138 -225
1788 -225 93 -144 -12 45 40 5 -133 -199 138 -62 6 -99 -101 206 474 216 -202 9 67 26 -200 84 125 -147
1812 -147 -99 -107 -69 43 137 -9 -6 -161 39 113 -19 83 -278 102 -33 -23 -69 262 -214 -143 -36 -76 -36 -125 -121
1837 -121 117 -114 -70 -27 55 -152 118 48 127 20 -24 -20 10 -59 73 93 75 -6 -129 73 16 48 -95 31 -20
1862b0m08L99RM2r1J37lj58j49K52K01k52J16m1j97J14k15L64j71j58J21J0J26
1885B8k24J78K1K38m51K85N0o0q1O9K1k0O2j12J17q6q4J4J34j17o4j6kJ74m5K15
1911B44p3o9j11p3K17qj01j14J44k2L6n6K0J9p5J40j7k62K56n6jn2j8m6j26J62
1937d2J07M1R3j99M6R0O1m23K70o8K8J33k59pJ88j04j87K00k73K82Q4o3J6L4j86
1962a38L34j62K17k15l2P7j38q6j39K93j11k4K12k12J21N0Qj20N3j13rJ72q1l3
1986g6N8N9qj2Jj05J34K3q1N8J56j93j63L27j66j34Q9M2J33K16o30M71j69p3L5
2011hl9%k2j31K12J77q1K6k06l7K45j62J0J59j06J15j12K7M1j89O8J77j68j56
2035a60J73on4l4Q6p5j5J65K5m1j31N1m3p6J61K58j08j2k13J90k05N2N3j6k23
$$ plain form
1862 -20 -428 -29 -20 22 -69 68 65 -93 -242 10 211 -41 75 34 -163 -49 -264 100 -71 -229 -108 -98 28
1885 28 -196 -18 3 241 -210 75 125 65 -16 53 74 54 116 4 121 35 -49 -35 99 -18 -82 -98 -100 74 29 244
1911 244 171 102 -9 -82 135 127 26 -88 56 34 70 14 34 53 -22 118 101 -161 95 39 38 -14 -32 -78 -204 -42
1937 -42 65 106 199 0 46 136 197 -226 44 -24 4 137 -122 -129 59 -45 -232 -32 -305 -23 61 -2 14 48 -138
1962 -138 196 34 251 36 4 81 -57 -143 -282 11 -100 -124 88 -124 -3 47 55 -65 -12 -125 -134 38 -43 -76
1986 -76 -18 41 33 21 22 -83 51 74 -7 51 207 14 -149 178 12 -122 -33 9 142 358 -272 199 30 -43 -8
2011 -8 -47 -47 -69 -200 12 189 108 134 -72 -109 136 -26 -16 143 37 152 40 67 108 -81 -13 164 -4 -160
2035 -160 13 7 -47 -81 5 -70 -85 80 105 64 -67 -16 -59 -135 26 284 176 164 -49 141 -64 -12 41 25 -198
2060a98K04Q8P8k53l7J03n3J34m1J93j94J93j80N2p0J24k48qol3J86RN6K58n06
2085a49L76l35K69J3l15n8j00N3J99R3m3J01l12J57N6l8J02J30j52p2j2J66j5
2108A14o6kK9n6J38M2j44N2on5lR8j05k56L17k88K46M8o8j77J29l03L08n0r3J42
2134impn3N9K50j49J08n7j96K4L13o5l62J89l2j83K71k13n6Q8L28j96j14l9P8
2159b7J56r6J75j28j14K4k29J85J8L7O5o9o5j7j3J12j53n4J24K3k9Q7K5K6Q1N4
2185A98j5K8m24M40k71l0K85j04l4J41k1m0j02P8n0j20J1J73J6R1k68O8K09j97
2209F2l15K29n4m7J08j05pP1k3Q4n0k13J59j23R6J84k13n5K96K0q2K23m20m9K60
2234C6j80L33k47J05k09K08n0J30r4k37N8J41k7k2M3J70k57P5L03k95%j12J70
$$ plain form
2060 -198 6 94 172 -81 -118 -15 -68 66 25 218 24 217 37 89 19 143 -105 -113 -119 -152 34 43 99 357 -149
2085 -149 227 -108 161 174 -141 -199 -299 -246 -47 46 3 104 -208 -51 5 -33 69 199 47 -25 -37 129 114
2108 114 48 46 75 19 157 199 55 107 101 46 43 141 36 -220 97 -191 55 103 35 -142 -13 -316 -8 -58 -151 -9
2134 -9 -13 -20 -73 -14 236 87 195 138 -58 -34 279 214 -148 41 9 -174 97 -116 -172 -84 244 48 -66 -105 -27
2159 -27 129 33 208 80 -34 -10 -239 -54 -36 1 66 -3 -68 -85 -98 14 -139 -193 -69 -46 -75 12 37 63 144 198
2185 198 183 211 -213 227 -44 -74 211 107 73 214 193 153 51 129 79 -41 -30 143 159 250 -18 50 259 62
2209 62 -253 -24 -78 -125 -17 -122 -129 -58 -81 3 -47 -260 -101 -224 -128 56 -157 -212 84 104 22 245 -175 -224 36
2234 36 -144 189 -58 47 -162 46 -4 126 32 -205 -147 -6 -33 -55 -12 158 -99 -24 279 -16 -16 -128 42
2257D2O1K6m8j1Q7l01J10n7J08j57J38p6K70m50L19r1J18Rj54M1q4R7J26j21J8
2282B0k51L38J66k92o5nO5j67P8L3K06N1j90j46J14K25l44J82j18J8l2J03Q5n
2306F9k88K2K87k51K41Mj15o0J38K23l7l23j69M46m9qj72j00J79Q4p1p9N1p1R0
2331D1j97K03M0j47Q4m7j37L06L2k43q7J15j56J76m2K4J30J04l54K74p6m7j77
2354a81L05j92K46l34K77k21M7J62j04J66k39Q9M8Q0Mj74j58j20L45ll8o5kJ96
2378A34l1k86J68n9J22k04J81m2J06k22m6L44qj60p5J14q3M6m2J0k8J36j44Ql6
2403i7L2N5O3J42j82l2L1q0J00j86K26k05K24k25L62k30m6rK40k49l9J64l4j86
2427a61R6m5K86j28l3j51L06j54L2j08K9lj48K57r4j0j15J97l06L60M9j34M0J4
$$ plain form
2257 42 103 129 81 70 157 -144 -34 -91 17 -140 -2 -78 192 -258 61 -30 88 97 -57 -16 -100 -3 123 2 20
2282 20 -231 107 273 -19 -84 -89 -24 -191 -113 -80 126 177 -13 -159 -45 180 -164 18 -100 -82 -114 -11 74 69
2306 69 -219 -197 90 -161 80 84 -31 -91 47 270 233 -90 -259 187 138 130 -42 -142 37 121 50 -29 22 -49 41
2331 41 -156 47 87 -60 24 -23 -160 146 178 -65 -152 -37 -193 -17 -59 -35 95 199 -155 119 43 -4 -181
2354 -181 124 -68 178 -156 121 -100 -53 109 5 171 -68 21 69 149 153 -21 -179 -299 46 43 5 -60 -62 134
2378 134 103 -183 -15 -74 48 -156 25 -17 89 -133 -179 165 157 -3 -78 36 -47 -1 -43 -33 -61 75 -69 -61 -97
2403 -97 -65 -10 53 195 13 -19 12 -68 32 -154 72 -133 91 -134 228 -2 -48 -57 183 -66 -105 59 25 -161
2427 -161 -65 -110 176 48 15 -136 170 16 48 -60 -31 -34 -182 75 -19 -29 -144 53 -253 107 156 22 62 76
2451G6j11K46j01n8m4q0K11j23J09J8j16j89K39k92L63k34J41j38J1j63K62K4
2473E1o5q9O2j24K11lm4n1l4M2K79j20j27L5J52k74PK08j47j2J07j99K01j65q0
2498a79K8J40Kp3J65l6m3r4J26l07M97l25l9K07k22J57m3N9m8N2nq9J94j85N3
2523hoJ2l7nj47J38O4j40p2L69p1l67L31Q4k44L4L1m5M2M6k12J75O3j30J44j57
2549a08N0K01k35Q1j10J2j4L42l28MK73j68J08q2J5J22k81R9L8J18r9K77j57j99
2573d1o8K26j30j87K41j15K45q6J00j74J88j57LJ3J80n7j32L9k70R1j04j0n9K75
2597A1j94K46j11o1L07k90J27m2j78N1J62p8j16J45J67j01j6j53J65Olj11J2J94
2621A39q1N6P1k31P3Q4j10Q3Ko6K31k80p6J52q0J90j07j17K05k02J01Q8m75J83
$$ plain form
2451 76 -35 211 110 52 8 -72 139 16 125 143 27 -162 77 -215 148 -86 55 -83 -72 -235 27 51
2473 51 -14 -103 -41 -165 46 43 -1 -52 -86 -44 235 115 -12 23 175 -99 -92 116 -31 -43 64 -135 66 -99 -179
2498 -179 -151 -11 -9 -82 83 47 4 -90 36 -271 226 -99 -138 69 -153 4 -39 20 -28 24 19 -70 124 -61 -8
2523 -8 -14 -2 -39 -44 -191 -53 11 -129 -201 168 97 -270 61 145 -99 -65 -34 -79 -37 9 -203 -28 35 -95 49 -108
2549 -108 -58 143 -92 -11 -121 -109 -123 219 -109 -105 168 0 108 26 41 163 -118 -19 19 137 38 315 158 -41
2573 -41 -109 117 -13 -200 41 -74 171 85 185 11 199 42 45 58 238 181 49 88 -182 -91 -195 -205 -264 11
2597 11 -183 63 -48 -109 198 -92 35 -7 -185 -134 28 -50 -166 -21 146 45 29 -124 41 47 44 -67 -55 139
2621 139 58 114 185 -46 27 111 1 84 86 20 251 -29 -105 47 -33 157 50 -67 138 -64 37 125 -350 -167
2645a67J05m2K22j22J84j02j14q0J5J75m9j05k7L1J50j08l3J52l3j23j00K62k31
2668a40L33j82P2j08rR8lj62J64J33k20k0J31m0o4m8J03o2j77K26k3j1N6k77K31
2693Am5J49J4R5k17j37K06m2Q7j56L18k48mj36K39j18J46j91j58K91j09n9J28
2716E4K4n9k9J24k27R9K2R3j22j0Pj41Q5P5J70q1j28Pj07L48k59J95lj23J84k13
2742a5j10J72j29K53j55j68L32k11q1J73J20k9k51Q0j9J02j95N3O0Q8j30Q9J14
2765A43j94K28j14o6N2o0kk14K78k50K32j6J56n9j35j28K24p2K8R2J41k40q0j
2789e7M8K0j3L5M2K44l09m8j9j7k9J21L0k21J72J6J35j30m5N6j38M3J4ll9J19
2815B7j18jn0K99j53Nj42J69nJ60j54j28J8J18q2J3J9M0J9n9k19J84J73j13Q6
$$ plain form
2645 -167 -62 -104 118 -4 180 78 -36 -116 -101 74 25 -80 -107 -76 74 -34 -67 85 52 -71 -171 91 -140
2668 -140 193 11 83 -25 -34 64 61 -101 63 196 -24 -44 87 47 -17 -65 38 -24 -201 25 2 -9 47 -230 1
2693 1 -44 105 119 214 -3 -140 66 24 111 -45 273 25 21 -115 124 6 152 -39 -197 94 -15 -74 54
2716 54 78 19 -10 114 -113 -14 8 101 -21 -31 -24 -165 -80 -5 165 84 -44 -37 -144 204 -55 140 137 14 198 -15
2742 -15 -125 47 -82 171 16 -152 180 -31 -112 61 181 152 -99 -19 -38 64 -131 -78 -18 70 -60 29 143
2765 143 -51 177 63 -3 49 -11 -13 -227 51 -199 33 17 173 114 -21 -149 75 3 31 123 264 24 -56 -57
2789 -57 -9 11 -2 33 75 319 10 -38 -57 -74 -103 18 48 -173 -1 15 150 20 -25 31 -107 -64 -50 -53 -92 27
2815 27 -91 -92 -142 157 4 9 -133 36 31 191 37 -91 -73 45 -37 -24 -5 35 54 -5 -224 -40 133 20 106
2840A06k1q2l3lj13J57j8m7K8n0J65O0j98N8R1j50L7p9J28L5r2Q9l41K81Q1P3
2866A62j99k3M0K8J54j69q4j0R5l3L7J25j19j9m3O0J27k51k9K51o4j48J24K9j19
2891g8J0M4P4J47p3j36O1k2Rn6L7k87K70Q2j08j07O3J45N7k88k6J96j37J77J86
2916B40k77l1j01K33q7K7j33J84l5j13Q4PM5j86J33K17l43J04J09o7j13K7j56
2939b32K68K26j74k27K54l1m7K4R5j57J9J6j7J45l02JJ84kk00J67J0j32J14R8
2963A00j02J5J2l7P4k3n5m3j0K5jK2J49k15O5r3P5J6n0L50m57K61R2l9k64K60
2989A27j08K9k1J0j03j52P5J39j00p1J90o6R0p5Q4j5LN8k75oK32K9l9K06m12J80
3015IN3j00j33R5p8p6J73j7j0rL3q4J90p5N0K8M2m7k4J36k42k8J49j13M3j21K86
$$ plain form
2840 106 85 3 -30 -33 -146 11 -7 -54 -26 -76 89 149 -49 9 100 -50 -13 -92 36 71 -21 68 -273 8 89 162
2866 162 -37 -60 -20 8 162 -7 -91 -101 -6 -39 -2 123 4 -15 -58 2 129 -122 -151 100 36 -112 12 41 -78
2891 -78 -68 -24 50 197 124 -12 49 27 36 -20 17 -270 0 82 -26 -133 -70 75 132 -156 -182 14 -123 54 240
2916 240 -37 -68 -169 64 -23 4 -129 55 20 -93 -9 -2 43 -143 -10 207 -136 -32 77 10 -103 -76 -232
2939 -232 36 262 88 -139 115 84 37 61 156 -1 18 34 17 162 -140 -139 45 43 -157 10 20 -112 2 100
2963 100 -2 13 25 -12 62 39 -16 -59 -69 -44 -45 -23 126 -89 -24 -117 -42 -26 -76 274 -183 78 170 131 -133 127
2989 127 19 48 27 37 -66 -218 -143 -4 -104 -175 15 -51 39 -36 48 33 36 94 -181 -187 45 74 35 241 -171 9
3015 9 62 -38 -171 -76 -154 -230 -57 -74 -84 -93 -60 -144 46 -29 21 49 91 44 20 156 -86 -114 35 -78 -35 -156 130
3042A30j35O5jk0j57J30rL38m40j73L42k88L21pj05j2K17k2j66K9m4j09N1p0J01
3067c4J47j71k5M3J73n2O0l16P4K2l3J69j37L36k56J94J1r9n4J3k01Q8L12j25
3091A39k30n4J73j45J56m5N1m6N4l09L93J20l08P3j73J00N4k5J46m07K56J68j84
3114d3n0nq2Q9J93mm0j43Q4o9O6J17j67N4k14J08K06K1p1j19k4JJ94o7j94K22
3140F3J33N0j58O3o9J22k33j84J38Q2r5J42k3j9j18J51p1Q8J20k59N4l5J86m8
3164H0o5R9j26L8J31J77k99m49L68P2J20k20K2K9q6K26j41J43M0k70K12k39L20
3187A82q8j78J13k6J91j90n8j96J24Q7q8J41k4L7k07K04K4R8k97J7K63k63M45
3210C11m14o6K40l7j81p8J02l7K19k26K22j08J68J9M7k92L13l15KK60j88k1J23
$$ plain form
3042 130 -5 60 59 39 -118 12 3 341 -99 -272 70 -218 103 96 -9 -21 196 174 8 37 -7 -116 -65 -135 -34
3067 -34 113 -58 -83 -40 133 81 141 -175 -101 -79 -112 57 -80 256 0 194 205 106 52 65 -136 -48 264 139
3091 139 -91 -145 28 -117 39 -6 45 -1 53 -256 137 257 -51 22 -151 -51 3 -22 124 -283 -27 141 -43
3114 -43 -93 -98 -180 -91 102 98 58 -85 -1 -70 -4 113 -54 0 -214 -106 100 121 50 -69 -93 -92 102 35 -159 63
3140 63 196 246 88 151 82 204 -29 -213 -75 7 -88 54 31 12 -106 45 -26 62 182 -77 -23 -58 128 80
3164 80 15 114 -12 26 157 334 35 -414 -46 26 146 -74 -52 -23 -109 117 -24 119 159 -111 101 -138 182
3187 182 94 -84 29 3 194 4 -54 -250 -126 -39 -127 14 -10 27 -180 24 48 146 -151 -134 129 -134 311
3210 311 -103 -169 71 34 -147 -225 -123 -160 59 -167 55 -53 115 134 181 -111 202 -113 -111 149 -39 -60 63
3233F3j83J74mN6j30OpJ2K0J08Q7k2k71N6Om2L86l69J70j74N5l7J25n4l4j30K8
3260a05JK30j18K8J0J75j09k25K23m4j62K44j36Q6k16J52L3J7m8J09j73N0o7j26
3284a71L10k59J79m7o9J86j33J22K7r3q6J91q7R3n7N5q6J79l34QP0J79j75J46
3308A48j61j37J68k52p8M16q5j16L55k86J20j5m7n0K56q8j06p0Q3k21J52j25P8
3331f1j9J75n8O0j12q6P6L6n9M63k71k20M1p8K00j55J10j72J23P1m7K6j42r3L08
3356A16L4k12K6K54j81j21K10o9p7l7R8j30K11j17J9L3m2j15J90j51R6J4r4q6
3380a31K77n0MJ16j36k30L62k65l8J67j70J80p0O0k7j99J49J11r7J24j19q0N2
3403a0Q4j42J35j75J64l05K08J84J1Q1k88R1j7O8p3J50k74J03%J49M8j46q9Q9
$$ plain form
3233 63 -120 54 50 106 -24 -18 -25 -13 7 115 202 180 -91 -35 -29 -71 315 -54 116 -58 -3 -40 85 31 -3 -133 -105
3260 -105 -104 126 8 36 46 221 112 -113 110 66 -96 148 12 98 -118 34 67 84 36 145 -28 22 -45 -171
3284 -171 139 -120 59 12 -57 129 -4 118 145 52 -34 157 70 163 106 161 75 254 -80 -72 -2 177 2 148
3308 148 -13 -150 18 -234 -312 104 19 -97 258 -28 92 77 30 -20 236 148 42 -28 55 -166 -14 -139 -61
3331 -61 -80 95 37 97 -15 -101 -25 11 -48 415 144 -76 -35 -113 87 -68 42 -130 -7 64 17 43 -99 -192 116
3356 116 150 -62 -36 218 37 -84 126 57 -20 -57 41 -89 122 5 24 57 15 -100 90 -61 35 49 -45 -131
3380 -131 146 96 100 216 80 -150 212 -53 -91 76 -94 86 16 76 49 -150 -1 110 13 137 18 -62 -10
3403 -10 74 -68 67 -108 56 -249 -41 143 154 235 -53 38 21 89 16 166 -108 -5 -5 144 192 46 -43 46
3427D6j31Q4K29j96J29L5j33j31J26K05j87l34L22J10k58J6Q9N6k05J21n7j62
3449b26J01O1K95j36N0j62K60k83K28o6n8k01J66K2j57K23k69K36nnn8j6K60k82
3473b2n9KP4j13K3J40K4j63J53P7p5n3j55rK73RN1k51J17k76L66o1j54L7ll3R3
3500A2J10k73J52m1J87l53L04q6m7O1j22J54J36k99J2J65j4j23j97M70j33j43
3522f8M9q5J56p5R6j85L53l70R2m4J96k02J81j79QJ11j35J02m1J45rk58K46N1
3546A35r8m7J05j11N1o3J11k44J05Q9m3k5J08J43k01n7L15j20m32N46l14mj10
3569a61K6J77J6q4j6j41K25j63M9Q0L4P8j69n9LJ88nO8j53O2j28J02n1j74L28
3594A32j91M1J74j66R4M7K3P5j78k37J23N3J01j43K8M7PPm2jN0J82l47J08K5k42
$$ plain form
3427 46 -85 -1 228 32 161 196 63 -68 58 263 76 -258 64 174 -84 -68 21 77 -128 -7 -64 -226
3449 -226 -125 -64 231 95 145 -17 243 -40 188 122 64 -137 29 51 -106 117 -152 84 79 74 16 0 260 -22
3473 -22 -81 -79 -5 -118 -95 45 69 -94 59 136 61 8 -147 -156 117 126 177 -74 43 -233 133 72 -82 -45 -48 -81 12
3500 12 122 -151 1 -40 147 -206 98 12 -35 26 -96 58 194 -105 -93 72 58 -65 -262 208 75 -68
3522 -68 -19 -104 52 -23 73 -112 241 -129 -37 -81 115 -87 94 -85 -77 34 -101 1 -40 105 96 -162 84 135
3546 135 37 -10 95 -16 35 -28 83 -161 -56 33 -10 -35 73 216 15 -42 273 153 -279 267 -47 -51 -161
3569 -161 -135 42 58 -26 -42 -183 42 -121 -72 8 42 120 -49 -108 -105 83 78 146 -7 55 -73 29 -22 -196 132
3594 132 -59 -18 156 -10 84 131 154 229 51 -186 -63 -10 91 -52 -24 23 30 37 -5 -6 44 226 -121 -13 12 -230
3620b30K18j61Q1%P7q8O1J69j62J88l28K80j98J88l19K57J16q1m0J1o8J27l4j51
3644h7j73K44J05j45K27j06K1n6m0M7l9j3J43j46Q4N0j80l06oM84l65L37k66K38
3668E2p5j95J85p0N9lL1j07K40l09L3O4J51k00QQ0K0j40M4J58L4q1Q6j68K19q2
3694C4R0j56k0K2m2J86j50NM6K99k02j34J63j22K01l51J98k28L1K92j26j01Q2
3717A7L2O1k76J30k3l1J71j32R3J31k1l68J77J88j68M5j17L40m14R1l2J01R9n8
3741C6k54K57J2j59L08l49J64J00k12J92N2j16j38R3J6L2O5O3l73J73L4N4j23
3764g3L7m4j7J35l8K4j76K84j08J02J93k95n7J95l7j62O5r3J7j7m7J03N7R8k31
3789h5p6J2J78j41J9K45r1j2J0k67K71M7l3j23J31k01j83K86qk30M75j7l83M1
$$ plain form
3620 -230 -12 -173 -92 -92 -15 -103 -42 127 -35 153 -175 105 -93 95 -224 33 149 68 28 39 -29 98 64 -87
3644 -87 -260 -16 89 -56 171 65 86 30 -10 37 -2 -15 128 -18 66 116 -64 -370 -376 108 -257 80 -186 52
3668 52 -23 -218 -33 -103 -44 -47 -16 -123 117 -192 -159 -95 56 -144 -136 -56 -36 -176 -132 26 60 -21 65 -103 116 34
3694 34 124 -32 -52 -30 -72 114 -36 -31 15 314 112 -22 141 19 220 -131 67 -161 -130 162 36 -65 17
3717 17 49 110 -166 -36 -59 -90 81 -51 42 173 152 -216 -39 149 -19 26 -91 249 -165 -74 -106 -5 94 36
3741 36 -218 39 51 -108 200 -149 15 115 -97 95 147 31 -107 -14 2 34 99 162 -211 -38 -4 50 -73
3764 -73 -36 -80 -97 38 0 24 -152 132 24 126 319 24 -33 162 125 -37 28 -65 -48 -65 -112 -9 48 146 -85
3789 -85 -161 -149 29 -112 -93 152 61 49 59 -208 63 110 77 -46 85 -116 -299 -13 -21 -251 224 207 -176 -135
3813a35J14q7J20j64J87J49j53l7M7J07o9j29q8MN4J77Qj01o2K41k11P5L6j33
3837e0j35J68R3j83P0Q5pN9m17K27P3%m6Pl4M0K92k10J71k64Q9J0J1k29P5K33
3863A28K1l30L72j04J01j90k6M4j32J61j45J61k60L8J41j53J91n4q7PJ0J85j00
3886b1o2J67j3j9j73J92j26K25j28k00K49m7j04K14j45L1j9K06k08j37L54k57
3908b1q9L7K77m27J75J42j46mj4J56m7j25lJ41Rk91K14Jk89K71J80l16J28N0p2
3933f3J47k85L03O5l25K64j03J40l70K17K00l91N06l80O4j49K20k07J34m0K1m8
3955h0j80M79m14L57j36M7o4p0j26L18j71J26q1P6k31O7J52o5R0J47l97J77m4
3978b3j98K11J00o5l5k2J72o1M6L1J29l46K5O2p0j04L03q5J32m2k41O1L7N2J92
$$ plain form
3813 -135 -21 -108 12 -152 35 184 31 -6 41 148 79 -50 -138 -134 -80 97 105 4 -58 183 -28 47 83 -50
3837 -50 -185 -17 76 -107 -37 48 41 100 -317 -90 -17 -17 -63 -56 -90 -50 242 32 203 -61 28 38 49 -180 -105 128
3863 128 149 -181 191 87 188 -2 -28 16 -116 45 -100 61 -199 -161 -20 -173 18 -36 -123 -116 -106 79 -21
3886 -21 -83 84 71 52 -121 71 -55 170 42 -158 91 44 -60 154 9 40 21 227 19 -118 236 -21
3908 -21 -110 -73 204 -223 -48 94 -52 -56 -70 86 39 -86 -89 52 61 -230 -16 -15 -304 -33 147 -169 -41 9 -63
3933 -63 84 -201 102 167 -158 106 3 143 -227 -10 190 -201 305 -75 -11 -160 60 -147 -13 -53 -32 -80
3955 -80 -260 219 -195 162 26 73 9 -61 -187 131 -40 86 5 81 -150 -83 69 4 94 241 -156 21 -23
3978 -23 -221 -10 90 25 -10 -32 140 79 125 156 285 -61 -36 26 -44 -148 155 70 202 160 -81 -20 17 69 261
4003B61l66n1J52l3j48R4J14N8l02L11q9j60J64J31k16L6r0M6J65j29K9q4K15
4026A08j54m5L5J79k72J08M0J92k67j90L12j33J8K26q8J5J01j14p9j32K54l69
4048b55n4K88j80L04j14M9P0j43Q6L5j66K6N8N8M1j33L6O4n7n5R8pp4Q2q8J70
4074A39k93K03j17J7K7m7nJ44k83o6M82k69J7J42j63M4J33j9Pj55l5MR5p2J35
4099F5j47j55L37l68L76k35jK5R2K40l9p1k06L1p8J06j53J8J21J4Q5p4m6m6J0
4124i9ML98k55r1j6K23j09J06k29K3K59j30n9k01J00Q3j1J05n9O3k19j8R5Q5J12
4149A60k39K7k2J19Q4k16j24J23l1J78M1m9k9K2j5m9j78L09j40O6n0j10o4L17
4173A30J05k66L6P2q8m7J08k09n2J40J83mm2jj9r1m8j9J00lJ28J18j31K6j87m2
$$ plain form
4003 261 -105 -156 -4 -37 -185 -91 23 81 -221 90 1 -159 5 136 -80 -44 -134 -88 77 -52 -23 -107 108
4026 108 -46 -91 -56 123 -149 -41 -1 191 -76 -266 46 -87 -69 157 69 84 185 71 -8 -140 114 -255
4048 -255 -309 -21 -201 103 -11 38 108 -35 51 86 -80 -54 4 62 103 -30 6 70 13 -42 56 49 -25 57 -31 139
4074 139 -154 49 -68 -51 -24 -71 -76 68 -215 -281 201 -68 -51 91 -72 -28 105 86 93 -62 -97 -93 2 -70 65
4099 65 -82 -237 100 -268 108 -127 -128 -103 -11 229 190 119 -87 -56 -134 -28 -181 -163 -42 -28 57 -17 -63 -109 -99
4124 -99 -95 303 48 -43 -59 164 55 161 -68 -45 214 84 25 -176 -76 7 -4 101 42 105 -114 -132 -37 48 160
4149 160 -79 -52 -74 45 129 -87 -211 -88 -119 59 100 51 22 44 29 -20 -198 111 -29 37 -13 -123 -187 130
4173 130 235 -31 5 77 -11 -58 50 -159 -211 -71 112 108 66 65 46 -45 -93 -112 -12 -15 113 231 100 126 -61 -103
4199a03O3J09j47r2r2J70K2k4n9K22k27K78J60l72k7q3J26K65k31K0k8J43L2k85
4223a60O2r2m1J98m4K59M3k50j2J77l55J38J50j16j67K27J95j77j24J42p4L2r2
4246h1L03m20M6J63Q8J2j63l0O0N0j62mK72n3J1j77k8M8J17L6j14j3p9J90j0K2
4272H4R3R2l32j41K32j61M6K37l67K97J2K6j44j1k6J11mL2k2j61J4K09l94K24
4296e4J37L5k2L0pr4J86m27K24j38Q0L5n2k9J0q5J83O1k22K66q4p1J5j08L24n9
4322A34j63Q2j68o3K14J42M5k32l4j4O3k0NK02l12n3J24l0J73o6q0J88k12j4J06
4347A7j82K11j26J24K6K9J70j50Mk12K08j0p7L9j34N2K28l69L18o6j19J00k48
4370a67J37K85k13R7m9q3k54J97MK22k99J17k11L01J58j71q4N5l4q1J05k89M21
$$ plain form
4199 -103 -40 69 -78 -170 -262 -92 -70 -94 -153 69 -158 120 280 -92 -119 -202 -76 189 -42 -22 -50 93 125 -160
4223 -160 -98 -190 -231 -33 -77 182 225 -25 -37 140 -215 -77 73 -43 -210 17 212 35 -89 53 -21 11 -81
4246 -81 222 -198 -152 11 99 111 -52 -82 -22 28 -134 -138 134 81 92 -85 -113 -65 52 88 -26 -39 -118 72 62 84
4272 84 177 269 -63 -204 28 -133 -87 150 -217 80 92 118 -26 -37 -63 48 44 76 54 -107 -93 116 -278 -54
4296 -54 83 118 96 126 119 25 211 -216 8 -130 -50 -15 -67 -96 -86 -171 12 73 -149 117 33 -38 -23 -131 193 134
4322 134 -29 53 -115 -178 36 178 223 -9 -43 -57 6 -14 -9 193 -119 -172 -48 -78 95 29 -51 137 -75 -89 17
4347 17 -165 46 -80 44 70 99 269 119 123 -89 119 109 32 71 -63 -11 217 -152 166 100 -19 81 -167
4370 -167 -30 255 42 139 90 7 -247 -50 -46 176 -123 -6 -217 84 242 71 -13 42 8 -73 32 -257 164
4393A64j63nJ66j68j31J33q6m1J61J08j87pj6N1O2n0j57J52M6kk4p9l6J66j42
4418h5K28k02o8J23O4k77K35q2J14k08K28k19K24MM4k34j00K29J27k11J17o7L9
4441B3p7K6J10J94j46k47J18o3j0J52n8J3l3K8Q3l1N2k39K69n1q8l7J60j33j08
4466i3J83j55J71j55n4J34r6O5K13j21p9q4K21K9k67m7L03k27j01N9J5J22m9J02
4490H9j17n6J28q7J37k5j69O9j20pJ19L3p5J12q1K03j05J2L7r4j47K95j54nr6
4515a04NJ29j70K32lj44k17K90J1j37K00p6QJ1Nj31N9r4L5q3L09p7r1Q3j4J27
4541A63j73Mp0K81j95O5J9k93L36R9k72L3KJ80o8m9j58P9J01l9j65L73m05J49
4565cnJ18k19M6P7n9rJ24q0K24k64J84m1j12J23L6k43J2J20Kk29J69oJ51p1j92
$$ plain form
4393 164 1 -4 162 -6 -137 -4 -90 -131 30 138 -49 -56 -72 -21 41 -9 -166 -14 32 30 6 -73 -109 57 -85
4418 -85 143 -59 -127 -4 60 -217 18 -64 50 -158 70 -149 75 79 123 -111 -211 18 145 -66 51 -16 23
4441 23 -54 -28 82 276 130 -117 1 -62 -72 80 22 35 2 30 113 82 134 -105 164 113 25 -12 148 15 -93
4466 -93 90 -65 106 -49 -103 31 -65 0 213 92 13 -71 150 179 -88 -135 168 -59 -160 -101 -86 36 -13 89
4490 89 -28 -84 44 -43 94 69 -100 -31 -151 -158 -39 -6 -81 31 -50 153 48 60 97 3 -144 151 -3 -8 -104
4515 -104 -99 30 -140 92 89 -55 -272 18 29 -108 92 16 24 35 40 -91 -32 -126 -91 -174 135 58 -33 50 36 163
4541 163 -10 -6 -76 205 10 75 94 -199 137 236 -36 -3 -1 179 111 62 -96 -17 84 45 -120 253 -152 -3
4565 -3 -8 110 -109 -63 14 -45 -54 70 -10 214 -50 134 93 -19 104 140 -103 -91 29 31 -198 -29 -35 116 45 -147
4591a47J85Rj69R7P0k13L62k10rO9j13l6r5K55P0Ml31J78J84K6k85j13O9J23K2
4616Bj01K00r8J52j62q5Q5RJ87m16K42M6j02J9k6J72j57N9n5R4j18O8QJ6m1n0
4642e2k9K74j33M6p7j20J15k18J03K1l0L05k37q2j8L02nl2j5l7J42k46J18r2J73
4667A76j44p1J83j37j2K41k17N9p6J65l69L80Lq7J20k14J24j07j46O9J36l29K64
4690A1pL9Jl0P3j49L11j42o2j78J82n7o2J35j46J30n4K5L1k09L69k78k8N0M8j3
4716a0q0Q5R4r2J65j51J05l3q4K27j95K90k87J3j29N7J2k69L38K8j5J07j30J2
4740E8Q4j73p0K91q7j49qOJ00lp9j04J8K00m0k4n3j69J83R0j85J32JJ12k35p3
4766a77K71j53j04K10r2Q9K5j77N5K1r0K8n2K84o3n9J59j02j23k7J52j01j02K36
$$ plain form
4591 -147 38 47 -122 -25 45 -168 194 -16 -25 44 -69 -105 -200 55 125 129 -202 -24 160 186 -99 -212 -143 -20 2
4616 2 -99 101 3 155 -7 -92 -7 2 189 -227 15 61 -41 -22 -48 124 -33 26 -29 65 -53 15 23 39 -2 -52
4642 -52 -81 193 60 106 29 -91 24 -194 -91 -70 -100 205 -32 -114 -132 170 165 133 118 81 223 -23 95 3 176
4667 176 32 -39 144 7 -5 236 19 78 2 167 -202 178 181 94 214 0 124 17 -129 -60 76 -253 11
4690 11 4 43 44 14 87 -62 249 107 45 -133 49 -8 -70 65 -81 49 -5 20 51 -158 211 -67 -95 -45 3 -10
4716 -10 -90 -5 89 -3 162 11 116 83 -1 226 31 321 34 47 -82 -25 -13 -282 56 84 69 176 46 58
4740 58 142 -31 -101 190 103 -46 -54 -48 52 49 -30 -134 -116 84 44 20 -33 -202 -19 71 -114 18 19 131 -104 -177
4766 -177 94 -59 -163 47 -45 44 69 -108 -53 -32 -122 -94 -146 138 75 16 175 73 -50 -77 75 -26 -128 108
4790A08K8l31J87J64l67J33J93%k40K23l30J41J78j19J3J58j77p5J20P8k49J24
4812d0J81l9j39L0K20k19O7j21QM18m26J1o5O4L9j13J19J18j29M9j23q8n7K56
4836B1J60k20POL41m73K6J46p6J70m1L2k2o8M2k20J39or2l8K30J2J4j7j00L5k7
4863a9l8q9K92k37K11j05r3L08j57l0O0j28j43J94jj3J64k27K09k93O8K39j69
4886CJ09j40J01L1r8j6l3lmk7R7lq3K25N1k45p4J76m8k66K86J4j4J89k67J12j4
4913E9R5J0l11J10N9M0P3J35j10l0k9j29p3j4M9O5j42J28j0J05j96nJ8J14K5M6
4939H2Q7o6M5k81N3L5k2K5K4Lj34K14j04K2kJ30k09J16j19R9q8p8L57N7l47K26
4965A25j51K81j35k00K05o0j70R3J52l23M06q3o4L8j15J21m41L69Q5r0j09J62
$$ plain form
4790 108 136 -195 -8 156 -211 -78 115 115 -125 98 -232 -91 87 -32 -19 139 -38 -113 7 85 -164 -40
4812 -40 141 102 -37 -7 213 -6 61 -60 -52 366 -60 -49 -114 -50 -11 -124 -5 113 -16 33 -90 -178 -235 21
4836 21 181 -39 -32 -26 315 -158 -132 14 -62 108 67 99 77 9 51 -169 -30 -36 -128 -166 64 76 90 73 -27 8 -19
4863 -19 -57 -146 146 -91 120 15 -78 230 73 43 103 -25 -168 26 25 12 176 -51 158 -135 -67 172 3
4886 3 112 -28 73 104 6 -10 -43 -46 -50 -77 20 17 -66 159 210 -35 -109 67 19 -247 39 53 39 228 -39 73 59
4913 59 154 164 -147 -37 22 62 135 270 160 130 101 -28 -101 -115 -66 -1 -143 -15 -25 80 -116 -121 -103 11 36 82
4939 82 169 103 148 -133 -80 -45 -67 -42 -18 -15 -149 65 -39 -17 -19 111 -98 18 -101 -2 -90 -168 189 246 -101 125
4965 125 -26 255 120 -80 125 65 -105 -12 140 -183 223 140 76 114 -1 120 -321 48 133 43 -66 96
4987I6j61P3k9j91J53J49J78l06J86j65J70l32J38Q1k67J99N9j01kJ7J4k6r8J48
5011a7Ok9J38k08N2L1q0q6n5L54k93N8K04J2J66j40l89N36k05O3L4j81M5R7p9
5036C4L1p1J64l07k1J36J40j28J11lo2jj0o9n0L12k35L3J41l05K29j03M6p9K04
5061A37j67M2L2l15J82K4K90k52K2J50k34K6m5J69J13l88K18J5J9O2P9k16K10
5084A73k12J99j59L0J25j29J10j82J83n0Q3j33k6M2o0N8J50j78r7K9Q6L2r6J7
5108em7J07L6j26m6J51L2l5J9k76Q1Q5K2r4N5J64k01m0J28J02k65K04K31m79J17
5133h0J16j51J02o3K8M5l05K75j6m5K25k28J59k44J82L7j59K78k62J11r0J03j38
5156a20K00k0p0r8J34K9j02J76j17K74k50J53j55N6j87R2k00L18j70Q4J7J96l53
$$ plain form
4987 96 -65 8 -21 -212 -59 90 268 -38 148 -17 153 -179 -41 40 -227 -28 31 -70 -72 -55 -41 -67 -165 -17
5011 -17 -11 -40 98 -110 -58 -27 -107 -193 -248 106 -187 -129 75 87 253 113 -276 260 55 118 152 -29 16 113 34
5036 34 65 -6 158 -149 -170 -34 106 -22 89 86 24 23 13 -56 -106 206 -29 4 145 -160 69 -34 12 -67 137
5061 137 -30 12 44 -271 -89 -65 225 -27 -5 145 -89 -63 -108 61 174 -214 4 19 38 100 179 -37 173
5084 173 -39 160 1 31 156 27 137 -45 138 88 171 38 12 54 -6 52 202 24 -73 -44 42 74 -22 -5
5108 -5 -52 55 91 -35 -81 70 102 67 86 -190 -109 -24 -2 -96 -41 123 -78 -118 10 112 -153 51 282 -197 -80
5133 -80 36 -115 -13 -76 -48 -3 -308 -33 -49 -94 131 -97 62 -182 0 37 -122 156 -106 5 -85 18 -120
5156 -120 80 60 -10 -108 26 55 -47 129 12 286 36 189 34 90 -97 -5 -205 113 -57 27 44 240 -113
5179a13L22j84j69J09o2P4J57Jn7q6j04K49j81K37j41L2L9j97m9J29O4j00k05
5202b35L01j64J50j02q3N2L5J24l0N5o2O8j97O0R1J29j45j34J13j99M9J20R4N4
5226A44k8j43Q1r8J28l09J97j97K82k12J88j76J25P9K6j17j45J47m6j4P9K25l59
5249a43R7K39j55J44k45k7J33j08j2j08oL11k44K56j74k8L17m33R9J40lj24j21
5272a95K48j03O3j20J09m2k0Q4r4o5j06L26L7k84K51k28J14kj48J04K03k19N5
5295c2J6o9M2N4j10J07J28k18J39o3k17K74j47J62n1j79M5J74P1J6K2j02l44K54
5319b8J67m6j22J72j47J24k06K4O0k52K79j07K38k07Kn5M1P2J27o8o2K6K0K7o
5344G3L2K3k94M02m60K44k4J08j18pJ70j47j13J23J83k99R4n0r0J22J44j59L7
$$ plain form
5179 -113 209 25 -144 -35 -97 -23 134 135 78 -8 -112 137 -44 193 52 84 123 -74 -123 6 70 -30 -235
5202 -235 66 -98 52 -50 -133 -81 -46 78 48 103 41 109 -88 -28 63 192 47 -87 26 -173 -124 -4 90 144
5226 144 116 -27 54 -44 84 -225 -28 -225 57 -155 33 -143 -18 61 87 -30 -175 -28 -74 -88 -9 216 -143
5249 -143 -46 193 38 182 -63 -90 43 -65 -77 -185 -191 120 -124 132 -42 -70 247 -186 -87 53 50 -74 -195
5272 -195 53 -50 13 -107 2 -40 -60 24 -70 -135 -241 85 122 -162 89 -139 -25 -27 -175 -71 132 -87 -32
5295 -32 -16 -85 -43 11 -99 8 136 -82 57 -6 -223 51 -96 66 15 -164 -119 55 126 142 164 62 -282 -28
5319 -28 139 93 -29 143 -4 120 -86 -62 -2 -254 25 -82 156 -51 -49 -104 -63 9 136 68 6 32 52 79 73
5344 73 105 128 -166 236 -224 20 -4 104 -14 -21 149 2 -111 12 195 -104 -10 -60 -150 -28 116 -43 -6
5367fR2j15P9kP8k13n2K64k27n5K5K85k26J75k56L09j9j31P2o5J47p5j6n1j75
5392a58J45J19j67J55k92L14j50M9k38K47m2l5O4O9L5k89J63j73Q9p7M08k16R0
5415A10j02N2m7q2O6k0K52j91J97k18K6K3j41Q0k4J22k05K06j58O2j30K13L6m04
5439b77K91n0K9j06J80j8k21J91n5K09j88j90J30p2J04m3M0Q9j47n0M9L08j99
5462DR1p4L2j12J8J0K08N1j55j99Q0K27j90j47K72j84J32P6l21K00m9j6p9J27
5486BJ05jj28L28l51k5p7k29K60K44q8k0o3N5K0j0J72l5j01q0j84Q4J6P1O2j17
5512i0k18K95Q1p5R3K6R7k13j08K30j26r5o6J52J16m9j86M4J02m0J63j55K28l1
5536A75k64k3OJ68mo2K47m09N7j4M6J86k42J87j18J32J25k05Q7j56J98j20M2J88
$$ plain form
5367 -6 86 -29 50 48 126 -87 -139 125 -102 -157 -132 153 -73 102 -154 155 136 5 77 12 159 84 68 17 -158
5392 -158 -13 106 -61 94 -198 116 -34 15 -223 24 -18 -53 11 80 115 -174 -11 -184 -95 -172 236 20 110
5415 110 8 60 13 -69 -3 -23 229 38 235 17 43 66 -75 5 -19 103 -102 104 -54 8 -122 91 127 -277
5439 -277 14 -36 -7 -113 67 49 -172 19 -36 173 -15 -205 -75 -147 -43 -86 -46 43 -104 -154 -105 203 4
5462 4 95 21 53 -59 -41 -31 177 228 73 -126 -46 181 -9 -156 116 -68 64 140 -181 19 -30 -46 -125 2
5486 2 107 106 -22 306 -45 -70 -147 -376 -116 128 40 20 -43 12 32 22 194 159 58 -22 -206 -122 -106 -35 27 -90
5512 -90 -308 -13 68 -7 86 112 209 -4 -112 118 -8 -103 -169 -17 99 50 -136 -92 10 -30 133 -22 206 175
5536 175 -89 -112 -106 62 58 -4 243 -166 -109 -123 -77 109 -133 54 -64 68 193 -12 75 -81 117 -3 39 227
5560B27l82M9L5J23M8N%L9o7k47K35J1j82L16l17K75o8k53J30Q0K6k26M02l59
5584a00J89k04J93j49J30r7N2n6k7M2J73o5j95N4P3J44j61r6K69j21j8k03K0J94
5608D1r6j20J43L1j3p2R9rn3N2O5Q8j84L9Q6j28l0J38k66L12R7r1o5Q2j91R9j4
5635D0q5r0M4J42r4J55R0n8j85J14p6L7R0j8Kq8k10J80m5M3J47K1j57j82L13R1
5661B21j57k13j8K25J2P9k5j05l3Q9j4j02j1j58J42QP0k1n7J26MM4p8L7j4p0O5
5688D6l6q8P5J0k61K03Jq6q5J96N8m2K34l30L16m22K98KK1%l6o6o8Q5J61k19r0
5715a23J02ML4Jj45R2n2L6J50q5kJ00K9j21LN6L2k15K62j38j59j04K26K4j74J92
5741B5n8K42l65J49j44Q5K10J6j03j64K20j67Jl6P0r5M02l64O2l8j9K02k5j79
$$ plain form
5560 227 -155 -106 -71 52 100 105 105 144 77 -170 65 76 -106 210 -107 168 100 -153 -23 57 83 -143 259 -100
5584 -100 89 -115 78 -71 59 -38 14 -42 -69 -27 146 81 -114 -60 13 157 -4 -100 169 48 30 -173 -153 41
5608 41 -55 -175 -32 -1 -14 -86 13 4 -49 3 68 156 -28 11 97 -31 -61 77 -189 123 220 129 64 146 -45 54 40
5635 40 -45 -135 -91 51 -43 112 202 144 -41 73 -3 34 124 106 108 20 -190 -10 -55 -12 135 156 -1 -183 130 221
5661 221 64 -149 -167 58 70 149 124 19 -14 75 61 -41 -52 -210 -68 -60 10 -11 -68 58 62 106 28 65 51 -19 46
5688 46 10 -78 -3 7 -254 -51 -50 -136 -221 -25 33 -9 225 -105 211 -211 87 89 110 110 74 8 -60 25 186 -33 -123
5715 -123 -21 -17 17 18 -127 -35 -87 -51 99 14 12 112 141 20 23 79 111 -104 158 20 -139 -243 -17 7 -167 25
5741 25 -33 209 -156 -7 -151 -66 144 160 57 -107 113 -54 -53 -89 -19 -114 288 -76 -14 -52 -71 131 106 -73
5765g3J20P9j04qM9R5L5l13J05j0j1M3k56L98k64J26M3O5j02K0n8J74j17o9K14
5790A81k06p6J72q9J5n6j32J53k2r8K57k9n8J7N4j17R9J07j2k11m3J02m9K61j69
5815E1om18J76K68L4o8J09k43j31K84k0j59J21j78K53j24J8J76Jk3j57J6j58R9
5839g9K35j59j8J56j65J59l16K92j77M7J33k99J6K31k06L6L48k11l0mN5n2j18
5862a26m7J58p4J45p1Q4j8j56J47L9R8j78J50Qj3j37P2k66J10K73k68n1L43l8
5886A84l7j74J38n3L1L2%n6j74J12M4N4m3N0j07j23J08j66lR5O4m2m2L44k69p
5912d0j8K3j6L2J37k92K9J8R0n3K09j90J33Q7k78J74q6j8J42k55j4J98j29K35
5936A18j05j8J80o9k50R1J45m6l7o2J46r7j53L05l46J07K03j55M0p3K07N8l53
$$ plain form
5765 -73 47 126 22 14 63 158 193 -120 -15 -25 -36 7 -249 149 -115 11 54 119 17 37 -21 153 36 -33 181
5790 181 -25 -101 71 -18 -3 -59 -191 -38 -60 -158 99 70 12 29 83 -34 65 172 160 -51 -94 8 -41 220 51
5815 51 45 -373 -197 71 105 37 146 -97 -228 56 36 -123 -2 -180 73 -51 -33 143 144 121 -36 -20 -178 -79
5839 -79 156 -3 -21 135 -30 129 -187 105 -72 -25 108 -191 -175 56 -150 -114 234 23 -7 -11 44 -8 -126
5862 -126 -173 -15 -89 56 -15 69 51 -105 42 81 179 1 151 159 146 9 81 -185 -75 198 -70 -121 222 184
5886 184 147 -27 111 58 89 121 121 65 -109 3 47 101 58 108 1 -122 -14 -180 -183 -88 -24 -66 -108 236 -33 -40
5912 -40 -58 -35 -51 -19 118 -174 -145 -127 -37 -90 119 -71 62 149 -129 45 -41 -59 83 -172 -186 12 -117 118
5936 118 13 -5 175 106 -144 -53 92 46 9 -53 93 -4 -157 148 -198 -91 112 -43 -3 -76 131 189 -164
5959a64J01J25q3J44j96j02N4J53j50K62o4r5m5O1J6J9p7o2J56P2k95K08o7J55
5983A26j62j9j39J17M43l19j30J68j1o7j6r8K58l61M01Jm10J45j24J47J0o7J08
6006Ak7J96j84Ko1J40j1rLJOO2p8n2k1j33L14Nj8k85J72L0j40J6r8K04o0l6K90
6035B29o4n7j21J20M5Nj45K9M5p6J65l77J93k0O7m7j84Q6k0K04j0j76K83q2j49
6060e7O7J85j22j4j82J4L64k49j73J38k0J61J65j22j54K14l26K40j33n0Q7k2p5
6083f4J21k55J42j13j2j3J35J62j60N4n3J09l2J8O9j17O8j79J03k4l1K98k05J62
6107A83P8j80r2J77k80J56j55L20m14K50J40M7j30j61J08k64K71J34k45K07o7
6128H3j81k6p5M2J37kJ15K3l0O2j03O5J05k46J00n0K54j91l06J42J74j15J24j50
$$ plain form
5959 -164 -63 62 -21 123 -73 -175 -121 32 -118 144 80 -15 -60 1 17 36 -41 -103 53 125 -170 38 -29 126
5983 126 -36 -55 -194 -77 366 47 -83 85 74 7 -9 -107 151 -210 191 192 -218 -73 -197 -50 -40 -107 1
6006 1 -26 170 -14 -12 -73 67 56 47 50 51 57 119 41 -11 -32 -165 149 154 136 -149 23 53 -87 -71 -169 35 -25 -61 229
6035 229 165 108 -13 107 152 157 12 41 86 10 175 -202 -9 -29 38 -9 -193 -107 -127 77 67 -109 174 92 -57
6060 -57 10 195 73 59 -123 -109 255 6 -167 -29 -49 112 277 155 1 215 -111 129 -4 -54 33 11 -64
6083 -64 57 -198 -56 -169 -181 -194 -59 103 -57 -3 -56 53 21 39 108 -9 59 -120 -17 -41 -72 226 21 183
6107 183 261 81 -11 166 -114 42 -113 207 -207 43 183 230 100 -61 47 -217 54 188 -57 150 83
6128 83 -98 -124 -199 -157 -20 -22 93 116 86 148 45 110 215 -31 69 19 273 82 -224 -82 92 -23 101 -49
6152d9j4j37K67k02N6R5%j16Q2J48k3j93q0J91J32j68q5J76p2J2Q7J1j46l5r4
6177a57J41j46K89k63J91q1n1j07K60m9k30j5L04k09K7K17l34K35q2M7J47J17
6199B51p1j99j25J62l2K40l33L33j79j30J55l11M9J79m2j08J58j07j5N2J63jm1
6222D8p3m8P8Q0L2j77j42K65j58K47l05K49l6k30NR8LK51j00k90J38K6J54r9j6
6247@J52J13k78P7P0l8L0m1k40J37P9J08k03M6L1j33M7k9j2J45k4jQ7k52J63l6
6273bj28J30J67k99J48m4j67L07p5J85k60R1j9nk7J80k29n9J19N3Ok79K07j26
6297a26J66q8M9j73K94l4j46K04k97P2O7J20j67J78k25L2Jk0r9K00j28M78m40
6320h2J69m4k56L73k25Q3n1n1J69k19K47j06Q1k05J07J02j96P1Q9r8J43kl0j66
$$ plain form
6152 -49 -63 -200 67 -135 -79 16 16 -100 -18 130 107 -86 -166 25 157 -11 -96 80 8 20 107 118 -28 -63 -157
6177 -157 -16 -162 127 -136 55 -26 -77 -184 76 27 -203 -218 86 -123 -96 121 -213 22 -60 -13 134 251
6199 251 180 -19 -144 18 -14 226 -107 226 47 -83 72 -239 -190 -11 -53 -161 -3 -110 -125 -73 90 89 48
6222 48 -25 -73 5 85 117 -60 -202 63 -95 152 -153 96 60 -170 -165 -67 -64 187 87 -203 -65 -39 115 16 0
6247 0 152 265 -13 64 134 96 126 85 -155 -18 61 169 -34 12 43 -90 -43 -72 -84 61 37 36 123 -129 34 -2
6273 -2 -130 0 167 -132 16 -28 -195 112 37 222 -38 53 34 29 2 182 -47 -106 13 66 72 -207 0 -126
6297 -126 40 -48 1 -172 122 88 -58 146 -151 -79 -12 108 -59 119 -106 -74 -73 -93 -192 8 -120 358 -82
6320 -82 87 43 -213 160 -65 18 -33 -84 85 -134 113 7 88 -117 -10 92 -104 -33 56 -42 101 99 69 -97
6344i7r9J15J30k7J29k41K37o8j11J4J80J46l35LJ2k9kJ31m2M4j04m8QR0N8l5
6370E9Jk0j39J04n1L6m2K33k15M9N2m8o2j47J27M1R9j01j1J61j11o9J80r7M1P4
6396A44k01R6j22J36k4o8J29j51J34r5R2n9Q5j11N8j93J49j64PJ9J34J90j25k59
6420a99K38l1p5K33j99L97m72J67K5j35j13K8l8N8J10J16j23K9Q5j65rK7K39l22
6444a29L45j03j14m9J74k06J31j26K41l42R0M27l79K03l09l2J45J4R4j97K0J04
6466BK33j42k74L38l05J88p9J47j92J4Q6n5L5j52J87k16L64O0l58J91J1j40R8
6489D1p4Q6l02L67j81N4L7L2l8o4J23q1K7j38J19j18K23J2R8k52O6OK7J35r9o8
6515C8J30j83J89r1r1J38j24k9J16q2o8Q1k33L74k18J26j21r0L18k51J65j70J85
$$ plain form
6344 -97 -196 -81 49 22 151 -90 147 79 -32 -18 162 308 -27 -24 -12 -41 -43 88 46 90 -14 -62 -54 36 94 59
6370 59 60 40 -99 5 -46 -10 -52 181 -34 15 67 19 -43 -190 -63 -22 77 -24 -35 126 15 -54 126 29 70 144
6396 144 -57 39 -83 53 29 -39 90 -61 73 -22 70 11 96 -15 43 -150 -1 -165 -158 -139 -5 185 60 -199
6420 -199 39 8 -67 166 -33 364 -108 59 84 -51 -164 -136 -174 -116 -6 110 -13 16 101 -64 -73 -46 193 -129
6444 -129 216 113 -1 -50 124 -82 49 -77 164 -178 -88 339 -40 163 -146 -178 -33 -19 75 -122 -102 2
6466 2 235 93 -181 157 -148 40 -39 108 -84 -70 16 -39 -4 -156 31 -185 179 239 -119 72 83 -57 41
6489 41 -33 53 -249 118 -63 -9 28 60 22 -42 81 0 27 -111 8 -110 113 125 223 -29 37 43 70 205 106 38
6515 38 168 -15 174 83 -8 130 6 -23 93 11 -57 24 -209 165 -53 73 -48 -138 180 -71 94 -76 109
6538A09R9kj17J92j25k52P7p8M5J52q8j89K13j13J84k19R9j11K23o1q6lJ6q6J20
6563aj10J91k1k74J88ql6J1J86j81P1K7J2J03r9l4J19k2k89J05m4P5n8K39l89
$$ plain form
6538 109 208 206 89 281 156 -96 -19 -97 -52 100 12 -177 36 -77 107 -112 -13 -124 99 38 -48 -51 -35 -121 -1
6563 -1 -111 80 59 -215 -27 -35 -71 -60 126 -55 16 43 55 158 59 25 144 122 -167 -62 -106 -31 -89 150 -239
$$ [...]
8191a14
##END NTUPLES=NMR FID
##END=
