##TITLE=1H_Pr 37-EH
 200.13MHz,CDCl3 ,
 8 sc
 
 31.10.2025
##JCAMPDX= 6.0         $$ Bruker NMR JCAMP-DX V2.0
##DATA TYPE= NMR FID
##DATA CLASS= NTUPLES
##ORIGIN= UXNMR, Bruker Analytische Messtechnik GmbH
##OWNER= pz
$$ XWIN-NMR		Version 3.5
$$ Fri Oct 31 14:24:54 2025 Russian Standard Time (UT+4h)  she@DPX200
##.OBSERVE FREQUENCY= 200.1313
##.OBSERVE NUCLEUS= ^1H
##.DELAY= (6, 6)
##.ACQUISITION MODE= SIMULTANEOUS
##.ACQUISITION SCHEME= undefined
##.AVERAGES= 8
##.DIGITISER RES= 18
##SPECTROMETER/DATA SYSTEM= spect
##.PULSE SEQUENCE= zg30
##.SOLVENT NAME= CDCl3
##.SHIFT REFERENCE= (INTERNAL, CDCl3, 0, 14.3821)
##AUDIT TRAIL= $$ (NUMBER, WHEN, WHO, WHERE, WHAT)
$$ ##TITLE= Audit trail, XWIN-NMR		Version 3.5
$$ ##JCAMPDX= 5.01
$$ ##ORIGIN= Bruker BioSpin GmbH
$$ ##OWNER= she
$$ F:/spectra/data/she/nmr/H-C/1/audita.txt
$$ ##AUDIT TRAIL=  $$ (NUMBER, WHEN, WHO, WHERE, WHAT)
(   1,<2025-10-31 14:23:48.18 +0400>,<she>,<DPX200>,
      <created by zg, POWCHK disabled, PULCHK disabled
       configuration hash MD5:
       00 E9 B6 7A A2 85 ED C7 34 08 36 98 17 FE 4E 26
       data hash MD5: 16K
       60 B9 E6 DC 60 2B 75 CB 61 C5 DB 58 6A 2E BE F3>)
$$ ##END=
$$ 
$$ hash MD5
$$ 11 C9 2C 17 74 4D 20 F6 CF 5E DF 2F 16 17 FB 65
##$RELAX= 
##$RELAX= 
##$RELAX= 
##$RELAX= 
##$RELAX= 
##$RELAX= 
$$ Bruker specific parameters
$$ --------------------------
##$DU= <F:/spectra>
##$EXPNO= 1
##$NAME= <H-C>
##$PROCNO= 1
##$TYPE= <nmr>
##$USER= <she>
##$AMP= (0..31)
100 100 100 100 100 100 100 100 100 100 100 100 100 100 100 100 100 100 
100 100 100 100 100 100 100 100 100 100 100 100 100 100 
##$AQSEQ= 0
##$AQ_mod= 1
##$AUNM= <au_zg>
##$AUTOPOS= <>
##$BF1= 200.13
##$BF2= 200.13
##$BF3= 200.13
##$BF4= 200.13
##$BF5= 200.13
##$BF6= 200.13
##$BF7= 200.13
##$BF8= 200.13
##$BYTORDA= 1
##$CFDGTYP= 0
##$CFRGTYP= 5
##$CHEMSTR= <none>
##$CNST= (0..31)
1 1 145 1 1 1 1 1 1 1 1 1 1 1 1 1 1 1 1 1 1 1 1 1 1 1 1 1 1 1 1 1 
##$CPDPRG= <>
##$CPDPRG1= <>
##$CPDPRG2= <>
##$CPDPRG3= <>
##$CPDPRG4= <mlev>
##$CPDPRG5= <mlev>
##$CPDPRG6= <mlev>
##$CPDPRG7= <mlev>
##$CPDPRG8= <mlev>
##$CPDPRGB= <>
##$CPDPRGT= <>
##$D= (0..31)
0 0.7 0 0 0 0 0 0 0 0 0 0.03 0 0 0 0 0 0 0 0 0 0 0 0 0 0 0 0 0 0 0 0 
##$DATE= 1761906227
##$DBL= (0..7)
120 120 120 120 120 120 120 120 
##$DBP= (0..7)
150 150 150 150 150 150 150 150 
##$DBP07= 0
##$DBPNAM0= <>
##$DBPNAM1= <>
##$DBPNAM2= <>
##$DBPNAM3= <>
##$DBPNAM4= <>
##$DBPNAM5= <>
##$DBPNAM6= <>
##$DBPNAM7= <>
##$DBPOAL= (0..7)
0.5 0.5 0.5 0.5 0.5 0.5 0.5 0.5 
##$DBPOFFS= (0..7)
0 0 0 0 0 0 0 0 
##$DE= 6
##$DECBNUC= <off>
##$DECIM= 32
##$DECNUC= <off>
##$DECSTAT= 4
##$DIGMOD= 1
##$DIGTYP= 9
##$DL= (0..7)
0 120 120 120 120 120 120 120 
##$DP= (0..7)
150 150 150 150 150 150 150 150 
##$DP07= 0
##$DPNAME0= <>
##$DPNAME1= <>
##$DPNAME2= <>
##$DPNAME3= <>
##$DPNAME4= <>
##$DPNAME5= <>
##$DPNAME6= <>
##$DPNAME7= <>
##$DPOAL= (0..7)
0.5 0.5 0.5 0.5 0.5 0.5 0.5 0.5 
##$DPOFFS= (0..7)
0 0 0 0 0 0 0 0 
##$DQDMODE= 0
##$DR= 18
##$DS= 0
##$DSLIST= <SSSSSSSSSSSSSSS>
$$ [...]
##$SUBNAM0= <"">
##$SUBNAM1= <"">
##$SUBNAM2= <"">
##$SUBNAM3= <"">
##$SUBNAM4= <"">
##$SUBNAM5= <"">
##$SUBNAM6= <"">
##$SUBNAM7= <"">
##$SUBNAM8= <"">
##$SUBNAM9= <"">
##$SW= 18.0517328524113
##$SWIBOX= (0..15)
0 0 2 0 0 0 0 0 0 0 0 0 0 0 0 0 
##$SW_h= 3612.71676300578
##$TD= 16384
##$TD0= 1
##$TE= 0
##$TE2= 300
##$TE3= 300
##$TEG= 300
##$TL= (0..7)
0 120 120 120 120 120 120 120 
##$TP= (0..7)
150 150 150 150 150 150 150 150 
##$TP07= 0
##$TPNAME0= <>
##$TPNAME1= <>
##$TPNAME2= <>
##$TPNAME3= <>
##$TPNAME4= <>
##$TPNAME5= <>
##$TPNAME6= <>
##$TPNAME7= <>
##$TPOAL= (0..7)
0.5 0.5 0.5 0.5 0.5 0.5 0.5 0.5 
##$TPOFFS= (0..7)
0 0 0 0 0 0 0 0 
##$TUNHIN= 0
##$TUNHOUT= 0
##$TUNXOUT= 0
##$USERA1= <user>
##$USERA2= <user>
##$USERA3= <user>
##$USERA4= <user>
##$USERA5= <user>
##$V9= 5
##$VALIST= <valist>
##$VCLIST= <CCCCCCCCCCCCCCC>
##$VD= 0
##$VDLIST= <DDDDDDDDDDDDDDD>
##$VPLIST= <PPPPPPPPPPPPPPP>
##$VTLIST= <TTTTTTTTTTTTTTT>
##$WBST= 1024
##$WBSW= 4
##$XGAIN= (0..3)
0 0 0 0 
##$XL= 0
##$YL= 0
##$YMAX_a= 704744
##$YMIN_a= -784176
##$ZGOPTNS= <>
##$ZL1= 120
##$ZL2= 120
##$ZL3= 120
##$ZL4= 120
##$ABSF1= 10
##$ABSF2= 0
##$ABSG= 5
##$ABSL= 3
##$ALPHA= 0
##$AQORDER= 0
##$ASSFAC= 0
##$ASSFACI= 0
##$ASSFACX= 0
##$ASSWID= 0
##$AUNMP= <proc_1d>
##$AZFE= 0.1
##$AZFW= 0.1
##$BCFW= 1
##$BC_mod= 2
##$BYTORDP= 1
##$COROFFS= 0
##$CY= -3
##$DATMOD= 1
##$DC= 2
##$DFILT= <>
##$DTYPP= 0
##$F1P= 0
##$F2P= 0
##$FCOR= 0.5
##$FTSIZE= 0
##$FT_mod= 4
##$GAMMA= 1
##$GB= 0.15
##$INTBC= 1
##$INTSCL= 1
##$ISEN= 128
##$LB= 0.25
##$LEV0= 0
##$LPBIN= 0
##$MAXI= 10000
##$MC2= 0
##$MEAN= 0
##$ME_mod= 0
##$MI= 1.114404
##$NCOEF= 0
##$NC_proc= 0
##$NLEV= 6
##$NOISF1= 3.799351
##$NOISF2= 2.8
##$NSP= 1
##$NTH_PI= 0
##$NZP= 0
##$OFFSET= 14.38212
##$PC= 1
##$PHC0= -2623.288
##$PHC1= 1.19235
##$PH_mod= 1
##$PKNL= yes
##$PPARMOD= 0
##$PSCAL= 0
##$PSIGN= 0
##$REVERSE= no
##$SF= 200.129724274929
##$SI= 16384
##$SIGF1= 3
##$SIGF2= 2
##$SINO= 400
##$SIOLD= 16384
##$SREGLST= <1H.CDCl3>
##$SSB= 0
##$STSI= 0
##$STSR= 0
##$SW_p= 3205.1282051282
##$SYMM= 0
##$S_DEV= 0
##$TDeff= 0
##$TDoff= 0
##$TI= <>
##$TILT= no
##$TM1= 0
##$TM2= 0
##$TOPLEV= 0
##$USERP1= <user>
##$USERP2= <user>
##$USERP3= <user>
##$USERP4= <user>
##$USERP5= <user>
##$WDW= 1
##$XDIM= 8192
##$YMAX_p= 0
##$YMIN_p= 0
$$ End of Bruker specific parameters
$$ ---------------------------------
##NTUPLES= NMR FID
##VAR_NAME=  TIME,          FID/REAL,        FID/IMAG
##SYMBOL=    X,             R,               I
##VAR_TYPE=  INDEPENDENT,   DEPENDENT,       DEPENDENT
##VAR_FORM=  AFFN,          ASDF,            ASDF
##VAR_DIM=   8192,          8192,            8192
##UNITS=     SECONDS,       ARBITRARY UNITS, ARBITRARY UNITS
##FACTOR=    0.0002768,     1,               1
##FIRST=     0,             0,               0
##LAST=      2.2672688,     0,               0
##MIN=       0,             -784176,         0
##MAX=       2.2672688,     704744,          0
$$ Real data points
##PAGE= N=1
##DATA TABLE= (X++(R..R)), XYDATA
$$ [...]
1594A563j053n83J46j5j016k94J777J728j015k870j248K378L079N1l202k295J231
1611a638K812J278j889j862K40J446K06o31k47J104j02j489r22R73K540K63k493
1628d11j929Q41K578R05j651j629O3J281N41j88j29j62k30o76n5J257O22j0j629
1647f11j115J020J507N34j290r40R8P46L44j17M86k18r55q03R49J645K10j597
1665a07j290K50J563J092r19j426J00O84O43o81m94R74N03p57j381M07J798R56
1683A915j636k069J14K432J281j452k009j50J779J308j179j476M27J528%j382
1699e69o19J253J525q00k054l50J591J701n21k008p04J197J521l8j352r57R45
1716b39P01k38p30L28J093m35j119k69J004J099l38j569n35P73J230J58r20o88
$$ plain form
1594 1563 510 -73 73 58 -958 -1252 525 2253 1238 -1632 -2880 -502 2577 2628 -574 -2869 -1638
1611 -1638 1174 2452 563 -1299 -1059 387 593 -38 -285 819 717 -772 -1694 -721 1819 2082 -411
1628 -411 -2340 -1499 1079 1984 333 -1296 -1233 48 589 401 272 110 -120 -796 -851 406 1028 1018 -611
1647 -611 -1726 -706 801 1335 45 -895 -797 -51 293 176 662 444 -511 -1314 -365 1280 1490 -107
1665 -107 -1397 -1147 416 1508 589 -837 -737 -53 590 -91 -585 389 892 135 -1246 -839 959 1915
1683 1915 279 -1790 -1676 756 2037 585 -1424 -1574 205 1513 334 -1142 -715 813 813 -569
1699 -569 -1188 65 1590 790 -1264 -1614 -23 1678 1157 -851 -1555 -358 1163 1125 -227 -1184 -239
1716 -239 462 224 -506 -178 915 480 -639 -908 96 1195 857 -712 -1247 -474 756 914 -6 -694
1734f94J19P03K71k21j70l74J58j21L06L45Kn85j71N15J68rl72j8L87l6o12kM06
1757eR32l17j138o25J014J312j98j571n79P99J350R1j411k61O08N41m11m69O8
1776b70Q92J08j223p86R13J496N4j929r22R68J899K44j832q34O68J474J49j352
1794b83o26P38R30n05q17J13Q24M24m48j251J20J113O64n47j085k32Q76Q33l39
1813E02n42l51L59J68k4m5J04J1l94m79L66Q94N3n79p18J12N92N56o5j79o63k46
1835e68K69P75M84o97q44q8O62N07L08p13q97K33P23K98k07l37k87K41J13j25
1855a50J66N68j16o55o92O67J057M9r60r60J57J133O73l68q61m19N57J97J43j29
1875E7Q1m7k91l97N43O47m8m49q13l2J077R20n66j195m97P05Q48N3o05m98M1J39
$$ plain form
1734 -694 -575 128 399 178 8 -366 -208 -329 -23 322 324 -261 -432 83 251 242 -130 -148 239 203 -409 -411 -5
1757 -5 927 610 -528 -1153 -139 1173 975 -596 -1175 -376 974 1065 -346 -607 1 542 131 -338 -270
1776 -270 622 730 -493 -1279 -366 1130 1184 -745 -1667 -699 1200 1444 -388 -1222 -554 920 1069 -283
1794 -283 -909 -171 759 254 -563 -450 374 798 350 -901 -781 332 996 449 -636 -868 8 841 502
1813 502 -40 -391 -32 136 112 67 171 182 -212 -691 -325 569 622 43 -675 -563 29 585 520 341 -322 -568
1835 -568 -299 476 960 263 -581 -669 -7 500 808 95 -802 -569 154 452 245 -92 -379 -138 -25 -150
1855 -150 16 584 468 -187 -879 -212 845 894 -66 -1026 -869 264 937 569 -292 -711 -154 43 186 57
1875 57 138 91 -200 -597 -54 593 545 96 -717 -749 328 1248 682 -513 -1010 -305 543 596 -9 -507 -466 -327
1897c27M88K37n1l77k72k49M45O19J5l61p17p1M78P61M3q93n13K91O32L80k67
1918B91n59j87K66L40J69r0j16k71N5J50K12j7j79l21L1J02R7L57k4l17k49j0
1940b70L07J34l9j39j88j16R2N89K3l05m27k02N90L76l2n63k35m8M86N53k27m13
1962e4p79M38N32N20l50o84j10L84M96l1o2n63k55N25L24J59n70j66J3L10K88
1983C65k06j27k53j44L94K64n5k58j53Oo3L76M1j83kj05o7K68N9l6j81j6kj07
2007a85J05L27j07J56o38l61O20R57j89r94m31L50P44P09q49p66j90O10P26J88
2027G82r55n66K71P55J35m51O1j09q5r0K53L74P6o64k32jQ04K12l70p87J84J76
2049b27Q21k02n43l67M85K62q6m29M9O20Ql79k59R2N94kl48l50j53P87K80m02
$$ plain form
1897 -327 161 398 347 -30 -302 -551 -106 513 528 167 -550 -621 -143 618 661 -232 -745 -454 178 558 291
1918 291 -268 -455 -189 151 320 230 114 -157 -102 48 260 243 64 -257 -226 -124 -27 330 306 -11 -260 -270
1940 -270 37 171 132 -7 -195 -311 -219 370 393 88 -339 -541 49 425 393 -170 -405 -453 33 586 359 -54
1962 -54 -833 -395 137 657 307 -377 -487 -103 393 362 300 -263 -518 7 331 490 -80 -246 -233 77 365
1983 365 159 32 -221 -365 29 293 238 -20 -173 -167 -230 146 187 4 2 -103 -170 98 157 121 -60 -76 -78 -185
2007 -185 -80 247 140 296 -342 -703 -83 874 685 -309 -740 -390 354 1063 214 -552 -742 -132 594 782
2027 782 -173 -739 -468 287 422 -29 32 -77 -162 -252 1 375 451 -213 -445 -446 358 570 200 -587 -403 -227
2049 -227 594 392 -151 -518 -33 229 143 -286 -237 383 391 12 -247 -155 439 437 89 -261 -414 373 653 251
2071B51o58j03K12N96J34k53n42o2J52P67K5m33k86j00J79L24K04k02k78l92L07
2092a58L17K05j70l20k14j20N02N00O3p08o07N15P97J23p46l26Q1J73L51J0l12
2113d4j63L07m5j04j98L51M87n06q17J61P38N52k27q24l18K72J132K46j012p37
2133g49J47P57L49k61l73o1J15j08Q0N29O0l91n79j11N13N80M69p69r79j4R99
2154B03P27m48p71m72M68M71Q5J23m94k87J1M11K61p1J47o11j77ON18N86j55q32
2176c01n44L32O40O57l5r84p35L17R84M89k28j048j34L07L80L63L6n89l83k26
2196g02N66L73K43j35o34o24J95J041P35n95j202k14N56Q68L35n58q79k46M92
2215c85R61j6m39k79j88J14J71N35J09m00o93l77O51R55K69p85r58j89O78R75
$$ plain form
2071 251 -407 -510 -298 298 432 179 -363 -425 -273 494 519 86 -200 -300 -121 203 407 205 -73 -465 -158
2092 -158 159 364 194 -126 -340 -460 42 542 605 -103 -710 -195 602 725 -21 -347 -266 -93 258 268 -44
2113 -44 -207 100 55 -49 -247 104 591 85 -732 -571 167 719 492 -332 -650 -378 754 1000 -12 -749
2133 -749 -602 155 504 243 -130 -191 -76 -184 -104 425 485 94 -485 -596 -83 497 966 197 -782 -796 203
2154 203 930 482 -289 -761 -293 178 263 386 -108 -395 -384 27 288 217 364 -247 -424 -418 100 686 531 -301
2176 -301 -845 -513 127 784 749 -235 -970 -653 331 820 592 -456 -590 -283 97 460 496 -93 -476 -702
2196 -702 -136 237 480 345 -289 -913 -718 323 1058 463 -739 -953 -397 471 806 248 -631 -877 -385
2215 -385 576 560 121 -158 -346 -232 -61 474 583 183 -510 -887 -236 719 988 203 -755 -944 -266 709
2235G09R7q29q05J13N94O22j39l54l55k91K94M42L63j08l48o20k39P31O89K63
2255H29p30r30N4R59O29k42o60n12J2N48P33j39p73m09K34L50L24J61l9m87n51
2276f39K84N83M73m34m41m62L11O67K78k2j064n5L02M01M11j37n00k83k73M16
2296a84N73q3j91m63R1J30L53L44K3n91p48M39O22J33l14l58l15O9O35M01j33
2317D33o13k61J70L70K18k24k19Mk77L35M62k8k20k96j15K8L59J72R3m69n59M64
2339a73L80L49o28k04m0L40K43j04q5l09o3J58L19k9L7j2l04j01J39M27L1m63
2361i2l55l4L85K41Q1j40l09J09J28J33j49j02J97j48j42J81K95l1l21j30J43
2382f0J76J99l04j53J8K4J36J55m0k57L3k38K03j9M81n9m78j46L82K58q5k96k15
$$ plain form
2235 709 806 -23 -828 -715 -121 501 362 8 -347 -638 -344 98 461 353 5 -615 -854 -123 566 829
2255 829 99 -831 -777 182 811 569 -91 -603 -591 -43 690 551 -222 -631 -397 -47 277 438 399 -88 -639
2276 -639 -355 228 701 267 -174 -636 -325 342 620 598 -466 -521 -219 182 593 456 -44 -327 -600 -184
2296 -184 389 306 115 -348 -257 -127 226 570 593 2 -746 -307 315 448 134 -224 -539 -470 165 566 433
2317 433 -180 -441 -271 99 317 93 -126 -122 -399 -64 398 370 150 -146 -261 -233 126 298 391 -78 -637 -173
2339 -173 207 556 -72 -276 -316 24 267 163 78 -231 -294 -136 183 154 191 179 -125 -226 -87 340 371 -92
2361 -92 -447 -481 -96 145 226 86 -223 -114 14 147 -2 -104 93 -55 -197 -16 279 248 -73 -203 -60
2382 -60 116 315 11 -142 -124 -100 36 191 151 -106 -73 -311 -108 -127 354 295 -183 -329 53 311 226 -70 -285
2405b85J14R2J48m4j81J39k4K9r6J3K73q2k12j65K94J38J16l11j74K2K77J45q9
2428A37l32J83K4K00k83o4K95q9k11j22J76L16km82J35J79J44n6k69J00L5k28
2450b14K65r8J68p6L1j75N9J83P7p4l66J46J40R2j85o7j40K53l7k46K03J19L07
2473C65l79k49R6L66L34m84m00j83O85J99m79J02r5L3L38l01j59K55L11l51m24
2494d20J03L75M29l74j79j46Q3M28j99j18j6K42j84m0l4J74j09M5k27k6K61L01
2516C69l72k55k51M57L55L1l87j92LK45J41K20j22k88j93K52J09P0j29l70M7O2
2538a98L59jm45r0J99R9nK59k16k2j73PO4M32J54l87j34j77K32L47r3j54m58J41
2562b60M51J8j95j44K13j62J38k40L31J76j59n77l0N27N35k57m77l26K34L63K29
$$ plain form
2405 -285 -171 -79 69 25 -156 -17 -41 -12 -108 -95 178 96 -116 -281 13 151 267 -44 -218 -196 81 226 137
2428 137 -195 -12 12 212 -71 -135 160 71 -140 -262 -86 230 228 -254 -119 60 204 148 -121 -21 14 -214
2450 -214 51 -47 121 45 76 -99 -40 143 220 146 -220 -74 66 158 -27 -94 -234 19 -18 -264 -61 58 365
2473 365 -14 -263 -167 199 533 49 -351 -534 151 350 -129 -27 -122 -89 249 -52 -211 44 355 4 -420
2494 -420 -317 58 487 113 -66 -212 -129 299 100 -18 -34 208 24 -16 -50 124 15 60 -167 -193 68 369
2516 369 -3 -258 -509 -52 303 334 -53 -245 -242 3 144 364 242 -46 -239 13 122 192 63 -307 -260 -198
2538 -198 161 160 -285 -375 -176 -77 -82 177 -39 -61 -234 -227 -163 269 423 36 -98 -275 -43 304 211 57 -401 -260
2562 -260 191 209 14 -130 83 -79 59 -181 150 326 167 -410 -440 87 622 365 -112 -438 -204 159 388
2583C88l62l03K14J35J58j39k41Q4J39k46M7P9K97j5m41l8M9K91L00m59j81J01
2605a43K31R5j95J8k05K62O6p2JR2j82j18M5J34K6k6j11J9O8K9n5R0j37R3j9m4
2631c8J21j94K14k18JK02J35p0r2Q4l72K16J06J20j28n7j05j97J87Q4J20k35K8
2654h8j32K49K50o5k34j82P9K60J39k83j20j24L13J62m14p3J78MR1o7j15P2K98
2677A98j03p4j46K37j4K9O8j07j55M9j13k9K31J79k96j15q6L64J79k20n27J73
2699b78L68J02k5k85k71L54K21k0j1k05j56J60L57j67k09j25K36M8j37r3l8K25
2721E1j43J89j54Q1Kp6J15K38m94M1J24J33K51k38k68q9N1L62J50k33m35k4K17
2744a49N24q5l83j47Q8N08k9k94L3j83J37J3R4m6l81J09J36R3l5J3q7q9K50k4
$$ plain form
2583 388 26 -277 -63 72 230 91 -150 -66 73 -173 -126 -47 250 235 -206 -244 -195 96 396 -63 -244 -143
2605 -143 88 183 -12 6 -199 63 129 57 58 150 -32 -150 -105 29 55 29 -82 -63 5 34 -21 69 -68 25 6 -38
2631 -38 83 -111 103 -115 -114 88 223 153 61 145 -227 -11 95 215 87 30 -75 -272 -85 -1 119 -116 -88
2654 -88 -220 29 279 214 -20 -202 -123 137 276 -7 -127 -251 62 224 -190 -263 -85 -81 10 -57 -172 -100 198
2677 198 95 21 -125 112 98 127 195 88 -67 -18 -131 -160 71 250 -46 -161 -247 117 296 76 -451 -278
2699 -278 90 192 167 -118 -389 -35 186 166 155 -50 -206 -46 311 144 -65 -190 46 94 -43 -136 -174 51
2721 51 -92 97 -57 24 26 -50 65 303 -191 -150 -26 107 358 120 -148 -237 -186 176 326 93 -342 -366 -149
2744 -149 375 290 -93 -240 -152 356 327 33 66 -117 20 33 127 81 -300 -191 -55 38 3 16 -71 -160 90 66
2768F6J45j46J4j42K91q2j68j77M09m2l5j93l35N45p5J87k48k98qK89J22J07k11
2791A5k61K8J35K43J44k00o59j5M30N08j57l37k81L22K45J80l11k16kJ80l0J14
2813G5j83K88q4k51l2M9O25m8m82k68L6M14J44j66j92m1J8k5k45M64L4j36j1m84
2837e01L63O53o6l25o85P5O90M21k36p14k01L25M38K55l37k48j63K03J4K20K31
2858D12k14l26N3N2J07K7pm27J70J60L09j40k72J00j05j90J60K01J98j92k42k03
2880c69M88K35l8l87j50O3MK09K68k89q9j53J57J59J42P7n65l59J51O78M06n19
2902A19o42J52L43L95J02n76j56J11L01o8k47L70P1j82n79K60M69J55k19n09J30
2923b00J32M77q9n84k32J61N52J18k90k98J80L22l44q0L49R0j83l66o2M29K37
$$ plain form
2768 66 211 65 79 -63 228 146 -22 -199 210 168 133 -60 -395 150 75 262 14 -284 -292 -3 119 226 15
2791 15 -246 -218 -83 160 304 104 -555 -570 -140 368 211 -126 -407 -85 160 340 29 -187 -189 -9 -39 75
2813 75 -108 180 96 -155 -187 -138 487 439 -43 -311 -275 139 283 117 -75 -116 -98 -123 -368 96 130 -6 -17 -501
2837 -501 -138 515 449 124 -561 -486 204 625 389 -325 -526 -201 237 492 155 -93 -256 -53 -39 181 412
2858 412 198 -128 -75 -23 84 111 104 -323 -153 7 316 176 -96 4 -101 -291 -131 70 268 76 -166 -369
2880 -369 119 354 316 -71 -221 -158 -154 55 323 34 -55 -208 -51 108 250 327 -238 -597 -446 232 638 119
2902 119 -523 -371 -28 367 469 -107 -263 -152 149 81 -166 204 275 93 -486 -226 243 398 179 -330 -200
2923 -200 -68 409 320 -264 -496 -335 217 335 45 -253 -73 249 -95 -175 174 264 81 -285 -347 82 319
2944C19k07l07k3J40J06K88l32%J4O9q6j2N7J2j82n5r7K53K84j51k55j45L70K00
2968B60k09J09j87j53PK24J18N6j74k74n7L37R9l5l51J7QL19M8l55K67j09J83
2991A48j07j61K35j10P0l7k59K50J72o4l43j84J29O44p3m00k76K60K10k0j37r1
3013a44L31j24j31j64Q7M88m9l29l29J2O77M4m33m82L02N83L9l38k36J02K8K54
3035A88o2k70K04j12J7q4L17J5j1k60k67K83J97J4l66NL8K38n4l5R7J01j06k67
3059a80L7R7K07j59n2j28K65J85k34j13J80m8L4J1j84K11J0k80o7Q3M47K6l96
3082d8l56Q9N56J5j95m56J5M61N07m21m23J72K16N6o1k43J69J42j00k52k2J46
3104c3J42O6l34p8K00M3N9k82J88J0J30Lk00J43K00l68j67m8L88L22l05j82k66
$$ plain form
2944 319 112 -195 -218 -78 28 316 -16 -16 -2 67 -19 -31 26 38 -144 -199 -296 -43 241 90 -165 -310 60 260
2968 260 51 160 -27 -180 -173 51 169 225 51 -223 -280 57 156 121 -230 -213 -205 114 162 -193 74 -35 148
2991 148 41 -120 115 5 75 38 -221 29 201 137 -206 -390 -261 383 310 -90 -366 -106 104 84 -53 -144
3013 -144 187 63 -68 -232 -145 343 294 -35 -364 -352 325 369 -64 -546 -244 339 378 40 -196 -94 -66 188
3035 188 126 -144 60 -52 -35 -119 198 213 202 -58 -325 -42 155 169 -197 -192 -154 84 30 -5 92 193 87 -180
3059 -180 -143 -46 161 2 -50 -178 87 272 38 -75 105 57 91 102 -82 129 139 -141 -208 -125 322 348 -48
3082 -48 -404 -315 241 256 61 -395 -380 81 588 167 -256 -84 132 188 127 -116 53 195 95 -157 -179 -33
3104 -33 109 175 -159 -237 -37 6 65 -217 -29 -19 111 114 -86 57 257 -111 -278 -326 62 384 79 -103 -369
3127c69L37J74q0k0l73K11K24J6r6n6J82j99Qr3K73L1m17J55J29j69K61j46j82
3150a99R3J61J62j56j92J69R0rk87J69J76j6k41k27J41L01r6j7Nj26J20p4J30
3173G7o0K07M3k30j19r4N22n7k91l87L12J36J23q1k03n5K97o0m2J6m1k5J8q3Q4
3198GJ4J31q3k56R7L31j94j01O5on3J20jk28J56o7L4q7J54KKn6j92J65j1L32k92
3225a7j66J74O5j64P6QP2p0J22j22L6Q7m5Nl44K99J75k61l3K5M2J53j81O9k6R8
3251G7k04O3l7J42J34q2o9j98Q3L52qk39k34K31J44p7o4k21J80j94J97j1N8J16
3275A39r8J30j69kM5J07j83j00O1K65j77L5j78P3R1o6J01J0L0j21n6K5r8J21j07
3300a22O3M0Q1O5j3k64K31n0J7p0M4j38L61n1j89K27k19p0K71j39k40K32j75J38
$$ plain form
3127 -369 -32 142 62 42 -331 -120 104 120 24 -32 150 -49 -41 -134 139 170 -247 -92 37 -132 129 -17 -199
3150 -199 -106 55 217 61 -131 38 128 119 -168 1 177 161 -80 -307 -166 135 39 22 27 -99 21 -53 77
3173 77 17 224 267 37 -82 -176 346 289 -2 -389 -77 59 182 101 -102 -157 140 80 38 54 13 -12 6 -77 7
3198 7 21 152 69 -187 -90 241 47 -54 11 5 -48 72 71 -157 -1 -68 -34 -121 33 35 37 -19 -211 -46 -57 275 -17
3225 -17 -183 -9 56 -108 -32 -24 48 -22 100 -22 14 101 56 61 -283 16 191 -70 -103 -78 -36 117 -64 5 -21 77
3251 77 -127 -64 -101 41 175 93 24 -174 -91 261 253 14 -220 11 155 78 14 -207 -27 -221 -24 -35 23 139
3275 139 41 171 2 0 45 152 -31 -131 -70 195 18 53 -125 -52 39 -27 74 84 114 -7 -63 -38 -136 -15 -122
3300 -122 -59 -19 62 127 114 -150 81 31 48 -22 22 -116 245 194 5 232 13 -57 214 75 -165 67 -108 30
3324C0M6j27K5r4KP0R8L3n1j60J21j16Q1Q3N5k61J47l0P5j78K05%k51K36j3J20
3350A46j58j16M0R7j5P0j00J02j02j3O8r0J06k06M0K24j55J93o7n8m2K9L3J9K3
3375F8k08%P6J11P3j4k49J09J07J07k77J9P0J53k55N8l3K12k4j66p1J78N9j71
3399f8J52j94K22m3J81j53k11m7J52j18K04j4k91L27l55L23N4lq2j70J87j35J30
3422D8N8M4k5j79j1R6R7q7K9n1k2q7QL03k55J25k15JJ34P8r9j20K9J07P8k63J20
3449e9m4K10l17K04j70K29j66K87m92K26J55M6q8j14j3j45M33k80K03k42P3LJ15
3472E4m9J19j24k0K4j7J23lM6j17j75J37K14j26k3j95R1J7K03J17m19o4J33n6
3496a10J32N3K30k78q2j50J10J78j31n6j29K27m8OP5J7J5j87J49Q1j3j53lk7J7
$$ plain form
3324 30 76 -51 -26 -120 -118 -48 50 83 32 -128 -7 -123 -42 41 96 -165 -18 -48 27 -151 54 54 -197 39 26 146
3350 146 -12 -128 -88 9 -6 64 -36 66 -36 -49 19 -71 35 -171 -131 93 -62 131 64 6 -36 -7 26 45 68
3375 68 -140 -140 -64 47 120 106 -143 -34 73 180 -97 -78 -8 145 -110 -52 -85 127 103 -63 -134 44 103 -68
3399 -68 84 -110 112 69 250 97 -114 -161 -9 -127 77 63 -228 99 -256 67 121 118 36 -134 53 -82 48
3422 48 106 150 125 -54 -65 31 128 41 70 19 -3 -90 -82 221 -34 91 -124 -123 11 89 -10 -130 -101 6 84 -179 -59
3449 -59 -103 107 -210 -6 -176 53 -113 174 -318 -92 63 109 21 -93 -106 -251 182 -98 105 -137 -64 -61 54
3472 54 5 124 0 -20 4 -13 110 107 153 36 -139 -2 212 86 63 -132 -41 -24 179 296 -123 -187 -54 -110
3496 -110 22 75 305 27 -55 -205 -95 83 -48 -104 -233 -6 -54 -48 27 44 59 -128 21 102 89 -64 -67 -94 -77
3521g7k7K30J24j73k07J26k6M5m6l7Q1j13K17r2j29J57P2l18J73M3J2O1j77p2
3545a53J60J95J0k46P7M6j78O7J03j29R2P5k06qM44l74q2n7J74j15J32L3j92j7
3569a49pJ76J30k1k28Q7Q6qp9K29m0j48j3o8P0N6j13l1r3J86J10q3k08K26P6k95
3595a52K23m6j05L9M3m9J25n7K59k67J34k45J9J58J5M1k63j6L01k6Q3k25J8l16
3619c09K52J52m0Oj53J18J8J34j37L2p0m2lL5J27n4j59K0O2O5J65K8l43J6J38
3644E8P1J72k04k90j01K94J90j75J69k8l41J11M6J3K14r5k40J02J3J13Q7q2l4
3667F3j93J6K99j83k8q6R0R8qL8j32O8j61N9j8J35Rl1j09j7P9J69O5k71k04J34
3693a19m3L32r7P5l35J33R2J06o0Q8l37J65Q7Q8k92J74p8j73J76o0K18j20j59
$$ plain form
3521 -77 -104 126 250 77 -130 -4 -30 15 -31 -68 13 -100 117 25 -104 53 125 -193 -20 23 35 96 -81 -153
3545 -153 7 202 212 -34 43 89 -89 -22 81 -48 44 119 -87 -95 349 -25 -107 -164 10 -105 27 60 -132 -149
3569 -149 -156 20 150 129 -99 -12 74 66 -13 216 176 28 15 -53 17 73 -40 -71 -164 22 132 49 -159 67 143 -152
3595 -152 71 25 -80 -41 2 -47 78 21 280 13 147 -98 -79 79 94 135 -128 -144 157 131 214 -11 7 -309
3619 -309 -57 95 55 61 -92 26 44 178 41 73 3 -39 -42 -7 120 66 -93 -73 -11 54 219 247 -96 -80 58
3644 58 129 301 97 -193 -294 0 190 15 184 156 -185 -74 -28 -15 199 104 -136 -34 -21 92 179 97 63
3667 63 -130 -114 185 2 -26 -112 -22 76 68 106 -26 42 -119 -60 -78 57 66 35 -74 -91 -12 157 222 -49 -253 -119
3693 -119 -162 170 73 148 -187 -54 38 144 84 172 -165 0 87 175 -117 57 -21 -194 -18 -78 140 20 -139
3716a39LJ93l2K6m3j16p6K91m4L0P0n0k12Q1J1J28n1O0k26P8p8L5L84j64k07Q7
3742C9j25J12K03j12k8l13O9K30Nj2Jk37J8J72L2j5j39%M4m5J1R1N7j15r4O4J91
3769A04J10p0j91p6ql3L49j41j55q0J64L7L6J71n0j32q9N0K67j86j13j94K27j05
3793a08M08l57K23l20j01J83J46N8j51l4j55J41J83j52K3m1J24k14N1k1J90MJ4
3816I4j33J49k7j06O8j31l2O9K89L3j54l16J69p8J54L3K0Q4k95l0J54J74m6l52
3840b10K3J58l5P1PK3j89L1N7J42Q5j73j1M8k09K2K65k88K69j98J89m3j20L06
3864B20k43K91k58m8j9J31L6n5j40O2L0J69j45j53k2m0L14q8r5Ll3K54j28K7L4
3889A04j06o2PJ68j9N6k65j4M7J19P1k05M0O6nJ44m8k57K7K78K3o8j02J3K3k2
$$ plain form
3716 -139 -136 57 25 51 8 -108 -184 107 63 93 163 113 -99 -18 -7 121 70 130 -96 -18 -96 -61 323 159 -48 39
3742 39 -86 26 229 117 89 -224 -155 75 80 68 69 -168 -150 22 54 39 -100 -100 -56 -101 -90 1 58 -57 -151 -87 104
3769 104 214 144 -47 -123 -131 -164 185 44 -111 -191 -27 10 46 217 167 35 -54 -4 263 77 -36 -230 -3 -108
3793 -108 300 -57 166 -154 -255 -72 74 132 -19 -53 -208 -67 116 -36 -13 -54 70 -144 -93 -114 76 80 94
3816 94 -39 110 83 -23 45 -86 -118 -49 240 273 119 -197 -28 -106 48 81 101 185 -110 -140 14 188 142 -210
3840 -210 -187 -29 -64 7 14 37 -152 -121 -64 78 163 -10 -21 27 -182 -160 105 -183 86 -112 77 34 -86 220
3864 220 -23 268 10 -38 -57 74 110 55 -85 -23 7 176 31 -122 -144 -184 130 42 -53 -50 -83 171 43 70 104
3889 104 -2 -64 -57 111 92 148 -117 -131 -84 35 106 -99 -59 7 2 146 98 -159 -132 146 169 101 -1 12 35 13
3915A3J2m8K05j20l0J25j60O3j74J65o5k1pJ72j15r2J76j19O7j28J47j0J59p2
3939A43m45J82R1J12p8J08k25P2l3J01j5n8j41J98J10pj48r4J10j7L3J51j16j45
3963a11R8m2R1q2k17K25J36j28K3M7N3j40K32k34J08j50K11l1o3j65N0J28j33
3986i4J90l8p8J45q4j79N8J38j02N7j91J59J19j39K5m2J87q1M3j69n1J35l4n4
4010h0m7MJ67Kj2j10J44l6j02J34o9K01j09r1lJ48j45L7q9oR7M7kr2o9N2om1K7
4039d9K15j05j32m0J59j32K90k16L4j35J87n0J68k42p0L4K86q5l4l4n1k9j48P2
4063a07p1K53J10p9j96J21k00L59j56j79L7J53NJ32j30j3j83J04k3J18J00j41
4085A4j35l8K03PN4k75K03O2N0k37J5OLJ12Rj50L3N6m8P2J5q6K28N2l22j15L35
$$ plain form
3915 13 25 -23 182 62 32 157 -3 60 -114 51 -14 -35 -42 130 15 -77 99 -20 47 -81 66 56 215 143
3939 143 -302 -120 -29 83 5 113 -112 -40 -73 28 13 -45 -186 12 122 115 -33 -127 -17 -34 -1 150 34 -111
3963 -111 -13 -55 36 -46 -263 -38 98 -30 -7 40 93 -47 185 -49 59 -91 120 89 26 -139 -89 39 -94
3986 -94 96 58 -20 125 41 -138 -80 58 -44 13 -178 -19 100 -39 -14 -56 131 50 93 -76 -127 8 -26 -80
4010 -80 -127 -123 44 46 34 -76 68 32 -70 64 -5 196 87 -4 -7 141 -4 33 -56 -62 35 82 80 -12 -81 -29 -35 -76 -49
4039 -49 166 61 -71 -111 48 -84 206 -10 24 -111 76 26 194 -48 -118 -84 202 117 83 49 -2 -31 -179 -107
4063 -107 -178 75 185 106 -90 31 -169 190 34 -145 -108 45 50 182 52 39 -144 -40 -63 55 155 14
4085 14 -121 -159 44 51 105 -170 33 95 145 -92 -77 -71 -68 44 53 -97 -64 -8 -56 16 31 -55 173 225 -97 -212 123
4112A23q6N6J15k87P3K72k12J0r9O0n3r1Q9K77l3k29K7O0R9n1l4r6o8L5n8J56
4138E5J02o6j68n2Q2N7K85l67j24M5J66RM9m3o8r9K55o5K53k19j46L3m9J28l2
4163B1J41k19J66j25n2J5J96l3k59L1J02m4J16l3q6p7R8R5j03k8j4oj6J26J58
4188A70Q4j44k68J51j47L31o2j86J9J3J60r9j7o1M3J08j0M8j20N7j55q5J44J3
4212a3R4k1j62J35r3K4J42k21j18L8J28R0N0j48Q7q1M6pJ00j85J15pP9Pj60J36
4238E5n1L1N6J7O1j29j87J49J20J5k37K27%k00m1J50J21j8j60o2K7KJ43K6j92
4263g7n7J25m7J00rl2l09L07k39L59o6p3j0j54J60l9R2n0kj59J41K2Q2j49J80
4288I6m1n1r6K25ko5k45R3P7N1K02j68o9j26p4J68M8j43J28n7J00J3j17K7r2K37
$$ plain form
4112 123 37 93 208 -79 -6 266 54 64 -35 25 -28 -119 -30 247 214 -15 12 72 171 120 86 -10 -78 -43 -101 55
4138 55 157 91 -77 -129 -47 10 295 -72 -196 -151 15 24 73 30 -38 -137 118 53 306 87 -59 -26 -75 53 21
4163 21 162 -57 109 -16 -68 -53 143 110 -149 -118 -16 -60 56 23 -63 -140 -42 53 -50 -78 -92 -98 -114 12 170
4188 170 254 110 -158 -7 -154 177 115 -71 -52 -39 121 22 5 -56 -13 95 85 133 13 70 -85 -170 -26 -13
4212 -13 81 60 -102 33 -60 -36 106 -115 -233 -195 -67 23 73 -75 12 -69 -23 -30 70 -115 0 -7 72 79 -81 55
4238 55 4 35 91 108 169 40 -147 2 122 137 -100 127 127 -73 -114 36 157 139 -21 -83 -56 -54 89 115 -77
4263 -77 -134 -9 -56 44 35 3 -306 1 -238 121 55 -18 -28 -182 -22 -61 31 -19 -21 -180 -39 -17 65 -84 96
4288 96 55 4 -92 133 131 66 -179 -86 -9 42 244 76 7 -119 -193 -25 23 -120 8 -49 51 64 -53 -26 -118 119
4314A19j76pP5L3Rj12O0J00rj00q6Q2qP2q1J50j11Ml4o9k5K79P3l41Q5l1J07K62
4342C20l99n1r7M7K76jJ01j51j94J17R6J02k69J42kn7O3J77rk36kj15J96p2Q7
4367F9k82K09m2j14K25J4k2q7N0j64j2K03q3l6K0l0J96j30K25j5k23M6j15P4j06
4392a30K86j28l08J02L04O9P8l54%Q1O5J22l00R0k16J90J48j66O5j9l7PK34Qj28
4417F3j02k4L2J84k53J50r6J68j89J6J75p0n2L8p5q7M2P2J17l4k11q6L75l3J79
4442B99l88n7J57j10K06P3N7k09k03J92K17j42M0q5j59J05n7J47m0M9j44Q9Q4
4465A21j23p9O6j20J86J13k39J76j26j53J43j02M8L8J8j04J48P7j41Q2j2J58j57
4488A8m1M1p0K03j1j48q4J05L8N5p4k69J93NP0R2k03q7l2J45J47q9o9k9p4K41
$$ plain form
4314 119 -57 -64 11 44 53 -59 1 101 92 -8 -94 -12 -20 52 -29 121 10 14 -20 -89 -114 165 238 -103 -18 -49 58 320
4342 320 -79 -130 -227 -180 96 95 196 45 -149 -32 64 166 -103 39 37 -20 43 220 211 -25 -27 -142 54 -18 69
4367 69 -213 -4 -46 -160 65 79 57 -30 20 -144 -156 47 -36 -72 -52 -82 114 -16 209 194 -29 17 -98 -24 -130
4392 -130 156 28 -280 -178 126 195 273 -81 -81 0 65 187 -113 -23 -239 -49 99 -67 -2 -21 -58 -51 183 191 63
4417 63 -39 -63 -31 153 -100 50 -46 122 -67 -51 124 54 2 40 -35 -122 -80 -8 109 75 -136 -222 153 120 299
4442 299 -89 -146 11 -99 107 180 237 28 -175 17 234 92 132 47 -112 -7 -64 83 43 92 -52 37 121
4465 121 -2 -81 -15 -135 51 164 -75 101 -25 -178 -35 -137 -89 -51 -33 -137 11 88 -53 29 17 175 18
4488 18 -23 18 -52 151 140 -8 -92 13 51 106 32 -237 -44 -39 31 123 -80 -167 -199 -54 93 4 -65 -94 -168 73
4514G3M0j0k45J7LJ25J21M8k00j9K1K71k72q4N5%N4N5l34L18p5J88j03Jp0Q8k0
4541D6nJ80l86J25J51J83k49j7j82R4K70k54m0Q0qr1n1L99k62n9J1J9K50j67r3
4566e6N6o6M5Pm5N9n9P6Q7j38J53j27o9j00O2K13q7m9OM9j95K25n1R4j32P0K6
4593E4j6j02j9Q5J50m9j48J07R2j47q1j24L01l7p2P6r1j67J15K21n4m1k9n7j0
4618d3JqJ9O9nj37J37K0q2O7j62J37j73J85Ql6J12j25J9j5j31L5J16j56J94r4
4644d8j21K5Q9p3O6M3k9J14P1o8j01q1J17J85k57JM9k5P8J46j75J14p2l5j26L52
4670B39j52j71R7j6M8k07K08q9k8O5M3j49J74n9j8j79L47n9l0l7j13J43P2j26
4694Cr3M3O3M2J%j47N0K23k14l4P3O9j69Rr4J62J48o7K1q9j49J09N8P6k9j53k1
$$ plain form
4514 73 113 103 -142 -125 -122 3 124 172 -28 -47 -26 245 -27 -111 -56 -56 -2 53 -281 37 -38 150 47 48 -22 66 46
4541 46 41 221 -165 -40 111 294 45 28 -154 -60 210 -44 -84 -4 -12 -103 -154 245 -17 -76 -65 -46 204 37 -56
4566 -56 0 -66 -21 -14 -59 0 -59 17 104 -34 119 -8 -77 -177 -115 98 11 -38 -32 17 -178 47 -4 90 -42 28 54
4593 54 38 -64 -83 2 152 103 -45 62 154 7 -74 -198 103 66 -6 70 -21 -188 -73 148 94 53 24 -33 -43
4618 -43 -42 -50 -31 38 33 -104 33 53 -29 38 -124 13 -160 25 33 -3 109 -16 3 -12 -143 -108 8 -148 46 -48
4644 -48 -169 -144 -55 -128 -62 -19 -48 66 137 69 -32 -113 4 189 -68 -67 -18 -43 35 181 6 120 48 13 -113 239
4670 239 87 -84 13 -3 45 -162 46 -43 -71 -6 37 -112 62 3 -15 -194 153 94 64 27 -86 57 129 3
4694 3 -90 -47 16 58 59 59 -88 -38 185 -29 -63 10 79 -90 -81 -175 -13 135 68 89 0 -149 -40 18 94 65 -88 -109
4722a09N1q1K4J09j15K54l70K91j44K29p5J16j90P1k9r8J63j74J09K2n8K86m46
4745a64J59R4j21J00l1j05o2K13p0j0n5k9O3r8J64j23j07K52j54o4J19k6J68Q0
4769A93k13j00J86j43K15q0M2m4j6j04r6K49K6K0j78J68k0n9k2J1k5J6j02J65
4793H9J8j43L3j80K57jo2k1J24r2qr0P5j22P7Q4N7p1j04J87j41r0J43j08N5kj02
4820a38J71j8j4n6L1mJ65k15Q1rj51L7L1K47k27J20q2J89lk09L5m3J82k11J22
4845C1q9O0J54o1j83M0ll5O6l1r3N3O8n3K37k77J73j41J64j23R2j4j07L52j63
4870A17j39n1J61R9l78n9L45k28K62k53J94j47L36j69k72P0M6M0j71J09M0q6Q6
4893d8O4r3N3K6p9L5R7k8r0J22J50j27q4J69k08L34l33l6K48k47P0r6K73j85j7
$$ plain form
4722 -109 -58 -139 -115 -6 -121 133 -237 54 -90 139 64 180 -10 61 32 -66 97 -77 32 54 -4 282 -164
4745 -164 -5 89 -32 68 37 -68 -130 83 13 3 -52 -81 -18 -116 48 -75 -182 70 -84 -148 -29 -55 113 193
4769 193 -20 -120 66 -77 138 58 100 56 40 -64 -160 89 115 135 -43 125 105 46 24 35 10 26 -76 89
4793 89 107 -36 -3 -183 74 73 11 -10 114 22 14 -76 -1 -123 -46 38 95 24 -80 107 -34 -124 19 -89 -34 -36 -138
4820 -138 33 15 1 -55 -24 -28 137 -78 3 -6 -157 -120 -89 158 -69 51 -31 158 155 -54 -19 -62 120 -91 31
4845 31 -58 2 156 95 -88 -48 -51 -86 -20 -51 -144 -91 -23 -76 161 -116 57 -84 80 -43 49 35 -72 280 117
4870 117 -22 -73 88 187 -191 -250 95 -133 129 -124 70 -77 259 90 -182 -112 -66 -26 -197 -88 -48 -134 -48
4893 -48 16 -77 -24 2 -77 -42 55 27 -63 59 209 82 -2 167 -41 293 -40 -76 172 -75 -5 -101 172 -13 -30
4918c0Q1Lm0M4k08L03k17J3P4R9k5j76K68k52m5R2j2P8n0j28J23m6P8j35P9OO2
4945C9P4j71Q8l0P5k0O5j93J96m3j24k4O3J16l5j54J6l5RJ20k3m7Kj25J26l6O4
4972gm1k7j6j8L6k04K09o0Q2M9J03o9j55pn7K61o1p4J02m0k5k0J08L8j60R7j23
4999g9j0K39p0R2k8q5j42P0Q9Pj36R1j4j17K37O3j92l7o9K26o2j73NJ49L9j23
5025c0Q5RNq6P7p9qJ80q6l3j20p5K12J01K7j34k3j33O3m6L01q7k17N2k0K3M6O2
5053F6j60%l7J13N4m1M1j55J21J17n3j17o2M8J02j14r2J33P5r8m0L1J07M0q6k5
5079c2L6j48L62j25Kl5j70J60Q4j96J52q2N3k33K56J13l28L2j2nK20K9k00J19
5103E2q1J02p7K10k20Rj4j59J31PJ17n0m9p6O0P5J27k20JK9l7p2N8J63q4R8j14
$$ plain form
4918 -30 51 54 14 58 -150 153 -64 -51 23 122 97 -79 189 -63 -108 -16 -28 50 0 -128 -5 -51 27 -108 -29 -23 39
4945 39 113 -58 30 0 75 55 120 -73 123 80 -44 -68 -5 111 76 -78 -62 -97 -88 32 9 -38 -36 -161 -35 -71 -7
4972 -7 -48 -75 -91 -109 -73 -277 -68 -128 -46 3 106 37 -118 -125 -182 79 18 -56 46 6 -19 -39 69 107 -53 44 -79
4999 -79 -89 150 80 172 144 59 -83 -13 76 83 -53 38 24 -93 144 207 15 -22 -91 135 73 -100 -95 54 93 -30
5025 -30 55 64 69 -17 60 -19 -27 153 67 34 -86 -161 51 152 179 45 22 -111 -48 -94 207 120 -97 -45 -65 -42 4 66
5053 66 -94 -94 -131 -18 36 -5 36 -119 2 119 66 -51 -113 -65 37 -77 -169 -36 39 -59 -99 -68 39 79 -7 -32
5079 -32 4 -144 218 93 95 60 -110 50 134 -62 90 8 61 -172 84 197 -131 -99 -111 -116 104 133 -67 52
5103 52 -29 73 -4 206 -14 -5 -19 -178 -47 -40 77 27 -22 -98 -38 37 164 -56 -55 -26 -63 -135 -77 86 2 100 -14
5130a4J01J01j07o5p0J7P9j67J81J62j38j87l2J97j00j33L34j60L9Q0j01j8K0
5153A9K0r8j06K19m8J2j09P8l6j10K38O2j65q8nJ47j1p2J43j59J7M6Q4j11K9j5
5179a9mJ13m8j63J26O6m1p1n8K22m7m3k62L15O1j81p4R9KK4J63q8o3J0j19K3K03
5206A46k9j08j3O2r6J31j75R6j60J55k49K50L7P0j13p6J67j37L6oJ16k81K6K25
5230G4k12J18J0m5K26j11k2k1p0o8J46k01J05J16l2R6j68QP9n6Q5p0M8J03j15
5255B3l2k1J8M3J44n7q1j5j13P4L4j53K55j43p8MP8J20j32o6R1o6rP7R8o0p4J75
5283A34j65k%k7P7J03N0j54j12L32N2l48OJ69k6j0j7k72J13L9JR2J09q1N9j74
5309e2J04j47K67q8j23j72O0R9L7l0Jk06Q7J87km8L4q2K93k59M0j02P8m2J82n0
$$ plain form
5130 -14 87 188 81 16 -54 -37 42 -125 56 218 80 -107 -139 58 -42 -175 159 -1 38 118 17 -1 19
5153 19 39 -59 -165 54 6 18 -91 -13 -49 -159 79 141 -24 -112 -117 30 19 -53 90 -69 -52 -6 78 -33 -4 -19
5179 -19 -23 90 42 -121 5 71 30 -41 -99 123 76 33 -229 86 147 -34 -108 -9 -7 17 180 92 29 39 -80 -57 146
5206 146 117 9 -4 58 -38 93 -82 14 -146 9 -240 10 47 117 4 -72 95 -42 -6 -12 104 -177 -151 74
5230 74 -138 -20 -10 -55 171 60 38 17 -53 -121 25 -176 -71 45 13 109 -59 -51 28 -28 57 -13 35 138 23
5255 23 -9 -30 -12 31 175 118 37 22 -91 -17 17 -136 119 -24 -102 -98 -20 100 -32 -98 -7 -73 -82 -5 93 33 -41 134
5283 134 -31 -33 -33 -60 17 120 170 16 -96 236 288 -60 -54 115 89 79 62 -210 -97 -58 -57 35 144 63 122 -52
5309 -52 52 -95 172 84 -39 -211 -151 -52 -15 -45 -44 -250 -163 24 22 -26 8 -74 219 -40 0 -102 -24 -66 116 66
5335F6j41O2Q9k73J41J35k25K14k27m4L3K31j42K45j09r8J6l4J82o7p9l0J11p8
5359b2L5rk8P2p8j16N8K00q2L7j09O9OK0nk03K35j85Q3k0n9PP9J10l1k06O1J01
5387B0j0N3j33M9l1m4J45q0J25j48kR7J13j63P8O6j11L5q7QJ2J16n8r0K10k37
5413f7K86k55M4J72j45J18l23J15n2J99P8l94K11N0l9j41J20J3k1J22M6k43J55
5436D9k9J5j08j37J27M8N5R6k06R7r9o1K20k06K26k80K15Mp6l2O5K02j32k18J84
5461A9J03l3J17j30kKN0p0j7j20j2J71j11O1j31oK86k17J0r2L5J17Jk61K19o9
5487h0K10k0j93K9l1O4R6n1p1R5J33j10j10J34r9K57l58OM5J32Q4k99R0R6l5K9
5513D3rk5k32K20q8K7j7o1N8pR8j86K03r4Q6j11Q0O7l3J16K3j63J35p3j01J35
$$ plain form
5335 66 -75 -13 76 -197 -56 79 -146 68 -159 -203 -170 61 -81 164 55 -43 -27 -61 121 54 -25 -55 56 -22
5359 -22 13 4 -24 48 -30 -146 -88 112 30 67 -42 27 33 53 48 -155 80 -105 -22 -42 -101 -94 -15 95 64 -142 -81 20
5387 20 10 63 -70 -21 -52 -96 49 -31 94 -54 -56 41 154 -9 69 135 24 59 -28 -20 -8 108 50 -40 170 -67
5413 -67 219 -36 8 180 35 153 -170 -55 -107 92 170 -224 -13 37 -2 -143 -23 -10 -31 91 137 -106 49
5436 49 20 35 -73 -210 -83 -35 20 116 -90 7 -92 -153 67 -139 87 -193 22 26 -50 -82 -17 185 53 -165 19
5461 19 122 89 206 76 74 76 126 56 39 -81 -93 78 -33 28 -103 -109 177 -40 -30 -122 -87 30 31 -230 -11 -80
5487 -80 130 110 -83 -54 -85 -21 75 24 -47 48 181 71 -39 95 -4 253 -105 -99 -54 78 162 -137 -47 49 14 43
5513 43 34 9 -223 -3 -91 -64 -81 -142 -84 -91 7 -179 24 -70 16 -95 -15 52 19 135 158 -5 130 57 -44 91
5539I1j69L8p6L01j15m5n1PO0K5j5r4J64J1k00N0j48K61j45R4m7m7N8PJ22k99
5565a62J39P3J28l43P3M7R7O6j4o6j82K33o5j2J4j9N7k82L40m43N95l36J51j56
5589f7O6O5J02j07r6L7j47J22L16j68k53K5lL23k51j5K2Q1p0j6k2k1N1J12j9o7
5615@K3j59R5O1OJ03r2LM5j46J0K52k43R0Q4o0J9j02j9rJ23n6p9q6n0R3K06m8
5643F4M6l16j36N43N9k43r1j97J57J73j07M5K9r3J03J87l13q9J0K16J35j54m8
5666b0M6R4j5j18Q4n8j05P9o3J36K1j97K1k5K37j35q6j5qQ2K58k58k4J4K11lj41
5693A2j08j37K60P4j4J34m01L01l78M00j75O0Qm1J39l9n6l1J00k0L0q2p4j77O8
5718a47N7OJ46j73J37p9P6m3J49k52K20k2m2l0j2k18L06R6k01pr4kJ41Q5j49m6
$$ plain form
5539 91 -78 -40 -116 185 70 25 -26 -19 41 66 51 -43 121 132 -68 -18 -166 95 -50 44 -3 -50 8 15 137 -162
5565 -162 -23 50 178 -165 -92 -45 52 118 104 38 -144 89 24 12 26 7 64 -218 122 -321 274 -62 89 -67
5589 -67 -1 64 166 59 -37 0 -147 -25 291 123 -130 -105 -108 215 -36 -51 -29 52 -18 -34 -56 -77 -26 86 67 0
5615 0 23 -136 -41 20 26 129 37 40 85 -61 -51 201 -42 48 132 72 91 -11 -30 -39 84 28 -51 -137 -187 -94 112 64
5643 64 110 -206 -342 201 260 17 -74 -271 -114 59 -48 -3 26 -67 36 223 -90 -179 -169 47 182 28 -20
5666 -20 26 120 105 -13 71 13 -92 -13 -76 60 81 -116 -95 -120 117 -18 -104 -119 -127 -45 213 -45 -69 -55 156 153 12
5693 12 -96 -233 27 101 87 221 -180 121 -257 143 -32 28 36 -5 134 95 39 8 108 88 118 36 -38 -215 -147
5718 -147 -90 -84 62 -111 26 -53 23 -20 129 -123 97 75 33 3 -9 -227 79 175 -26 -33 -127 -129 12 97 -52 -98
5744i8j09J23K13j44j25J47p2R3K16k38M1j09K2R5P5o3l10J68N2K0R3j29M6L9
5768D6J24k09N7K8Jj04M5Q3j37nQ2J05M7j88J9k17M96k08q7J17j25J15j33N3j30
5793a25L9J08K7J23N1l80M6q7L23j46P9j45O8o1QR6q5m6L1J24J2o6p7n4Q1J83
5819A27j76j32KJ49J67J06q1k74J65j69J63K49m27J62j35N8J30j4j37lJ07J43
5841A80on6r4j18K5K76k66k17L45jo8Pj14J28j33K48j0r8j2n7J0R1r9R1M2j46
5867e2R1Q7r9p5J22j82J91O1k39j05O1J43K8J69k31q5J21N8kk21K5J46K04j90
5891B6J52k26p8J39J07Q7j51j72N9K86j78M4N8k46K4J28J1o9P7l06P8J42l3J66
5915A25j13R4o2M8j31K9j3J6r1J35j73Q8j32J86k6q0o1K33k76K21K0M9j4o2R5
$$ plain form
5744 -98 -207 -84 129 -15 -140 7 -65 28 244 6 47 -62 -40 55 130 67 -243 -75 -23 -3 90 -39 7 46
5768 46 170 -39 18 46 47 -57 -12 71 -66 -71 11 116 163 -25 -6 -223 273 65 -22 95 -30 85 -48 5 -125
5793 -125 -86 22 49 172 223 -157 -111 -198 125 -21 58 -87 -19 -80 -72 24 -61 -107 -76 48 60 -6 -83 -137 -56 127
5819 127 -49 -181 -179 -30 137 243 162 -112 53 -116 47 296 -131 31 -104 -46 84 70 -67 -70 37 180
5841 180 174 118 24 -94 -69 207 -59 -276 69 68 0 7 -107 21 -112 136 126 28 16 -41 -31 60 -39 52 94 -52
5867 -52 39 126 27 -48 74 -108 83 144 -95 -200 -139 4 32 201 -30 -115 6 64 62 -159 -134 12 216 26
5891 26 178 -48 -126 13 120 207 56 -116 -57 229 51 95 153 -93 -69 59 70 1 78 -228 -150 -8 -41 125
5915 125 12 106 44 92 -39 -10 -23 -7 -98 37 -136 -48 -180 6 -20 -100 -161 72 -204 17 37 86 72 10 105
5940A05K8j62j47L9K21J04k23j97L33j30l9J99r9j7J2J56mm6j71J66k42Q0J30
5963I6j03j8M7n3r9R1R1j45P2j20J40j05K5m9N3J87k12K03j25j10J09O4k34J80
5987a5Q1j80M1J27j72L9j44K08L1j91K09n8J75j13P9m5n7k21oK55j30J36k3j62
6011a36K49k25rJ0N6J87j65l6J20n6N5j02p8R8q0N0J71k13J13rp9l9p8M26k17
6036A3j05K44k03N7p4Q1l4J93k36P6j1l6O7j60P5J80j02L3L7k06lP5Q9J34j6k68
6062a00K9J54o7j32J28lJ41k84J32N8M4%k2k2j52J06p3k4RK34J4j11j29J26K0
6087G6m9R8j80QK4N1q9J35k57J40J32k20R8k7J03N3j86P3m0l7P5q9J80j62N8o0
6113i2J00j06J37j18N8kK8l8Q8K7R3j52l7j18M7P8O2j82J89j16J16q0M7J61j52
$$ plain form
5940 105 133 -29 -176 -137 84 188 -35 -232 101 -29 -68 131 32 15 27 183 179 133 -38 128 -114 -34 96
5963 96 -7 -25 22 -31 -130 -39 52 -93 -21 -141 -1 -106 -81 -130 -77 110 -102 101 -24 -134 -25 39 -195 -15
5987 -15 66 -114 -73 54 -118 -79 -223 -15 16 -175 34 -24 151 38 117 72 15 -206 -212 43 -87 49 26 -136
6011 -136 113 -112 -121 -111 -55 132 -33 -69 51 -5 50 -52 -130 -32 -112 -62 109 -104 9 0 -79 -118 -196 230 13
6036 13 -92 152 -51 6 -68 13 -21 172 -64 12 1 -35 32 -128 -53 127 25 58 95 -111 -114 -39 50 184 168 -100
6062 -100 -71 83 16 -116 12 9 150 -134 -2 56 100 100 78 56 -96 10 -63 -87 -78 156 170 59 -70 56 76
6087 76 27 125 -55 -47 -23 28 -61 74 -183 -43 89 -131 -33 -60 43 96 -90 -17 -57 -94 -19 -108 72 -90 -32 -92
6113 -92 8 -98 39 -79 -21 -23 5 -33 55 82 175 23 -14 -132 -85 -7 55 -127 62 -54 62 -18 29 190 38
6138C8O1k67K13j7L1j77J05R5j8n7q0J06o6j97J57K1k9J03J55k14K79j14J1mj57
6163b2J26q6k8J67j76O3j77K8J33n5nJ09%j08j28R8J8k10K46M0j20K04p1k25J03
6188g6N7J57j10k7o0K9lO5K3p0r3O5jk2N8K28j68M4k87J62M8k07J46Q1N1j7k4
6215D9q1K8q3J78j00j05J27M2J10m9k4j66l3K12j40R9j49n6K37l9j37Rn6J82k9
6240B6k0l0rpj06K73j69L7J42q7j43r2L67k53J28k10K51j10N9O8k80R1P9L3L8
6265G6Ll6r1J01P9j25o3J32M3k63K53j50O5k11J85K1Q9j44J22j98J54j08qR6q
6290A4l7Om4j4j50L06J43r5n1j88MQ8L5j54J40Np7Q8L6j10N4p7J91O9l63J58K9
6317FM0m6N5j19J10L3j86PJ27j3k56K01J43r9RKp3J66j11n7J72k19q0J99O3o3
$$ plain form
6138 38 99 -168 45 28 59 -118 -13 82 64 7 -73 33 -33 -230 -73 -52 -81 22 177 -37 242 128 139 135 -22
6163 -22 104 18 -10 157 -19 44 -133 -105 28 -27 -32 77 77 -31 -159 -61 -43 -253 -7 33 -87 117 46 -179 -76
6188 -76 -19 138 28 1 -59 -30 -33 32 55 -15 -108 -43 -44 -66 -8 220 52 96 -191 -29 19 -188 -42 39 90 73 49
6215 49 -32 -4 -87 91 -9 -114 13 55 165 116 92 -74 -107 105 -35 64 -85 -141 96 57 -80 -71 -127 55 26
6240 26 6 -24 -33 -40 -146 127 -42 -5 137 50 -93 -185 182 -71 57 -153 98 -12 47 115 -165 -74 5 38 76
6265 76 79 43 -48 53 132 7 -56 76 119 -144 109 -41 24 -187 -2 19 108 -36 86 -112 42 -66 -74 22 14
6290 14 -23 -17 -61 -75 -225 81 224 129 78 -110 -106 -18 17 -137 3 8 -69 19 55 -55 -1 -78 113 182 -181 -23 6
6317 6 46 0 55 -64 46 79 -107 -100 27 14 -242 -41 102 3 12 14 -59 107 -4 -61 111 -108 -188 11 74 11
6343A1J7J2j03J03O0N6k62J79n3q1m5M0J17l1kr3R6nj29K6N1N5j72K35Pl5k5q2
6371e3k1q4K7J16p8J56n3r7J70P4j20J2j67J09Q0J2K5j31l0N1J10m0j64J18N1
6396G3j08P4q8j08J06J72l1j01r1q9K21K5n8K9j23Q4j0K22K4j48m1O8r7m0R9j04
6422d0n4P2o4J47R0k03J6J17n9j54J30M4q9J89j57PJ07j27j2K07j95J51np8j9
6447B1k9K3J00j11J74j86J03o4l2l1j49J05j2J50q1J8J06r3o1m7J26p6n2J22Q9
6472A13j64J39p8K00j05m9j70L1N9J26k63K62k36J49j74J59j2rk0n5N1q4J38J05
6496A13j67J69j54l7Q3P5O7j41mk2N0%o7N0q3Q1k3j39K41o2N2J7q5M2q5J08O1
6523A40m5j80K5Q8%P1k9j58qJ08k3O9m1m1j6L9kQ8jj22N4q2N1j52K31k1RO0k05
$$ plain form
6343 11 28 40 -63 40 100 156 -106 73 20 -61 -106 -66 51 20 18 -75 21 16 -113 -87 -36 19 -153 82 89 54 29 -53
6371 -53 -74 -158 -131 -15 -93 63 10 -87 83 157 37 49 -118 -9 71 83 108 -23 -53 -2 108 68 -96 22 73
6396 73 -35 39 -49 -157 -51 121 90 -11 -102 -191 30 55 -3 26 -97 -13 -23 199 223 75 34 102 5 -35 64 -40
6422 -40 -94 -22 -86 61 151 -52 -36 81 22 -132 -2 42 -47 142 -15 -8 99 -28 -40 167 -28 123 118 40 21
6447 21 -8 15 115 4 178 -8 95 31 -1 -32 -181 -76 -88 62 -19 -1 105 12 -49 -96 30 -46 -98 24 113
6472 113 -51 88 10 210 105 56 -114 -83 -24 102 -161 101 -135 14 -160 -1 -13 -22 -42 -97 -46 -130 8 113
6496 113 -54 115 -39 -76 7 82 149 8 4 -18 32 32 -35 15 -68 13 -10 -149 92 30 82 99 14 56 -29 79 140
6523 140 95 -85 -60 28 28 99 70 -88 -96 12 -11 58 17 -24 -40 -1 -3 85 84 -38 16 -66 -15 -167 64 43 52 112 -93
6552i3R8n7j17K38jk83K96k02J92j61K29r6j49L7Q6j07J66l0k05J33n0J46p9j41
6576a50P5p0O5J6J38j88J24o5p7R9j8J76k01P1q9m4L78k82N4P8j74mK58j37p5
6601d2J67k79R1J38j92K36l42J59J86j64J44j01K9j3j6lO1LO1n1l4R1j18oj4J05
6627I6k0L9j20k3q2P9J41j14j00l2J75J29k25K9Q3j02K10l2j80J40k60M8J35r7
6651h3L8M3J05j00n2P8j33J95k6j30o5L68j35O1l9j12j56O0J88Mo0j24J62j44
6675e7O7J6j01J45j86J77k96J50Q9Nm1o8J02Q8M8m8j80M6r5J54j20R6j15O6J94
6700A36j14p8l2K86k37J23k67J78j02J03Q8K6j80J50k9j8j73J19n9N3j10J12%
6723b5mJ51j05O4j47Q8J7r0q5j21K28n5J66j44J62j50MN7l3j09P7J46P3o7j56
$$ plain form
6552 -93 5 -52 -169 69 68 -215 81 -121 71 -90 139 43 -106 -69 17 -90 76 46 -159 -26 -76 70 -9 -150
6576 -150 -75 -145 -80 -64 74 -114 10 -55 -132 -33 -51 125 -76 -5 -94 -138 240 -42 12 90 -84 -88 170 33 -42
6601 -42 125 -154 -63 75 -117 119 -223 -64 122 -42 102 1 30 17 1 -2 59 62 123 72 38 129 11 5 -9 96
6627 96 76 115 -5 -28 -110 -31 110 -4 -104 -136 39 168 -57 -28 55 -47 163 131 -49 91 -169 -121 14 -83
6651 -83 -45 -2 103 3 -49 29 -104 91 65 -65 -130 238 103 164 125 13 -143 -83 105 109 49 -75 87 -57
6675 -57 10 26 -75 70 -116 61 -235 -85 4 9 -32 -100 2 90 138 90 -90 -44 -139 15 -105 -9 -124 -58 136
6700 136 22 -56 -88 198 -39 84 -183 -5 -107 -4 84 110 -70 80 51 33 -140 -21 -80 -27 -137 -25 -25
6723 -25 -29 122 17 81 -66 22 39 -51 -136 -257 -29 -84 82 -62 100 -50 -46 11 -22 -131 -54 92 165 98 -58
6748e8J5M6N6O2k18R7L9r1J58J9k30o4K0K17l9K7J56k26P1j39K11j24R6J6k74
6773a57J98K04j95q5KO5j94J58M1j31J53l1l4q8K2R1r8j7K83k49J42j19oL9lp2
6799h1P0J32j05j02j49L65j07N1r7j32J19J66k6j14O9p5j21P1J42o6o6q5J60j39
6823a20N2J5N6O7m2j93J53J4OO7p3j90K03n5P9j04j5N2J43j56K7j32J68M7q9j34
6849a54L13k86K45o8p9Q4j43m8K60j37p0K1P2J19j07n3K5Kj05J06J3o2k5R4J35
6874A52k38O8K1r1J46n7K9M6J1K2j77M7m4J16K4j49l4Q3O4Jm3j32J20p2J79o6
6900B6J17j10o1j00o9K59l5j25K09j21p2J73l3l3j26N7J61k36Q4j1L4O7q1J5K8
6925A7j19J60j34R2N9n0K52l33J52OjJ00k38k7J06j15l4L3J76k06J74l41K09l2
$$ plain form
6748 -58 -43 3 59 121 -97 0 39 -52 106 125 -105 -169 -149 68 29 56 212 -14 57 -82 129 5 101 117 -157
6773 -157 41 245 50 -35 -33 32 -162 -4 37 -94 59 28 -6 -94 -72 19 -79 -96 187 -62 80 -39 -45 -6 -9 -81
6799 -81 -11 121 16 -86 -235 130 23 74 -23 -155 -36 130 104 -10 59 -16 -137 -66 76 10 -56 -141 19 -120
6823 -120 -68 -53 3 70 28 -165 -12 2 8 75 2 -188 15 -40 39 -65 -80 -28 115 -41 -14 -146 22 69 -20 -154
6849 -154 159 -127 118 50 -29 55 -88 -136 124 -13 -83 -62 10 129 22 -31 -6 -4 -109 -3 10 -52 -77 17 152
6874 152 -86 -18 3 -88 58 1 30 76 87 109 -68 -21 -65 51 75 -74 -108 -25 39 40 -3 -135 -15 -87 92 26
6900 26 143 33 -28 -128 -197 62 27 -98 111 -10 -82 91 58 25 -101 -44 117 -119 -35 -46 -12 55 -26 -11 17
6925 17 -102 58 -76 16 75 25 277 -56 96 102 101 201 -37 -64 42 -73 -107 -74 102 -104 70 -271 -62 -94
6949i4J10l2l3j2r6J83J6kM8J05k63O6j44K8J61j71K07J5j70J99j09J0j00J67
6973H9j28q0JR7O3j01k21J35K49O9j26j37l3R8n5P4L5n2J2n1O4R3L6k7k3q0j14
7000a13J46P6j23k5Q6k24J52J06l4j34P7p7J47M0M8j36l3L8j59J08j42J64p1J40
7024E7j47K17j23m2K7J23l05L36m5j94K23j15PJ56j97L8r4j5J77m0J5J6K0j04
7048iN0O1j78K47j58r0O4M7K34l97K02O1k33N0K4J00o7k7N9M8j41M8K6r6P5P0
7074G0o8j03N3N6Q2O7j25Nj41R7q4Oo0J82q0J68j46J17O9j59p1J21M1j02P2k6
7100D1J5K8Lj44Q1q4J16q7mj04P9k0J54O0j42K8M8j13K6Jj4K5L1m8J26j17J38
7127A23j47k6J46j67J70m7L4p7j3O5j75N1L8J52j42n7L22k15J7j81J74j20M8l5
$$ plain form
6949 -94 16 -16 -49 -61 -157 26 42 40 88 193 -70 -4 -148 -120 41 -130 77 92 -78 121 12 22 -78 89
6973 89 -39 -119 -118 -21 42 -59 -280 -145 104 173 47 -90 -123 -25 -80 -6 29 -23 -11 -62 2 95 131 104 81 1 -113
7000 -113 33 109 -14 -39 47 -177 -25 81 47 -87 -10 -87 60 100 148 12 -21 17 -142 -34 -176 -12 -83 57
7024 57 -90 127 4 -38 -11 112 -193 143 98 -96 127 12 19 175 -22 16 -78 -93 84 44 59 75 95 -9
7048 -9 41 102 -76 171 13 -77 -13 34 268 -129 73 134 -99 -49 -25 75 8 -19 40 88 -53 -5 21 -75 0 70
7074 70 2 -101 -48 8 90 157 32 37 -104 -7 -91 -85 -145 37 -43 125 -21 96 165 6 -65 56 97 -5 67 41
7100 41 56 84 87 -57 24 -60 56 -31 -35 -139 -60 -80 74 134 -8 20 68 -45 -19 -18 -32 -7 24 -24 102 -15 123
7127 123 -24 -50 96 -71 99 52 86 9 -4 61 -114 -63 -25 127 -15 -72 250 35 52 -129 45 -75 -27 -62
7151f2M5p8J75k32J30L7O6k2j74K08J16l18J0J91J7j44N6L3k13J76J0O5j38P7
7175C1P4l9l7J14r2j50K09k15J69k30LK30j07m9j07J03J08pL6Pm2j08O8l1K5l2
7201f9J03p2P7J32j92Oj4j2J33j16j25L5P9J68j06l0R7l7o6N8j22J85j07r6J55
7226F4k05J01J3j95J43J06O8j60K2pQ4p4LO5j38J72p3q0J84oj32M2K08k44l6r3
7252a68J92OP0r3j36K23j40K35k90M8K75j39J57k38Q2P2l01L11p8q5l3R8r4P5
7276D9J09k22L4%M4q7J47o5n8J33j61J01O1j36p6K02p8nl8P7Q4l7j15k7j2K92
7302B16k29l9j53J70p3J55j65K07PLr6J83j59Qn9j01R0j69K38j01r4K93k35J8
7326h5J40j36jj09O0J75MRK1r4J08P6k04j12K96l95K16l2J52j69J20r1J33n1o6
$$ plain form
7151 -62 -17 -95 80 -152 -22 15 81 59 -115 93 209 -109 -99 92 109 -35 21 54 -159 17 27 92 -46 31
7175 31 105 66 29 143 51 -99 110 -105 64 -166 -163 67 -40 -89 -196 -93 15 8 44 51 9 -99 -31 -62 -37 -69
7201 -69 34 -38 39 171 -21 -15 -29 -41 92 -24 -149 -114 -35 133 27 -3 94 57 -9 49 -73 112 5 -91 64
7226 64 -141 -40 -27 -222 -79 27 95 -65 -43 -50 34 -40 -37 28 -110 62 -11 -91 93 87 -45 -3 205 -39 -75 -168
7252 -168 24 30 100 7 -129 94 -46 189 -101 -53 222 83 240 2 84 156 -145 166 88 3 -30 68 -26 49
7276 49 158 -64 -30 -30 14 -73 74 9 -49 84 -77 24 85 -51 -127 75 -3 -8 -46 31 115 78 -37 -64 -76 216
7302 216 -13 -52 -205 -35 -108 47 -118 89 96 99 3 186 27 35 -24 -125 -35 -204 34 -67 -161 132 -103 -85
7326 -85 55 -81 -82 -191 -131 44 48 57 78 -16 92 168 -36 -148 148 -247 -31 -63 89 -80 40 -51 82 31 -35
7351c5P9k7N4j25M8N6%j28R8Nm1k8n5K36o2j75m6m8K23p1QJ08k03L4R7J13j60
7378d5N9j18k8J57m4j23L07j49Jm3R9j36R2K9kk48K63o9pJ60o9n8j46K22j66J4
7404d8j02M7Pj2q3L22j08q4l0k3J75oj85%j8R0J37q4j17n4J90J1k5j96J79J06
7430H9J4k01J2Q9K5J3m6k6J5nK47m13J44j29R9P6Q2q4q1P1r5K66q4j33k6P9n9
7457f1J69j92Q6j1J20k98J59m2N1P3j89L7J99l5j02Q5k2M8l4j1j19J83P5j30J00
7482A39j73j81L60j01p8p6O9m0L43k60j09%K55k26%P5j27K35%l4j68J47J8n9O4
7507G3k8n8R9k03K03L7j82J4K56l20J81j69K33r4j17J0J16J59k05K9j19M8j64
7530b01K22K1Kk18K4L51j49kk08J16K17l66m7K52l1M4jk20J49J09j3l7om2J21
$$ plain form
7351 -35 44 17 71 -54 -6 50 50 -78 20 25 -16 -44 -99 137 75 -100 -146 -194 29 -42 -34 74 -129 -95 2 115 -45
7378 -45 14 -104 -132 25 -19 -142 165 16 17 -26 73 -63 29 58 56 -192 71 2 -5 155 86 28 -118 104 -62 -48
7404 -48 -150 -103 -96 -108 -191 131 23 -61 -91 -114 61 55 -130 -130 -148 -58 79 -5 -122 -176 14 25 0 -196 -17 89
7430 89 103 -98 -86 3 28 41 -5 -31 -16 -21 226 -187 -43 -172 -73 3 85 1 -80 -9 -104 162 78 -55 -81 -2 -61
7457 -61 108 -84 2 -9 111 -187 -28 -70 -19 54 -135 -98 101 66 -36 49 27 75 41 30 -89 94 169 39 139
7482 139 -34 -215 145 44 -34 -110 -41 -81 262 2 -107 -107 148 -78 -78 -3 -130 105 105 71 -97 50 68 9 73
7507 73 45 -13 86 -117 86 123 -59 -45 211 -109 72 -97 136 42 -75 -65 51 210 5 34 -85 -37 -201
7530 -201 21 42 44 -174 -150 201 52 50 -158 -42 175 -191 -238 14 -17 27 26 -194 -45 64 51 14 8 -34 87
7555H7J67l36K19j0r1j20P0M9j00Q8j03K05l3j03J50j78R7r1l9J48Rk43k4K38
7579E6m6k4m5q2P6R7Jpk57K76j9N6j29J84l06O5L9J72j27m2l0R3N6j96PJ56p2
7606d8O8j29J78k7m5l6m3K7J2p2QJ61O2l0j34J60j46L2J74JP1l02R3J5N7m9j21
7633f3M9P5j8Qj06j8K05j43J05k21N7J01M1J12n5j35J78L1k71o9J22L9j49J57
7657C2m8j1N8J08j66O0NP5j91J12j82J79m5J29n7o8L3n5m8L4J82k28J7J90j5k27
7683a27K61j97J46j52O7J2J05q6k3p0Q1j40O2J84o3j97J03N4j26J19N4o2M3j72
7707a24K72r1j9J16j87K0j47K33p9p1pK8P3M4o6J0K9n4r3K04j12R1j90K01j56
7732g5J43o1J02o6k4o2J21p7M0j11O1P7Mq9J49n3jL0j45R4r4j8j4M0K4l6K22j88
$$ plain form
7555 87 254 -82 137 127 36 -84 -14 35 -65 23 -80 125 92 -11 139 -39 58 -33 -72 76 85 -158 -182 56
7579 56 10 -14 -59 -141 -65 32 33 26 -231 45 26 82 -47 137 -169 -104 -65 107 -20 -62 -92 1 57 -139 -132 24 -48
7606 -48 20 -109 69 42 -3 -39 -82 -55 -43 -115 -107 54 116 86 -48 112 -34 -2 172 173 244 -58 35 50 107 58 -63
7633 -63 -14 61 43 51 -55 -73 132 -11 94 -127 -70 31 72 184 129 -6 172 203 -68 -137 -15 24 -125 32
7657 32 -16 -27 31 139 -27 33 38 113 -78 34 -148 31 -14 115 58 -10 23 -32 -80 -46 136 -92 -75 115 100 -127
7683 -127 134 -63 83 -69 -2 10 115 29 6 -64 17 -123 -61 123 60 -137 -34 20 -106 13 67 5 48 -124
7707 -124 148 57 38 154 -33 -13 -160 73 -6 -77 -84 -56 17 61 -5 5 34 -20 -113 91 -21 70 -120 81 -75
7732 -75 68 7 109 43 19 -43 78 1 41 -70 -9 68 72 -17 132 79 78 108 -37 57 -37 -55 -69 -29 -5 -41 181 -7
7760gp7j9J99k34Q0o8L7L3J20m2kK9q1rQ1J86n8j74l4MQ0N5m9j26J19j61J13o5
7788g0J44q4R0J9p4L9L5n9o2M7k7J09j26j6j02K03m9J07j6r4jK7M2j40kJ23R8
7815A61j75K3j13Q3K1q4%K13j25j04J1nK9J29j75J00q2K34j70J03j10j1m0P3J3
7840aN7K4J46k72K1M0J19mo3jk5L8j0m5J25k45K49j53j5o5M8o9K55k42J4J14j82
7867a42K26J0m6P9j78K21j44j40K04j51J99j88K9m5K6J15p5j8N6k3o3m4J81p9
7891A0J7j27J26j34K58j77K34j82J2k39J59K5J19l7O7p4L4jj59O9j59K06j78J36
7915Ej19J03m2J34k02J24p9O8n4J12M6j1j58o8QJ52p3N4N9r7R6K0Q5j07r7J28
7941H7k36J47k1j54K41l1k0j07N2l7P4J18j51J04p2j60J40J69j89K9ll3N2J15
$$ plain form
7760 -7 -84 -103 96 -138 -58 -126 -89 -56 64 22 20 49 -32 -41 40 226 168 -6 -40 -36 44 99 50 -76 43 -118 -5 -70
7788 -70 74 -10 80 99 25 64 99 40 -22 25 -2 107 -19 -35 -137 66 17 124 108 14 13 40 82 -58 -60 63 161
7815 161 -14 9 -104 -21 0 -84 -84 129 4 -100 -89 -94 -65 64 -111 -11 -93 141 -29 74 -36 -47 -87 -14 -1
7840 -1 56 80 226 -46 -25 15 134 130 67 66 41 79 69 24 149 -96 153 0 -15 -80 -32 -101 154 -88 -74 40 -142
7867 -142 84 94 48 127 -51 170 26 -114 90 -61 138 -50 -21 -66 -40 75 0 -18 38 15 -48 -92 89 10
7891 10 27 -100 26 -108 150 -27 207 25 37 -202 -43 -18 101 64 131 57 91 90 -69 0 -159 47 -131 5
7915 5 -114 -11 -53 81 -121 3 -76 -8 -62 50 96 85 -73 -141 -133 19 -54 0 59 -38 58 78 163 56 -41 87
7941 87 -149 -2 -23 -177 64 33 13 -94 -42 -79 -5 113 -38 66 -6 -166 -26 143 -46 -17 -20 -53 -1 114
7965A14k6P5r5k3k4Q6j44J74j01M3o7k6J15j56K03j48j7M7K1j30JJ7K3J2J75k89
7991a40N9j8J94j57Q6J84k42P3PP7j85j0k9J39N8m03L99j30L9k0n5J39q4N6p7
8016d0J27r2r2J57l8k04J31N8J19p9%R7j63l6Q8Q5j05M5j05J8K00k44J24r9P4
8041B6Q3k08J09q6Q0j14O4P1k3j10K78j83L05j05j11n2J30j34P8l1o9k4n9pK32
8066A40n6r8J20j80J49o7q8j22M9P7K24q7j63Q2p0n5N4L5m9J07N5j66K0K48j53
8091FJ41q2q9J47k10N1lJ0N9J0Rj28M6pJ53p6p2jm5RJ73l7NQ3k21J62p7j1K41
8120B46m17J31O4j49M1J23q1J0j32K22r2o0J2J28n3nJ8J10j1k98K30j56J28j63
8144a54K32J46j34m6j08k3J36Nm0L1n3p8N7l6P7K13k40J62r3m0Q9j97J00m7O7
$$ plain form
7965 114 88 163 68 45 21 107 -37 137 36 79 12 -14 101 -55 148 0 -17 30 51 -79 -78 -61 -38 -26 149 -140
7991 -140 -81 -99 95 -62 24 208 -34 39 46 123 -62 -72 -101 38 96 -307 92 -38 1 -19 -74 65 -19 37 -40
8016 -40 87 -5 -97 60 22 -182 -51 7 126 47 47 144 -19 -55 33 118 13 58 -47 -29 171 -73 51 -48 26
8041 26 109 -99 10 -76 4 -110 -46 25 2 -108 170 -13 292 187 76 24 154 20 98 67 -2 -26 -85 -92 140
8066 140 84 -14 106 -74 75 8 -80 -202 -153 -76 148 61 -102 -20 -90 -145 -91 -56 -105 2 57 -109 -89 159 6
8091 6 147 65 -24 123 -87 -36 -39 -29 30 40 49 -79 -33 -40 113 37 -35 -36 -81 -72 101 64 69 152 -69 93 16 5 246
8120 246 -171 -40 24 -125 -84 39 -42 -32 -164 58 -34 -94 -82 46 -7 -12 6 116 105 -193 37 -119 9 -154
8144 -154 78 224 90 44 -64 -87 49 54 14 45 -8 -86 -29 -65 12 225 -15 147 54 14 103 -94 6 -41 26
8169B6j38J53m0K01k16O7m1p2O0J36Lk90L71j48j37O2r0O8j52K37j53L4
$$ plain form
8169 26 -112 41 1 202 -14 53 12 -60 0 136 139 -151 220 72 -65 -3 -93 -25 -177 60 -93 -59
8191e9
$$ Imaginary data points
##PAGE= N=2
##DATA TABLE= (X++(I..I)), XYDATA
0@%%%%%%%qQqJ6j6K4l3M1n6P2q8J04j22J47j78K11k51K98l47M02m67N41o21P10
31C79q13R24j047J187j339J503j685J886k107K348k610K897l209L553l930M338
47B275m785N276n812O402p054P774q573R467j0472J1610j2911J4415j6177J8276
61I711k0826K3999k8078L3541m1280N3179p4009J20871m15318J32959R09995k80774
73D23970o54842k10775M01897K02284m8472j18529j1872k2949O1096J1029r1586
84e8749n9175K02086J36981k19495k86978J64400L58395j0827l48315j25590K03106
95d4161J93937j4766j07602j23941n2490J12266J73958k5665j61686q129J17168
106E8889n6152j58732Q0260K64145L1776k58272j92653O3837J87160J63541L1152
$$ plain form
0 0 0 0 0 0 0 0 0 -8 0 -8 8 -8 16 -17 24 -32 40 -48 56 -66 81 -97 114 -137 161 -186 216 -251 290 -331 379
31 379 -434 490 -557 630 -709 794 -891 995 -1112 1236 -1374 1523 -1686 1867 -2063 2275
47 2275 -2510 2766 -3046 3356 -3698 4076 -4497 4970 -5502 6108 -6803 7612 -8565 9711
61 9711 -11115 12884 -15194 18347 -22933 30246 -43763 77108 -338210 -205251 704744 423970
73 423970 -230872 -441647 -39750 162534 114062 -4467 -16339 -39288 21808 32837 -58749
84 -58749 -117924 84162 221143 1648 -285330 -120930 237465 226638 -121677 -247267 -44161
95 -44161 149776 135010 27408 -96533 -149023 -36757 137201 111536 -50150 -58279 58889
106 58889 2737 -155995 -75735 188410 220186 -38086 -230739 -166902 20258 183799 214951
117B14951j98382k71591J8544L16240J77407j57718j89146j1906K4842K8420J60663
128A12324J09967k28473k90874J55590L96841j1846l85265j09934K82584J42396
138A73310j75224j00389J30875O4285j24768q4294P3183J09011N4155l4251j57452
149g1559j38701J25244K81600K1228k84152j44834J82578J52820j07291j04878
159h7945J02114R9131r3091j32676J0107J10263J01852J9657j26634j82004K4073
170a55153K61524J37776k05984k47213O2287K38709P3943j26309j26216j9749
180a06385O8715J06390L8540r2874j00452L1234P3364j7376j5832Q6202K5910
191I7436j57931j11921J46755J86360o2350j73616k705J02699q051o3126M5546
$$ plain form
117 214951 16569 -255022 -236478 79762 257169 99451 -89695 -101601 -76759 -48339 112324
128 112324 222291 -6182 -297056 -141466 255375 243529 -141736 -251670 30914 173310
138 173310 -1914 -102303 28572 92857 -31911 -116205 -43022 65989 120144 85893 -71559
149 -71559 -210260 -85016 196584 217812 -66340 -211174 -28596 124224 16933 -87945
159 -87945 14169 113300 20209 -112467 -102360 7903 109755 129412 2778 -179226 -155153
170 -155153 106371 244147 38163 -209050 -146763 91946 165889 39580 -86636 -106385
180 -106385 -37670 68720 107260 14386 -86066 -54832 18532 1156 -14676 71526 97436
191 97436 -60495 -172416 -25661 160699 98349 -75267 -77972 24727 16676 -46450 -904
202i04Q0094m1262r8956j0052O3660M7107J1100k8161o7327k3349Q0618O6348
214G8916o5413q1902N4157Q3468n6108r1743O0011J14685m5425j42898r073J35612
226C4287Q4061o0188j19249o3879N9562J51773P5692j28802j84627J8098J90268
237E6996Q4729j11111j04902L3685O6199j0494l6656R445L7482J4699l2305o3297
249e5530j7097Q7567R4575n6860j50642j2691J55849Q2115j12216j15794N0271
260e0453J07528J86p0803k1605L2881K1104j2646k4269m562L5677L9124l2288
272A9874q6700j2101J02994P7257n8816j03725j1608O3927M5143O212j2608l8399
284h550m3082J3465O3078K5565l7378l3368L389M529J49K3993K2103k7076m2281
$$ plain form
202 -904 79190 37928 -61028 -71080 -7420 39687 50787 22626 -44701 -68050 12568 78916
214 78916 13503 -68399 -14242 69226 13118 -78625 -18614 96071 50646 -92252 -101325 34287
226 34287 118348 58160 -61089 -124968 -65406 86367 162059 33257 -151370 -133272 56996
237 56996 141725 30614 -74288 -40603 25596 15102 -21554 -12109 25373 40072 7767 -55530
249 -55530 -72627 14940 109515 52655 -97987 -110678 45171 127286 15070 -100724 -50453
260 -50453 57075 57261 -13542 -35147 -2266 18838 6192 -18077 -22639 13038 52162 19874
272 19874 -66826 -78927 24067 101324 42508 -61217 -72825 -8898 36245 42457 29849 -8550
284 -8550 -51632 -38167 24911 50476 13098 -20270 -16881 -12352 -12203 11790 33893 6817 -35464
297c5464Q576M1581R809k0485r190o9q497M173K9745J2098l0859l1973P594K7536
311D575J7248L447j6353l6326j5617L9276M5635j5474m7174l909L0737Q32k3224
324a6327R585L6084L24m2505k6842K1771M0824J6302k4634m2245j1293L7993L8367
337C7404j7371m5355l361L8240J4143k7222j6081J8765J5709j1931j4067O798
349d329J4027K370r997j4048l652J8879K2536r021l4805j2065K7198K4610r360
362A2343k0202j484Q328k26l559M736Q195L49o797q523l612P826J4737K525j5200
377e64j1506O611R646l807m121P387M550j1757j1682Q884J7153P32j4532r164
391a2170P900J3517J949j2413j0088P411J5355j243j6184n133J4669Q022j5256
$$ plain form
297 -35464 -26888 14693 24502 4017 -5173 -5242 -13739 -9566 20179 32277 1418 -30555 -22961 4575
311 4575 21823 25270 8917 -27409 -43026 -3750 41885 26411 -20763 -24672 6065 6897 -16327
324 -16327 -6742 29342 29666 -12839 -39681 -17910 22914 39216 14582 -27663 -38956 -963 37404
337 37404 20033 -25322 -28683 9557 23700 -3522 -19603 -838 14871 2940 -11127 -4329
349 -4329 9698 12068 2071 -11977 -15629 3250 25786 16765 -18040 -30105 -2907 21703 12343
362 12343 -7859 -9343 -1015 -1241 -4800 -64 8131 8480 1683 -6840 -10452 -2626 12111 14636 -564
377 -564 -12070 -5459 4187 380 -3741 3646 8196 -3561 -15243 -6359 10794 11526 -3006 -12170
391 -12170 -4270 9247 11196 -1217 -11305 -3894 11461 10218 -5966 -11099 3570 11592 -3664
404c664j3562J4140K2345n657k8061j1518K1220K5838m47k3007j7325O674K1200
417H176R573j2108j5125L027J2933n51j3996j871J6652R740j6044k0847N763K5353
431A0675R591j8548j9628M867K0285R157j0302j4989l000J1054J2275k3j2459
444a045r530M169J0445J934o703k124N261j135j0124j221J5127R840j1072j4967
458a1145J923J0970L363q45L156l058j4748n234J9796J8779j3930k8493J9K7428
472G981J1130j8521j5641Q297J2692j478o218Q65J829j690N76J631k971l44R892
487H030M227j7802j7508J6151L2305j150l8229j9941K6786L2159o930k8314p549
500a7765J5484J0435l630n338o2P25J276J641k897n430M875J2473k648k1558p985
$$ plain form
404 -3664 -17226 -3086 19259 13602 -14459 -25977 -4757 21081 20634 -2373 -19698 -13024 8176
417 8176 17749 5641 -9484 -6457 6476 5925 -8071 -9942 6710 16450 406 -20441 -14678 10675
431 10675 20266 1718 -17910 -13043 7242 16399 6097 -8892 -11892 -838 11437 11414 -1045
444 -1045 -10575 -6406 4039 5973 -730 -2854 2407 1272 -8852 -10073 5054 14894 3822 -11145
458 -11145 -9222 1748 5111 4266 7422 4364 -10384 -15618 4178 22957 9027 -19466 -19447 7981
472 7981 19111 590 -15051 -6754 5938 4460 -1758 -893 936 -754 -178 1453 -1518 -1862 8030
487 8030 12257 -5545 -23053 -6902 25403 24253 -13976 -33917 -7131 25028 18098 -10216 -17765
500 -17765 -2281 8154 4524 -814 -876 -151 1125 2766 -131 -5561 -686 11787 9139 -12419 -20404
515b0404K4559K2592j8049l4437K665L5268J3001k4557j8703J1414J3914m937
527B326m227Q945O24j5758m573J7295R426j4105r198J1678M974j5826n941K1451
541G091J3788k0683k2612J0980K3503J853j3524n454J87j279O756J4012k958k2259
555a0599p805K0993J5987j4064j8072P453J4835n770j3958N616J6866j020j7831
568g369q152J1817J4250K354r048j1881n926Q186J8556P402j7607k3288L507K6802
582I603J1124j8671j7588Q979J4812o208j1783Q866J5421q109k1486J01K2248
595G309J0436j2267j2995r68K715N859J2473K767j9265j9000J1302K6196L489
608A8051j9351j1204O354N548J25M814N835o881j2729q36R778P435K661q69j0612
$$ plain form
515 -20404 4155 26747 8698 -25739 -23074 12194 25195 638 -18065 -6651 7263 2326
527 2326 -1901 7044 7668 -8090 -12663 4632 14058 -47 -9245 2433 7407 -8419 -14360 7091
541 7091 20879 196 -22416 -11436 12067 13920 396 -5058 -4871 -6150 606 14618 11660 -10599
555 -10599 -18404 2589 18576 4512 -13560 -6107 8728 2958 -11000 -5384 11482 10462 -7369
568 -7369 -15521 -3704 10546 12900 3852 -8029 -13955 -5769 12787 20189 2582 -20706 -17199 9603
582 9603 20727 2056 -15532 -6553 8259 2051 -9732 -866 14555 6446 -15040 -14939 7309
595 7309 17745 5478 -7517 -8485 -5770 89 12562 15329 -3936 -22936 -11634 14562 18051
608 18051 -1300 -12504 -6150 -602 -477 4337 10172 3291 -9438 -10274 -496 6939 9600 8731 -1881
623a881j6093J667K6277J8480j7474l2832n732K5960K3914l828k1478j4484L533
636a3971J5002J1782n52r951r715l294M815J0151Q800j567j2797j4087j315J5734
650i65K0657K160k3507k6620M337L3074K1789j5640l0343q087J6566J6518K989
663A2928m443p255r890m666P536J4785P999o817j8070j4467O061K6256J9233j3400
677A5790l3392j4396K1036L0829Q173j9315k5596q761J6031K5822J0038j6975
689I284k4388o374J4147J6828O417m792j2835j4936k616J6418K2305L974k0571
702B861k5779l558K4487K8429Q17k8198k6644M829K8181J9081o965k1372j3826
715a7657L225J3778J2221K040q740j1966p548K455J4076J6756J242k1991k4436
$$ plain form
623 -1881 -17974 -16307 9970 28450 10976 -21856 -27588 -1628 22286 18458 -3020 -17504 -13971
636 -13971 1031 12813 12261 2310 -7405 -10699 -5884 4267 13067 11500 -1297 -15384 -16699 -965
650 -965 19692 21852 -1655 -28275 -23938 9136 30925 15285 -15058 -23145 -6579 9939 12928
663 12928 8485 1230 -8660 -13326 -5790 8995 16994 10177 -7893 -22360 -16299 9957 29190 15790
677 15790 -17602 -31998 -10962 19867 28040 8725 -16871 -25632 -9601 16221 26259 9284
689 9284 -15104 -21478 -7331 9497 15914 11122 -1713 -16649 -19265 -2847 19458 23432 2861
702 2861 -22918 -26476 -1989 26440 27257 -941 -27585 -22756 5425 24506 17541 -3831 -17657
715 -17657 -14432 -654 11567 13607 4867 -7099 -14647 -12192 1884 18640 19882 -2109 -26545
728b6545L291L1230K4508j1363l3894j8621J5892L0763J2614j6774k5344p631
740b1874J3816J7034M629n638q804r085m464P840J7606R870j2110k2847r355J5605
754g777K4485P977j7389k5075o272J9282K3345K600j9438j8851O6J5446J3785
767A2184O86r876j0813l273N354Q813P147M21q728j3261m163J2719J8533L365
781A9108j7790k0359j48K0230J8677k693k0633j5942M730J9794J2040o719j5512
794e217o569N403Q374M224K33k422o071o306j00R190J1189O47j4204j5032J977
809a4684J9116J5169p496k1350j0355J1842J8632M632j1037j3223j990Q110Q546
822E912J667m232m700k522j399J645O583O525k737j2136q533O235J5537P971r554
$$ plain form
728 -26545 -23254 7976 32484 21121 -12773 -31394 -15502 15261 27875 11101 -14243 -21874
740 -21874 -8058 8976 13605 7967 -837 -9922 -14386 -6546 11060 20930 8820 -14027 -23382 -7777
754 -7777 16708 24685 7296 -17779 -24051 -4769 18576 21176 1738 -17113 -17047 -1601 12184
767 12184 12870 2994 -7819 -11092 -5738 3075 10222 10643 1915 -11346 -15509 -2790 15743 19108
781 19108 1318 -19041 -19189 1041 19718 17025 -3608 -19550 -14820 4974 17014 10295 -5217
794 -5217 -11786 -6383 1991 6215 6448 4026 -2045 -8351 -8451 739 11928 12575 -1629 -16661 -14684
809 -14684 4432 19601 12105 -9245 -19600 -7758 10874 15506 4469 -8754 -10744 -2634 5912
822 5912 7579 3347 -1353 -3875 -5274 -3629 2954 9479 6742 -5394 -13927 -7692 7845 15816 6262
837F262j6848n661J2204J7064K342j4641j4244K918J3777P442n439p976j962K660
851b102J282K87K125L374j190p351o544M095J3265P221r861j7013k594J5421J4974
866A5389k887j6311j0453O107J3561N892o660r824k093M996M047K5N0J443k246
881A036p005k121Q528R881r27j2003r372L733J3312Q249o013j3743o733Q813J2627
896H262J966r034p886L41N103M337P03j359k974k456J6J757K796L395o9n822p116
913h040J311J0074P522m453j2255o043O839J2334M378q927j2279r56J1378Q294
927I177l707q231j763L454J606o58J371K417q93m979m028K070P688N987m511j2586
943g586n075J1198J3764k229j4891p018Q408J0054k81o237l107J157J796O55n31
$$ plain form
837 6262 -10586 -16247 -4043 13021 15363 722 -13522 -10604 3173 10615 5176 -2800 -4762 -2102
851 -2102 -820 -533 1592 4966 3776 -3575 -10119 -6024 7241 14462 4601 -12412 -15006 415 15389
866 15389 12502 -3809 -14262 -8155 5406 11298 4638 -5186 -7279 -2283 1764 1789 1839 3282 1036
881 1036 -5969 -8090 438 10319 9392 -2611 -11983 -8250 5062 13311 7298 -6445 -13178 -4365 8262
896 8262 10228 1194 -6692 -6351 -1248 3089 3792 2433 -541 -2997 -2981 -1224 1572 4967 4898 -924 -8040
913 -8040 -6729 3345 10867 6414 -5841 -11884 -5045 7289 11667 2740 -9539 -10495 883 9177
927 9177 5470 -2761 -4524 -1070 536 -122 1249 3666 2773 -2206 -6234 -4164 3524 9511 5000 -7586
943 -7586 -12661 -1463 12301 10072 -4819 -11837 -3429 6625 6344 107 -3000 -1843 -47 608 77
958G7l2J870R05l839n128K062R133L832q235r612J805J0176N326m756p246k313
974e975L903M902J438k599k962p20P06J020J614J399j537k957j095J650J865J027
990A679P50j457m107j831M941N690j504o527k310K916L803J143o16l221l556J408
1006b799N793J592n844l320N191L353m771m346M887O309l181p433m75N897L982
1021D835j582m096l337P15N311L758l636o625M92O381K034n390k823M395L626
1036D058l342m910J064N678K467l905n394j04N451M525k831n930q57M124K901
1051B995j737j884n31L87M37M61o7k63Q23Q70j879k477J704M881p0n555k281L964
1069b22L167j852j587P64m43j972J079L824l46m195j188L407J257j945j92J841
$$ plain form
958 77 45 1915 2820 -1019 -6147 -4085 5048 8880 645 -8967 -7162 3014 8340 3584 -3662 -5975
974 -5975 -2072 2830 4268 1669 -1293 -2013 -1307 -287 1327 2726 1189 -1768 -2863 -1213 652 1679
990 1679 2429 972 -3135 -4966 -25 5665 4161 -2366 -4676 -1760 2043 3186 2570 -651 -4207 -2799
1006 -2799 2994 4586 -1258 -4578 613 3966 -805 -5151 -264 6045 2864 -4569 -5044 853 4835
1021 4835 3253 -843 -4180 -3465 1846 5604 1968 -4657 -4165 2216 4250 -1140 -3963 432 4058
1036 4058 716 -4194 -3130 2548 5015 1110 -4284 -4388 1063 5588 2757 -3173 -4030 94 2995
1051 2995 1258 -626 -1157 -770 -333 128 61 -202 621 1491 -388 -2865 -1161 3720 3650 -1905 -4186 -222
1069 -222 2945 1093 -494 270 -173 -2145 -1066 2758 2412 -1783 -2971 436 1693 -252 -444 1397
1085A397r74k656R64K947J81j996K1K20j455m41L317K125l467m325J542M692J156
1102C248l112k201K85J532J674K56j656j525J292J310j173j123J784J666j988
1117B69l166J078L401P61k105j823m76J104K543R88k453l033J397L475k27k765
1133a032J64K260n74k494M98K700L68k168j164O66J82J044J270m80l199p24L423
1150G40K088k336k020J188J117j247l76K110K00k013j207J358J215l90J35kj705
1167a145j047K111K376j350k382J22J415K17KP63k22j887n38J748J300r15j079
1184e11J70L5m92J137J210q13k198r4J981N77o86l03P5p68m3J416O72j339j143
1203a117R79M09o03M7J270j57j983o62K056R07q58m68J53o17l75J369J361j268
$$ plain form
1085 1397 423 -2233 -1269 1678 1859 -137 -116 104 -1351 -1792 1525 3650 183 -4142 -2600 2092 3248
1102 3248 136 -2065 -1780 -248 1426 1682 26 -1499 -207 1103 -70 -1193 591 2257 269
1117 269 -2897 -1819 1582 2343 238 -1585 -2061 -957 1586 2574 121 -2912 -1515 1960 1733 -1032
1133 -1032 -868 1392 818 -1676 -1178 1522 1890 -278 -1442 -776 -594 450 1720 1240 -1959 -2683 740
1150 740 2828 492 -1528 -340 777 -470 -846 1264 1464 -549 -1756 -398 817 427 562 560 -1145
1167 -1145 -2192 -81 2295 945 -1437 -1315 100 317 319 1082 860 -1027 -1565 183 1483 568 -511
1184 -511 -341 -306 -798 339 1549 736 -1462 -1556 425 1002 316 13 88 -680 -723 693 1365 26 -1117
1203 -1117 -138 271 -332 -285 985 828 -1155 -1817 239 1146 288 -180 -27 -644 -1019 350 1711 443
1221D43j661o6J817M51o25P4l89j332j91K339J175j753k076Q98J211J85R9K1r70
1240c50j179R30J910J77j965n26O48M42J72P22j18j777p97J661J718q48k032J44
1258a068J260L71l62j96j78j92M77L31n24p05J144J181j696j713Q85K695J34k589
1276g45j008J078J524L01q26q47m13N26J089K30r02k25K12m60m77J155J965p33
1294A444l151j019K767K655q15k833j691R57K500J899j341l269n54K261J946m93
1310A263j531l59L88n07K62J592N67j523j890J57J648J333j07j463j249j48J740
1327A73J402o34j289j97K12k60L26J417N09j555k178J69K605J675r31k400j250
1344b206Q02K172J270q66j888q11L90J093J366P75r08k907j311K539L460K53l607
$$ plain form
1221 443 -1218 -1284 533 984 359 433 44 -1288 -1479 860 2035 282 -1794 -896 315 500 599 620 -350
1240 -350 -1529 -599 1311 1488 -477 -1003 -355 87 259 981 863 -914 -1711 -50 1668 820 -1212 -1068
1258 -1068 192 563 201 5 -173 -365 112 443 -81 -786 358 1539 -157 -1870 -985 1710 1844 -745
1276 -745 -1753 -675 849 1150 324 -523 -936 -410 679 909 7 -218 -6 -466 -943 212 2177 1444
1294 1444 -1707 -2726 41 2696 1881 -952 -2643 -1686 814 2713 1372 -1897 -2451 -190 1756 1263
1310 1263 -268 -627 -239 -746 -484 1108 1675 152 -1738 -1581 67 1400 1293 -170 -1419 -1567 173
1327 173 1575 941 -348 -545 -333 -593 -267 1150 1659 104 -2074 -1905 700 2375 1444 -956 -2206
1344 -2206 -1404 768 2038 1172 -716 -1527 -1137 -44 1322 2097 1189 -1718 -3029 -490 2970 3223 -384
1361c84k930R74L304K001j319k785j351J318K316L64j371l70K05n69q70J161K330
1378B024K93k983k360J298L411J276k036k793m76J962J922j0j533p73K28J55k18
1395f13P72J589k62k516j755J525L407R93k539l303l5K843K654p91k718j399J046
1412a102J537K89L5j78q14j353j04K261K138j048k920j362J394K781Q10j769k139
1429a544j12J533J059j26o06j90l68p28r7J812J693j212k788j013K317L019k93
1446B356k986j557R90J951P29r87q17K1k60k76N90J117O95j465j900j72K476K177
1464B682r55k945j584J898K916J89k110j538P32R63P3l64M65N89j116j681L94
1481a392K691J067j641k786l02K418K239n85k019j465O67J441N91j69l99m24p78
$$ plain form
1361 -384 -3314 -2340 964 2965 1646 -1139 -2490 -1172 1144 1508 137 -233 -28 -597 -1467 -306 2024
1378 2024 2317 -666 -3026 -1728 1683 2959 923 -1870 -2346 -384 1538 1528 -5 -778 -550 -395 -613
1395 -613 159 1748 1486 -1030 -2785 -1260 2147 3140 601 -2702 -2737 106 2760 1969 -749 -2148 -1102
1412 -1102 435 724 759 581 -233 -1586 -1690 571 2709 1661 -1259 -2621 -1227 1554 2364 595 -1544
1429 -1544 -1656 -123 936 810 204 14 -354 -1082 -1179 633 2326 1114 -1674 -2687 -370 2649 2356
1446 2356 -630 -2187 -1197 754 1483 496 -321 -300 -560 -836 -246 871 1566 101 -1799 -1971 505 2682
1464 2682 1727 -1218 -2802 -904 2012 2201 91 -1447 -715 248 321 -43 422 1011 -105 -1786 -1392
1481 -1392 1299 2366 725 -2061 -2363 55 2294 1709 -310 -1775 -1108 333 924 755 356 -68 -846
1498h46m09P62J857Q09k168k901O19L500J971k082l140k93K492J601r08j425J63
1515c98Q6O4l12M48J272Qj697j595O68K693J561j935l054m34K852K193j096k270
1533i46l83J173P01n14M8J023k92j958r35J359K754N47k896k493O95K879J993
1550B755j387k467j115J452J754M08o98r25m80k88L75J212J204o45k441j308J665
1567i29L084j49k100j762N33J539Q62n55k60j31p15m16M63J791P26j534k307n03
1585b363K271K576m18k938j771J490K491K99j441r71M48M49o43O8J338J120j676
1602C29k543n6K825K384j124l488j434K311L099L3k621j649R61J735J06r05l14
1619c51Q41k5j348k67J409J780p86k528j147J879K420P6k250j503O85J553M96
$$ plain form
1498 -846 -1255 -493 1364 2173 5 -2896 -2277 1223 3194 1112 -2028 -2321 171 1772 864 -561 -398
1515 -398 -312 -248 -560 -112 1160 1168 -529 -2124 -1456 1237 2798 863 -2191 -2625 227 2420 1324 -946
1533 -946 -1329 -156 545 31 79 1102 810 -1148 -2083 -724 2030 2577 -319 -2812 -2117 762 2755
1550 2755 1368 -1099 -2214 -762 992 1400 702 -223 -703 -991 -616 596 1800 1155 -1286 -2594 -929
1567 -929 2155 2006 -94 -1856 -1323 216 1078 523 263 132 -583 -999 -536 1255 1981 447 -1860 -2363
1585 -2363 -92 2484 2066 -872 -2643 -1153 1338 1637 196 -775 -327 122 -521 -453 885 2005 329
1602 329 -2214 -2270 555 2939 1815 -1673 -3107 -796 2303 2336 -285 -1934 -973 762 868 -37 -351
1619 -351 490 465 -883 -1150 259 2039 1253 -1275 -2422 -543 1877 1953 -297 -1800 -1115 438 934
1636I34p68k98k12J31l44K01J070L68o53j512k75J493J360m27j413q92N05J065
1654C33M13n17l44Ko92j17Q69J386k07j686j201R99J731M75j447r96K31J152L24
1673G08p64m54N63N74r76r59J043J487L9j705j513J149K395M07k071j759Q02J982
1691I48N63j506j267N37J466l9j358m93J492J104j271j907J84K418R24j322j931
1708a458m6J788J234p81j522k21J251M15n52p10M78P99m43j150QJ442O61q71j193
1727h71k29J171J043k48j319l70N26P54K78l37n42j36K3K92J34L03l91o44J25
1746d38N64K07k66k87O5K85J53n04k36N97O30n25j296lJ472P91n56j610l69J394
1766F8J201n90j200j80P85N35m48p13N72O30l2j228k67R98J216p27j538o20J639
$$ plain form
1636 934 166 -132 -344 -213 -557 -356 714 1082 429 -1083 -1358 135 1495 1068 -345 -1237 -732 333
1654 333 746 229 -115 -113 -805 -922 -53 1333 1126 -560 -1761 -762 969 1444 -3 -999 -768 384 708
1673 708 -56 -510 53 627 -349 -1308 -265 1222 1261 -444 -1957 -808 1587 1994 -77 -1836 -1034 948
1691 948 1511 5 -1262 -725 741 702 -656 -1149 343 1447 176 -1731 -1547 871 1795 473 -1458
1708 -1458 -1504 284 1518 737 -785 -1006 245 660 108 -602 -124 675 232 -918 -910 532 1193 322 -871
1727 -871 -1100 71 1114 866 -453 -823 -297 457 735 398 -144 -280 -257 35 169 472 81 -563 -438
1746 -438 126 333 67 -220 -155 130 283 -221 -457 140 770 245 -1051 -1054 418 1209 653 -957 -1326 68
1766 68 1269 679 -521 -701 84 619 171 -542 30 660 628 -600 -867 131 1347 620 -918 -1538 101
1785A01J676p33j943n83J181J582l20j592l85J002P87l59r43j93J215J06n71q60
1803h32K68J229M99j132r58J50J068N15n47q16j03P23Q3P2k26k4l6k18j31L91
1823b5P35j92n20n68J18O37N74m21o51k23K59L80M14j46o59l82J05R51L18j80
1843E24q16l47K86P63J29l16n04j18M23Q9j07lM72n01m66j74P38R58l64r11r18
1864a163Q52R79M07q13r05J87O41K66k28k38L6L7k86j51L82L92O5p17n74L08J064
1885E41N83p37j199j68J058J002o18p84l79L29M43L23nk33l79l94J46P49K81k82
1905B77n61l73J74P22N90l35r37n85P35Q90K8n76m57n5M99J14J07q2m35j31K7
1926c64M87L0QL4k98O3j15K45K71j95k92k03K33M13J3k11l95L0K27P0K21J58o23
$$ plain form
1785 101 1777 1044 -899 -1482 -301 1281 961 -631 -1016 -14 773 414 -529 -722 493 599 28 -832
1803 -832 -564 665 1164 32 -926 -776 292 807 260 -556 -659 64 147 219 -7 -31 -67 -285 -416 -25
1823 -25 710 518 -2 -570 -452 185 759 338 -313 -536 -277 103 517 371 -288 -670 -565 386 704 524
1843 524 -292 -639 -353 410 539 223 -281 -399 24 113 6 3 475 -26 -492 -666 72 1030 666 -245 -1163
1864 -1163 -311 668 1075 262 -643 -456 185 451 223 -15 21 58 -228 -379 3 395 460 -257 -831 -523 541
1885 541 1124 387 -812 -980 78 1080 462 -322 -701 -372 71 394 389 156 -223 -617 -471 278 559 277
1905 277 -284 -657 -483 239 829 494 -443 -1028 -293 597 625 49 -408 -463 36 150 257 175 -260 -391 -364
1926 -364 123 153 161 195 -103 -40 -155 90 361 166 -126 -329 -96 317 330 119 -276 -246 -19 51 272 430 -193
1949a93l05J90O64J82k25n20l18N14K86K00Pp46l60L84Q34J46o95n43rM19M78
1970C90j55k57m29K4N48M02j98o45k84M70M36P8k41k34l0n5K80J94k0l18j32j95
1992c71M95Q0k04J56k93K89k52J86P8k99J87j21M4J02o1k2K97l58l30q9O89L97
2014F00j88r50j64N64R30j93o82l64J00N97N36m15p23l25M56Q46j85n39j25oj1
2035b41J60K15K01k58n20k52N81P94r7n22o34J37P86K51j35q98p5L23M64o5l72
2056a57p3M81o1m04k18L19L88J5m90m27L32O20J65m59n85J54N90L64j86l80m76
2077d88J49L71M86k82n63o4L07K53K12k62m3m70l2M02N32k87k35k21o1J76L03
2098A83K60j07q17j44N15P35j45o65k56K86M79Q1k58l32k8J77R6l04K27Q7L72
$$ plain form
1949 -193 -498 -308 356 538 313 -207 -525 -11 275 475 482 -264 -624 -240 594 740 45 -498 -507 -88 390
1970 390 235 -22 -451 -427 121 523 325 -320 -604 -134 302 380 139 -95 -125 -180 100 294 274 -44 -176 -371
1992 -371 124 204 0 156 -137 152 -100 86 164 -135 52 -69 -25 77 16 -6 291 -67 -397 -486 203 600
2014 600 412 -538 -702 -138 792 599 -83 -447 -347 250 786 371 -352 -677 -221 625 440 -99 -224 -230 -241
2035 -241 -81 134 335 77 -443 -695 -114 680 583 61 -573 -436 350 601 466 -432 -507 -184 280 215 -157
2056 -157 -230 251 190 -214 -432 -113 275 290 -200 -627 -295 325 490 31 -554 -400 190 554 368 -12 -488
2077 -488 -339 32 518 236 -327 -391 -84 169 381 119 76 -394 -426 -24 508 221 -14 -235 -296 -120 183
2098 183 443 336 -481 -625 -110 625 480 -185 -441 -155 324 405 147 -185 -213 -36 60 -244 -17 70 442
2119D42l19o68K19P06L83n98r96N5O24Q64Q4j037n69M21R22J60p57m00L42J0j6
2140a28P3L66nm52l26P7N27M24Qo87q58L95J147M92q42q48j94J011L57p5m18k04
2162a60l08K30L88J81l83j64j30j37J31O14N24l69q18k50N21O66J75n37o57l77
2182h60Q52Q55np79p91Q3N65N61O6k83o47r5K69P00j56J29k62o36l16N03J143
2203H96L1r06j020J39J140P07k75o93p98K9R61N58j91p50l35R2L95O0L28J93n67
2224fp12M0R40N78j27p53o31m1R07Q02l25j088o04P45P86K42l29m81m63m4N24
2245d0O26q6l26n41q9K06M55O39m85o66o39M16Q62M82n44p16l50M58O57L65l15
2266C69p87j29N67K54K99l60k80q5k63L99M70J16n08n95j62O26M39K97m03o46
$$ plain form
2119 442 123 -545 -326 380 763 165 -831 -776 -152 712 796 -241 -810 -389 533 693 -64 -464 -122 -112 -128
2140 -128 -55 311 306 -146 -472 -395 132 556 564 -123 -981 -586 561 1053 211 -637 -831 180 537 462 44 -160
2162 -160 -468 -238 150 331 -52 -216 -346 -483 -352 262 786 417 -401 -651 -130 536 711 174 -483 -860
2182 -860 -8 847 842 63 -728 -645 -80 481 547 264 -383 -478 -209 491 335 464 202 -434 -750 -247 896
2203 896 927 21 -999 -860 280 987 712 19 -779 -750 211 769 578 -172 -507 -415 -20 40 368 561 -6
2224 -6 -718 -678 262 840 713 -40 -671 -712 195 997 672 -416 -1020 -275 511 753 424 -57 -520 -564 -40
2245 -40 586 500 174 -367 -456 -250 205 844 359 -307 -946 -530 332 814 270 -446 -796 -338 319 684 369
2266 369 -418 -547 20 274 573 213 -67 -152 -415 -16 454 570 62 -533 -695 -69 370 667 264 -382
2286c82m47O89N74J22m92l96m6Q8N71J13j87m21k19R0L30L28O3n10k91k06O66
2307C7M53r7l54l38k61L44M99J23k63m58m3K92N27k60k89j41j32J56J44L66o8
2328B37l55KJ23k5K47j8o1l91j41L11M66o2m85K9k84K45N71j08l73j20r3K55P1
2351D1J70P4l24l4l71M47K67n8l28l37K91L44Q9j89k60l9k9L41P4j10k46L9pN6
2375i9N1L10j31n94J17J87N36l15j92j3l8J62K06J29k00l06J50P3K25k50K86j46
2397A48l30r4L47K58j25l50m6L51K3m2j1l11K94j40q7j2J43J75j42j81k69M92
2419I1K36k04m86J10K01J38J4j3k21jK47P4l67K48o0J72l02n1L96J5j58j97m7
2442a65K71O3m8l78K15p8J62ok1J36j44q8J6p0K92j84O7j36K08N0j06k77k6K29
$$ plain form
2286 -382 -829 -140 434 556 64 -332 -378 -290 281 394 207 -214 -433 -343 -13 315 378 -132 -423 -629 37
2307 37 490 393 39 -299 -560 -216 283 406 143 -315 -358 -66 461 201 -88 -229 -361 -205 -61 305 237
2328 237 -118 -116 7 -18 229 211 150 -241 -382 -71 395 333 -152 -123 -407 -162 409 301 -72 -192 -285 -30 41
2351 41 211 285 -39 -73 -444 3 270 212 -116 -453 -162 182 271 82 -178 -217 -246 95 169 59 -187 -148 -155 -99
2375 -99 -48 262 131 -463 -346 -159 377 62 -130 -143 -181 -19 187 316 116 -190 -40 33 258 8 294 148
2397 148 -182 -276 71 329 204 -146 -192 159 182 140 129 -182 112 -28 -115 -127 16 191 49 -132 -401 91
2419 91 327 123 -363 -253 -52 86 100 87 -134 -135 112 186 -181 67 7 179 -123 -174 222 237 79 -118 -165
2442 -165 106 169 121 -257 -42 -120 42 36 15 151 7 -81 -65 -135 157 -27 40 -96 112 162 56 -221 -247 -18
2466a8J51k10o4q7K22J38k14j04L4M06L6l12l97K33L68J48l24j88J33R5J62k86
2488g8J44J10o5K48n17q1M18L0o1o34K50N99J5l84k77M5L69J36j99j39K21j18
2510C2L1p0m1K65K69l33l94o3L64L77q4n49K7J00L43j81J2l01Q6K7kM41j48l02
2534i4j94l9L79K18r1k32k35K33K13j37K03k49Kj02p1M5K40qq4k73Q1L37K58k99
2558A01k49k00M90K41k23j68N9k70K72j3J4NN3k33n5j22M23L97k65n25j57M55
2580C0K12Q3n64j37J53L65M6j37k25J80n8j0o2K70J70l07j97j14M39J93j16l16
2602a02j72P6M88P3l50j51n6K29P8k26K16j43p0Q0J3J19%j00m6L1m3J49J51k35
2626IJ8r1L4o5l8J08J99l70j92M93l8J06q9k90n3K94J04n2N6j48k4q6K54j31r3
$$ plain form
2466 -18 133 -77 -141 -228 -6 132 -82 -186 -152 254 290 -22 -419 -186 182 330 6 -182 -49 46 208 -78
2488 -78 66 176 111 359 -158 -239 179 209 148 -486 -236 363 378 -6 -283 -238 131 267 68 -71 150 32
2510 32 63 -7 -48 217 486 153 -241 -304 60 437 353 -196 -169 -69 274 93 105 -196 -110 -83 -85 356 208 -94
2534 -94 -288 -327 52 270 179 -53 -288 -55 158 21 224 -25 -23 -125 -196 -151 89 81 -3 -276 -195 142 400 101
2558 101 -148 -348 142 383 160 -8 51 -219 53 40 54 59 112 -121 -176 -298 125 522 257 -268 -425 30
2580 30 242 325 -239 -376 -223 142 188 51 -174 6 -52 -62 -124 146 316 9 -188 -302 137 330 214 -102
2602 -102 -274 -198 290 363 13 -138 -194 35 113 -113 103 -40 -110 -30 -17 102 102 2 -44 -13 -56 93 244 9
2626 9 27 -64 -30 -95 -133 -25 174 -196 -388 105 67 173 84 -206 -259 35 139 87 143 -5 -29 -115 139 8 -85
2651h5j55J47o3L15L6p7l16m2K63J08o4j95k34K56L25m3l5j27l2J0J66k30mKM6
2676b8kOk2j29K11n8J04r1l0J50N9j69J35Rj92k5KL60Q9k93m13J92N4M39n50O5
2702a27k8K38M4J90k27k55kK35J45k52J62k34%J91M8j78J58q1J33n2j19j17J00
2725b8J55o1L9j58j33R4K7L27q6l10j78J18N64lm10l34J08K13M05J4p45o6M79
2748C1K87p3k75j31P0K36O8j75p9Kj62J27K41L9k47o5N4J06j73K81k54p1M7J62
2772D6J16m00K00R4J39j42m67K45J67K61L5m63q0r8N42R3o6k18m30J18M79O2P0
2795C03m02k70M8M74L05l35l24k35M05M32k05l40j94K31J99K3k24J87q3J45l86
2816b46j55L58K28R1m54j37J40L06Q0j60j78k22K11K51j09R7N5l3l97m6M21N03
$$ plain form
2651 -85 -240 -93 -156 159 195 118 -198 -240 23 131 67 -128 -362 -106 219 176 141 14 -18 -8 158 -72 -76 -74 -28
2676 -28 -30 -24 -46 -175 36 -22 82 -9 -39 111 170 1 136 145 -47 -72 -70 290 379 86 -327 -135 -81 358 -192 -127
2702 -127 -155 83 127 317 90 -165 -167 68 213 -39 123 -111 -111 80 128 -50 108 27 160 108 -11 -128 -28
2725 -28 127 66 105 -53 -186 -92 -65 262 176 -134 -312 -194 370 367 -43 -377 -269 -56 349 363 -382 -448 31
2748 31 318 245 -30 -161 -91 145 213 38 -41 -39 -201 -74 167 206 -41 -106 -52 54 -119 162 -92 -163 -116 46
2772 46 162 -238 -38 56 195 53 -414 -169 -2 259 294 -169 -249 -347 195 288 222 4 -426 -308 171 233 303
2795 303 -99 -369 -321 153 458 123 -201 -436 -31 401 196 -144 -338 -107 92 115 -109 78 -5 140 -246
2816 -246 -401 -43 185 276 -178 -315 -175 131 211 51 -127 -349 -138 113 4 101 156 123 -274 -320 101 604
2838F04p2p98l12L18R78O0r18l25k6N60M16j37l97l35M7L73J12j1K3l43o4n3L39
2861C9J69R2m48j44Q6L33K38j55l37l7M3P4K22N6j27j53k72o0M46L07k65l49j62
2884d04L36J75L8k00J68j98q3L02M6L23m38l74j99L68N52L8m92o23J75P76J74
2905D60l08m26K27K27j00p9m1O5J0k11j72J36N79n5k73m26j8N78J90k54n21L2
2927c80L73L62k61j64k33L99j32r9K68q0K9l5m43K53K50J95k42l57JR7M13q7j04
2950B3l69K73K58k3j3r4J73l27k01K41K75K26m84k66J91K08Q8q7k71m4J10K03
2972I0k30L56k5k15k47R1L53K8j13k48K4L12J87k76j35j21J16K26J8j84r1K35
2994A51m3k81k35L65L49r2l33k25L39K79o3k51j72J97J41r7k00o9K43J78j64q1
$$ plain form
2838 604 532 -266 -578 -260 718 778 -140 -465 -491 69 485 348 -49 -384 -337 36 148 137 160 -183 -247 -300 39
2861 39 208 300 -148 -292 -206 127 365 210 -127 -164 -121 -47 175 231 104 -49 -321 -381 65 372 107 -242 -404
2884 -404 -68 107 145 -55 113 -85 -168 134 180 503 65 -309 -508 -140 412 450 -42 -665 -490 286 460
2905 460 152 -274 -47 180 80 1 -40 25 35 -176 -348 -212 367 312 39 -387 -405 173 363 109 -412 -380
2927 -380 -7 355 94 -70 -303 96 -36 -135 133 53 82 47 -396 -143 107 302 60 -297 -296 -199 214 127 23
2950 23 -346 -73 185 162 149 55 228 -99 -300 -59 216 442 -42 -308 -117 91 179 92 -179 -223 -113 90
2972 90 -140 216 191 -24 -271 -180 173 201 88 -160 -136 176 363 87 -48 -169 -53 173 191 7 -84 151
2994 151 108 -173 -408 -43 306 214 -119 -344 -5 274 211 -40 -212 -15 126 29 -171 -240 3 181 17 -64
3016f4k0K93R1n09j83L96L13R1o82j62J91N88J63m34l38J46K15R5r0j36LJ48j13
3039Bm1J84K6j39k60R0J05K55j35l30J13K09l5J18k91Q8o7K22j34j94K75L5m2
3062E4j05j35L39l0j28r2m2J11J17O5k44J93p4j03m5K22J77M0n95r8N95K0P7k56
3086F3l08Q5L70K79k85o64O9O03j51K17m49J79Q0J10l26P1L61p2k63p4j74L79
3108A00K10l6l76N7l2L33j50k76K70K9ok47R5M14kl44m26J16K35K84n3l13j22
3131b40J80O6M4pM3k54Q8J45j06J88l5k32q8J57J96K2j58k01J60J86j30m1n7K40
3155A66j50j38pR2J61j19M2j51l0J36K33k54Q6j26J95k0j10n8J87lk91O7J51J98
3179B57k00j79lJ31J80Ok89j36J48K64p2j28j54K39Q4k10jn6J50L3j22j93Q8M14
$$ plain form
3016 -64 -84 209 300 -209 -392 4 317 408 -274 -436 -245 343 506 72 -266 -120 95 190 100 -36 -33 115 2
3039 2 -39 145 171 32 -228 -138 -33 222 87 -243 -130 79 44 162 -129 -41 -108 114 -20 -214 61 96 54
3062 54 -51 -186 153 123 -5 -97 -139 -28 89 154 -90 103 29 -74 -119 103 280 320 -275 -373 222 242 319 63
3086 63 -245 -160 210 489 204 -460 -391 212 61 278 -171 8 88 198 -128 -57 304 232 -31 -105 -279 100
3108 100 310 274 -102 -45 -77 256 106 -170 100 129 123 -124 -29 385 383 39 -387 -271 -36 248 195 -118 -240
3131 -240 -60 6 50 43 86 -168 -80 65 -41 147 112 -120 -208 -51 145 167 9 -192 -32 154 24 -17 -74 166
3155 166 16 -122 -129 -37 124 5 47 -104 -134 2 235 -19 67 -59 136 116 6 -52 135 132 -159 -92 59 257
3179 257 57 -122 -125 6 186 192 -97 -233 -85 179 107 -21 -175 64 148 -62 -63 -119 31 64 -58 -251 -163 251
3203B51nk22l3j76L26k5j48QQ7N5K4k42J04O1J48k58J5L2j3P0j60q7K15O7o0r4
3229f0k9L4J11ql50L59j03J25k30M5J50nO2k84MK51J47k26q5O5L8nM4l7m2O7P
3256D5o7n5L66k05l4m0j37L8K99j56j60k4J86J3Rj28Q9J17q6j01l8N5J21j36q8
3281a17m8J08J56kk42l4J50J97k42N6N5K3j33K03k87K13j5k5r5J07J65j77J64
3304A80k76Q6J06n6q7K51j96Q4j89L1Q2m0Q1NN9r7n4J50Qj56R8O5N6k24J19p4
3330A2J66k47PJ7M0J84l02K59j28K7J69j15r0j46K17N9k16M9o8J28o5J7L2P8r2
3355hK34j34j29J12J34j35k62J57p9J86j63K2j7J16o6n5K35q3J43l42R3J82j52
3378a1r0l0j18L22p6J26j55l8l7J26K2n4j38K74q2lj18R0L8q7J00m8l3l1K26k1
$$ plain form
3203 251 246 24 -9 -185 141 116 -32 -24 63 118 142 -100 4 65 213 -45 -30 2 -11 59 -101 -188 27 94 34 -60
3229 -60 -89 -55 56 48 -302 57 -46 79 -151 -106 44 39 101 -183 -179 72 219 -7 -92 -27 11 6 50 13 -29 38 45
3256 45 -22 -77 289 84 50 10 -127 -89 210 54 -106 -130 56 69 78 -50 39 156 70 -31 -69 -14 107 -29 -117
3281 -117 -165 -57 99 97 -145 -179 -29 168 -74 -18 37 60 -73 130 -157 56 41 16 -79 28 193 16 180
3304 180 -96 -10 96 40 -47 204 8 92 -97 -66 16 -24 57 62 121 24 -30 120 128 -28 70 135 191 -33 86 12
3330 12 178 -69 -62 -45 -5 179 -123 136 8 35 204 89 -1 -147 70 129 -87 -38 -106 22 -43 -26 6 84 -8
3355 -8 226 92 -37 75 209 74 -188 -31 -110 76 -87 -65 -82 34 -32 -87 148 65 208 -134 -41 141 -11
3378 -11 -101 -131 -249 73 -3 123 -32 -70 -107 19 41 -13 -151 123 41 38 -80 10 48 -39 61 13 -20 -51 175 154
3404A54k36K07j47j6j9m7Q2o7K82l00L2J55k0j75J25lq7Q1KK1j4K6oJ22j9j38
3430eq5k4K18J6m8j01K2r5M5J08j7j2k42J18R1M5l9K6r5J74o4J1p2K3l1j16J26
3457b3J05j54K12j73k18R9L2J55O7k8j46o1P9J57o0m9k04K0J67K14j11p3p5J45
3481G7j28LJ24m5k19L4O6o7L03k23J43k27J55J33j50j6L5j40R9L5K3J58r2k22
3505a41j14L27L2K8%k63j36K12J17J13j00j40L2J62j60j0J30m9r2n2K12j06L6
3528C8j36M3k47K62K02K5j19o1N4k81J71R0Q8j88j2J01l5P2J07k89j57K05o2K90
3552A61l1o8j75N0N5J55J9m8k64O0l1K37R9l67RK9M2J81p7L3j87M7J11L4R1j64
3578AQ1k46K47j11K94j89j05J57k22m8K67l1l4j11j24L56j60l8j24O9M8L19j53
$$ plain form
3404 154 -82 125 -22 -38 -57 -104 -22 -89 193 -107 -75 80 60 -115 10 7 -80 1 3 24 10 36 30 152 133 -5
3430 -5 -90 -114 104 120 72 -29 -7 -102 -57 51 34 22 -220 -102 -11 34 -5 21 -74 100 36 47 -25 -2 -33 -149 -23
3457 -23 82 -72 140 -33 -251 -152 -120 35 102 74 -72 -133 -54 103 43 -6 -210 -190 -23 191 80 7 -68 77
3481 77 -51 -48 76 31 -188 -154 -88 -155 148 -75 68 -159 -4 129 -21 -37 -2 -142 -43 -8 15 173 81 -141
3505 -141 -255 72 104 132 132 -131 -267 -55 62 175 75 -65 -33 129 -31 -41 89 40 -52 -104 108 2 38
3528 38 -98 -55 -302 -40 162 187 68 7 61 -220 -49 41 129 -59 -71 30 -5 67 174 -115 -272 -67 -129 161
3552 161 130 62 -113 -63 -8 147 166 118 -146 -86 -117 120 219 -148 -139 -110 -68 113 36 69 -118 -71 40 74 165 1
3578 1 82 -164 83 -28 266 77 -28 129 -93 -141 126 95 61 -50 -174 182 22 -16 -140 -71 -23 296 143
3601A43J3j7n8j51q3K73j8m6j67J85l12L99j05m8j60L8N9J92q5k30K35q7o0J07
3625A7P2%Mk90J80JJ82j58m9O9k44J50J45K9J0l58j57K53K89o4J49k99J6KR4R1
3651A34j18J9j20J02mo7K45k52Q2j31j15K34J06n9q8j40K18N9J4N7k36m3J6J60
3675G3NN5j70o0M2P1P5l6j26l5j11L35k%o1k08K8R1J95O2l02n6P1J99l8k05j4
3702a22p0P5J27OJ38j25j52l5N4J10J89j54J12l72J06L02n6q1J8j30M0P1j5N9
3726I5j66p1J43P7L9J66l14p0o6K09J51p4j55p4j12K36J62J30k79m1m3l9K55p9
3750H0q7J4j11O1JK30k66R0j38J44k2K19r0l1J25l12l6K10J49l54N5j09O4J79
3774F5J25j29j31j66J83K06q7Q3l83J45l5J64R9r5n4r6O8J43K22j16k57l7q7J82
$$ plain form
3601 143 156 139 81 -70 -153 120 102 56 -111 74 -238 161 56 8 -152 -114 -55 137 52 -178 57 -30 -90 17
3625 17 89 89 93 -197 -17 -16 166 8 -41 28 -216 -66 79 108 118 -240 -397 -144 145 81 230 -69 -53 -51 43 134
3651 134 16 35 -85 17 13 -54 191 -61 21 -110 -225 9 115 56 -32 -172 46 105 119 176 -60 -103 -87 73
3675 73 78 133 -37 -97 -55 16 91 55 -71 -106 -217 118 116 116 55 -153 -125 -34 161 223 -79 -135 -64 135 97 -108 -122
3702 -122 -192 -117 10 16 154 29 -123 -158 -104 6 195 41 153 -219 -113 189 133 52 70 -60 -20 51 36 95
3726 95 -71 -142 1 78 117 283 -31 -101 -167 42 193 119 -36 -110 -222 14 176 306 27 -14 -57 -96 159 80
3750 80 -7 7 -104 -43 -42 188 -78 12 -126 18 -4 215 125 94 219 -93 -129 81 230 -124 -69 -178 -114 65
3774 65 190 61 -70 -236 -53 153 66 149 -234 -89 -124 40 139 44 -10 -106 -38 105 327 211 -46 -83 -170 12
3798A2J42j28k11K8J19Q2K22j71p4O1j74J5O9r6J05k8j79%J64K11l1j24k32J45
3822g3K53o5q8o4j40R3R4J98j51Jj48P1J6%K20k28j08J0%J04j26L2J92j80j2J85
3848H6L5j20%j37K05o4J38P6k46P3j90J84N0o4P5p7J1j27O5K08j93o9L0J0J7O5
3874D1J15j68k0k1O4J84j94j6j58J70K00k85J47n6j03qK4q5M1l0J11J33j12K23
3898A97k09j51J82j39J82k7o6o2M6K20j27q4Q4O9j11m4j2J50l10K22l0m8L0L9
3922Al0j1K69l28QJ1R8Mp6R0o6j3J23O7j04p2j8M0J45q8nj52Q4K3R8j56R7pr2
3951f0j26K63kk5j75Q3q0L35k39K9J21k80J33j17K17l2K7K1j37k9L2J42k64K81
3975A18k51J90q5K19j7k60N2j17K51O4k56O3p0J18j67M1P0K16n6j07JL7k7j27
$$ plain form
3798 12 154 26 -185 -157 -38 44 266 95 21 82 -92 -77 -8 -104 1 -27 -206 -206 -42 169 138 14 -218 -73
3822 -73 180 115 27 -37 -177 -84 10 208 57 58 -90 -19 -3 -3 217 -11 -119 -109 -109 -5 -131 -99 93 -87 -99 86
3848 86 121 1 1 -136 69 5 143 219 -27 46 -144 40 90 26 101 24 35 -92 -27 181 -12 -81 -51 -41 -24 41
3874 41 156 -12 -32 -53 11 195 1 -15 -173 -3 197 -88 59 3 -100 -108 -84 -169 -128 -158 -47 86 -26 197
3898 197 -12 -163 19 -120 62 35 -31 -93 -47 173 46 -38 46 115 4 -40 -52 98 -212 10 -20 -68 -38 1
3922 1 -29 -40 229 -99 -91 -80 18 22 -54 36 -30 -43 80 147 43 -29 -47 -7 138 50 45 -107 -23 0 98 -58 39 32 -60
3951 -60 -186 77 75 50 -125 -42 -122 213 -26 3 124 -156 -23 -140 77 45 72 93 -44 -73 -41 101 -163 118
3975 118 -133 57 -28 191 174 -86 -34 -151 100 164 -92 -29 -99 19 -148 -107 -37 179 123 16 17 54 27 -100
3999a00M0K1J15o0j56J43o9P1j24J48ko5R1p7J18j48lM9J40r1J7m8N2Nk15L06
4025A58L0j65j20O0nP1K3k71O3J52P7j06qo5J88j23j5J13O2J1j26j56J66K9p2
4050b9l2n2N9l7J50j24Jm0N6J44j45LJ86L2j24k02J40q4J08n2m6kJ28j1k81L17
4076F3j11M6r1o4K17n9J3J02j80l8J20J60k35j29K6L65j10j44O6j28R9j01J59
4099D6M7j76N7k10M04j28J33j72j1o1m3J86M5P9l80J92l1J40n9K0O7l30M5%K65
4124A25j9j36M7o5K02j87O2j88q6K66J47o7j01K08k39j41L96j26Mk01J06o3QN0
4148BN0N8j71Q4j74J57p5J54j43m4qK01K28m47K05j9j56J01J19r5n6r3K43rJ4
4173A26m4l3k08jJ52J57p9j18J51j38L7o8J34N2j99Q7p9K09K3j54L8l06J16J28
$$ plain form
3999 -100 -60 -39 76 16 -140 3 -66 5 -119 29 27 -38 53 -24 94 -54 -57 -8 132 41 58 10 62 67 -148 158
4025 158 188 23 -97 -37 -42 29 52 -219 -156 -4 73 -33 -41 -106 82 -41 -56 57 119 130 4 -152 14 43 -29
4050 -29 -61 -113 -54 -91 59 -65 -64 -104 -48 96 -49 -46 140 172 48 -154 -14 -98 10 -42 -88 -90 38 27 -254 63
4076 63 -48 -2 -93 -157 60 1 14 116 -64 -102 18 178 -57 -186 -160 205 95 -49 17 -111 -12 -113 46
4099 46 93 -83 -26 -236 168 40 173 1 -10 -71 -114 72 117 196 -184 8 -23 117 58 78 145 -185 -140 -140 125
4124 125 106 -30 17 -48 154 -33 29 -159 -245 21 168 101 0 208 -31 -172 224 98 102 -99 7 -56 -48 2
4148 2 52 110 -61 23 -151 6 -69 85 -58 -102 -110 91 319 -128 77 58 -98 3 122 27 -29 -122 121 112 126
4173 126 82 49 -159 -160 -8 149 70 -48 103 -35 2 -66 68 120 -79 8 -71 138 161 7 45 -261 -145 -17
4197a7o7J72j27J32o3O3r1N2j52N3k3k8J33O3l4j55j25J60R1J78k03m1j12J39
4221bK18k39O1q2j10K62j0j36J34m4j12Q0j96J55J36j62K5J24j95J82j2j02l8
4244f3o5J22J06j05J27j7k00L51j90J19m1k33O8m5N0q9J32k3j64J29M7j01K05
4267A20p6j49K4O0J89K5l1qk45J05l3J04j50P7k59K65o9J60n4J3j35jJ22j06J8
4292c4Q6q3j09M6J07R2k60l5J05K25j40N2j12R3j50K04j17LN8l0L1j33K82r5q8
4317bl5P9p1J01N2j57j69j3K10O4L3k53K57N1p4j24J14J60j95j22R9j59J81j36
4341a09K1R6j74J63M5K24l54j89J00J34m5J48P2j88j14J82J07j07o5L7r9J30L51
4364C66k72J1j50q4K44mk38L4J65P3k19l7K1L06k13Q2k82J32J2J35j68K13q9k1
$$ plain form
4197 -17 -84 88 -39 93 30 93 2 54 -98 -45 -68 -96 37 100 66 -89 -214 -54 37 215 12 -29 -141 -2
4221 -2 216 -23 38 -44 -154 108 98 -38 96 52 -60 20 -176 -21 115 -47 -22 102 -93 89 77 -25 -63
4244 -63 -128 -6 100 -5 122 105 -95 256 66 185 144 -89 -21 -66 -16 -105 27 4 -160 -31 16 -85 120
4267 120 44 -105 -81 -21 168 193 162 154 -91 14 -19 85 -65 12 -247 18 -51 109 55 68 -67 -68 54 -52 -34
4292 -34 52 -31 -140 -94 13 105 -155 -190 -85 140 0 52 -60 33 -117 87 -30 -27 31 1 32 -101 181 86 -2
4317 -2 -37 42 -29 72 124 -33 -202 -215 -5 59 92 -161 96 147 73 -51 63 223 28 -94 5 -154 27 -109
4341 -109 -88 8 -166 -3 42 266 -88 -277 -177 -43 -88 60 132 -56 -170 12 119 12 -53 -16 -115 15 366
4364 366 94 105 -45 -129 115 111 -127 -93 72 145 -74 -111 -90 216 3 85 -197 -65 -53 82 -86 127 38 17
4388A7j55K1K54p4M3k32J26N5K8o6k27J03J44J73q3p2k76L2P9J97J1o2J%l7O7
4414F7j1o3R2j15k1J6M3j45K07P7j32J94k90R3j7N1m1r5J97j00J39r2l4j78J27
4439c1m6K11k36Q7j23J20O6J27j78M1k63L14m2J50k55r1Q5J86N8pk07r2Q5J66
4463A25J26j01j02j81K13j82L4j4M5j4J23k68J82Q8j02J47j02P9j23mj03K18l4
4486E0%j7k12L02J08l22J37k48K73N9q9j30n2nL29M5j47n7j66L56k49j05L20l38
4510a58K3J65j26L5J13L6j64oK20k60K50k93L0JR4P6o8j03K34j28R8j04M7nj37
4535a30Q3j29K0K11Op0O1j42J29j25K09j25q2M1J19P0K0j90o2M0J51q4J72j29
4559F4j94J20J3R0nq5j64l5K80j72R5J57k77P6M6K0m3n3j49K69l8q2kq4K9Q4J12
$$ plain form
4388 17 -138 -117 137 63 106 -126 0 55 83 17 -210 -107 37 210 127 55 -221 -189 -110 87 98 36 37 37 0 67
4414 67 56 -7 85 -30 -51 -35 8 -137 70 147 15 209 -81 12 -5 46 5 -90 107 7 146 54 20 -158 -31
4439 -31 -77 134 -102 -15 -138 -18 48 175 -3 38 -225 89 47 197 -58 -149 -64 122 180 173 -34 -126 -41 125
4463 125 251 150 48 -133 80 -102 -68 -82 -37 -51 72 -196 -14 74 -28 119 17 96 -27 -31 -134 84 50
4486 50 50 33 -179 123 231 -91 46 -202 71 130 41 -89 -141 -146 183 228 81 24 -142 214 -35 -140 180 -158
4510 -158 -135 30 -96 -61 52 88 -76 -82 138 -122 128 -165 -135 -134 -40 36 -32 -135 99 -29 69 -35 12 7 -130
4535 -130 -47 -176 -156 55 61 -9 52 -90 39 -86 123 -2 -84 -43 76 146 166 -24 -86 -46 105 21 193 64
4559 64 -130 -10 3 93 88 3 -161 -196 84 -88 7 164 -113 -37 9 29 -14 -67 -216 53 15 -67 -69 -153 -124 -40 72
4586G2k9qK9N3O7j9J22j93j65L33j92k54K46j49L48k60k3k02K87k8O1j22qJ5N1
4611C2L5j03N5r8j01R1J75j67L2Pn2M2O3O4O4j49j20J31Q6N4k33pN1j35J43r9
4637a39QK09r0R9q0l2J02j50Q5rL6P7j56Q3P4j46n2J36j13R2l9k83M4K65J37j99
4663d1j5M7r5J78j56O3k7J32j16J52k65Q2j36J92j7J5K7q1K44j71k41K86m1M2
4687E8J79l45J54O6qL3k0k33J21K2n9J26j77P9jO1j58P5L2j2j21L37k16J71k80
4712a16J53KM2r0j51J11J28q8j6o3K5K34k99J06j57K14q1J07r0m9J4J48l4n3L4
4737C1l2j24K57j04J0O9j29l3j42J03J72l16J93j21K16j9p1L1J18j54J55r8o2
4760e0K6j78K26o3l9k2J19o2j74J98p4l3om2K56O6Qj18P7j1j48j2J13k63J76M5
$$ plain form
4586 72 43 35 64 117 184 165 287 94 -71 262 70 -184 62 -87 261 1 -22 -224 63 35 96 -26 -34 -19 32
4611 32 67 -36 19 -79 -180 -89 86 -81 -49 -42 -94 -52 11 75 139 -10 -130 1 87 141 -92 -99 -48 -183 -40 -139
4637 -139 -131 78 -12 87 7 -25 77 -73 12 3 39 116 -40 43 117 -29 -81 55 -58 34 -5 -288 -244 21 158 -41
4663 -41 -56 -9 -104 74 -82 -19 -46 86 -30 122 -143 -61 -197 -5 -22 -7 20 -61 183 12 -229 57 16 58
4687 58 237 -108 46 112 104 137 117 -116 5 27 -32 94 -83 -4 -5 56 -102 -27 5 -7 -128 209 -7 164 -116
4712 -116 37 39 81 -9 -160 -49 79 -9 -25 -88 -63 171 -128 -22 -179 35 -46 61 -29 -78 -64 84 50 -3 31
4737 31 -1 -125 132 28 38 107 -22 -55 -197 -94 78 -238 -45 -166 50 31 -40 -9 109 -45 110 12 -50
4760 -50 -24 -202 24 -39 -78 -100 19 -43 -217 -19 -93 -126 -132 -174 82 148 156 38 115 104 -44 -56 57 -206 -30 15
4786A5Oqp9R4J3n3K6P1j75P5J0O9R0k53NK0K0M7j62K37jj22L9l5J7J28J60j44
4814A10j85l6O6J87M6m2j30q5J43M5J8j67J52p2m4j0K07r0p4l9J34p0k35J91n4
4839c4m6P7p4K33k35N5O9p5OR0j8k03K66j50O0L1m7J86r7k18L5J09n8L0J29p4
4865D7j77K98j93o8K23j79K0M6j46Q8P8j3J13j87j40J56K6j5J08j01O2l3K8o8
4889b7R3j1r3p9j10K12J51r0j11J1O8O9p7k9K8j62m3J45J15j65K01l01K27l6M8
4914C4M9o3k37K58jj47J65j12J7N9p2J75p2ro5p1OJ75N2k35R0j93K41M2J05j63
4940B8p2Jo5J22M8N4j78o1J12q2J95j13N4K0j29Q7L8MP4j94R7j3MK3p2o9J49j78
4968a16K44k06L53j74j67n7R4J58j02r8LJ48M0K9k30R1K0p6l4J17j66J78jq0J30
$$ plain form
4786 15 21 13 -66 28 41 -12 14 85 -90 -15 -5 64 154 -99 -94 -74 -54 -7 -169 68 67 -55 -16 -51 -34 94 254 110
4814 110 -75 -111 -45 142 188 146 16 -69 74 119 137 -30 122 50 6 -4 203 113 39 0 134 64 -171 20 -34
4839 -34 -80 -3 -77 156 -79 -24 45 -30 -24 66 48 -155 111 -39 21 52 5 191 94 -124 -89 20 -38 -8 121 47
4865 47 -130 168 -25 -93 130 -49 -29 17 -129 -41 37 24 137 -50 -190 -34 -8 -23 85 -16 46 13 41 -27
4889 -27 66 55 -38 -117 -227 -15 136 46 -65 -54 14 83 6 -23 5 -157 -200 -55 60 -105 96 -205 22 -14 34
4914 34 83 20 -217 41 40 -107 58 -54 -37 22 -50 125 53 44 -21 -92 -86 89 141 -94 -4 -197 44 86 191 28
4940 28 -44 -43 -108 14 62 116 -62 -123 -11 -93 102 -11 43 63 -66 21 59 63 137 -57 40 27 31 54 -18 -87 62 -116
4968 -116 128 -78 275 101 -66 -123 -29 129 27 -71 -68 80 120 149 -81 10 30 -46 -80 37 -129 49 48 -32 98
4993I8j40k0J83k22J42k7p6K3J3j85J15k1K40j15m5J43N9j72q1rOO6Rj36P3LO
5020g0J93j33r9K46j88O4j27K89r8m5J9q0J5O3o5l4J01K8kj05Q5R1l9j85J39J7
5046H0L4k47oK39k6Nj46k2J27j50O1L4L6Q8j57K42k15Q7m3J6j6P7k58K71l7k19
5072a45L59k05j07j9J27l8o3J53r5J71N1k12L6k9m7R9N3j07R7l0m2J32k5m3o3
5097HM8M4M1Mj36r0N3j6M9J41k51K0L0J99l6l8j40K8k7m5n8J49J77k58L6k7J35
5124D0K8j71Q7q2qP0K88j43p6o9J01j21R4J5n2j64J90q9m4R0J50l88K01R4M5k8
5150E8L7k30P8J51j81J23j70J03J22q9m1J49o8r0M4m8j49K72ppj11J42j16%J02
5175G4j11l9n1OJ88m1m2J04k16J27PJ94p2k27J06J1k4o1K04l47J61K33j31O4j20
$$ plain form
4993 98 -42 -62 121 -101 41 14 -62 -39 -26 -211 -96 -117 123 8 -37 106 165 -7 -88 -97 -91 -25 -16 -152 -79 -76 -70
5020 -70 123 -10 -109 137 -51 13 -114 175 77 32 51 -29 -14 49 -16 -50 51 79 77 -28 57 148 109 -76 63 80
5046 80 114 -133 -139 100 74 79 -67 -89 38 -112 -51 -17 19 107 -50 192 -23 64 21 37 21 98 -160 111 74 -145
5072 -145 214 9 -98 -117 10 -28 -91 62 -33 138 189 -23 13 -16 -63 36 89 -18 79 49 7 139 114 71 8
5097 8 56 100 141 145 9 -81 -28 -44 5 146 -105 -85 -55 144 108 70 -70 -42 -69 -114 -172 -23 154 -104 -68 -95 40
5124 40 68 -103 -16 -98 -106 -36 252 109 33 -36 65 -56 38 53 1 -163 27 -62 -106 -16 134 -254 -53 41 86 58
5150 58 95 -135 -57 94 -87 36 -134 -31 91 2 -39 110 42 -48 -4 -52 -201 71 64 57 -54 88 -28 -28 74
5175 74 -37 -76 -127 -121 67 26 -16 88 -128 -1 6 200 128 -99 7 18 -6 -67 137 -210 -49 184 53 117 -3
5200cK5Nm2kJ09j12NkJ2M5j6l3N0j26J25j20J99j38q7j12K69j20kJ9p1K66k98
5227a55L68k05O6L3p5k0PN4oK7j33Q2j37J07l0rKm2kJ74J03n6k12m4K8J87k2j42
5255e2j1k4k5J5M1J28l6j21J95l8J0K8q8r5J18k9J10j45j99K7K25m8J57L3j38
5280C8j38Q4k5L7k9k4J73j4k82J7R5o6L44k89pK6R5Pm1P0%p7N2o9J6%O0j09J77
5309A21k3j89J13m3o1j1J10mM0jk02L15q8M9k76N2P9n6K47r7m2M3L3n2M7j53J18
5336F9O4k84J87j8q1Q7k6j7j42J10J63J35k34o9o5K38q1p0o6o7J1K11j25j8M2
5361d6M9L8O6j80M3O6K1j98l4J93j56K10j0j49L5J24J87k86q2q2K52m1p3K3JQ2
5387E3j5o0J80j60jJ02j15j38K37N0j74L3j1J26j61J12r8m8L0R2j70R4RJ19k6
$$ plain form
5200 -3 22 27 -15 -17 92 -20 -15 -17 -5 40 24 -9 41 -85 40 -80 119 -19 -106 -218 51 -69 -71 -52 -123 143 -155
5227 -155 213 8 74 107 32 12 19 73 67 94 -39 43 -94 13 -17 -26 -24 -66 -68 106 209 153 -59 -103 -75 112 90 -52
5255 -52 -63 -87 -112 -97 -56 72 36 -85 110 72 82 110 22 -73 45 16 126 -19 -218 -191 34 -14 143 176 38
5280 38 -100 -16 -41 -4 -33 -57 116 102 -180 -163 -68 -134 210 -79 -86 -60 35 42 1 71 71 -6 46 -23 -7 -7 53 -56 121
5309 121 98 -91 22 -21 -82 -93 17 13 53 52 -150 165 77 126 -150 -98 -19 -75 172 75 33 76 109 57 104 -49 69
5336 69 133 -151 36 18 -63 24 -2 -19 -161 -51 112 247 13 -56 -121 117 36 -34 -100 -167 -156 55 -70 -88 -46
5361 -46 3 41 107 -73 -30 36 57 -141 -175 18 -138 72 62 -87 -52 72 259 -27 -109 -191 61 20 -53 -30 -29 53
5387 53 38 -22 158 -2 -3 99 -16 -154 83 133 -41 -8 -19 107 -54 58 -40 -88 -58 34 -136 -42 -33 86 60
5412F0J1j88O1J2K9J83j78j15M7J09N8j02j77K40R1Q5l23m5Q9J82k72K44j84R3
5436A0K22k74k1K14j95n3J30q1q2QJ30J53k66J04O0n9J08j90l4K8M4K48m16M6
5460a66K14J70k23j08PK24N0j45l5Pj2K01j75oN8Q2Qr8q4l5K60j20m4l9o5R9K4
5487D9r2j02J22j2M6p2J3n9K39j52M4J17k85RL5R3j27K00k7j02K0ql1J60m2o6
5513c0J07q5q0J68km7j44p5J46n2J22j04L9J77l64K34o5J11o6K12l69j13K83J08
5537A11j12j4N4j0J2P2j33j50K25J03l69K92j39N0O1m8M6k62J66N3k9Q2k13J87
5561C5j14J56p9k0J45j28J03o2k41J10P3JR4j12N0J80P9j46j23J26k7n1m9k3P7
5586E4J9n2J3l2k7j6r3L1J24l7J88k30r1L8K97M1j20r3k6J72j62J5J15j27o8k6
$$ plain form
5412 60 71 -117 -56 -44 -15 168 -10 -125 -78 31 89 -13 -190 50 141 226 -97 -142 -53 129 -143 101 -83 10
5436 10 232 -42 -63 151 -44 -97 33 -48 -130 -122 8 161 -105 -1 59 0 108 -82 -116 -88 -44 204 -212 -166
5460 -166 48 218 -5 -113 -106 118 168 23 -12 -5 -17 184 9 3 61 143 151 53 -31 -66 194 74 30 -9 -74 25 49
5487 49 -43 -145 -23 -35 11 -61 -48 -107 132 -20 24 141 -144 -135 -100 -7 -134 66 39 -63 -43 -51 -82 78 36 -30
5513 -30 77 -8 -88 80 78 31 -113 -188 -42 -94 28 -76 -37 140 -224 10 -55 56 -10 202 -167 -280 3 111
5537 111 -1 -15 39 29 41 113 -20 -170 55 158 -211 81 -58 -8 53 5 51 -211 -45 8 -21 61 -152 35
5561 35 -79 77 -2 -22 123 -5 98 36 -205 -95 -22 -21 73 -39 11 191 270 124 1 127 100 49 0 -23 54
5586 54 73 21 34 2 -25 -41 -134 -103 21 -16 172 -58 -149 -111 186 227 107 14 -12 160 -2 13 128 1 -67 -93
5612i3J01J07k21J2L0Mk3J07Kp9K5N7J50k60J17q7J09M8Q0oj30K6nq1no6O9Rp0
5641g3J09nj08r5L12o4j22m3J57L7q3P3o6k81J72P3QK8j53O3Q1J16Q6l47J92o8
5667aL1J59j57K1j81M4K29J38k57p5P3j25K42j05k39K61n5J67n4j43L3J67j7L8
5691A94j38%j19J18J70q5k42o3k4J37J68j87J22k00m6K44m2j83J05q8J92K27l00
5714d0K6o5J31L9q0j5Q8j68p1L59j05j06j54J73r2O4lK9o5L4L4Q5l03J65O8J07
5740A35j77L0j2N4N7J03j17q8L3J9l2K9o6m9r1K09K19k82J15j18J41k2M0p9mj39
$$ plain form
5612 -93 8 115 -106 -94 -64 -60 -83 24 26 -53 -28 29 179 -81 36 -51 58 106 186 180 50 76 71 -10 -15 -81 -12 -3 -73
5641 -73 36 31 -77 -172 140 76 -46 -89 68 105 22 95 29 -252 -80 -7 1 29 -124 -61 20 136 222 -125 67 -1
5667 -1 30 189 32 53 -128 -84 145 283 26 -49 24 -101 141 36 -203 58 3 170 116 -27 6 173 156 194
5691 194 56 56 -63 55 225 140 -102 -165 -189 -52 116 -71 51 -149 -195 49 7 -176 -71 -159 33 260 -40
5714 -40 -14 -79 52 91 11 -4 84 -84 -155 204 99 -7 -161 12 -80 -16 -19 10 -55 -21 13 98 -205 -40 28 135
5740 135 -42 -12 -24 30 87 190 73 -15 18 37 5 34 -32 -81 -172 37 256 -26 89 -29 112 90 130 51 47 -92
$$ [...]
8191F3
##END NTUPLES=NMR FID
##END=
