##TITLE=1H_Pr 37-E-M
 200.13MHz,CDCl3,
 8 sc
 
 13.11.2025
##JCAMPDX= 6.0         $$ Bruker NMR JCAMP-DX V2.0
##DATA TYPE= NMR FID
##DATA CLASS= NTUPLES
##ORIGIN= UXNMR, Bruker Analytische Messtechnik GmbH
##OWNER= pz
$$ XWIN-NMR		Version 3.5
$$ Thu Nov 13 14:07:09 2025 Russian Standard Time (UT+4h)  she@DPX200
##.OBSERVE FREQUENCY= 200.1313
##.OBSERVE NUCLEUS= ^1H
##.DELAY= (6, 6)
##.ACQUISITION MODE= SIMULTANEOUS
##.ACQUISITION SCHEME= undefined
##.AVERAGES= 8
##.DIGITISER RES= 18
##SPECTROMETER/DATA SYSTEM= spect
##.PULSE SEQUENCE= zg30
##.SOLVENT NAME= CDCl3
##.SHIFT REFERENCE= (INTERNAL, CDCl3, 0, 14.3821)
##AUDIT TRAIL= $$ (NUMBER, WHEN, WHO, WHERE, WHAT)
$$ ##TITLE= Audit trail, XWIN-NMR		Version 3.5
$$ ##JCAMPDX= 5.01
$$ ##ORIGIN= Bruker BioSpin GmbH
$$ ##OWNER= she
$$ F:/spectra/data/she/nmr/H-C/1/audita.txt
$$ ##AUDIT TRAIL=  $$ (NUMBER, WHEN, WHO, WHERE, WHAT)
(   1,<2025-11-13 14:05:43.23 +0400>,<she>,<DPX200>,
      <created by zg, POWCHK disabled, PULCHK disabled
       configuration hash MD5:
       00 E9 B6 7A A2 85 ED C7 34 08 36 98 17 FE 4E 26
       data hash MD5: 16K
       5A 1B 83 E0 A6 28 B7 39 34 B8 B5 83 3C 35 AA 7A>)
$$ ##END=
$$ 
$$ hash MD5
$$ 99 2B BC BB B0 0F D3 1C 71 96 B5 A4 4A 4E FA BF
##$RELAX= 
##$RELAX= 
##$RELAX= 
##$RELAX= 
##$RELAX= 
##$RELAX= 
$$ Bruker specific parameters
$$ --------------------------
##$DU= <F:/spectra>
##$EXPNO= 1
##$NAME= <H-C>
##$PROCNO= 1
##$TYPE= <nmr>
##$USER= <she>
##$AMP= (0..31)
100 100 100 100 100 100 100 100 100 100 100 100 100 100 100 100 100 100 
100 100 100 100 100 100 100 100 100 100 100 100 100 100 
##$AQSEQ= 0
##$AQ_mod= 1
##$AUNM= <au_zg>
##$AUTOPOS= <>
##$BF1= 200.13
##$BF2= 200.13
##$BF3= 200.13
##$BF4= 200.13
##$BF5= 200.13
##$BF6= 200.13
##$BF7= 200.13
##$BF8= 200.13
##$BYTORDA= 1
##$CFDGTYP= 0
##$CFRGTYP= 5
##$CHEMSTR= <none>
##$CNST= (0..31)
1 1 145 1 1 1 1 1 1 1 1 1 1 1 1 1 1 1 1 1 1 1 1 1 1 1 1 1 1 1 1 1 
##$CPDPRG= <>
##$CPDPRG1= <>
##$CPDPRG2= <>
##$CPDPRG3= <>
##$CPDPRG4= <mlev>
##$CPDPRG5= <mlev>
##$CPDPRG6= <mlev>
##$CPDPRG7= <mlev>
##$CPDPRG8= <mlev>
##$CPDPRGB= <>
##$CPDPRGT= <>
##$D= (0..31)
0 0.7 0 0 0 0 0 0 0 0 0 0.03 0 0 0 0 0 0 0 0 0 0 0 0 0 0 0 0 0 0 0 0 
##$DATE= 1763028342
##$DBL= (0..7)
120 120 120 120 120 120 120 120 
##$DBP= (0..7)
150 150 150 150 150 150 150 150 
##$DBP07= 0
##$DBPNAM0= <>
##$DBPNAM1= <>
##$DBPNAM2= <>
##$DBPNAM3= <>
##$DBPNAM4= <>
##$DBPNAM5= <>
##$DBPNAM6= <>
##$DBPNAM7= <>
##$DBPOAL= (0..7)
0.5 0.5 0.5 0.5 0.5 0.5 0.5 0.5 
##$DBPOFFS= (0..7)
0 0 0 0 0 0 0 0 
##$DE= 6
##$DECBNUC= <off>
##$DECIM= 32
##$DECNUC= <off>
##$DECSTAT= 4
##$DIGMOD= 1
##$DIGTYP= 9
##$DL= (0..7)
0 120 120 120 120 120 120 120 
##$DP= (0..7)
150 150 150 150 150 150 150 150 
##$DP07= 0
##$DPNAME0= <>
##$DPNAME1= <>
##$DPNAME2= <>
##$DPNAME3= <>
##$DPNAME4= <>
##$DPNAME5= <>
##$DPNAME6= <>
##$DPNAME7= <>
##$DPOAL= (0..7)
0.5 0.5 0.5 0.5 0.5 0.5 0.5 0.5 
##$DPOFFS= (0..7)
0 0 0 0 0 0 0 0 
##$DQDMODE= 0
##$DR= 18
##$DS= 0
##$DSLIST= <SSSSSSSSSSSSSSS>
$$ [...]
##$SUBNAM0= <"">
##$SUBNAM1= <"">
##$SUBNAM2= <"">
##$SUBNAM3= <"">
##$SUBNAM4= <"">
##$SUBNAM5= <"">
##$SUBNAM6= <"">
##$SUBNAM7= <"">
##$SUBNAM8= <"">
##$SUBNAM9= <"">
##$SW= 18.0517328524113
##$SWIBOX= (0..15)
0 0 2 0 0 0 0 0 0 0 0 0 0 0 0 0 
##$SW_h= 3612.71676300578
##$TD= 16384
##$TD0= 1
##$TE= 0
##$TE2= 300
##$TE3= 300
##$TEG= 300
##$TL= (0..7)
0 120 120 120 120 120 120 120 
##$TP= (0..7)
150 150 150 150 150 150 150 150 
##$TP07= 0
##$TPNAME0= <>
##$TPNAME1= <>
##$TPNAME2= <>
##$TPNAME3= <>
##$TPNAME4= <>
##$TPNAME5= <>
##$TPNAME6= <>
##$TPNAME7= <>
##$TPOAL= (0..7)
0.5 0.5 0.5 0.5 0.5 0.5 0.5 0.5 
##$TPOFFS= (0..7)
0 0 0 0 0 0 0 0 
##$TUNHIN= 0
##$TUNHOUT= 0
##$TUNXOUT= 0
##$USERA1= <user>
##$USERA2= <user>
##$USERA3= <user>
##$USERA4= <user>
##$USERA5= <user>
##$V9= 5
##$VALIST= <valist>
##$VCLIST= <CCCCCCCCCCCCCCC>
##$VD= 0
##$VDLIST= <DDDDDDDDDDDDDDD>
##$VPLIST= <PPPPPPPPPPPPPPP>
##$VTLIST= <TTTTTTTTTTTTTTT>
##$WBST= 1024
##$WBSW= 4
##$XGAIN= (0..3)
0 0 0 0 
##$XL= 0
##$YL= 0
##$YMAX_a= 278284
##$YMIN_a= -315140
##$ZGOPTNS= <>
##$ZL1= 120
##$ZL2= 120
##$ZL3= 120
##$ZL4= 120
##$ABSF1= 10
##$ABSF2= 0
##$ABSG= 5
##$ABSL= 3
##$ALPHA= 0
##$AQORDER= 0
##$ASSFAC= 0
##$ASSFACI= 0
##$ASSFACX= 0
##$ASSWID= 0
##$AUNMP= <proc_1d>
##$AZFE= 0.1
##$AZFW= 0.1
##$BCFW= 1
##$BC_mod= 2
##$BYTORDP= 1
##$COROFFS= 0
##$CY= -3
##$DATMOD= 1
##$DC= 2
##$DFILT= <>
##$DTYPP= 0
##$F1P= 0
##$F2P= 0
##$FCOR= 0.5
##$FTSIZE= 0
##$FT_mod= 4
##$GAMMA= 1
##$GB= 0.15
##$INTBC= 1
##$INTSCL= 1
##$ISEN= 128
##$LB= 0.25
##$LEV0= 0
##$LPBIN= 0
##$MAXI= 10000
##$MC2= 0
##$MEAN= 0
##$ME_mod= 0
##$MI= 1.114404
##$NCOEF= 0
##$NC_proc= 0
##$NLEV= 6
##$NOISF1= 3.799351
##$NOISF2= 2.8
##$NSP= 1
##$NTH_PI= 0
##$NZP= 0
##$OFFSET= 14.38212
##$PC= 1
##$PHC0= -2986.752
##$PHC1= 16.39234
##$PH_mod= 1
##$PKNL= yes
##$PPARMOD= 0
##$PSCAL= 0
##$PSIGN= 0
##$REVERSE= no
##$SF= 200.129724274929
##$SI= 16384
##$SIGF1= 3
##$SIGF2= 2
##$SINO= 400
##$SIOLD= 16384
##$SREGLST= <1H.CDCl3>
##$SSB= 0
##$STSI= 0
##$STSR= 0
##$SW_p= 3205.1282051282
##$SYMM= 0
##$S_DEV= 0
##$TDeff= 0
##$TDoff= 0
##$TI= <>
##$TILT= no
##$TM1= 0
##$TM2= 0
##$TOPLEV= 0
##$USERP1= <user>
##$USERP2= <user>
##$USERP3= <user>
##$USERP4= <user>
##$USERP5= <user>
##$WDW= 1
##$XDIM= 8192
##$YMAX_p= 0
##$YMIN_p= 0
$$ End of Bruker specific parameters
$$ ---------------------------------
##NTUPLES= NMR FID
##VAR_NAME=  TIME,          FID/REAL,        FID/IMAG
##SYMBOL=    X,             R,               I
##VAR_TYPE=  INDEPENDENT,   DEPENDENT,       DEPENDENT
##VAR_FORM=  AFFN,          ASDF,            ASDF
##VAR_DIM=   8192,          8192,            8192
##UNITS=     SECONDS,       ARBITRARY UNITS, ARBITRARY UNITS
##FACTOR=    0.0002768,     1,               1
##FIRST=     0,             0,               0
##LAST=      2.2672688,     0,               0
##MIN=       0,             -315140,         0
##MAX=       2.2672688,     278284,          0
$$ Real data points
##PAGE= N=1
##DATA TABLE= (X++(R..R)), XYDATA
0@%%%%%%%%%%%%%%%%%%%jMpJ2j6J6j6J6j7K1k5K9l3L7m0M3n1N7o1O8p6Q4r4J04
43E4j14J24j36J50j65J82k00K20k42K67k95L27l65M10m63N27o06P05q33J008j254
64f99J618k207L268n524J2075o2988k60683J98848L25665p1472k43228K1025J82318
77I8016n314j32641j9539L7629J275N1372P0364p1047j49397J7186J67786K2466
89H8156j44403j9337J29790K7200j05999m9883N4034L6847Q13L8461L44j01490
101d5467l8636J01609N4165q5392n3575Q8771O4760q9953q1393M9219N5965l871
113A6202O822P751m8095m1623N8725O1999p0582o2046J01728Q0147j13197j13755
125a15924Q5360J20512o8422j00899Q6658R3450j08309j12912Q8540J21887n5567
$$ plain form
0 0 0 0 0 0 0 0 0 0 0 0 0 0 0 0 0 0 0 0 0 -1 3 -4 8 -8 8 -8 8 -9 12 -13 16 -17 20 -20 23 -28 29 -32 36 -40 44 -50 54
43 54 -60 64 -72 78 -87 95 -105 115 -127 140 -155 172 -193 217 -246 281 -325 380 -453 555 -699
64 -699 919 -1288 1980 -3544 8531 -54457 -315140 -116292 209373 137901 -105327 -84302 98016
77 98016 92702 -39939 -59478 -21849 -20574 30798 101162 30115 -119282 -102096 65690 88156
89 88156 -56247 -75584 54206 81406 -24593 -74476 -20442 16405 17218 55679 56023 -45467
101 -45467 -84103 17506 71671 -13721 -67296 21475 86235 -3718 -85111 -35892 20073 16202
113 16202 23024 30775 -17320 -58943 -218 61781 -8801 -70847 30881 111028 -2169 -115924
125 -115924 -30564 89948 21526 -79373 7285 100735 -7574 -120486 -31946 89941 34374
136C4374j01131N6867Q5159o7079q4663M8338P4481j3511l4643J3172l857m8655
148d1148J1997O7946j2744o2642K0445O3774k6233q3018J1911Q8689K792o2122
160b0353R189M1229k6763m3748K7026N1478j9445l9059K9119K2555m7241k8025
172d4038L9040L4213j7377k0052J3224p097l2358K0147M3206j7125l1866K5555
184E472L1271l8968n1470M2540O6822l4073n6593L1776M2412m1913n4060M1224
196a5560O8907k9811o2744K1504M3218k2181l7763J7554M3098R82k5646n633q774
209a2849j0142L0671K9644k8020l7849K1480M4696k6338o4315K0268P3274k48
221D0272n7639j6796L3605J3734k3566M84K3908n305j0700J1839l156k5618l217
$$ plain form
136 34374 -66757 -9890 75269 8190 -76473 -28135 46346 32835 -1808 11364 7507 -41148
148 -41148 -29151 38795 26051 -36591 -16146 47628 21395 -61623 -49712 38977 41769 -20353
160 -20353 -11164 30065 3302 -40446 -13420 38058 18613 -20446 8673 31228 -16013 -44038
172 -44038 -4998 29215 11838 -8214 5010 -2087 -34445 -14298 28908 11783 -20083 5472
184 5472 36743 -2225 -53695 -11155 55667 21594 -34999 -3223 39189 -2724 -56784 -15560
196 -15560 53347 23536 -39208 -17704 25514 3333 -34430 -16876 26222 27204 1558 -4075 -12849
209 -12849 -22991 7680 37324 9304 -28545 -7065 37631 11293 -53022 -32754 40520 40272
221 40272 -17367 -34163 -558 13176 -10390 -9906 14002 8697 -2003 9836 6680 -18938 -22155
234b2155L6930K3441l2159k9835J7325J2371j3872j509J3749M008r819L98Q019
247F892k0056j8224L5712L5444k5355l9894R966L8450o609l9795P909L8937L50
260B3727k7799j2863P064P726J150P110J445j6003R63J5594q542j7676R886K7432
274A9214L756k8384r528K0671J071j5391O333J6163l210j8618k884J4376m637
287a068j4464J4266J7701j0311j7819p70J3493L152p260P877P078r981m371K496
301A9l676j952P543J3573m560k3605k002J8354q10j2534L127J5226L510j7902
315e689q373J3130M266l231N140K541m784n825O39N515n087l477J2037L866j2984
330b316o888K970N322o30k268Q321K197j0827j250M991m43k76L848O894j650j3463
$$ plain form
234 -22155 14775 38216 6057 -23778 -6453 5918 -7954 -9463 4286 8294 -1525 -1127 6892
247 6892 -13164 -31388 4324 39768 14413 -25481 -15515 22935 16326 -23469 -15560 23377 23727
260 23727 -4072 -16935 -9871 -2145 -995 6115 7560 -8443 -7480 8114 -428 -18104 -8218 19214
274 19214 22970 -5414 -14942 5729 6800 -8591 -2258 13905 10695 -7923 -10807 3569 -1068
287 -1068 -15532 -1266 16435 6124 -11695 -12465 1028 4180 -3080 4797 11875 1894 -2477 19
301 19 -3657 -5609 1934 15507 10947 -12658 -14660 3694 2884 -9650 -6523 8703 12213 -5689
315 -5689 -14062 -932 3334 103 5243 7784 3000 -2825 -2186 3329 -1758 -5235 6802 10668 -2316
330 -2316 -9204 -6234 -912 -1542 -3810 4511 6708 -4119 -5369 -378 -821 -1097 2751 9645 7995 -5468
346e468r08R905j100m335K047L832j046r211k545P599J221l33L680k468l977M04
362b703J584L091j538P62P634k532j0887j150N408M616j558m932K678J742o431
377d216j398K379J103L735J293r30k376m697K947O451j845p50J770j641l79j867
393d21j719J371j224L012N399o093q125O17O207N567m426n658O252N293m040n391
409c379k638O508Q227j963n645n534r83Q209L098p041m423K420P145N98j0672
424f073m710R468R330j048j0176o230R219Q512l257o982l159O933P190n523q752
439e258j626N187Q887j306j0539m265N004Q637J208j1860l975J2521Q335o426
453D524j3098l01J5493M765j0975n568M185M925j844n470J638L003k687Q9L136
$$ plain form
346 -5468 -6376 3529 2429 -1906 141 3973 2927 -6284 -8829 -1230 -9 -342 3338 870 -3107 -2703
362 -2703 -1119 1972 434 1196 8830 6298 -4589 -5739 -331 4285 2727 -2205 473 2215 -4216
377 -4216 -5614 -3235 -2132 1603 2896 1966 -410 -5107 -2160 4291 2446 1696 3466 1825 1446 -421
393 -421 -2140 -769 -1993 1019 6418 325 -7800 -7183 -976 4591 165 -5493 759 6052 2012 -3379
409 -3379 -6017 491 8718 6755 1110 -4424 -5407 2802 5900 -1141 -5564 -3144 4001 4599 -6073
424 -6073 -10783 -1315 8015 6967 -3209 -9439 -220 8292 5035 -1947 -5106 1827 9017 3494 -5258
439 -5258 -6884 -1697 7190 5884 -4655 -8920 -3916 4721 5929 -5931 -9906 2615 10950 4524
453 4524 -8574 -8875 6618 11383 408 -5160 -975 3950 2106 -3364 -1726 1277 -1410 -1321 1815
468A815k377m098m09O424N453o292n043M694K850j908j983J344L492k168l047
483a253L466j230n923O70O574M497o485j0885N129J1815r62r080l848P786R194
498I465n660r920J431O212N099j356p050k851J725M988M230o634r958M474J3923
513H118K687j5486j2751J4123J9506p119j9369j479J7390Q916j3997j1753Q653
526b561J0413j837p078l822J467K322L131K894o086p871N893J0344k382j1326
540f499k380J3031O914j0901p666O145O948j843o048O52M779k052l624K220R40
555F16k118j088K392L431l121n308K585N295K30k754k074K792J872l593O6L108
571B331q68l227K9M440J450q290m102R457P129p211j0463L435J3151L04j3129
$$ plain form
468 1815 -562 -4660 -5069 1355 6808 516 -4527 167 3017 1109 -874 470 3962 1794 -1253
483 -1253 2213 983 -4940 -4270 2304 6801 316 -10569 -5440 6375 5413 -3667 -7515 271 9465
498 9465 3805 -6115 -4684 1528 6627 5271 -1779 -4630 -2905 2083 6313 -321 -10279 -5805 8118
513 8118 10805 -4681 -17432 -3309 16197 9078 -10291 -11770 5620 14536 539 -11214 -2561
526 -2561 7852 6015 -1063 -4885 -3418 -1096 2035 4929 -1157 -9028 -3135 7209 4827 -6499
540 -6499 -8879 4152 11066 165 -7501 -1356 5592 3749 -2299 -1647 3132 1080 -2544 -324 616
555 616 -1502 -2590 -198 3233 112 -5196 -2611 2684 2914 160 -1914 878 2750 -843 -777 2331
571 2331 1463 -1764 -1735 2705 4155 -4135 -8237 1220 8349 1138 -9325 -5890 7261 7565 -5564
586e564l075J0727O887n492q883J428O750P49j493k123l436Q95N033K116n664
601a145o766M564J1107k458j1067j620Q820O088n572p414K712O676K51l408l618
616b850M70L588J788j084l506l150L261M639j530m271j454M073M435l348n340
631d279J432N049K784l718n233K396M900p68l850j188K712K308k907j944K138
646a68Q7r43J13J485N65k257o59K940N28k155QJ290N29o58j506Q93q9n09R22M63
666H79j836r39J147J740l48k597P39K648l41j596m41J029J239p66n54M68l57k23
684a09O72m48m18j11r0P86o43p72J90Q26L87L07j153k45J271K04J59j041l02J660
704A130P3j682k26P00R57p87j470N87J273o02q37N8L65Q84j09n70K11J24L58K79
$$ plain form
586 -5564 -8639 2088 8975 3483 -5400 -3972 2778 3527 2034 -89 -3525 -2630 2403 4519 -1145
601 -1145 -7911 -3347 7760 5302 -5765 -7385 1435 7523 1951 -5463 -2751 3925 4176 768 -2850
616 -2850 -2380 1208 2996 1912 -1594 -4744 -1483 3156 1626 -2645 -4099 -26 4409 1061 -4279
631 -4279 -2847 2202 4986 1268 -3965 -1569 3331 2563 -1287 -2475 237 2545 -362 -2306 -168
646 -168 -81 -1024 -911 574 1139 -1118 -1777 1163 1691 -464 -456 834 1363 705 -801 92 3 -506 416 879
666 879 -957 -1896 -749 991 643 -1954 -1215 1433 1092 -504 -945 84 1323 557 3 471 114 -109
684 -109 563 115 -303 -414 -504 282 -361 -1133 -943 -117 270 577 -576 -821 450 654 813 -228 -530 1130
704 1130 1203 -479 -705 -5 952 165 -1305 -718 555 -47 -884 -826 -461 423 314 -256 -45 79 437 716
724G16p00o8R94k60q09k26J38Q99o02j131P96L13k20ll38L71L77n96M87J21l67
745a08J48J73o0M26n21j1K1m84M98K4m35J86L02n51k24j7M65N44m60j67M18k7
767A40K15k53p7N97l41j48K52l53j51Q1k14J08r3j50M25k57k25L19N4j8L92n5
789B48j74q3M8L79J1n17k3L76Q9m45m18J87P83o65l84J97J92M13J5q10O07L22
811C48p1j4n11J87N40l24p1kn8L36k66o78L42L94l8k7n35j60N48N9J36K7m79K99
835a8M21j98M3l94K50L44m20m12L83j03K86p5n72L36P1O1j9oj87K71K7O4j43k33
859b23M10K2j15J2K6k89n8J57L05l24m01N16K3k40l1Q7J08J66k21J57r7k19L51
882A22L48o46P5O8M70r9m55l21N55N0n39n2K57M26k68OR4L2j62M21l21j17k02
$$ plain form
724 716 16 -52 942 682 -127 -353 -215 684 82 -1049 -253 60 -160 -163 -501 -130 247 -349 138 259 -108
745 -108 40 213 153 579 58 47 68 -416 82 106 -329 -143 159 -392 -616 -633 -168 376 -84 -251 167 140
767 140 355 102 25 622 281 133 385 32 -119 -38 -252 -144 -237 -387 38 -219 -444 -125 -71 -89 303 248
789 248 74 -9 39 418 429 -88 -111 265 354 -91 -509 -322 461 -204 -588 -391 -199 214 229 -581 26 348
811 348 277 263 -248 -61 479 155 84 82 24 360 94 -584 -242 152 114 87 -448 -608 -60 -1 135 162 -317 -18
835 -18 403 205 248 -146 104 448 28 -384 -1 -104 182 107 -465 -129 -58 3 -16 -22 -209 62 89 153 10 -223
859 -223 187 209 94 106 132 -157 -215 -58 247 -77 -478 38 61 -179 -210 -123 -15 151 -70 87 -10 -229 122
882 122 470 -176 -101 -33 437 338 -117 -438 117 167 -372 -424 -167 259 -9 -3 91 123 -39 382 61 -56 -258
905b58K80J78j14j95rK64k85J92o2k22P0O4K47l36l82N63M18j98l36LL71J15m81
928a13J84L18k79l37M42om01N2j08N95k19m96J38O08j77k52m2O9R6j0N7J52m68
951a97L14J68j45k35k37K03M70k83k22k25L97L93l59k24m7O21L28p61n13M13N44
972D03j46k16m81N46K38k67k53J75L4k50M83n8n12j60L25Q65m79q90O44P09m77
993B33p54K27O42n8n19J38K87k29k87L51L03k88m16K03L52q3m43K84K86m8k98
1014a17qJ76K71j43k75J84k16Q5N0j77K40j19j31L45j29J41l53j75K40L84k92
1035a9K1k36M69l9l15P8J75J05m11P0J43n2l25N37N4m10j32L26M30k91k91j28
1057b41M78j15l47P1N22k15j06j24L14k1m50J8N65n67o5J09L78l28k05K91K00
$$ plain form
905 -258 22 200 86 -109 -118 146 -139 53 -9 -231 -161 -97 150 -186 -568 -5 413 215 -121 -118 253 368 -113
928 -113 71 389 110 -227 215 209 -192 -140 -248 347 128 -368 -230 378 201 -51 -93 -24 72 62 119 271 -197
951 -197 117 285 140 -95 -332 -129 341 58 -164 -389 8 401 42 -182 -229 392 720 -41 -554 -141 403
972 403 257 41 -440 106 344 77 -176 -1 33 -217 266 208 -304 -464 -139 726 247 -643 1 710 233
993 233 -521 -294 348 290 -229 -91 196 -33 -320 31 334 46 -370 -167 185 102 -341 -57 229 181 -117
1014 -117 -125 51 322 179 -96 88 -128 -43 7 -170 70 -49 -180 165 36 177 -176 -351 -111 273 -19
1035 -19 2 -234 235 196 -119 -41 134 239 -172 -102 41 -11 -336 201 255 -155 -287 39 469 178 -113 -241
1057 -241 237 122 -225 -154 368 153 47 -77 237 216 -234 -216 349 -218 -283 -174 204 -124 -329 -38 162
1078A62k84K9N1j3K39j98J38J6j13J15Q7m96O1J68J20k65R8P8J16l01K04R8k00
1101i0l6n6M01j66k42P1K86j8J3r4r3o4k25O35j81j47k93M19J7j11l68L83J3r
1125D5k29J30K41k28r7L42r3q9o9K92o1k28J10n4J61k24K9Q9j09M2j07L07j63
1148C7n2M3J60Q5n44L08J49l20J8J37j8j68Q9J00pj6j97L00k24N3j85M10j6l6
1172A06q5J44q1o9L0J1j2k99L45Q0q4n2k3j16NJ04L8k2o5R6q9Q7k24L51N4R4l09
1199A5L4j47J4L08k64K0r3j03R8K78n7M6k33R3Q3k37J02J71j30qj6K58j44l00
1223b12K10K72k48j68L15k03O8k54J72K84l16Pj56L13j95J92k2K8m4j05J7N8j75
1246a62K05J6q1Pj12J93%k10R3O7j5J86k38n0k6J29p2P7n2J40O8k07l9M5O5j09
$$ plain form
1078 162 -122 -93 -42 -55 184 -14 124 140 27 142 229 -267 -206 -38 82 -183 -85 -7 109 -192 12 110 -90
1101 -90 -126 -182 219 53 -189 -118 168 150 163 69 -24 -88 -313 322 141 -6 -299 120 137 26 -342 41 54 45
1125 45 -184 -54 187 -41 -138 204 111 22 -47 245 184 -44 66 12 173 -51 -22 67 -42 0 -107 200 37
1148 37 -15 28 188 273 -271 37 186 -134 -116 21 3 -165 -76 24 17 1 -196 104 -120 -67 -252 158 142 106
1172 106 21 165 84 15 45 56 44 -255 90 170 86 34 11 -105 -100 4 42 20 -45 51 -38 49 -175 176 230 324 15
1199 15 49 -98 -84 224 -40 -20 -113 -216 -118 160 103 149 -84 9 92 -145 -43 128 -2 -10 -26 232 88 -212
1223 -212 -2 270 22 -146 169 -34 34 -220 -48 236 -80 -73 -229 84 -111 81 59 87 43 -62 -45 13 -162
1246 -162 43 59 -22 -15 -127 66 66 -144 -51 16 1 187 -51 -101 -127 2 -70 7 -45 95 163 -44 -83 -38 27 -82
1272h2J12l23L87k06L3J93j53L5j45P6R3j51K22k2j22O3o4j7K74j04j44J45j78
1295g8M8J28j28L01j66M6pj40p5J42j40J83j39M8j62K2nJ75k73K58R5m02K99K07
1319B37j85k8j04r0J03J3J64j56j12J26k4KJJ73k28J01J84l73K20k95L43j61J13
1342B4j60J42J0j8p8J24P6j38M9J77l16K25K8k12J90j95K16j17j80J31L2Q3R8
1365A91l28J39M7j16N7Q1k30L02q7n6j28J44Q6l1n6J32j24p7j39R3J38q6O0K57
1389B69l00p8L58j18q0q2j1J62k84jJ71p8Q4o6j60M53j21P0l6k26K65k97K6O3
1413a7J8k08K59l6j80M7j62J49O1K93l49K30M5j88J78kl4j36J13J0nj41j23L84
1437B06l26J73J1k34J72J09l7j36L5L2J10k00N5o4k9j75K53J01k7j81K08j71J48
$$ plain form
1272 -82 30 -293 94 -112 -79 114 -39 -4 -149 -73 20 -131 91 69 -53 10 -54 -71 203 99 -45 100 -78
1295 -78 -30 98 -30 271 105 151 144 4 -71 71 -69 114 -25 23 -139 -117 -122 53 -220 38 133 -269 30 237
1319 237 52 24 -80 -170 -67 -54 110 -46 -158 -32 -56 -54 -53 120 -108 -7 177 -196 24 -271 72 -89 24
1342 24 -136 6 16 -2 -80 44 120 -18 31 208 -108 117 145 -67 123 -72 144 27 -153 -22 10 93 191
1365 191 -137 2 49 -67 -10 71 -159 143 56 0 -128 16 102 71 15 147 23 -54 -193 -100 38 -48 12 269
1389 269 -31 -109 249 131 51 -31 -42 120 -164 -165 6 -72 12 -54 -214 239 118 188 152 -74 191 -106 -80 -17
1413 -17 1 -207 52 16 -164 -117 -279 -130 -69 224 -125 105 150 -38 140 138 104 -32 81 91 86 -55 -178 206
1437 206 -120 53 64 -170 2 111 74 -62 -27 5 115 -85 -30 -94 -123 -298 -45 56 29 -152 56 -115 33
1460C3J17j21j38K90l04J64N8n0J3P4j45J27l33L84L2k68L8P0KJ1K8k6j73K0J87
1485I0J20l93M9J44k85K41O0q9J67k58J51m9J34m1j63J6pJ62l8qm8r8J4J66m2
1510eL8j08L03l54J02Q6R2p2m2j5J28l1k20J13L05m50K19j34q6J97j64J03o3N6
1534bP0M0k05P9J34m32L08n9J15J66m02L28k76np2J54P6J67k78J74l34K45K9K
1558B2n9m8J48j25n1J51r5J16j76n7J57K06lk76K33l50L52k85k0J18q9K19P3r2
1582F9r1J84j16j40l3J39L9p5K29m28J77J49j60O2j24j4J92q7K5j19J19K11p4
1605A34l35K15MM1n3k4J5J70j17K7J4j10n4o4R0K73o5j59k8q8L3O7j0n2R0M9m4
1632A9n6J33j18J2p8nK60l17M2J69K6j56K54k61J03p8p4N4J21j61o0L3J75kj06
$$ plain form
1460 33 150 29 -109 181 -123 41 99 49 62 136 -9 118 -215 169 201 -67 -29 41 43 54 82 56 -117 -97 90
1485 90 210 -183 -134 10 -275 -34 26 -63 104 -154 -3 -52 82 41 -122 -106 -113 49 11 3 -45 -143 -129 37 -5
1510 -5 33 -75 228 -126 -24 62 154 82 40 25 153 122 -98 15 320 -130 89 -45 -131 66 -98 5 -58 -2
1534 -2 68 108 -97 -18 116 -316 -8 -67 48 214 -188 140 -136 -141 -213 -59 17 184 -94 80 -254 -9 20 22
1558 22 -37 -85 63 -62 -113 38 -57 59 -117 -174 -17 189 186 -90 143 -207 145 -140 -160 -42 -131 88 161 69
1582 69 -22 162 46 -94 -127 12 51 -24 205 -223 -46 103 -57 5 -119 -133 59 -28 -3 -122 -3 208 134
1605 134 -201 14 18 59 6 -18 -3 167 50 77 91 -19 -73 -137 -47 226 161 2 -26 -114 -81 -14 -24 -76 14 63 19
1632 19 -37 96 -22 -10 -88 -93 167 -150 -108 61 87 -69 185 -76 27 -51 -125 -71 50 -111 -171 -138 37 35 -71
1657g1M1J65j92J63j43m0Q6J95j79J0o3J05M2O3l30J58J04k29j49J17K01j00M0
1680fn2N6J54j66J64N0l99L9j17K47j27J40K7J20k43N7k4J45j4j47O2j1K62k77
1704f0J08n7j71R3J33J2j54P7N1k26L02j40j6j1J09N9j58M1j60J52J48q5k28K15
1728C4j03K09j53p5J83q9o3K2j30K43n2M9o4j72P7R2Q4j92K38o1q5p4Q4j9M4l6
1754ij28O8J72J99l99r6Q0J14J52l49L11p7j47K0q1Q0J56p8J21j37J09j78Q7L
1778gm6K84j99K0j32n5j21K95J88k65L7K6J3K4k9j40J23j11J19O7lj26K27k04
1802a5O2j29R7P4k48J48q3P9O0j57J55o3K4P3QKl8j87L28k02m8J07k36P0J39m
1828A6K4J2j0p0j30M66m21J44k3j16K9J73k00P2OQ4J78l17J93j75k4R2J7j87J92
$$ plain form
1657 -71 -30 135 -57 106 -37 -77 9 204 25 35 -28 77 119 182 -148 10 114 -115 -264 -147 54 -46 -6
1680 -6 -58 -2 152 -14 150 200 -199 -160 -277 -30 -157 -17 10 130 -113 -56 -80 65 51 -96 -34 -45 217 -60
1704 -60 48 -9 -180 -87 46 58 -96 -19 32 -194 108 -32 -48 -59 50 109 -49 -8 -168 -16 132 47 -181 34
1728 34 -69 140 -13 -88 95 6 -57 -35 -165 78 26 75 11 -161 -84 8 92 -100 138 77 -8 -82 2 -17 27 -9
1754 -9 -137 -69 103 302 -97 -193 -113 1 153 -196 115 38 -109 -89 -170 -90 66 -12 109 -28 81 -97 -10 -7
1778 -7 -53 231 32 52 -80 -135 -256 39 227 -38 -1 25 38 62 33 -107 16 -95 24 91 88 -38 189 -15
1802 -15 47 -82 15 89 -159 -11 -94 -15 45 -112 43 -20 4 77 85 87 49 -138 190 -12 -60 47 -189 -119 20 16
1828 16 40 52 42 -28 -158 308 -113 31 8 -108 -79 94 -106 -34 -28 56 234 -83 110 -65 -89 3 20 -167 25
1853B5J19j08L6n8oJ93k51Q3J23j91J51k04J98k2j65J85k80L9O3J46j07L20m80
1876a91K18N0j50J15o3j04K48P0k98K75m25J64M7n8J05k3j90L36j30L5j95K73
1898A09k73K58J49k16R8p3k1N6q0p0o9L15p1r4n9pJ12m4J35m0p0J49j99l3m0N5
1924b3J13m1J05j31q1%K56k84j06K43M5r9K0O6qn1P8mr9N8p0j16K44q8p1P9l83
1951c48L70K2o3j88R2K03m7J1j04M3J20j22n0J3K1J5K1o0N2J48j02Q3j49N6o1
1976b4Qk2J38l45K27Q3M0j98J30j09JJ99K5l22J96j12K42o1k11L57j40j25kN8
2000C3q1k6q8K50l18J80R9j07R9MLj74J91j94K37j32r7P5J02l19M40nk0l23O8
2025a03M6J93k70K28k11J33o7k26J79J3J18n4J7L8J19j19O2k6L3k94K32j06R3
$$ plain form
1853 25 144 36 72 14 8 201 -50 33 156 -35 116 -88 110 88 -77 108 -172 -133 -70 76 -31 289 -191
1876 -191 27 77 -73 42 -21 -125 123 193 -105 170 -255 -91 -44 -102 3 -20 -210 126 -4 31 -164 109
1898 109 -164 94 243 27 125 52 31 87 7 -63 -132 183 112 18 -41 -48 64 20 155 115 45 194 -5 -38 -78 -23
1924 -23 90 49 154 23 -58 -58 198 -86 -192 51 96 -3 17 83 75 24 102 98 -1 57 -13 -129 115 27 -44 35 -348
1951 -348 22 44 -19 -207 -115 88 41 52 -52 -9 111 -11 -61 -48 -27 -12 9 -51 1 149 47 130 -19 37 -24
1976 -24 -16 -38 100 -245 -18 65 105 -93 37 -72 -71 128 153 -169 27 -85 157 96 -115 242 102 -23 -25 33
2000 33 -48 -74 -162 88 -230 -50 49 -58 41 45 48 -126 65 -129 108 -24 -121 -46 56 -263 177 172 152 -171 -103
2025 -103 -57 136 -134 94 -117 16 -51 -277 -98 -85 33 -21 -4 34 153 34 96 70 103 -191 41 -65 28
2048B8k00J68k09O0K43j29P4J38k71m0O1q2J23K12l39L9L01k6l79P7J46Q8k19
2071a36J47k4m4L3N9j24OJ11n6J44K5j74rL7j23NJ19r4L7K35j70J7Q2l01L11j10
2097Co8P6K7n7N7l26L79J18k95p2K23j0j44K6M3K7j72K03o0n8QK1J70k3j14p6
2123i4J67P7j74J84k60J26j7k25J55J35j32J43p6j29Q1K48k68k3J54j65p0J40
2145b3JRj45L05j99K71k82M0mJ03j14J5MK7m1p2J58j95Q0pp0K74k52K10j26M5
2171A2Q2k33K69o5j34M1O7N0m7j1M9q4J00J24k62R9L6l49K54J20J3k1o6r4J60
2196A10j84J5K12j06L6N8k77K12r9KrJ9J55j37J1k62K76j25j2Q3J6O0m8l76L46
2221b4J01pj20j23J75r0jK22o9o4l6Q4J70k38L0l8J6j00r7J07LL30q1k43nJ0M5
$$ plain form
2048 28 -172 -4 -213 -153 90 -39 35 173 -98 -138 -77 -159 -36 176 -163 -124 177 151 -228 -151 -5 83 -136
2071 -136 11 -13 -57 -24 35 -89 -83 28 -28 116 141 -33 -42 -5 -128 -123 -4 -98 -61 174 4 21 103 -198 113 3
2097 3 -65 11 38 -19 38 -288 91 209 -86 -158 65 55 -89 -63 -20 7 -165 38 -22 -80 -72 -51 119 96 -18 -94
2123 -94 73 150 -24 160 -100 26 9 -216 -61 74 -58 85 9 -120 -39 209 -59 -82 72 -93 -163 -23
2145 -23 -22 -13 -158 147 -52 219 -63 -23 -27 76 -38 -23 -19 8 -33 -105 53 -142 -62 -69 -139 135 -117 93 -33 12
2171 12 94 -139 130 65 -69 -28 39 89 42 31 80 -4 96 220 -42 57 93 -256 -2 118 131 110 44 -50 110
2196 110 -74 -59 153 47 83 141 -136 76 -23 -21 -30 -11 144 7 18 -244 32 -93 -105 -22 -6 54 6 -370 -24
2221 -24 77 70 -50 -173 2 -88 -89 133 64 0 -36 48 218 -20 10 -28 -12 -112 -209 -102 -99 231 150 -93 -98 -88 -43
2248d3K7M8n8R1j26O5n3j18l8q3M55o2j15k4M5j3O1j07K75j70j59K87l40J18M1
2273Dk25N71j44l29K11N0N5m4j86n0J9L9k30K13N9K40j81j13p9K08Q3l06K55O
2297A26L1q7M4l11K70M6j42M4O6k20K40M4j29j69N4K27k17K03k19J07R8j77K2
2320d9M7Q2m3j11K18l05K07r9J84Nk33J25L7j41N4l9M0K08j99K30l24Qkjl6O8
2346f9l0K07r2M0J20j77L6Q3j92J78r9k23M30p7q0p6O4J26k01L0j20lO9n5k0J24
2372gO6k12J2J75j2K8j22k9J46m2j00J10N7m0m4m6k4R4j17R3K30l26N2K29k76
2397a05L43k87L5k4K3j01N8k8P0J73l1J22l71M5j8m2j18J79J27j68J50J3j43K38
2421A40j65j1J78j58Q9j33j46J25K61j46k74L19l11L74j01J69k00p3J98m04J61
$$ plain form
2248 -43 -16 32 -26 65 -61 4 -49 -167 -205 -288 167 105 -10 -34 11 -2 59 -48 227 57 -102 185 -155 -37 4
2273 4 -221 350 206 -123 88 138 193 149 -37 -87 -68 -29 -259 -46 13 253 72 -41 -120 88 171 -135 120 126
2297 126 157 70 114 -197 73 119 -23 21 87 -133 107 151 22 -147 -93 134 -83 120 -99 8 106 -71 -49
2320 -49 -2 80 37 -74 144 -161 46 -53 131 136 -97 28 65 -76 -22 -61 -21 187 -12 218 -106 -98 -100 -101 -137 -69
2346 -69 -99 108 16 56 176 -1 35 118 -74 104 5 -218 212 135 55 -21 43 169 -32 -2 -122 -125 -56 -111 -131 -7
2372 -7 59 -153 -141 34 22 50 -72 -101 45 3 -97 13 70 30 -14 -60 -84 10 -107 -14 216 -110 -58 171 -105
2397 -105 238 -49 -14 -38 -15 -116 -58 -86 -16 157 126 248 -123 -78 -96 -138 -256 -77 50 -118 32 45 -98 140
2421 140 -25 -36 142 -16 73 -60 -206 -81 180 34 -240 79 -232 142 41 210 10 -63 135 -269 -108
2442a08K89r1k8l05K00J85j03J99l44r9J09Q0L2O2ro6m1Q1J84j78k04q8K06K82
2466B45j78o1Om4J0M8j52N7R8l5n1L4k7kJ55j00j08J70k33J55P5j61j18J06M2
2491f9R9L1j07oJ82j51J44k61J74j44P8r7J38j17j37K31j2J12M6j24j80J06J44
2514H0j68p8K95j96J7N6J3LKj05J11J6M9j64p7O3M6K6k30K02Q2k8J19l70K88N
2540E7j21K22j89l8L4n7j21L1Q6J30M5j06Q5k44M53m28Q7K2N6R9R5l19K37n4j08
2565d6J12j33R2K3j6j00K48l14k3o7K05jK1O4k7L2k39J78K02j7j18j22q3k2J85
2590C4n2J26q4k17J02J15J01k31K80j58o7qJ22j5R1p9o8NK2J29k62Q1J16m8J66
2615B01k45J08J19j86J77k26j7J52j88K11J2m3jR8m0j75K31l17J50o2n9J91j05
$$ plain form
2442 -108 181 90 62 -243 -43 142 39 238 -106 -205 -96 -16 16 78 69 3 -38 43 227 49 -155 -243 -37 245
2466 245 67 6 12 -32 -22 26 -126 -69 29 -6 -57 -23 -50 -52 103 3 -105 65 -168 -13 62 -99 -217 -111 -69
2491 -69 30 61 -46 -52 130 -21 123 -138 36 -108 -30 -127 11 -106 -243 -12 -24 88 134 10 -170 -64 80
2514 80 -88 -166 129 -67 -50 6 19 22 24 -81 30 46 95 -69 -146 -83 -37 -11 -241 -39 43 15 134 -236 52 57
2540 57 -64 158 -31 -69 -35 -92 -213 -182 -96 34 79 -27 58 -186 267 -161 -74 -52 4 103 198 -121 116 62 -46
2565 -46 66 -67 25 48 32 -68 180 -134 -157 -224 -19 -20 1 65 38 70 -169 9 211 194 76 -46 -129 -151 34
2590 34 -18 108 24 -193 -91 24 125 -106 174 16 -51 -59 63 48 139 60 -8 -3 19 148 -114 -33 83 35 201
2615 201 -44 64 183 -3 174 -52 -69 83 -105 106 118 75 74 172 132 -43 188 -129 21 -41 -100 91 -14
2638a4L8q1q5K43k02L4J55j58j77M15m62L06O6N0j84Q5R0q3j12J82k89K39O9j86
2662f1Q4j30J92J94k15p4J13k59J09K6j29K44k90L06k04J61j87R9NK5j35L7K00
2685A11k38k0K37l3l2r3KJ45J04l83K74j09n9J2R4RJ52q2k08J8K04p0J8J14l24
2710a57J72N7%j20J02r6Q5j32K00j17K16j66j24J58N6j57J28j81q0K78l48K44
2732A8j33K23j40J47p7j77J63J61j75j9nN0j21m7P7K39j26j14P1R1o8j31R8o2
2756e7p1J77k6j04J72l0K44n86K38O3J18j69j80K77j99Q0J76l14K97k04K1kl3
2779a12K44o2oq8N3L5j18J3R1j1k6J04j18m9N4j35K52k6l63L35j77L0m5N9K79
2804B13k05m1O4l6r0J32Q7j36n3K48n13K62p8J14N5o6N5m8J03j59J68j32J55j10
$$ plain form
2638 -14 24 -57 -142 101 -101 -67 88 -70 -247 168 -294 12 78 128 -56 29 119 36 -76 106 -183 56 125 -61
2662 -61 23 -107 85 279 64 -10 103 -156 -47 -21 -150 94 -196 110 -94 67 -120 -21 -16 9 -126 -89 111
2685 111 -127 -147 90 57 25 -68 -66 79 183 -200 74 -35 -94 -82 12 21 173 91 -117 -99 105 35 53 167 -157
2710 -157 15 72 72 -48 54 -42 43 -89 111 -6 210 44 -80 78 134 -23 105 -76 -156 122 -226 18
2732 18 -115 108 -32 115 38 -139 24 185 10 -9 -14 36 -85 -132 -55 184 58 -56 15 106 38 -93 5 -57
2756 -57 -128 49 23 -81 91 61 305 -281 -43 20 138 -31 -211 66 -133 -53 123 -191 106 -98 -77 -79 -112
2779 -112 132 70 64 -24 29 64 -54 -41 50 39 13 117 -1 -50 4 -131 121 95 -268 67 -110 -80 -125 -66 213
2804 213 8 -33 31 -5 -95 37 124 -12 -65 183 -330 -68 -146 -32 23 -43 12 -36 67 -92 76 -56 99 -11
2828a1q4K06o0J88j42k47L7J47K4M0k51J67k6J30o5M1n2j02j9j2J10q1J28j57
2852i1J01q3Q2m2o1K85j46j10M6r3P6O2nk7Q6KK8M4j1p1k01J39J00j31M5j25j01
2879b02K18p5P2M1l52M36r2O9l53R2k12K82K89m01J65o8J01qO4l2J09j32K43m39
2903a85M47l24J40m3RK44o86J74N4j3J78M5j19K51l16J07J18k05R3p4j25nK03
2926c2j8JO4j0j03J59j54J05k7J22J36j14o2k61K98L4j92L13l67J20l8p0J19K9
2950E2j02rJ29J06j66j1l2L2j25Q0j14N6M7J4j07L22k12L6J74k27R8n7R6j45r2
2975a57j40J25J75r2mJ05J24j70Q3j24J44j63K40j44K2%j78J12L5K57k59J32l8
2998H5j85K25j60p5K1J18q6qj3K60l93K18j67M68l31J28K2j11p4J8j42L58j1q
$$ plain form
2828 -11 -95 111 51 239 97 -150 -113 34 58 98 -153 14 -12 118 53 94 42 -60 -79 -91 19 -62 66 -91
2852 -91 10 -73 9 -33 -94 191 45 -65 -19 -112 -36 26 21 -6 80 82 110 154 143 72 -129 10 110 -21 24 -101 -202
2879 -202 16 -59 13 54 -298 138 46 115 -238 -146 -358 -76 213 -188 -23 -91 10 2 66 34 143 11 254 -185
2903 -185 262 -62 78 35 44 288 -398 -224 -170 -183 -5 40 -79 172 -144 -37 81 -124 -31 -105 -230 -235 -32
2926 -32 -50 -49 15 5 -98 61 -93 12 -15 107 243 129 67 -194 104 138 -54 259 -108 12 -26 -96 23 52
2950 52 -50 -59 70 176 10 -1 -33 -1 -126 -46 -160 -104 -57 -43 -150 172 -40 -4 170 -57 41 -16 80 -65 -157
2975 -157 -297 -172 3 -89 -93 12 136 -34 49 -75 69 -94 146 2 24 24 -154 -42 -7 250 -9 123 85
2998 85 -100 125 -35 -110 -89 29 -57 -65 -78 182 -211 7 -160 308 -23 105 127 16 -58 -40 -182 176 165 157
3022A57k16j40L24l0j80R6J13n5k46L7O6J21j12p9K95k61J10K51k75j0K03l9j58
3045b8R0l21K87M6j0l7K52l70P8J80j68N0j41P0J1l6J10r2J50p1o3M8j37J42K03
3070B43k94p0J16J10k32j57L47J81l75J71m3j20R1j51J03M5l4J28R1k62J12r7
3092i7j0J71M6k18Q7j7j68J87J0K6O8k6lJ6K02j15k27J82L6j03M3j01J29j00r4
3117g6K15k87K46o2j70Pq0L06q4l8n0M8J61n9j05J02M6k80J96k58L08q6q1j2J55
3142F2o4Op3K23j50j40O2J58j68n0O1LK25k8l00J83j89K69l45K73lJ05j9j95j4
3167a08m1L43k49O4j72K01q3jO4J59k55O7K9k7K6j31K23n1n3K3O4j27k7J72l8
3192G2J00l23R0M3j47Q4O2O9J90k43j6K50l57k3K43p1n8P0J7nk04J93J10l92N9
$$ plain form
3022 157 -59 -199 125 95 -85 11 124 69 -177 -140 -74 47 -65 -144 151 -110 0 251 -24 -34 169 130 -28
3045 -28 62 -259 28 74 64 27 279 -91 -13 167 -1 49 -92 -22 -11 -47 63 -29 121 50 -13 35 -102 40 243
3070 243 -51 -121 -5 105 -127 -284 63 244 -131 40 -3 -123 -32 -183 -80 -35 -69 59 150 -112 0 -97
3092 -97 -107 64 110 -108 -21 -38 -206 -19 -9 17 85 59 56 72 274 159 -68 114 150 47 90 -11 118 18 -76
3117 -76 139 -148 98 36 -134 -127 -207 99 15 -23 -73 -25 136 77 -28 74 120 -160 36 -222 86 0 -81 -93 62
3142 62 -2 4 -69 154 4 -136 -74 84 -84 -134 -73 -70 155 127 -173 10 -179 90 -255 18 15 120 101 -94 -108
3167 -108 -149 194 -55 9 -163 38 -45 -46 18 177 -78 -11 18 -9 17 -114 109 58 5 28 92 -35 -62 110 72
3192 72 172 -151 -61 -18 -165 -81 -19 50 240 -3 -19 231 -126 -149 94 23 -35 35 52 47 -157 36 146 -246 -187
3217a87K53k84J12J14L1L4p4Q5k8J48k46J21J01k31J41k21L7O4q4K27M5l03J40
3240eP7M8j74J84k03J48J7M5k50M9r5m9L53j70J27k22J28l7j36J7K39J00k43m3
3264i5K80r9M9k6k91%Q9K21j1j65J94j79O3j07J76k02J06K3o2q9J25k1L9J22j59
3289a9J86nj54q1K27j12mj25K93k64L2j15K14l4n4j47L33l4q7j91K54j39m8J15
3313D1j70K61j66P6k97M19j27Q9j76M5L8n1R2nl4o4PL0J2m4J79j56k98J78L9J19
3339C7O7j12k42K11J52j94K77k30J59N6Kn8L9m1M4j53Q0j79J28j83K56r7q8J86
3363A17QJ18j59m2O8m6Ok65J65n0L1O8k10N3K2R5l24L17J26j21L5N7q3J77n0j56
3389d3j2J4k0J57j56l3K38l46J59J43j9Q0l08J20L6j79K15K47l51n3K43k39J44
$$ plain form
3217 -187 66 -218 -106 8 39 73 -1 84 56 204 -42 79 180 -51 90 -131 -94 -30 -114 113 158 -145 -5
3240 -5 72 120 -54 130 -73 75 92 137 -113 -64 -159 -208 145 -25 102 -120 8 -29 -165 -148 91 191 -52 -95
3264 -95 185 86 135 109 -182 -182 -93 128 117 -48 146 -33 30 -77 99 -103 3 26 -36 -125 0 -21 18 140 -19
3289 -19 167 162 8 -73 154 42 38 -87 206 -58 -26 -141 73 39 -15 -162 171 137 50 -141 113 -26 -74 41
3313 41 -129 132 -34 42 -255 164 37 126 -50 -5 33 -18 74 69 35 -29 -22 8 20 -24 155 -1 -299 -121 -82 37
3339 37 104 -8 -250 -39 113 -81 196 -34 125 181 183 125 164 123 167 14 94 -85 43 -140 116 19 -69 117
3363 117 125 243 84 42 110 64 70 -195 -30 -80 -49 19 -191 -138 -116 -21 -345 -28 98 -23 12 69 -14 163 113 -43
3389 -43 -55 -41 -61 96 -60 -93 145 -201 -42 101 82 162 -146 -26 10 -169 46 293 -58 -111 132 -107 37
3412C7n9j71OK54l6l7K9j0j18J48L00k85r9m9j4J7M8n1O9j4N4j34N3Q9q1J41J5
3439A02j92J56j06oJ4J82j30J3P0j43LJ27M3j54J65R8l35J40j48M0K30l28l9K89
3463I1K8p4n3pK06l17J23M1J25j72j44J12j32J2N5Q7j83K58r0K2j0P7j05LK10
3488A63j70k1j79M15k59J25j54K64j17k6o2L1n4L3K28l78J9L58j47l5k32K71j45
3511g2J4Lq0L30l12R1%K1K0m6j10J54r9L82l59K30k08O7J07jj77J09j74K11j66
3536f5J15q3K05j82j80K11j08O9j48K86o0J9q7J49j20OJ0K9j58l8M6K05k12R6
3560EJ25k47n7J61J83j69RLm6q1Q6K85l40J21J9K6q8R9k55K27j52J6Q6N2j58Q7
3586cj4j79L1K05j02R7L4k49N5K6J23m1K4j31J21K5j75N4j8J01n7N8J06j66K23
$$ plain form
3412 37 -22 -193 -187 67 31 -6 23 13 -105 43 343 58 -41 -90 -104 -87 -39 -90 -21 -35 19 -115 -62 27 -54 87 102
3439 102 -90 66 -40 -46 -32 150 20 33 103 -40 -37 90 133 -21 144 242 -93 47 -101 -61 169 -159 -198 91
3463 91 119 45 -8 -15 191 -126 -3 38 163 -9 -153 -41 -173 -161 -106 -19 -202 56 -34 -12 -22 55 -50 -47 163
3488 163 -7 -28 -207 208 -51 74 -80 184 67 41 -21 10 -44 -11 217 -161 -142 216 69 34 -198 73 -72
3511 -72 -58 -55 -135 195 -117 -26 -26 -5 15 -31 -141 13 -86 296 -63 167 -41 26 133 132 -45 64 -110 101 -65
3536 -65 50 -33 172 -10 -190 21 -87 -18 -166 120 60 79 -8 141 21 27 37 66 -92 -130 -84 121 -91 5
3560 5 130 -117 -174 -13 170 1 10 13 -33 -114 -28 257 -83 38 57 83 -5 94 -161 66 -86 -70 16 68 -90 -3
3586 -3 -17 -196 -165 40 -62 35 69 -180 -125 -99 24 -17 7 -124 -3 22 -153 -99 -117 -16 -73 -15 91 -75 148
3611A48k86J38P3k41J33j72J84jkQ3j85K25j98k1J53o1j95L50r7Q2j26PJ68n7
3635A02O2k05p8J74j24J49Q8n0m4j41j3J92l17K49m2K8J1r0J12j31J9N5J60l00
3659a34K77k7j34J39k96L26j64Q2j59R0J23k82%L4MJ64J9J81j13L6j23o3L2J2
3683B4j22RJ33j65L35j67k8L2N0k15J03n5J41p1K11k21J58k13nK39k13J7o0J69
3707H6R2j31j39J93n2l6K1kK5j17j33j2K91j85J83O1l1Mj72K08q1J7j40R8N2N
3733A05j19K5qNO8J56n5j10j41j7Q8j54PJ21K24j14j56K33K8j09J04l27O7J81
3757A02J18q7k18L51l03K9jQ6j47m0k6j17M27j69p1R9K0l65J56K04p7L7k1N3k22
3782a82J33K00j26j18O5P3k8P3j61j53N15k03q9N9J17j30r5Q8j56J08J59j27K5
$$ plain form
3611 148 -138 0 73 -168 -35 -207 -23 -24 -26 57 -128 97 -101 -122 31 -30 -225 125 28 110 -16 -9 159 102
3635 102 164 -41 -119 55 -69 80 168 118 74 -67 -80 112 -205 44 2 30 41 -49 63 -68 -49 6 166 -134
3659 -134 143 116 -18 121 -175 151 -13 69 -90 0 123 -159 -159 -125 -121 43 62 243 130 166 43 -20 12 24
3683 24 -98 -89 44 -121 214 47 19 51 101 -114 -11 -66 75 4 215 -6 152 -61 -66 173 -40 -23 -83 86
3707 86 178 47 -92 101 49 13 34 32 57 -60 -193 -205 86 -99 84 145 114 118 -54 154 73 90 -50 48 100 105
3733 105 -14 11 3 8 76 232 177 67 -74 -91 -3 -157 -150 -29 195 81 -75 158 186 77 181 -146 -79 102
3757 102 220 133 -85 266 -37 -8 -9 77 -70 -110 -136 -253 174 5 -66 33 53 -312 -156 48 -29 8 -13 40 -182
3782 -182 -49 151 25 -93 -28 45 17 90 -71 -224 291 88 -1 58 175 45 -50 38 -118 -10 149 22 47
3805D7J1J32j83n3n5J0J33j09J15M2j27k00L29k48J71J61r6k03J70k45K54j32
3827g6J66j36j49K75j4m9K22k04kM7j94N7j2J35J6k24J14L3j37J16m8p9J15p0
3851i8p6R7J18K6r6J99k25J67o3K9o6n4K38l75J43J64k51P3J1L5k32j8J87q0N6
3876i1J12J85l69K22m2L2K7N9k65r7J57k2J44M9j82Q1J1j27J61J11j43j12P6J24
3900A01n2j01M2K9j0J06m5M4k16N3J60j27r2K4L9PPo3J49J8j28J37o3L3n6l4n8
3927i6J14K2Oj92j4J61j56J97k59K56j70L48k62%k5J50j22J53k81M01k7l06K05
3950A03j33o3LL01j66K7j73L59j86J34j28j34j54J42K13P5r2j47Jj45M54k04q
3973G9o5j5k11K30Q3P6J3k95J46j42K02M7j16k56K15j8J56j61J3M5J7Q0k54J46
$$ plain form
3805 47 58 190 7 -46 -101 -91 42 -67 48 90 -37 -237 92 -156 15 176 80 -123 47 -198 56 -76
3827 -76 90 -46 -195 80 66 17 239 35 33 80 -114 -57 -69 66 82 -142 -28 5 -132 -16 -64 -143 -28 -98
3851 -98 -174 -77 41 67 -29 170 -55 112 49 78 12 -42 196 -179 -36 128 -123 -50 -39 -4 -236 -254 -67 -147 -91
3876 -91 21 206 -163 59 17 49 76 135 -130 -227 -70 -92 52 101 -81 0 11 -116 45 156 13 -99 -23 101
3900 101 49 -52 -10 19 9 115 70 114 -102 -49 111 -16 -108 -84 -45 -38 -31 -94 55 73 -55 82 19 52 -4 -38 -96
3927 -96 18 40 46 -146 -160 1 -155 42 -217 39 -131 217 -45 -45 -70 80 -42 111 -170 231 204 -102 103
3950 103 -30 -93 -90 211 45 72 -101 258 72 206 78 -56 -210 -68 145 220 128 -19 -18 -163 291 87 79
3973 79 14 -1 -212 18 101 177 190 -105 41 -101 101 148 32 -224 -9 -27 129 -32 -19 26 43 123 -131 15
3997A5Q7j82Q7j47R9kj34J20J62k35J71J51k86QP3l86M63J68j92J37k68J74j01
4020a8j10Q4J4k47J59JK29J67l46P8o8r3J00l3J41q1p5J58o4j46P0J05J31j85
4044b9J93j21j50Q9Qj48O7L7o3J92K7n0O9k07K36j68j45J00k58M61j55k1rJ48
4068A03j24O3k28L64k79K78l43K07j27j08J52J52k52J83lk81K55Nl8KJ4J9M5J58
4092B17k16P2p0j38R8K24k10pJ28j27J9R0k13K03j55J02m0l0J28M4l9l8p0K22
4116A94m03J15K17l01K34l15J88J03j22n1L43p8O8j69J27k00K06k63J06j61J38
4137b4K03r5j80m1J20j47J24J22K8j74p1J92m9L2M9J55k96K1l8J73j67o3O7PK5
4162b7K74k16r6O5j73J01K01J6l99K65J15l97M24j34q2J5M4j2M8p7j29K13J19
$$ plain form
3997 15 102 -80 7 -140 -41 -43 -177 -57 105 -130 41 192 -94 -86 -13 -399 64 232 40 177 -91 83 -18
4020 -18 -128 -44 -30 -277 -118 -117 112 279 -67 11 -57 -150 -50 -83 58 -23 -98 60 -4 -150 -80 25 156 -29
4044 -29 164 43 -107 -18 -10 -158 -91 -54 -117 75 102 52 121 -86 150 -18 -163 -63 -321 140 -15 -36 -45 103
4068 103 -21 42 -186 178 -101 177 -166 41 -86 -194 -42 110 -142 41 38 -243 12 17 -21 -19 -5 14 59 217
4092 217 1 73 3 -135 -37 187 -23 -30 98 -29 -10 80 -133 70 -85 17 -23 -53 75 119 80 42 -28 194
4116 194 -209 -94 123 -178 56 -259 -71 32 -90 -141 202 124 192 23 150 -50 156 -107 -1 -162 -24
4137 -24 179 84 -96 -137 -17 -164 -40 82 110 -64 -135 57 8 40 89 244 -52 -31 -69 104 -63 -126 -59 -52 -27
4162 -27 247 31 -65 0 -173 -72 129 145 -254 11 126 -271 153 19 -63 -48 -4 -16 32 -45 -174 39 158
4185A58k28J08r4K1P5j01n2L4K61k50M2loj8K7N4j49J40J3j15n5K79k01K8k7J46
4211H7j82K28j32k87K92n0J5j24J00k08K83l4N0J89l83K22j40q7N7L9J73k06K47
4234A49k19R0q5J67k1j62O3K7N3rj49K9p7O7J64k48L50j22k69K53j07p8O1j0J55
4259G2q2p2J49L0j17J42j22J56k85r8K53pO4J34k46J29j62l8J48K33j94k60J7
4282a56J02J53r5J84j38j8J67j02r5K24r5l47K25L1N8j50n4J87o7j05J92j92J57
4305F6p3j65J72O9j92J51o8M1M3p8p7J80J34m9j28n3m7J17j48J00q1J11j04j15
4329a94K65q5l4j0J81o3p7J3j34R5j22K86k17L7J85m8m3j93K37P8j86k22M44j58
4353C5K34j65l18M12k03Kn2PQ8L42n32P9P1O3Q0l19J03n7L7J03J67n2k04J13q9
$$ plain form
4185 158 -70 38 -56 -35 40 -61 -113 -79 182 -68 -26 -29 -35 -53 -26 28 -121 19 32 -83 -138 141 -60 -32 -59 87
4211 87 -95 133 1 -286 6 -44 -29 -153 -53 -261 22 -12 38 227 -156 66 -74 -161 -104 -65 108 -98 149
4234 149 -70 20 -65 102 81 -81 -18 9 62 53 -96 -67 -144 -77 87 -161 189 67 -202 51 -56 -134 -73 -83 72
4259 72 -10 -82 67 97 -20 122 0 156 -129 -227 26 19 83 217 -29 100 -62 -100 48 281 87 -173 -156
4282 -156 -54 99 4 188 50 32 199 97 2 226 131 -216 9 40 98 -52 -106 81 14 -91 101 -91 66
4305 66 -7 -172 0 69 -123 28 -40 1 44 -34 -111 69 203 154 26 -27 -74 43 -105 -5 -86 25 -79 -194
4329 -194 71 -14 -48 -58 123 60 -17 -4 -138 -43 -165 121 -96 -59 126 78 35 -158 79 157 -29 -251 193 35
4353 35 269 104 -214 198 -5 -3 -55 -48 40 382 -150 -71 0 63 143 -176 -73 -130 -93 10 177 125 -79 34 -55
4378e5J38j14r7N9LKoO9N7k31P5k9O2J8oJ4Q4r7L0k9l0n9o8J35J54m3K0n6j02
4407a02K53k78o9M1J45Q8J17k98J79k3r1L16k48Nj19K77q7J1o4l07P6j16L86j64
4431g2NJ69m9j82J54m8qJ45j13M9M0j65n1K46k70L9R3l8M5M5j16J40j28J19k04
4456a55L04j63Q0R6j69J34j71P9no8M8q5q7J01J37n6J30j67Rm5K22k23l8J42o5
4481a5K6j62K61m5j97j2j30L22Nj52K50O2j58L3j62K03l11m9K16n7K21k46M7J2
4505c8p6J82J60k56p1J66j02j95J87K1m4K30l30R4M8j70J93j72R1j80L96j94k
4528f2Q3j71J90P7j76J1J00J91k26p8K8r6j7K4r3J32J46j17J11o5j23O2K12l8
4552A05j6j78J0J16J98j53R6j64J27k08Q6j97J40K1j59L0J12j20J01J2m3J12k74
$$ plain form
4378 -55 83 -31 -128 -69 -66 -64 -70 -1 56 -175 -100 -129 -67 -49 -55 -41 43 -54 -24 -53 -83 -142 -210 -75 79 36 56 0 -102
4407 -102 151 -127 -196 -155 -10 78 195 -103 76 53 -38 278 30 35 -84 193 106 117 53 -254 -178 -294 92 -72
4431 -72 -67 102 53 -129 25 -23 -31 114 1 50 90 -75 -126 120 -150 -111 -18 -56 -11 34 -82 58 -70 49 -155
4456 -155 149 -14 66 162 -7 127 -44 35 30 -38 10 -75 -162 -61 76 20 150 -17 -8 -53 169 -54 -92 50 -15
4481 -15 11 -151 110 65 -132 -144 -274 48 53 -99 151 213 55 88 -74 129 -182 -231 -15 -72 149 -97 -50 -38
4505 -38 -114 68 228 -28 -99 67 -35 -230 -43 -22 -66 164 -166 -72 -24 -194 -1 -173 -82 -262 134 -60 -62
4528 -62 21 -150 40 117 -59 -48 52 243 17 -61 -33 -129 -146 -122 -215 -83 63 -54 57 -8 -131 -69 143 105
4552 105 89 -89 -79 37 235 82 178 14 141 -67 19 -178 -38 -17 -176 -146 -34 -154 -53 -41 -84 28 -246
4575b46J05K60l47J98R4M7k71K90j53K02k85K97k55q3N1O3J79j64M6J94l5N9j56
4598I0j84J44Oj55K06j16j75J32k52J34M33l66K07q1r4j79M4M6K28J59j62L1J3
4621A09k19L8p4K04p4q3J81j13J20M5p4K2o1o8k4M2K21j31O3j75o0J28J59l82
4645b06L55m8j60P5ol2L6j57P3J11l5j89M4K80k06J27k0J8J3k47K53k18K21k81
4669a99K51k09P7P2r7J33m8L9J9p2J09M8k20N0L8m6J14m9R5k91K43l1p0R0M9j46
4695e1Lk2K7O5J41k13P8j87K10l4j92J96j82l7J77P1j13K35q0R6k92K01j27L9
4719Ij19K85k60N0p0L25p4k41N5p4N5L7j30K33J5j62N7k8l6mJ59n1j68qL83r3
4745A45k96j5J1q6N34j00j98J19j41o5M7J0j95J91R3j18N0Q3R8j83J01p5Q7J63
$$ plain form
4575 -246 -141 119 -228 -30 64 111 -160 130 -23 179 -106 191 -64 -147 -96 -33 146 -18 28 222 187 246 90
4598 90 -94 50 56 -99 107 -9 -184 -52 -304 -170 263 -103 104 23 -71 -250 -206 -160 68 227 65 96 109
4621 109 -110 -72 -146 58 -16 -99 82 -31 89 134 60 82 21 -47 -71 -29 192 61 124 -51 -111 17 176 -206
4645 -206 149 101 -59 16 10 -22 14 -143 -70 41 6 -183 -139 141 -65 62 42 60 73 -174 79 -139 82 -199
4669 -199 52 -157 -80 -8 -105 28 -20 19 38 -34 75 123 -97 -47 -9 -55 59 10 105 -186 57 26 -44 46 95 -51
4695 -51 -48 -70 -43 22 163 -50 28 -159 51 17 -175 21 -161 -198 -21 50 -63 172 92 188 -104 97 -30 9
4719 9 -110 175 -85 -35 -105 220 146 -95 -40 -114 -59 -22 -152 81 96 -66 -9 -37 -73 -77 82 31 -137 -145 238 145
4745 145 -151 -166 -155 -241 293 193 -5 114 -27 -92 -45 -35 -230 -39 54 -64 -14 69 167 -16 85 10 97 260
4769B60k18n0N9k74L43l73J22m9L97k83R9j37p1J01k0K29m7r4j29k7K52j15P1
4792D6j42o3M5J24m9o3J05j38kQ5J7k3j9k0K75j80R7j32o9K20j16J09m1r3q8j5
4818a30J69q6J3j80M37l27P4J28J94j71k81J10r3M19k25j57J8PL8mo5K20j94j19
4842b05J64J36j49j2O5k4J15n4k7J0Kq1J48j95J95N1k51K16Q6k38N1o6K29l42
4866a76L8L13r7r1J24k1l9j83K80j33q9K67j64J23j44j05J28k95L53Oj58k6oL1
4890f4L35k03j53j02K60o4r0N5P5j6J22l84J77q1l8J14M6J1K04k64l8J44n7R4
4914H3q0L2l3j46M0P9P9J2r0N7j57qJ64o0JJ38k56n8J91r7K53k27L7L18k09Or4
4941b5rj07K75l04P4J01k97K76rM6j81k7J49n5l6K50r1j66LN3J04o9J7p1p7M1
$$ plain form
4769 260 42 -8 51 -223 120 -253 -131 -180 217 -66 33 -104 -175 -74 -94 135 88 -6 -135 -162 90 -25 46
4792 46 -96 -159 -114 10 -39 -102 3 -135 -137 -52 -35 -58 -77 -97 178 -2 95 -37 -106 114 -2 107 66 -27 -115 -130
4818 -130 39 -47 -34 -214 223 -104 -30 98 292 121 -160 -50 -143 276 51 -106 -88 -81 -43 -47 -112 108 -86 -205
4842 -205 -41 95 -54 -66 -1 -25 90 36 9 19 21 -60 88 -107 88 139 -112 104 190 -48 3 -63 166 -176
4866 -176 -138 175 78 -13 111 90 51 -132 148 15 -74 193 29 152 8 -97 31 -264 89 95 -63 -89 -95 -64
4890 -64 271 68 -85 -187 73 9 -81 -26 49 33 155 -229 -52 -133 -171 -57 -11 0 204 -60 -98 46 -11 83
4914 83 3 35 2 -144 -104 -25 54 66 -24 33 -124 -132 32 -28 -27 111 -145 -203 -12 -109 144 -83 -46 272 63 69 -25
4941 -25 -34 -141 134 -170 -96 5 -292 -16 -25 21 -160 -187 -38 -93 -129 121 30 -136 -133 -80 24 -45 -28 -99 -176 -135
4967a35k4L04Mj18J79m11K43j12J01k6k7j54K32l54J73J34j29K43j48q2J15m5
4989c7j6J6N3J83r9k77J35QR6J8j17QJ01k01r5K99j52J77k14J76LJ60l52K19j75
5014h3J7J8J3K09j60j04O7JJ30k10K23j96N8J3o2J49P4k79J60r2K37j65j22L44
5038B40l70J32%J10M1j88q1O1P8J29j06j10P2j32K4M3R4p8P8r6O3l07J81JJ58
5063C7l41M21j61J1j00L00j67Q7j7j46k5K88l05Q4n1L5nr2J02j38L25j56J9N4
5087E9J03j08q1J44k96R3L70m64J70j28K60k1p3p8Nj16K38Jj6l2Jj38nJ70j88
5112a30J45Po6K14l57J67Q0J1p0L16k89O8M1j36P3L3j51K5J60Q2k78J85j73m2
5136h5J11rj20J21Q9R4j88lk2R0K02k20r5J44j03j84L54k95J60K7j38K18j60J00
$$ plain form
4967 -135 -159 145 149 31 210 -201 42 -70 31 5 -22 -176 56 -298 -125 9 -120 123 -25 -107 8 -37
4989 -37 -53 -37 16 199 100 -177 -42 -34 62 80 -37 -29 72 -129 -224 75 -77 100 -114 62 65 225 -127 92 -83
5014 -83 -66 -48 -35 174 14 -90 -23 -22 108 -102 121 -75 -17 -4 -66 83 157 -122 38 -54 183 18 -104 240
5038 240 -130 2 2 112 153 -35 -116 -55 23 152 46 -64 8 -124 -100 -57 37 -41 37 -59 4 -303 -122 -121 37
5063 37 -304 117 -44 -33 -133 167 0 87 70 -76 -101 187 -118 -34 -85 -50 -55 -147 -45 -183 142 -14 5 59
5087 59 162 54 -27 117 -179 -86 284 -180 -10 -138 122 101 28 -50 -45 -161 77 78 62 30 31 -107 -112 58 -130
5112 -130 15 22 -44 170 -187 -20 60 71 1 317 28 96 137 1 74 107 -44 -19 141 223 -55 130 -43 -85
5136 -85 26 17 -103 18 107 201 13 10 -12 78 280 60 -35 109 6 -178 176 -119 41 68 -70 148 -12 88
5160H8j70K01j33p1J05M1J34k49L05k52PKL3Q3k93J49J41q1k03K29l24L75j38
5183b1j08J70J27j31q1k74K05K94k91K8ML0jjJ20l24K90M1l02K25k7J66n2n0J9
5208E6j8m2J04j85J68M7k73K18j41J47o1Q5n6m6R4l21K79J70l01M5N3j04K18j37
5232ajQ8j94K00n0P3j1J82j33k83L85r4k7k88J14J44j61J03K7q8O1kq9m9j19K72
5258E9n0K22k60k00O3M28j33p5oj29Q2k46K28k26J58J19j60M00m10J08J20j53
5280f1lJ94n9j94k7K29j40K02rr9Jk2j50L31j74J9k18M75l02q5N7O0P5j82o1R2
5306e1Q7r7J65K2j27mM2m2J87k25N6r8l8J38m7J76M2j59m9k8KQ3p1M1j0j0r1P
5334i9j3J02j31M69k59O0q1j61J14J00p4J04L7k4k5k71R2P6l4l4r4L18k34J04
$$ plain form
5160 88 -82 119 -14 -85 20 61 195 -54 251 -1 6 8 41 124 -169 -20 121 40 -163 66 -258 117 -21
5183 -21 -129 41 168 37 -44 -318 -113 181 -110 -82 -78 -48 -49 -50 70 -254 36 77 -225 0 -27 139 87 37 56
5208 56 38 -4 100 -85 83 130 -143 75 -66 81 20 105 49 3 97 -224 55 225 -76 -31 22 -82 136 -1
5232 -1 -2 86 -108 92 42 115 104 286 153 -130 255 161 134 -154 -40 104 -57 46 73 -15 46 44 -45 -94 -213 59
5258 59 9 231 -29 -229 -166 262 129 54 48 -81 1 -245 -17 -243 -85 34 -126 274 -136 -28 92 -61
5280 -61 -64 130 71 -123 -150 79 -61 141 132 33 34 12 -138 193 19 38 -180 295 -7 -92 -35 25 100 -82 -143 -51
5306 -51 36 -61 104 126 -1 -5 37 -5 182 -43 13 -85 -123 15 -32 144 186 27 -22 -50 -48 35 -36 5 -5 -15 -106 -99
5334 -99 -112 -10 -141 328 69 129 48 -113 1 101 27 131 168 144 119 -152 -60 16 -18 -52 -146 172 -62 42
5358D2q6K6o0nL18l76K06p0m7P7k5K1j91N18m81J23J47k48J79L5r7J6J45k38K73
5383B02p0l42K88q1j22M2n9J10J09J18k66R3k12K63n4M6k66LM8q4K18j2j05q8
5407b21L92j35o6P0n7J85q7p8j78K42P7j71RN1q9Q5j47pj16L35j77J03J02k12
5431i0J06j6Q7J13k85J22R7j44J16N9k37PP9J02j36p2K20k72j6J35J01p3l8k4
5455e9J17p2J13l8m4j8j14mK4L1J00j10K31k45N0p4K16N7o7N4k11j2K97j67j77
5480a22o8L54j25m8k9J07n0L6j10oJ77j97q0M9k4J14R2j15L08k37k8j60J00JJ10
5505D9R3l55M8K39J7J02k6m1k05M9o1j43L69j29J12j40M5m8J03l9j33J21j84Q4
5529g3K73l64K97j06l5K6J74Q8j51Q8k21K15l54L30k07J40k3L8k14J7p5j2K09
$$ plain form
5358 42 -44 -18 -78 -83 235 -141 65 -5 -52 25 0 21 -170 348 -133 -10 137 -111 68 103 6 22 167 -71 202
5383 202 132 -210 78 -3 -125 -83 -142 -32 77 195 -71 22 -190 73 19 65 -201 -198 -150 -234 -16 -28 -133 -221
5407 -221 171 36 -30 40 -17 168 81 3 -175 67 144 -27 -18 33 -56 29 -118 -125 -241 94 -83 20 122 -90
5431 -90 16 0 87 200 -85 37 134 -10 106 165 -72 -65 14 116 -20 -92 128 -144 -160 -25 76 3 -35 -59
5455 -59 58 -14 99 61 17 -1 -115 -119 -95 -64 36 -74 157 -88 -38 -112 104 161 94 148 -63 -75 222 55 -122
5480 -122 -190 164 39 -9 -38 69 19 55 -55 -61 116 -81 -161 -112 -136 -22 70 -45 263 26 -2 -162 -62 -61 49
5505 49 142 -213 -165 74 91 193 167 126 -79 -30 -91 -234 135 6 118 -22 23 -25 78 39 -94 27 -157 -73
5529 -73 200 -164 133 27 -8 18 192 280 129 217 -4 211 -143 187 -20 120 97 135 -79 -62 -137 -149 60
5552F0j21l3M1J62R4j90LJ19k08Q2j10O5m9J9J00%j75M4J24L8r5j28J18K44j01
5577A03j81M8r0j46J37J55j34K25Q1k16R3O3k19k14L58m3L1m7Q9P5j02jj85N6
5601f4k3L00m00J67m2K36k79L01l95L19k10J79q3K6m43O63j117Q60K5J43o8j59
5623f4K14j09j67K48j83j86L4n9O33m40j1k01M42j76J67m14N07j32l4j00Q8j43
5645h6J28k54K07p7j00K52p9j22N8J33r9n1R2k12Q5K39J73p59M79K44l95N51j120
5668g13O55m15J072n71k06K12N1K9L82n7l81K55m14K10k22nJ36L2j16r9Kk9P3
5691a19J9J95k99K96K66M26k18j260N48P72n03k80J69k83M37o33N56n28O16n43
5711c66L37j44J83J2K4J2k5RJ17k86L2J67n5j04K72l61K60J60k25k3P2l29J43
$$ plain form
5552 60 -61 -94 -53 109 203 13 16 135 -73 9 -101 -36 -85 -66 34 34 -141 -97 27 65 -30 -158 -40 204 103
5577 103 -78 -30 -120 -266 -129 26 -108 117 198 -18 75 138 -81 -295 63 20 51 4 93 168 66 65 -120 -64
5601 -64 -87 213 -187 -20 -62 174 -105 196 -199 120 -90 89 6 32 -411 252 -865 -5 20 163 95 -64
5623 -64 150 41 -126 122 -61 -247 -213 -272 361 -79 -90 -291 151 -25 142 -272 235 103 69 -31 57 -86
5645 -86 42 -212 -5 -82 -182 70 -9 -131 -73 60 -39 -90 2 -210 -125 114 287 -472 7 251 -144 407 -713
5668 -713 -58 -473 599 28 -178 34 85 114 496 439 58 313 -101 109 -113 -118 18 50 -66 -165 -163 -192 -119
5691 -119 -100 95 -204 92 358 784 566 -694 -146 626 123 -157 12 -271 166 -467 89 -439 177 -366
5711 -366 -29 -173 10 22 46 58 33 42 159 -127 -95 72 17 -87 185 -176 84 244 19 -4 68 -261 -118
5734a18J33J12j35j9o4p8q7L45j49J16J04K27J52n16J80n65J74M95k02o2R5m28
5756b90M58n96P02n18P72r6n63P7L48j27m41N84l01K38l69k9j69M99j12k55l33
5777e21N45J19o8j6j86P15K24j393O18j78L07l25K89k29L06k84m14M74k85J80
5797a22r2L70o41L8M08k8r8K24M5K7j1Q8l04R3q4k97N24m94J90O89p93o4K90J67
5821A25P6n12L11n3L86k55n1K7Lm8j29N1J66n4J59k17l84J89M19L0p4K1l29M34
5845B91l58N15n35L67l83L64k30k84O3J17l3Q8j84l2J35K23j34N8k47K51j8K10
5867B44j87O3k77N2O31p78N69j23N29j027K31l4m1J29K27k57l1K88k22Q7j58o1
5889a46M9K09k02K05l2j5r0J5R2j24k1R2r1j28K47K3j38R7j1j79J73j06l1j5J50
$$ plain form
5734 -118 15 127 -8 -27 -91 -169 -256 89 -60 56 160 387 539 23 203 -362 -188 307 105 43 138 -290
5756 -290 168 -428 274 -244 528 432 -131 -54 294 167 -274 310 9 247 -122 -151 -320 179 67 -188 -521
5777 -521 24 143 75 59 -127 588 812 -581 37 -141 166 -159 130 -99 207 -77 -491 -17 -302 -122
5797 -122 -214 156 -485 -447 -39 -67 -165 59 104 131 120 208 -96 -3 -87 -384 140 -354 -164 525 -268 -332 -42 125
5821 125 201 -311 0 -53 333 78 27 54 57 9 -120 -69 97 43 202 -15 -399 -210 209 239 165 186 -143 291
5845 291 -67 448 -87 280 -103 261 31 -253 -190 -73 -106 -18 -202 -234 -99 124 -10 48 -199 52 34 244
5867 244 57 120 -157 -105 526 -252 317 194 723 -304 -73 -107 -148 -19 208 -49 -80 208 -14 73 -85 -146
5889 -146 -97 112 -90 115 83 68 -22 -7 85 -39 -60 32 -59 -187 60 83 -55 42 31 -148 25 -81 -112 -127 23
5914B3q4p5P6k5J51j13L17m10J10r5J7m9K37j27K63j0k11Lj09J98%ml4O1q1M3
5940G2j08K52k80p6K63n2Nj85J95q5qN0J03j05j48LP7J18j51q3L55k96K4K6k0
5965e4%J31M6j7k84N4J57j78J09L07m16Q9J85L8jj88N3j27P4j31O9r6O3J10o2
5990f9J56J3j04k9J70j53K12k34M9l3J28J64l01J83k40O7K4K0k36J59oJ16m9n2
6014d5J2j02K6J4k5J29j39L8J05j29J19k3j65J58M8n6Q7o7O2j32J22q5j03J92
6038D1m0mlK64l95O0J51Q9j70j10J55P2l05J38p5K00j61L78k63M4j5k03J22R2
6062F2l61L04n6OK84k03p9Q6l36O31m11K30mj07j05j51J93o9K85l81l3J80K9K62
6086B56m05K8J05J4n1J14j34N0OK16j54j29J4J11k14K95k60J33K8P0j36p8J78
$$ plain form
5914 23 -61 -136 -60 -85 66 -47 270 -140 -30 -125 -108 -157 80 -47 216 206 -5 -2 -111 87 87 83 49 110 29 72
5940 72 -36 216 -64 -140 123 71 76 -109 86 1 -7 43 146 41 -107 -104 -27 91 -60 -143 212 -84 -60 -34 -54
5965 -54 -54 77 123 106 -178 -124 33 -145 -36 271 -145 -56 129 167 166 -22 31 -96 -22 -153 -84 -180 -117 -7 -69
5990 -69 87 100 -4 -33 137 -16 196 -38 11 -22 106 270 -31 152 -88 -21 3 23 -213 -54 -60 56 7 -45
6014 -45 -33 -135 -109 -95 -120 9 -130 -92 13 -116 3 -20 -185 -27 21 -35 52 -15 47 -85 37 -48 -151 41
6038 41 1 -3 -6 258 -137 -77 74 163 -7 -117 38 110 -195 -57 -132 68 -93 285 22 66 51 -152 -30 62
6062 62 -299 5 -51 -45 239 36 -43 43 -293 338 -73 157 153 46 -59 -210 -17 -86 199 -182 -215 -35 -6 256
6086 256 -149 -121 -16 -2 -53 61 -73 -23 -17 199 45 -84 -70 41 -173 122 -138 -5 23 93 -43 -121 57
6109E7q5Q4k10L69k83K27n3j53j29K20J02k85L7j2R7mK02k07j29J98q0K39j83
6132A9J23j00K14m58O7P3J30j83K26k62Q8N1n1l3J51p6o2J30P8j10o6j8K61j49
6156D3j21N9J04j22rJ8j75R9P7j1L3J77k84L68j77K49k75j68N1J85j07Q6j15N9
6180D4k4P2J58m20K36j65m4K01j59M7J10J57k75J73k1Jk14N0O1k51MK04R0j0j60
6205a35J53o9jK20j8k41jL06l47K29q5J10j79K08q1Q0k46Q5O26l52L10p8n90k00
6229b96K81q3L38l67n5l9J68k47L16M0K44q4k32J76j27m9k3Nj04J65j62m2K74
6252I7N1l8k73P3lK4j65K66K01k82J84l6K7l95L20K73k84o5k06O2J33m2l8N0Q
6277e8Q5O3j20q5J66L1k17J20Q2j67J7K96k32Q1J7n5Q3k21RL16j23R6r7l32L53
$$ plain form
6109 57 -28 56 -154 215 -68 159 106 -47 -176 44 146 -139 -102 -114 -17 -21 181 -26 -155 43 -37 202 19
6132 19 142 42 256 -202 -135 -62 68 -115 111 -151 -63 -12 -63 -96 55 -21 -83 47 125 15 -51 -69 192 43
6156 43 -78 -19 85 -37 -46 -28 -203 -104 -27 -38 -5 172 -112 256 79 328 53 -115 -64 121 14 100 -15 44
6180 44 20 92 250 -170 66 -99 -143 58 -101 -54 56 213 -62 111 90 91 -123 -73 -12 -263 -259 -55 35 25 -135
6205 -135 18 -51 -52 168 150 -91 -92 214 -133 96 11 121 -58 150 69 149 -97 -12 614 262 572 494 -96 -296
6229 -296 -15 -98 240 -127 -182 -221 -53 -300 16 56 300 216 -16 160 33 -16 -39 -34 -138 27 -135 -177 97
6252 97 148 110 -163 -90 -93 -69 -234 32 233 -49 135 99 126 -269 51 324 40 -25 -231 -169 -36 -78 -116 -66 -58
6277 -58 27 90 -30 -115 51 82 -135 -15 67 -100 -83 213 -19 62 79 24 107 -114 -105 211 88 184 87 -245 108
6302A08j59J42l3j57J0P9j35L46j30k51K32k34K7J55j10J03l2L70k80j0k3j27
6324a09o0K33OJ32j77J08j82J53R6j60j15L1J29n0o6P2J7Q3j00%k2J27N2k45K50
6349B03j74n8J04L1n3j66J54L1l6M3J01k80J44N8l2j21n3J83l7j2o1n2j7J08j43
6374a35J63mkN3Mk19j0J21J27Mj64K97l28l7j11L85M1l6k51O7J6J33j42j40J31
6399c7Q0j50K93r0L8k25Q0q9R2ml5N7l4J92l81L51j03Lkj34j16K48Qm3J5k6M4
6426C2p5j06J51oJ6j26P3j1J91k5o6o5K91j10l42K73k22J72P2j82M8j04m1L21
6450A59p5j57j80J28K88n0j53O1j64J38j12J26k53K96j52j37K70Qn4M6j32K86
6472A87k01R0p6n7Q5l9mO1K1j5o8J4J56k62Q7P7m8RJ60j89O6j13J1k8J0J31k66
$$ plain form
6302 108 -51 91 58 -99 -89 -10 -145 201 71 -180 52 -182 -155 0 -110 -7 -39 331 51 41 18 -109
6324 -109 -169 64 70 202 25 133 -49 104 200 40 -75 -44 85 35 -31 41 58 141 41 41 19 146 198 -47 203
6349 203 29 -29 75 106 53 -113 41 72 36 79 180 -100 44 102 70 -51 -104 79 42 30 -31 -83 -100 8 -135
6374 -135 28 24 22 75 79 -140 -150 -29 98 102 -62 235 -93 -130 -241 144 185 149 -102 -35 -19 114 -28 -168 -37
6399 -37 43 -107 186 96 134 -91 -11 -100 -8 -12 -47 10 -24 168 -213 138 35 38 36 -98 -214 34 42 -1 14 -12 32
6426 32 -43 -149 2 -4 12 -114 -41 -52 139 114 48 -17 274 164 -178 95 -127 45 117 -65 -17 -121 -162 159
6450 159 84 -73 -253 -125 163 113 -40 21 -143 -5 -117 9 -244 52 -100 -237 33 41 -13 33 -99 187
6472 187 -14 76 0 -57 28 -11 -15 46 67 52 -16 -2 154 -108 -21 56 8 17 177 -12 54 -59 -48 -76 -66 65 -201
6499b01K78j67O1J92k54j55J69PJ66j56p5J87j20J31l59L39j60J65Mk36J03j0
6521i1J29k41K49k17K27j38J17r9J78j02M3J96j61k81L38k52J69k09j18L59j92
6542i6R2n8k12L09j10o2K42n07M62q9J40o0q2J38j54J14K6k80K58k3j92J99k68
6565b13J97p4J37k31L50j43j83K93j21P0j60l9J71r3N2k13K71m15L09K01j55p
6587DO0k9MQ4j71R4j90P7o6K7L5N6j09mk5J8L11l24N7J16j08J60k44J47J5j42
6613a47P6Jn9J22j0k0j0Q2j83Q8J16kL9m5j21J92J9j22j01N4p1K84k47K7MR4j57
6640i7J25j99J37P9J1P1j09L7Q2k31K7K6J39j07Q4L1j38k2M0m6q8K59q6J54j32
6665D7m0LK19l26K32n4K6j04J03k5r8J45k17K25j42m4K10k43R0M6r3R9j07J74
$$ plain form
6499 -201 77 -90 -29 163 -91 -246 -77 -70 96 -60 -135 52 -68 63 -296 43 -117 48 52 -184 -81 -91
6521 -91 38 -203 46 -171 56 -82 35 -64 114 12 55 251 90 -191 147 -105 64 -145 -263 96 -96
6542 -96 -4 -62 -274 35 -75 -137 105 -402 60 -29 111 51 -31 107 -47 67 93 -187 71 48 -144 55 -213
6565 -213 -16 -90 47 -184 166 23 -160 133 12 82 -78 -117 54 -39 13 -200 71 -344 -35 166 11 4
6587 4 64 35 39 123 -48 46 -144 -67 -133 -106 -71 -15 -124 -128 -153 -135 176 -148 -91 25 -83 77 -167 -20 -5 -147
6613 -147 -71 -70 -129 -7 -17 -37 -47 35 -148 -60 56 54 93 48 -73 119 138 16 -85 -31 -102 182 -65 -38 -34 60 -97
6640 -97 28 -171 -34 45 56 127 18 55 137 -94 -67 -41 98 -9 75 106 -32 -54 -14 -60 -148 111 25 179 47
6665 47 7 10 229 -97 135 81 107 3 106 81 -17 128 -89 136 -6 -50 160 -83 7 53 -40 59 -48 126
6689A26j20L9k6J30j91Q4N0j10J98k61j26L25Q1j54j5J95j84j84L06j82J37m0
6711G8j84o4P7L8J07RN5N4j65Rk4J27J1o1j97K55k32J73j04J19j26J80n1j01O7
6736E0R8k31K08j23j07Q2r6K16j51P4q8M5rJ55j98m3j7K4L03l4j10l8j33K20k6
6761G1J5j08N8l6q5K2J23k72P4J81j02J69m3k09K07j98J10j11K19L9m5l94L63
6784D8j88L0N1l7O2PK32j63J54l10K21n7r4O9l57L98j11J2r4qq9J84j00J0Q4o6
6810a12L54m27M09r6jk30m4L07k72K8J27Ll5K8j14L23k15j81K8M0Q6o2K64n06
6834b98K27K00k32o0J66R7Rl33K38r5J30qj62J25k0J84j25K03q2q5k09Q8m1L14
6858B31j45J7k12J0J4r4RM20l48J85l36K86J23l54j68M41j25p6J16k8J5L40l60
$$ plain form
6689 126 6 45 19 149 -42 42 92 -18 180 -81 -207 118 199 45 30 225 41 -143 163 -19 118 78
6711 78 -106 -170 -93 -55 52 61 116 170 5 14 -10 117 128 67 -130 125 -107 66 -38 81 -45 135 84 -17 50
6736 50 148 -83 125 2 -105 -23 -119 97 -54 20 -68 -23 -32 123 -75 -118 -135 -111 192 158 48 10 -123 97 71
6761 71 86 -22 36 0 -85 -63 60 -212 -138 43 -59 110 67 -142 65 -133 -23 -134 85 124 79 -315 48
6784 48 -140 -110 -59 -96 -34 -27 205 42 196 -114 107 50 -44 25 -332 66 -45 -33 -127 -135 -224 -40 -140 -130 -46 -112
6810 -112 242 -185 224 128 127 -103 -147 160 -112 -84 43 46 11 39 -75 248 33 -148 -120 -80 6 -56 208 -298
6834 -298 -71 129 -103 -163 3 100 109 -224 14 -81 49 41 -121 4 -16 168 43 246 164 79 -130 -42 -83 231
6858 231 86 103 -109 -99 -85 -179 -170 250 -98 87 -249 37 160 -194 -362 79 -46 -122 -6 -34 -19 321 -39
6881c9j26M34l37O8m5M6p1R2k37L25j3j33R0o1j01L22k18q1M4J49l06K29k1Mj08
6906i4J23J21m8r6j6k4o2r2P08l9m55J65l60R5j62N2J84l6p6L07l66J86J09l63
6930b39M28k94M3J31J23k51n3K04j00Nq8J13m9L94l24jj57J08r4J2k5J41l00K19
6954e4j02L23k67J79j43q3J30jJ05j58q4K16r8j39J14L78r85O40J88l30J98K43
6976B70m86Q6n0J58J83m84N8K13j31J56k2q7J13LN5j07J61k78K60J15l31K29L4
6999A18m8j07M1J04p1l3m9R5R7l44L86j41m9o2PJ18l16M14j42J37l64J28J19m37
7023c99N34o67K85k80N78K24j48j97m86K0O20Q1p4M8q01Q02p5j37R9O8K98J30
7045E23m49j13k81J69J78k62L97j74K35K37o19r7L68Q9m6k25K59k43K21k90L7
$$ plain form
6881 -39 -165 269 -68 0 -45 1 -70 22 -215 110 97 -36 54 -7 -108 214 -4 -85 -41 108 -198 31 10 14 -94
6906 -94 29 150 102 6 -10 -34 -96 -188 520 481 26 191 -169 -74 -236 -184 0 -36 -112 195 -171 15 124 -239
6930 -239 189 -105 -62 69 192 -59 -112 92 -8 -3 -91 22 -27 367 43 42 -115 -7 -101 -89 -114 27 -273 -54
6954 -54 -156 167 -100 79 -64 -147 -17 -18 87 -71 -155 61 -37 -176 -62 316 -669 -29 159 -171 27 270
6976 270 -216 -130 -180 -22 161 -323 -265 -52 -183 -27 -49 -136 -23 -20 35 -72 89 -189 71 186 -145 84 118
6999 118 70 -37 4 108 37 4 -45 50 147 -197 189 48 -1 -63 -56 62 -254 160 18 155 -209 -81 38 -399
7023 -399 135 -532 -247 -527 51 275 127 -70 -556 -536 84 165 91 139 -662 140 65 -72 27 95 393 523
7045 523 74 -39 -320 -151 27 -235 162 -12 223 460 -159 -256 112 201 155 -70 189 -54 167 -123 -86
7066h6j82j13O21j20k57o64J127m32R3J38M55m51l33L30ll95q5M94J02m36K76
7087G9j03J13n8q0J01o1J48j93O8n7O1K39k68j13%J42j25J4O8Q7k22J50K03k75
7111h2K11j15o0J30J64k06R5j89J53K6M4j49j56K15k26J41m4J06k15K22m2J60
7133A83l15Q6K56k36q7K02m6R9l0j51M7J11k03K29j58O7r1j30J41L4Oj62J31K95
7157B78k66n9L1L2k2k22J65j8L5L9J67p4k39K09m9jR2j16j27K30n0J18q4k8p2
7182c1J84k18J74k58J09K15q7J36p0j85n6r5R8J20j84K16k39K81P9r9l03K93J46
7205B26k26l7L3k1R1O3k58n5L29j53P7O5l42K25p8J15j5J49n6k89O2J76j18J97
7229A60l6Q4m53J15K65j44l0k4q5J18o5L8J47p9R5j03j30m1R0m6J2N5P9m9j02
$$ plain form
7066 -86 -268 -381 240 120 -137 -801 326 -106 -13 125 580 129 -204 126 123 -272 -357 137 239 -197 79
7087 79 -24 89 31 -49 52 -9 139 -54 14 -43 18 257 -11 -124 -124 18 -107 -93 -25 62 -160 -10 193 -82
7111 -82 129 14 -46 84 248 42 137 -52 101 127 171 22 -134 81 -145 -4 -48 58 -157 65 23 183
7133 183 -132 -46 210 -26 -113 89 43 142 112 -39 8 119 -84 145 -13 54 -37 -167 -26 8 14 -148 -17 278
7157 278 12 -47 -16 16 -6 -228 -63 -81 -46 -7 160 86 -153 56 7 6 98 -18 -145 85 35 153 69 41 -31
7182 -31 153 -65 109 -149 -40 175 88 224 154 -31 -87 -182 -84 36 -148 68 -171 110 189 90 -213 80 226
7205 226 0 -37 -4 -25 66 129 -129 -184 145 -8 69 134 -208 17 -61 54 39 188 132 -157 -95 81 -37 160
7229 160 124 208 -245 -130 135 -9 -39 -63 -148 -30 -95 -57 90 11 106 3 -127 -168 -78 -124 -112 -57 22 -27 -129
7254a29L6M4J68k7j53J98r3j38J3J86j4n6j79q9K55j18OO0o5K02n7nP6j15P5j39
7280e8J57k3j72K55k52k0J10J03j4k3o8j3q4p7K98n2k00k7K55j24J32n1k08K84
7304A28m3j53K69k05q3L2J25O1j77mL5L8m7j5N3n9K28m3l31J75j04n8L00l87K47
7329a8QP1q1r9Q4j05K8N8p4J3Q5N2j67Q1K84k44N7r3K53j87n6J37m31K60K18o4
7355G0R9q9k7J4n1l1P3n8K9M4o4J77j29p3j03R5m0n5J32o4J07m5n9r9J5L23l37
7382a46J72lj19j3K4J83k22J16J53k23j25M16m3r3P7o2k59K88j11j44K37o4k31
7405a92K28j46K40m3j38J76k8k00q7J92K5j49J0OK2J4P4J10m0L8k14J68k14J44
7429dk25K94j73O7J80r1j40K62n7j77r7J01R8R0k66j56J43J25K11j46K8j26K89
$$ plain form
7254 -129 -93 -49 119 92 -61 137 44 -94 -81 105 91 35 -144 -233 22 -96 -90 -30 -95 107 50 45 121 6 81 -58
7280 -58 99 76 -96 159 -93 -113 -3 100 86 63 -5 -18 -102 -179 119 67 -133 -160 95 -29 103 52 -156 128
7304 128 85 -68 201 -4 -87 -55 70 131 -46 -50 -15 23 -24 -39 14 -45 183 140 -191 -16 -120 -178 122 -265 -18
7329 -18 -10 61 -20 -119 -35 -140 -112 -54 -128 -115 -30 22 -145 -64 220 -24 33 -60 193 6 -50 87 -344 -84 134 70
7355 70 169 80 53 67 16 -15 58 0 29 73 9 186 57 -16 -119 -24 -64 -119 13 -51 56 11 -48 -147 -132 191 -146
7382 -146 26 23 -96 -109 -85 98 -124 -8 145 -78 -203 213 170 77 154 92 -167 121 10 -134 103 39 -192
7405 -192 36 -110 130 87 -51 125 97 -103 -190 2 27 -122 -112 -106 -84 -70 4 114 74 112 -102 66 -148 -4
7429 -4 -229 65 -108 -41 139 48 -92 170 113 -64 -161 -60 38 128 -138 -294 -151 -26 185 39 67 -59 230
7452B30k49J96j49J7n7q7J13O6j58J46l1o2k4k5J43q0K16j55j12o7Q8no7K52o9
7477G0r9J21O8L6l82o6pK89M2p9J02O4n9j33Q5M7m6j82jQ1J15qj35J30p2j2r5
7504a26Q0K5j9N2J37j97J11l4J78k46K36j14K5M7l3k4j8j11K2l7K20k29j5J34
7528F4nJ15j73j67L14nl01J08L4J7l8J95j83j05K92k16K71k12n8j06K5J75k1K8
7552D8j62k3j13M42k35J35k48K68k54j47M32J3j41J16j60R9j35j5K95l43J98k03
7574a33O7r3J58p3J39o9n6J80k86O2PJ54k9j10J22J00m4R5k09lOQ0j24q1l0J15
7600e5J85p2kk39J68L9j59J06N6j00Q3N3J09M1j52J65m86L62k11J83j1j7O9k08
7624i3j7J51p1L4J81k2M5k66P9j3q4N3K20k26Q5j73mK95j48j88K69lQ0j03j22
$$ plain form
7452 230 -19 177 28 45 -12 -99 14 80 -78 68 37 -25 -49 -74 69 -11 205 50 -62 -129 -41 -46 -113 139 70
7477 70 -29 92 160 196 -186 -252 -259 30 72 -7 95 159 100 -33 52 99 53 -129 -130 -49 66 58 -77 53 -19 -31 -126
7504 -126 -46 -21 -40 12 149 -48 63 29 207 -39 197 83 108 155 122 98 80 -31 -9 -46 174 -55 -70 64
7528 64 59 174 1 -166 148 143 -158 -50 -16 1 -37 158 -25 -130 162 -54 217 5 -53 -159 -134 41 20 48
7552 48 -114 -137 -250 192 -43 92 -156 112 -142 -289 143 156 15 131 -29 70 -65 -80 215 -128 70 -133
7574 -133 -66 -159 -1 -74 65 -4 -60 120 -166 -104 -97 57 28 -82 40 140 96 191 -18 -21 -15 65 -59 -140 -170 -55
7600 -55 130 58 56 -183 -15 24 -135 -29 27 -73 10 63 172 213 61 226 -260 102 -109 74 63 46 115 -93
7624 -93 -110 41 -30 4 185 163 208 -58 21 8 -76 -23 197 -29 56 -117 -121 174 26 -162 107 104 184 81 -41
7649d1R8M1l7N5lO9R6k80r1J7J01N9j52M1j72M49l75l8J43l3J22j84J75k02J36
7674fn4O4L28l78o0J3N9K0j99J48q0K88n3j58K32k68Q4P0n4M1L8Q9l32R5N6N8
7700D1K6l40n2J96nK88r9o4o9J7L8j00k1J65j31K11j68PJ50m4M3k09J07m5J8J56
7726A16k40j21J60O0j28J24l6K7q0K56l20M75l11J6r1l1J27J34l2j97R8j88J65
7749a7J24p7R9j47MN9P2M4j42p6O5j29J37j88K10M8J7m7j65J22K17k34j4J29p2
7774C9j32K69L1j37P9p5P1r5R1k34lJ57K3k23j40K59Jj10J76k39J45J79j6j20
7798dn4J42R1m0R9m41K82l7n5k1p0k3K19j02P4r3k12L67k44K24k65L10j20J22
7822A49l46L96j79m9J27q1O0k01k6P0L5J64j56L3l0M36m00l5K1L6K3j2Jp0RQ4
$$ plain form
7649 -41 57 98 61 116 113 182 278 -2 -93 -76 25 84 -68 -27 -199 250 -125 -163 -20 -53 69 -115 60 -142 -6
7674 -6 -60 4 332 -46 -106 -93 -34 -14 -213 -65 -145 143 90 -68 164 -104 -20 50 -4 37 75 164 -168 -73 -17 41
7700 41 67 -273 -325 -129 -134 154 55 -9 -78 -61 -23 -123 -144 21 -110 101 -67 -60 90 46 89 -120 -13 -58 -40 116
7726 116 -124 -245 -85 -25 -153 -29 -65 -38 -118 138 -182 293 -18 -2 -93 -124 3 137 105 -92 6 -182 -17
7749 -17 107 30 129 -18 -14 45 117 161 19 -57 8 -121 16 -172 38 86 103 56 -109 13 230 -4 -18 111 39
7774 39 -93 176 207 70 149 74 145 50 141 -93 -96 61 84 -139 -279 -20 -19 -129 47 -192 -47 132 116 -4
7798 -4 -58 84 175 135 234 -207 75 38 -17 -38 -108 -131 88 -14 60 -33 -245 122 -122 102 -163 147 27 149
7822 149 -197 199 20 -29 98 17 77 -124 -150 -80 -45 119 -37 -4 -34 402 2 -33 -12 24 47 35 36 -34 -25 59
7848E9M1l7O3k57J28m5o5K25k58J04n0P6R1P5k50%N3P4M1K0j14nK73l49J01j15
7874a21J20J5N8K7j87K28jj83NrK3J45k66p4K24j68J05J14j36J98km3j8M7K0j23
7900bQ0R6l7j62K3K2k7Q5k46L43k19J54o7k7m0j25K56j47mk6K8J85l60J03k1J72
7926C7L21l31O8j19l6N8n6P4k72K36Mr9N0o9J69m3J9k47M55l10J32K1o9l9QJ43
7952A05l7m43L97k53Q7J00q4J08j79J82k54K27Q3p2K03jj26J35l38L76l85K62
7974I3R8j36J11k16O0L9j38K08N9j29j5q6K16j01N0j9r4J14j01R4k60J3L4J15
7998Ij61K35O6j28j7OP7K8j92L7P9j23P5K12j61J22o7n0L3r5n5J89j63J4JmO1
8025B8n8J78j68l7J67j33j00K11j74J10J83pk71J34r6J46q9j43J66j8J84l64L3
$$ plain form
7848 59 100 63 126 -131 -3 -48 -113 112 -146 -42 -92 -16 75 150 -100 -100 -47 27 68 88 -26 -31 242 -107 -6 -121
7874 -121 -1 14 72 99 -88 140 139 -44 -39 -48 -25 120 -146 -220 4 -164 -59 55 -81 117 115 72 54 101 121 -2
7900 -2 78 174 137 -25 -2 20 -7 78 -168 175 -44 110 43 16 -24 -149 107 -40 -44 -70 -42 143 -217 -114 -135 37
7926 37 358 27 95 -24 -60 -2 -58 16 -256 -20 -16 -115 -65 -134 35 -8 11 -236 219 -91 41 62 -7 -46 -38 105
7952 105 68 -375 22 -231 -144 -44 -128 -20 -199 -17 -271 -44 39 -33 170 169 43 178 -160 216 -169 93
7974 93 191 55 166 -50 10 49 -89 119 178 49 34 -52 164 63 113 94 0 114 13 107 -153 -140 -106 9
7998 9 -152 83 149 21 4 10 87 115 -77 -40 39 -84 -9 203 42 164 97 47 80 -15 -70 119 -44 -30 -29 -33 28
8025 28 -30 148 -20 -57 110 -23 -123 88 -86 24 207 200 -71 63 -33 113 24 -119 47 29 213 -151 -118
8048a18N3J41k58L58j50O2J01j2j9j50K2J8k74K56k75L37l3j01Q2J9q3K91j76
8071I1J43q2k53J57j12J67q3q0k19J76j5K1r8L05l04J24J37j22J08O0k67L27k48
8094f7K9k0j57K67k06Q7l5K7qN8p0K20j15J57q4l0n1L1j13P6p4K29j71L5k89M79
8120B05j60K04l25J19m9L1K2p0j20jK66j88l9K35j26j96J67LJ80M0o3l6j24P1
8144D6L4k05O4J63j35j75K85l97K45j8NL59k56Q1j97R1l9J37n0j62K05j40P0L8
8168D9l9j63J42j05J31j90J07J1k05K29J43l3J0p3J80j2O4k63N5J2l8m1p7
$$ plain form
8048 -118 -65 76 -182 176 26 88 189 177 158 8 30 48 -226 30 -245 92 59 -42 40 59 -24 267 91
8071 91 234 152 -101 56 -56 111 28 -52 -271 -95 -110 -89 -187 118 -186 -62 75 -47 61 121 -146 181 -67
8094 -67 -38 -58 -215 52 -154 -67 -102 -75 -83 -25 -95 125 10 167 83 53 2 33 -80 -4 -78 151 -20 15 -274 205
8120 205 45 249 -76 43 -6 25 47 -23 -143 -144 122 -66 -105 130 4 -192 -25 -22 158 198 135 99 -25 46
8144 46 80 -125 -61 102 -33 -208 77 -320 -75 -93 -88 271 15 96 -101 -10 -49 88 38 -124 81 -59 11 49
8168 49 10 -153 -11 -116 15 -175 -68 -57 -262 -33 110 77 87 14 194 182 246 -17 38 50 12 -29 -106
8191a06
$$ Imaginary data points
##PAGE= N=2
##DATA TABLE= (X++(I..I)), XYDATA
0@%%%%%%%%%%Qj6J6j6J6k4L2m0M8n6P2q6J01j19J36j59J84k10K44k83L26l72M23
33B25m79N41o09O84p69Q61r60J069j188J319j463J619j788J974k179K403k649
50a389K917l212L540l905M312m770N288n882O569p371Q329r493J0942j2806J5307
65H376j8855K4314l3887N5488j92583M5061L90370j61200k58939K0656K26786
76A05587k3404j46471j5636R9578J1861J8265K2255o9311j21278N0308J60954
87I2708J0202j62192k2645J31620K1145j23113l6969Q2676N4416k2692q59p616
99A6681p4051j7949J09893N0526r0553n4537Q5072N4792r4241p7068P2868P3501
111E4934k3926k6696j379l2977k3947N6364N5995o1104o0749Q6779O8633j11521
$$ plain form
0 0 0 0 0 0 0 0 0 0 0 0 8 -8 8 -8 8 -16 16 -24 24 -32 40 -46 55 -64 72 -87 97 -113 131 -152 174 -198 225
33 225 -254 287 -322 362 -407 454 -506 563 -625 694 -769 850 -938 1036 -1143 1260 -1389
50 -1389 1528 -1684 1856 -2049 2263 -2507 2781 -3101 3468 -3903 4426 -5067 5875 -6931 8376
65 8376 -10479 13835 -20052 35436 -157147 -112086 278284 117084 -141855 -121199 105587
76 105587 82183 -64288 -79924 19654 31515 49780 72035 2724 -118554 -68246 92708
87 92708 102910 -59282 -81927 49693 70838 -52275 -89244 -6568 47848 25156 24297 16681
99 16681 -57370 -75319 34574 85100 -5453 -59990 25082 79874 -14367 -91435 -18567 54934
111 54934 31008 4312 2933 -30044 -53991 2373 58368 -2736 -63485 23294 91927 -19594
123a9594r7089J02309J22604p2201j12300P3433R2552j02531j02762J02381J20577
134A07379p0657j14277N1317R0869o4124q3556O3488Q4312k8429n6197P948J3209
146A282k8986J1617O2642j1613o7527J4730N9433k6694p3473K0170Q9447l041
158D7987p8231j5M8992j8675l9219L0206N0510k1099m6530K2101K9734l9108k2441
171c5788M6794L2344k9081l0983J0715N299k2488J4921M0183j9416l8608J9586
183f522K9393l2168l9112M3787O2910l7698o3314L1954M7552l6533m5353M3538
195a566O2559l6820p0038K3200N1684k2858l8284K1174M0763q158l7771n889R502
208a2502P49K4265K1803l0404l4060K3610M0236k3546n3988K5489P1242j2182
$$ plain form
123 -19594 -116683 -14374 108230 36029 -76271 -2838 89714 -12817 -115579 -13198 107379
134 107379 36722 -77555 -26238 64631 507 -83049 -19561 64751 36322 -19875 -11927 1282
146 1282 -27704 -16087 46555 34942 -32585 -17855 41578 14884 -58589 -38419 51028 47987
158 47987 -30244 -30259 18733 58 -39161 -8955 41555 20456 -26074 -3973 25761 -13347 -35788
171 -35788 11006 43350 14269 -16714 -5999 -700 -23188 -8267 31916 12500 -26108 -6522
183 -6522 22871 -9297 -48409 -4622 58288 20590 -42724 -10770 36782 249 -45104 -1566
195 -1566 60993 24173 -45865 -22665 29019 6161 -32123 -10949 29814 21656 -16115 -22004 -12502
208 -12502 -11753 12512 34315 3911 -30149 -6539 33697 10151 -43837 -18348 52894 40712
220D0712o9547j1541M4056J6987k6807o430K3780m079j8625Q559L106j7105M276
233a2658L3559J4018l6120k9624K5074K2252j4638n261J2824J649j3345n066P017
246c19j0018j1786L0286K7311l2547l8789J7435L9836n756l7688Q617M1213n007
259B2788l4566p634J6787J2285j492j184j077j3927k600J5605n317j5619J1111
272d840K2883l564k8605q165K5759P395j6310M677J5851n944j7747r38J6125R4
286F671j4382R840J5213j5218j9521M308J5896L804r622K339P109j0285n594P563
300a879J685PP032P483p101k0324N30K2185N84j5060J995J1941j225j7507p269
315a6923J6092P742p381J043K405n800l403K949O907q81m270R110L408j4115n900
$$ plain form
220 40712 -28835 -40376 3680 20667 -6140 -12570 11210 7131 -11494 -2935 171 -16934 -12658
233 -12658 20901 34919 -1201 -30825 -5751 16501 1863 -3398 9426 11075 -2270 -7336 -319
246 -319 -10337 -22123 8163 35474 2927 -35862 -18427 21409 15653 -22035 -13418 27795 22788
259 22788 -11778 -19412 -2625 9660 8168 6984 5907 -8020 -10620 4985 -332 -15951 -4840
272 -4840 18043 14479 -14126 -22291 3468 10863 -5447 -770 15081 9137 -8610 -9548 6577 6671
286 6671 -7711 2129 17342 2124 -17397 -13089 2807 6611 -3011 -672 6437 -3848 -9442 -1879
300 -1879 -194 -187 6845 14328 7227 -13097 -12567 9618 10202 -4858 -2863 9078 7853 -9654 -16923
315 -16923 -831 6911 -470 573 2978 -2822 -6225 -3276 3631 2750 -1520 7590 10998 -3117 -9017
330i017P387O267o80m476L293J236j1134k413Q351J013j196K971K890k326j0497
345h331O24J3481P70o315K075K926k744o636j718Q904K321n004P14k253n136J959
361d363K960J923l15j284N036j373r974J891R100L866k806n288J093L289n734
376a979j808M613Q72O53p81l900j973j950K994O741j840l094K138q05k71J7m72
393h45K729Q02P53L000n989p694L291O917K493n366o698N283N106o030m440J440
409e248O741O454m318p225j740K879P781K907q242l685M441M663j212r805l173
424h782J0933O673o292r810l379J0380Q065o110p136M32P500N752o477q136K586
439c801P447N555l233j0989k452P734O524k345j1011k731J2474N967j0232j0674
$$ plain form
330 -9017 -1630 4637 3957 -519 2774 4010 -7124 -9537 -1186 -173 -1369 1602 4492 2166 -8331
345 -8331 -7707 5774 6544 229 2304 5230 2486 -4150 -5868 3036 5357 353 1067 -1186 -6322 -4363
361 -4363 -1403 520 205 -1079 3957 2584 -7390 -5499 3601 7467 4661 -627 466 3755 -1979
376 -1979 -3787 826 1698 2351 1570 -2330 -4303 -6253 -3259 3482 1642 -1452 686 -119 -390 -373 -845
393 -845 1884 2686 3439 6439 450 -7244 -3953 2964 5457 91 -6607 -1324 3782 -2248 -6688 -5248
409 -5248 1493 7947 3629 -3596 -5336 -2457 5324 8231 -11 -3696 745 5408 4196 -5609 -8782
424 -8782 2151 8824 2532 -7278 -10657 -277 7788 1678 -5458 -5026 2474 8226 1749 -6387 -3801
439 -3801 3646 9201 5968 -5021 -7473 261 6785 4440 -6571 -9302 3172 9139 -1093 -11767
453a1767L623J5227L556j3318n058P672N431k167n005J233M685k716j813K277
467A860j997l873J188N065K933p068n786O148L702k880j544K116L005j045l614
482a790K972J215m830J525O300J150p194q246N474J1463l374j1004j187Q254O641
497G369o790r542M064Q954K557l931o429o15N160M108R32o023p664N858J2019
512A0027k069j5418p860J4998J6714j1013k0377L146J8787O280j6009j0510J2297
525a007J1598n128q794j503M325L925O43l01n075o431O367R156m600j0839l48
540h012J2421N004j2355p441R051P629l029o409J004N604j164m482K344K094k001
555B58j001J423K021k728n166K977N658j278m226j020K540K457k914p66L634Q5
$$ plain form
453 -11767 -8144 7083 10639 -2679 -7737 -65 5366 3199 -1806 -573 4112 1396 -417 1860
467 1860 -137 -4010 -2822 2243 5176 -1892 -7678 -1530 2172 -708 -2252 -136 2869 1824 -1790
482 -1790 1182 2397 -2433 -908 5392 6542 -652 -8898 -3424 8039 4665 -6339 -7526 728 7369
497 7369 579 -8963 -4899 4055 6612 2681 -3748 -4363 797 4905 5837 -186 -7850 -1992 10027
512 10027 7958 -7460 -15320 -322 16392 5379 -14998 -11852 6935 13215 -2794 -13304 -1007
525 -1007 10591 5463 -3331 -4834 -509 3416 4059 3758 -1317 -7748 -1381 7775 3175 -7664 -8012
540 -8012 4409 9413 -2942 -10383 -1332 6297 3268 -3141 -2137 3467 2303 -2179 165 2259 258
555 258 -743 680 2701 -27 -5193 -2216 3442 2164 -2062 -3082 -542 1915 -999 -1765 1869 1954
571A954k926N58L405R08o548l127R262N302q794r128N074J1556j461j3643j666
586i274J2459N051q084p758L424Q328J03l526j814r91J581M288M90n926m506N390
602g65Q617m077j1450L26J0304M179p568p033M504P412j242m519j874K017L938
617B769R25k474k777j325L408L895k932m549k64M099L057l876m936K484N085J094
633C683m364m029L293N280j396m189j24L162K001l118k213K363O85j428K91N78
649D75j74j534j122K994N40k453j11J828M76p08j279J018J027q12P13N31j896
666d87l35J349R93j140k309N60K897r56k059J54R36J102k25j037M55L35j13O20
684G40j44o15K00J97N51n17j021J58R34k80k12q70m03J372L11o43o62J41J439
$$ plain form
571 1954 -972 -414 2991 3899 -2649 -5776 3486 8788 -6 -9134 -4060 7496 6035 -7608 -9274
586 -9274 3185 8236 152 -7606 -4182 4146 4249 723 -1091 -2082 -501 3787 4277 -1649 -6155 -765
602 -765 7852 3775 -7675 -7349 2955 7134 -434 -7467 -2963 4449 3207 -1312 -3186 -1169 2769
617 2769 3694 1220 -1557 -2882 526 4421 1489 -3060 -3324 775 3832 -44 -4980 -2496 2589 3683
633 3683 -681 -4710 -1417 3863 2467 -1722 -1846 1316 3317 199 -2014 349 1034 -394 -103 475
649 475 301 -1233 -2355 639 1179 -1274 -1385 443 919 211 -1068 -50 977 165 878 1409 -487
666 -487 -822 527 1520 380 -1929 -1369 1528 572 -1487 -1333 -397 705 480 -557 -102 233 120 740
684 740 596 -19 181 378 929 412 -609 -451 483 203 -9 -879 -1282 90 401 -242 -904 -763 676
703F76N42j841j60J588M18p41r92J99J282n13j294L26L96M56j81r93K29K65K83
722e5K71o18J41R20k79m96M8M67O62l96j257Q16L81n49k19j44J92L63p64nO10
743H9m17j07M44N5L01n59J17N81q4j41J35m83N71j27m03j94R1K18J91m90n20N68
765a64M6r3%q0M39M5n18M76j26j16L39P1j95K69l40P4M7m73J70N8r6K01j47l31
789d44L00R1K30J60l39j30J88M48k45l15L06N64o19o56J95J67K99k75n92L49N25
810B07k76o3k03k7O82p8l35pK13L46j91n06L15N08j88m54k94J9K72j14J70l0l26
833c60L45K78m46K26j11K26M36l73l15K83Q3M8k46j49J09Q1k41K89m58o9N44j41
855C9%j01l12K36L56j95K6K16l05j8M35k52rm4n5K46n26N4M3P8qJ98m39K43J24
$$ plain form
703 676 1218 -623 -783 805 1223 482 -510 -311 971 458 -836 -510 -114 342 161 -832 -603 -338 -55
722 -55 216 -402 -261 659 380 -116 -68 399 1061 665 -592 224 605 56 -163 -307 -115 248 -516 -521 89
743 89 -328 -435 9 64 365 -194 -77 504 420 279 414 -69 502 375 -28 -222 -131 87 278 -212 -732 -164
765 -164 -118 -211 -211 -291 148 193 -325 151 25 -91 248 319 124 393 53 127 174 -299 -129 -71 -167 34 -113 -444
789 -444 -144 -53 177 337 -2 -132 56 504 259 -56 250 814 195 -461 -266 -99 200 -75 -667 -318 207
810 207 -69 -132 -335 -362 320 242 -93 -100 113 459 268 -238 77 585 397 -57 -351 -332 -60 -174 -4 -34 -360
833 -360 -15 263 -183 43 -68 158 594 221 -94 189 272 320 74 -75 34 115 -126 163 -295 -364 180 39
855 39 39 -62 -374 -138 218 23 49 265 -40 -58 377 125 116 72 17 263 -263 -209 -166 -88 -96 102 -337 -94 30
880C0o1J63k01l95O08J46K37o54p9O22l4k96j87J61j49K3j65qK63j07K14j33k06
903b08J9L25n2k07M8k8M89j90q8j00O3k49K15J64j99n22J43P79m05l19J38M00
925B16K60n54j89O09j66m48M51K35n98K6M2M61K6q23L83L72j81m03j62N42J94
946B93n47J66q0j32J41N57j31m55J88M74n4l57m45K48L27p9Jp73M23M50O3j70
968A08n64L16P16k76p22K64M05K85n93R9J11J38m54N66m6m35m02N72N41p66m25
989e62M16P07k34p54J45N61R4o90Q3L72J63l48J34J68l76j21K2O20k93m22J1M39
1011A35k53kjJ28P0j37k4K45l07J38Q1j23l8m9K39p5P8M1k06l65Q01o0k75l64
1035c23J9M67ll58P2L25p7k68lK29j54M0Q0K31m71k41N37K02l61m64M05N27q7
$$ plain form
880 30 -31 132 -69 -464 144 290 527 -127 -206 416 382 86 -101 60 -89 -66 -231 -239 24 -83 131 -2 -208
903 -208 -189 136 84 -123 -75 -103 386 196 108 8 71 -178 37 201 2 -520 -377 402 -3 -322 -184 216
925 216 476 -78 -267 342 176 -272 179 414 -184 -158 -116 345 371 -452 -69 303 122 -281 -443 99 293
946 293 -254 -88 -168 -300 -159 398 267 -188 0 474 420 63 -382 -134 193 114 115 -658 -235 215 278 108
968 108 -456 -140 576 300 -422 -158 247 532 -61 38 149 287 -167 399 353 -82 -484 88 629 -137 -562
989 -562 -146 561 327 -427 -282 279 373 -317 -234 138 301 -47 87 255 -121 -242 -220 400 107 -315 -304 135
1011 135 -118 -120 -121 7 77 -60 -84 161 -146 -8 73 -50 -88 -137 102 27 105 146 -60 -425 376 316 41 -323
1035 -323 -304 163 160 -198 -126 199 122 -146 -149 80 -74 -34 46 277 -194 -435 102 304 -57 -521 -116 411 324
1058C24p18K06L07k29J25k23L41k20n3N0M54k94q1R8j29J03k39K77J85l97J54
1079D1m0k08K70j21O3j04L02q3q3J24k05Q3kP7p5r7K09k05Ol5N3P7k04J26L20
1104B89l24k0K11j14j59J76qk5l7r4J42j50Q0J2K59j51k15J6J40k3j32J25K19
1127B17k88K9O0K2j94j11L23J16j79n4L17p2l04J9K55N0k00k60M28p3k16j24J98
1150d1n6pJ63J46l4k56P5R1J14m07K07%k4j21N1K86k40R6j10J05k38mK67j11R2
1175D4j67M76j82l06J56J41j66P2O7j61K7m3K03k94J27O9N5l5m6N0rQ8k25J06
1199D7q2J32l9j79J09Pl3mP9K01k04j71J04R4j38P3K37k57K12r3j61o6k2L46Q
1224B00j31k5r6m8j11M17j1j20j86M68l46j89N1J91o0o8j8J49j08P6j29RN9N7
$$ plain form
1058 324 -394 -188 119 -110 15 -208 133 -87 -140 -90 364 70 -11 87 -42 61 -178 99 284 -113 41
1079 41 1 -207 63 -58 5 -99 203 120 37 161 -44 39 37 114 39 -58 151 -54 -48 -83 -30 47 -157 -31 289
1104 289 -35 -55 156 42 -117 59 51 26 -11 -105 37 -113 -33 -21 238 87 -128 -112 28 5 -127 -2 217
1127 217 -71 -42 18 40 -154 -265 58 174 -5 -59 258 186 -118 -99 156 206 6 -254 174 101 -115 -239 -41
1150 -41 -97 -104 59 205 171 -85 -10 81 195 -212 -5 -5 -29 -150 -99 187 -53 43 -67 38 -200 -204 63 -48 44
1175 44 -123 353 171 -135 21 162 -4 68 135 -26 1 -42 161 -133 -6 63 118 83 37 87 78 166 -59 47
1199 47 -35 97 58 -121 -12 -5 -38 -42 37 238 34 -137 -33 61 -77 -4 233 -24 188 95 -66 -132 -154 192 200
1224 200 69 44 -52 -100 -211 206 195 75 -111 357 11 -178 -127 64 4 -64 -82 67 -41 35 -94 -85 -26 31
1248C1J9Q0k45K35p7r9J78j2q2R8k15P6lK0m3PP2p7j10J94o0J27k52j2m4J37q3
1275a40N1p1J84Q2r8ll6ql2K8p2J41j16K53o0m6j64J26J28q2r8K97l10J3r4J44
1301A7J31j84j53K80j15L8Q5K3j94mP7P8k8M6k13J06m6L23j44k9o8R2k39jk9R4
1327e7J93j39k7LJ0l3j4R5P7q1j6M9r8n1R9Q4j52J58J11j82J15j81j4K58q5j60
1353c8J40k0j56J10j57J35M6j60RqK17k09J62Mj97L4K15r2p0l8J78j14l0J74j83
1378d8L7J80l02J71p7k55K64J35o5Nl1j8R1j37J1J0K9p0Q2J04j99M7n5K0n6l8
1404a65J64K6N0p2J01Pk44P6K88j71j3P1L9j30l4o1RR3o3K54j30o1J9O1j06r4
1430h6J72J92j80n0R8j37l2o9J98j27k83J74J89k4j71K67k10M1p2J97k17M18m58
$$ plain form
1248 31 50 130 -115 120 43 -56 122 110 28 126 -89 -13 -16 4 -39 -32 40 -37 -147 47 -13 114 -138 -150 -194 -57 -140
1275 -140 -89 -160 24 106 8 5 -31 -39 -71 -43 -115 26 -90 163 103 57 -107 19 147 65 -33 264 -46 -33 -127 17
1301 17 148 -36 -189 91 -24 14 99 122 -72 -76 1 79 51 97 -116 -10 -56 267 123 94 26 118 -121 -122 -151 -57
1327 -57 136 -3 -30 -27 -17 -50 -64 31 108 27 11 60 -38 -89 10 94 -58 100 211 29 144 -37 -51 207 122 -38
1353 -38 102 82 -74 36 -121 14 60 -100 -91 -99 118 -91 71 75 -122 -88 127 35 -35 -73 105 -9 -39 135 -48
1378 -48 -11 169 -133 38 -39 -294 -30 105 40 45 14 -4 87 -50 -39 -29 0 -70 12 116 -83 -36 -91 -71 -127 -165
1404 -165 -1 25 75 3 104 111 -133 -57 231 60 47 118 157 27 -7 -68 -59 34 -29 225 95 34 53 114 8 -86
1430 -86 86 278 98 48 146 9 -23 -92 106 -21 -304 -130 59 35 -136 131 -79 -38 -110 87 -130 288 -170
1453a70n4K06J2o2K4P0j11J69Rj26J62k14pM3J71Q0l21L5J85l86J15J67O7J19
1477A83p3k68J4J79K2q6N3J05l00K93j56k00J32K54j5k06P9o7J31l83L01p0J86
1500A08j55m0J47j07J30j45J77j29l2J55k73K17J2J05o0k03j52K61m3R9j3j37
1522g8N5K5J43n0J87k39n3P8j17j42L58j35j55K22J21k79r1J43O5m3o1J45J5P1
1546A85m14R4J17q9M9J11j64LJ32O0Jk08Q7P3Q1j96JR1J56j71MP0j43J53j13o
1572c6M7R0j50n6K56j50l1O1r1pJ46k25K99O8j03k59J51n5m8J22j12J58P9j73
1596a9rK29j60l10N9L03j66J66j54K16o8P5l08K95k53N7j7J34n3%R6p9J34k33
1620f5p6j30M56k52l1J68j34Q9NJ5j39J50N5r3j30J60q0q9j2J39K31k7k56J22
$$ plain form
1453 -170 -224 -18 -6 -68 -44 26 -85 84 93 -33 129 -85 -92 -49 122 202 -119 -84 101 -285 -170 -3 64 183
1477 183 110 -158 -144 35 57 -29 24 129 -171 122 -34 -234 -102 152 137 -69 10 -57 74 -309 -8 -78 108
1500 108 -47 -87 60 -47 83 -62 115 -14 -46 109 -164 53 65 170 110 -93 -245 16 -27 72 59 -78
1522 -78 -23 2 145 95 282 43 -10 68 -49 -191 167 32 -123 99 220 -59 -150 -7 58 15 -46 99 114 185
1546 185 -229 -135 -18 -107 -58 53 -111 -108 24 84 85 -123 -36 37 118 -78 -77 14 170 -1 3 73 -70 83 -30 -36
1572 -36 11 101 -49 -105 151 1 -30 31 -60 -67 79 -146 153 221 118 -141 10 -45 -93 29 -83 75 154 -19
1596 -19 -28 201 41 -269 -210 93 -73 93 -61 155 87 162 -146 149 -104 -47 -64 70 17 17 113 34 168 -65
1620 -65 -141 -271 185 -67 -98 70 -64 25 30 45 -94 56 111 18 -112 48 -32 -121 -133 6 237 210 -46 76
1644G6JL9k91K11j67N8J95k72K24k04J58j41L6J02J22k26R0J19j83l4K33J59j15
1667A90l09J30j43L4JJ80mL6k9qm8j5k25J02M3J71j57J09k72J27K68k16K3n0J06
1692D4j44L5l1P0N2j05K76m4r4M3l1P3j39Q8k55J96l55L06m8R7K5rR9k80m0K51
1718H0j02L4n4J49j01M1r8Pn8L82l13K43k3j86J41j64OK37j56o6O0k01K44j39
1742c7J95k29j0j7K34j34J46l08P2m1L07q2q2Q4j02m8K2P9O0Lo6R7k20Q9J55j4
1768A53l00K33m6K04k77m8LJ82m2j33J35rk12K75j53J76k23K70k99K19k11J38
1790C5qJ1R1m2OP3j76o0N7N6O7k23J10j26J21p8n2M6J15N3k6p9L30k82L4j9l25
1817b91L09l5J16J22m14L02n9N8m9j98J01J29j07k1p6J2M4RL43o6j43j80OJ05
$$ plain form
1644 76 77 116 -175 36 -131 -73 122 -150 74 -130 28 -113 -77 25 147 -79 11 130 -53 -87 146 305 190
1667 190 -119 11 -132 -98 -97 83 79 115 86 78 30 15 -210 -108 -65 106 -51 58 -214 -87 181 -35 -12 -62 44
1692 44 -100 -65 -96 -26 26 -79 197 153 59 102 71 144 5 93 -162 34 -321 -15 -63 34 59 50 149 -131 -171 80
1718 80 -22 12 -42 107 6 47 -51 -44 -102 280 -33 210 187 1 142 -22 -16 221 65 -1 59 -142 102 -37
1742 -37 158 -71 -81 -98 136 2 148 -160 -88 -129 178 96 14 98 -4 -52 -30 49 109 112 46 143 -77 12 167 153
1768 153 -147 86 40 244 -33 -81 -78 104 62 -71 64 55 -157 118 -35 141 -82 188 -111 108 -103 35
1790 35 27 38 129 87 93 166 -10 -70 -13 43 110 -113 -3 -129 -8 -86 -138 -92 23 76 50 -29 301 19 53 34 -291
1817 -291 18 -17 99 221 -193 109 50 108 59 -139 -38 91 -16 -37 -113 -101 -57 -48 295 229 86 -94 -88 17
1841A7K6K7j66j30M40l85m3K98j05J83q9M9j13R2q0J09L4j06K20m60m3J81P7k69
1865b36K37j47J67o2J53r7q7K72k01p6L4K48k08n7K10j45J62j8k0k8J09j24l0
1888E6R8l69L37j22k05L24k65qK14j39K15k86o6M05l46J09J11j5j0p7M0J11J4
1911A26q2j12j53J85NR9j27J29j88N6j51K43J84k26m1R8r5K28j21k2j68K69Q1
1934B17n48L07m9K68j46k22K02o0j36J98R1l00K11Q5j30r1J48j3j06J40J9n6J00
1957A29j0k26K24k36K06j28K27j60j27j6lJ67lM4K3k21O7K53j15l14M03l33J23
1980b6p7J63M4k01J12j98mK27k9p1J30r3q4Q0R1j04R0j16j86J89J44k9L0j52M6
2005b4J59l18N9L48l54JN5J32K8k88J58J23k57J76O8q9P7l10K04r0M12l03J09
$$ plain form
1841 17 43 70 -96 -226 214 -171 -214 84 -21 162 73 122 9 101 21 130 164 58 278 -182 -225 -44 33 -236
1865 -236 1 -146 21 -41 112 15 -72 200 -1 -77 -43 205 -3 -60 150 5 167 149 129 101 210 86 56
1888 56 154 -215 122 0 -205 119 -146 -154 60 -79 136 -150 -216 189 -157 -48 63 48 38 -39 1 112 126
1911 126 44 -68 -221 -36 -31 68 -59 70 -118 -62 -213 30 214 -12 -53 45 -50 178 57 35 -133 136 217
1934 217 -331 -24 -73 195 49 -173 29 -31 -167 31 122 -178 33 118 -12 -103 45 32 -74 66 85 29 129
1957 129 119 -107 117 -119 87 -41 186 26 -101 -117 -120 47 44 88 111 -110 -43 210 95 -219 184 -149 -26
1980 -26 -103 60 104 -97 15 -183 -187 40 11 -60 70 -23 -107 -27 64 -40 50 -66 -252 -63 81 52 82 -70 -24
2005 -24 135 -183 -124 224 -130 -129 -74 58 86 -202 -44 79 -178 -2 66 -23 54 -256 -52 -142 270 -33 76
2028G6m3n4q7R4j44L8K76j86J25m2Q3k33J29J69r0k90J65j32L35l31L05k64J80
2051G9P2l5j43l3J35l6J12r7k5K3k03K22o0%j69J95n21M96m2j41J17J49j58K5
2075c8J51j41j37K81j33j04K09j5j75Q4J36l3PJ2k76M3J17j99J24KJ38m6j86K59
2099H0l0o2j04O5q5J99l7L5j29Q6j48P3J75j21j67K13r6O5m2J2j5j30j6J27J75
2124A23M7rj91k54L66nJ9J33j45q7N8j50K06o9j32r3K53J62j99J4K3M9j84J47
2148H2M1l01K89l26J57Qk2J94k27O5m5J9m0O0j28R4J43k09K56N2l22l1K46j84
2172a29L76j99j05q7J76J35k69J65o3m7P3M6l02L36M8N2m8rj64k31M26j79J2K18
2196B31k37J26P4k96k3J61k20Q2J4j53L28j10J71k93J31J74m56L69n1K5q9m2K62
$$ plain form
2028 76 33 -21 -108 -14 -158 -120 156 -30 95 53 136 -97 32 201 111 -179 -14 -146 189 -142 163 -101 79
2051 79 151 116 -27 -60 75 39 151 54 29 52 -151 71 11 11 -158 37 -484 12 -30 -171 -54 95 -63 -38
2075 -38 113 -28 -165 116 -17 -121 88 73 -102 -18 118 85 92 104 -172 -129 -12 -211 -87 -85 53 7 -179 80
2099 80 50 -12 -116 -51 -136 63 26 61 -68 18 -130 -57 118 -3 -170 43 -53 12 -30 -18 -33 -163 -179 -52 123
2124 123 170 161 -30 -284 82 77 96 229 84 -3 55 -95 111 42 -90 -183 70 232 33 47 70 119 -65 82
2148 82 123 -178 111 -215 -58 -50 -72 122 -105 -40 -85 -66 -106 -46 -174 -80 63 -146 110 162 -160 -191 55 -129
2172 -129 247 48 -57 -144 32 167 -102 63 0 -47 26 72 -230 106 154 206 158 149 -15 -246 180 1 13 231
2196 231 -6 120 194 -102 -125 36 -184 -102 -88 -241 87 -23 148 -145 -14 160 -296 73 22 47 -42 -84 178
2219A78o0o9l7J43Nj32l16K88j78J84p2q7K16j37K37p9r2J26j58K56Nl10J8J84
2243A13k47R1j4j10M01l53N4P3m8k2j6M6K1p0P8j5K18K6k01k6o7K01KM4j10q5
2269a6K24j83p5J66q1k39J57j3J79k65K60j72k0K17k67J66l18K28j60K02r4Q6
2291a8J21k86J88J5J9j27K6J06m9M0j30K83k17J2K92m17P0p5J09j33K86k48k7
2314a60R8Q0J8j16L15k74J8J07o6kk3p3J71L6L5j30k19O9M2K9L5J74j24j13O7
2339fk1o4L03l07L00k32r4R9R0k14Q1L2M1K02l87J47Q3l0R7r3j15J68L0j65M7
2364hj9J89j14j6NQ8k20J6K85l15L4M5L1k63K43o3P6j53J85k6k4Q8J41r9q7M6
2390F5jK5q4J05l08R8J18P5m4n4k61K25j14L3Q9K52j00m3KO6j7k97J26J1k9K1
$$ plain form
2219 178 118 49 12 155 160 28 -288 0 -178 6 -66 -153 63 -74 163 84 -8 118 -40 216 221 -89 -71 113
2243 113 -134 -43 -57 -167 234 -119 -65 8 -40 -62 -78 -32 -11 -81 -3 -18 200 226 25 -1 -68 133 135 179 69 -16
2269 -16 208 25 -50 116 35 -204 -47 -60 119 -146 114 -58 -78 139 -128 38 -280 -52 -212 -10 -104 -18
2291 -18 103 -183 5 20 39 -88 -62 44 -5 35 -95 188 -29 -17 275 -142 -72 -147 -38 -171 115 -133 -160
2314 -160 -62 18 36 -80 235 -39 -21 86 20 18 -5 -78 93 129 164 34 -185 -116 -74 -45 -10 164 40 -73 -6
2339 -6 -27 -91 212 -95 205 -27 -121 -22 68 -146 -65 -33 8 210 -177 -30 53 23 120 27 -88 80 110 -55 -8
2364 -8 -27 162 48 32 37 125 -95 -79 206 -109 -75 -30 1 -262 -19 -82 -6 -159 26 0 -24 64 205 106 19 65
2390 65 64 89 5 110 -198 -100 18 93 49 -5 -266 -41 -155 -122 -33 219 119 76 78 144 127 -170 -44 -33 -62 -41
2416d1p8J54Rk01J63K4j6j93K21j63lJ10J69j8n4j19l3m9J58jj0j18M8r4K12k58
2442a81O9N4M6J51l19k8L32Nj17j72J51P8P0k83k0K59l81N12j28j63m7J68N7m3
2466G0l2M4r6Q9QP1m9l6P1j19n9j02L55l28K85l29M9K08l29J58p3K20k09J10K6
2491Cp6J42q3k08K16N6J35k56K43j11J46k68Rl9l7L43k30j2P6j08j8R2L5J7j13
2516d6N9j07K34l2m9m9K4J68j79m7j5K65k21j70J69J25j08J09k00M7j46J24Km8
2540i1J42J58l63J38l1R4J78n3k25J82J1j63L9J18j09J63K4l69r4J63J6J32r1
2563c1j25P2M1M0K7p0K48j97K0J14l19J13lN8j2K96q6r1l07K10r3K57k5k61R0
2588c4q2R2P6j78K85j75n4J03j5N1k43Q4L04l6j39n9J7K13k95M4Q2j00J65K7j98
$$ plain form
2416 -41 -119 35 44 -157 6 30 14 -179 42 -121 -124 -14 155 137 83 -36 -69 -118 40 39 29 -89 -41 -135 77 -181
2442 -181 -112 -58 -12 139 -180 -208 124 129 12 -160 -9 69 139 -144 -164 95 -286 226 98 -65 -112 56 113 70
2466 70 38 82 -14 75 83 154 105 69 140 21 -38 -140 215 -113 172 -157 -108 100 -229 -71 -144 76 -133 -23 3
2491 3 -73 69 -14 -222 -6 50 185 -71 172 61 207 -61 -52 -91 -128 215 -15 -27 49 -59 -77 15 50 67 -46
2516 -46 13 -94 140 108 59 10 34 202 23 -24 -39 226 5 -165 4 129 21 130 -70 -23 -169 -45 -43 -91
2540 -91 51 209 -154 -16 -47 47 225 172 -53 129 140 -23 16 134 25 188 212 -157 -251 -88 -72 60 -31
2563 -31 -156 -84 -43 -3 24 -46 202 5 25 139 -180 -67 -70 -12 -24 272 186 95 -212 -2 -95 162 137 -124 -34
2588 -34 -116 -24 52 -126 159 -16 -70 33 18 69 -174 -90 214 178 39 -20 -3 210 -85 -41 41 -59 106 133 -65
2613f5k00K80K1N5r1o3K6lm4K58n2l47K25K5o9K7J59j10l7r0J52j32j20K12N0
2638F7j55P1J7M5M3j80J84m8n4k50K62l4O2k6l6J46j04l1p5n1J48K6J84l06n8
2663a53J1N8J46o2j09J73m7P6j6k77L19k67K26k8j54M09k78j3k01K20m5O3o4k40
2687b53L51j98l6K55K12k37J2j06r1J53%kq9J05j42o5K31k00K99j33k05P9K4k6
2711f2j10j9J55K17r8k31J44k7K61j6j74Mm4J00j42J1J78k20J71j48P5j4r9Q0
2735hQ6j91P9R7j96J00r7M69l93l7L6N5k56K67Q7J7k21L08j73J50k50o9J24k6
2759d2J52j46J43r8L7l9j42K20j35n4R5R6m8j2p6rK12k32O8j27J41j58J54m7J0
2784c7J39j37J54j60J71J43n02J11K46j28K02k71n8R6n4J01j5J29l05K24k23p2
$$ plain form
2613 -65 -265 15 36 91 0 -63 -37 -40 -84 174 122 -225 0 25 -44 -17 142 32 -5 -95 57 -75 -195 17 67
2638 67 -88 -17 0 45 88 -92 92 44 -10 -260 2 -32 30 4 -32 114 10 -21 -96 -147 1 27 211 -95 -153
2663 -153 -142 -84 62 0 -109 64 17 93 77 -200 119 -148 78 50 -104 305 27 14 -187 33 -12 51 -13 -253
2687 -253 98 -100 -136 119 331 94 106 0 -91 62 62 60 -29 76 -66 -131 100 -100 199 66 -139 -60 -36 -62
2711 -62 -172 -191 -36 181 83 -148 -4 -31 230 214 40 44 0 100 -42 -31 147 -73 98 -50 25 11 -88 -8
2735 -8 78 -113 -34 63 -133 -33 -130 339 -54 -91 -55 0 -256 11 98 115 -106 202 29 179 -71 -140 -16 -42
2759 -42 110 -36 107 9 46 7 -135 85 -50 -104 -9 87 39 27 -49 -58 154 -78 -10 -137 4 -154 0 -47 -37
2784 -37 102 -35 119 -41 130 273 -229 -118 128 0 202 -69 -127 -31 -85 16 1 130 -175 49 -174 -246
2806b46K69j88K65Q4m01M85m10Q6J12J71r8k3L6k88N5J30o0R9m9j48K83o6k01
2829a03J46j21j02K12J55k66nl8j08P1J60J8k89L87k35J69k82K55Q4k35Q3J12
2851F8j67o1K79n6K16l18J44k89J79L7j38K45k24k4K82j23J16j84q3J15P0k76
2873a92K91k57J20Q9j04J64k1q9J0N4q6P5m0j40j15L00k3Q0l56L52j81J48j38
2896e9J9M3M6k4l8J57M5k23J45j64p2JL34o3J5k14R5n5k89L12rP9q6j19K80k15
2922e9m0J33p2K98j33k85J96N8k87J07R9J6o0J74j68J10r9J93M3j47j79l8J82
2945D2J04K3j68nk1J66m11L04j47j5P8L4j63K84j25j2j03J86O7J74l13J22p3j08
2969h0K31k19K9j5L1J88j17l8q9p3OJ04k80J47M59k66J33j67j4J98k31K23o1j78
$$ plain form
2806 -246 23 -165 100 184 -217 268 -142 -56 56 227 129 106 142 -146 -91 39 -21 78 29 -119 164 98 -103
2829 -103 43 -78 -180 32 187 -79 -84 -122 -230 -159 1 19 -270 117 -118 51 -231 24 108 -127 -44 68
2851 68 -99 -160 119 63 279 -39 105 -184 -5 32 -106 139 -85 -109 173 50 166 -18 -101 14 84 -192
2873 -192 99 -158 -38 51 -53 111 90 1 11 65 -21 54 14 -126 -241 59 36 116 -240 112 -69 79 -59
2896 -59 -40 3 49 25 -13 144 189 -34 111 -53 -125 -124 210 147 162 -52 43 -12 -301 11 2 81 -5 -124 156 -59
2922 -59 -99 34 -38 260 127 -158 38 96 -191 -84 15 31 -29 145 -23 87 -12 181 224 77 -102 -140 42
2945 42 146 169 1 -4 -25 141 -270 34 -113 -128 -50 -16 -179 105 -20 -32 -135 51 118 292 -21 101 28 -80
2969 -80 151 -68 -39 -54 -23 165 48 10 -79 -152 -146 -42 -322 -175 284 18 151 -16 -30 168 -63 160 99 -79
2993g9K34j69P3q8o0N9P6m4J43k13J17j34K75m03K53j3P4k5l13K69o9q5P1j99
3017b50K13N7M4P6Mj59R3M1k91K7J46J0L9j14J73p6k85O22n33M7K19k04J56j39
3041h4M6J13o4m1J17Qp7J28j83K05j09P0M5k58K2R2m7o7Q1m3J4r2J23j29R5J45
3067A10N8j39J08k23J22K8j03Rj03K44j21K77k14l0l1r1J18J00J29k36k63K76
3089B5L2j9p0l3J39q9O4j92m2Q0K69l5K0k22K6J90rl60K07N0j40J9K01r7J72k72
3115h6K51r4K3o6p3j09K28J6R0j25l3n4J9J05l62L48k7p3J11q9j39K17j12lJ42
3140A05j77J31j20J07r5m1P4LP4k3J12j86p7J46l4Q2j92J13rK79k25r3L6R8mO3
3166A47qk68M12l31J41k78M6L18r8o0j6r5P0JM2N3k04O7J27k10J89J03l52L29
$$ plain form
2993 -79 155 -14 59 -29 -89 -30 46 2 145 -68 49 -85 190 -213 40 27 101 76 -237 32 -37 -122 -51 -250
3017 -250 -37 20 64 140 144 -15 78 119 -172 -145 1 11 50 -64 109 33 -252 370 -163 -116 103 -101 55 -84
3041 -84 -38 75 11 -30 87 95 18 146 -37 168 59 129 174 -84 -62 30 -17 -84 -3 -46 -32 -124 -1 -130 -35 110
3067 110 168 29 137 -86 36 64 -39 -30 -133 111 -10 267 53 23 -8 -99 19 119 248 12 -251 25
3089 25 57 38 -32 -65 74 -15 49 -143 -185 -105 164 129 149 -73 -47 143 134 -226 -19 31 -109 -90 111 14 186 -86
3115 -86 165 71 94 28 -45 -154 74 90 180 55 22 -32 -13 92 -270 78 51 -22 89 0 -139 78 -34 -37 105
3140 105 -72 59 -61 46 -49 -90 -16 -13 61 38 150 -36 -113 33 -1 81 -111 2 -7 272 47 -46 -10 88 84 147
3166 147 139 -129 283 -48 93 -185 -139 179 81 21 5 -90 -20 -19 23 76 -128 -61 66 -144 45 148 -204 125
3190A25j46K82l09R1n8j43M3K01j33N7p2o8j42K66k46M10Q3l37K60N0k11J12k24
3213a09R8M5k1J0j62J63K2O2l5o3m7J91k53J95r8K0R6j39K22m05p2L41o6K18j23
3238I0j72n6J52p6J25j31J83j52J74Q0k79J81j60J28j97K65j48K2Q0j50k0J22
3260F1J32k58jo3K35l7q3j09o9M02J7k69j66P1J53j55J93Q9j03O1j6j03K6j16
3284a08J44J42j22l3J31j34K95k34j80N4L2N9k1J67k35J3J04J0k32J33M7q9K11
3307A54R4r9l14J51j37k25K78J48O1J08k47j37L88l09R0j63N6K74m8k01J32k40
3329a86J38Q5j84K85k11O8j78J67k47M44l4k64J02r6L37r3q1l3J05j40j46l1K48
3352E5q0J40k63K35k7P1m7N8j01k52L45r4O1j79J15j6j0P6J4k9p2N6N4N6j23p0
$$ plain form
3190 125 -21 261 -48 43 -15 -158 -115 86 -47 10 -62 -130 -272 -6 -252 158 241 -96 164 214 3 115 -109
3213 -109 -11 34 13 23 -139 24 46 108 73 10 -37 154 -99 96 -2 18 114 -25 197 -208 -280 61 -5 213 90
3238 90 -82 -138 14 -62 63 -68 115 -37 137 217 -62 119 -41 87 -110 155 7 29 109 -41 -61 61
3260 61 193 -65 -66 -129 106 69 -14 -123 -192 210 227 -42 -208 -137 16 -139 54 143 40 101 85 -18 8 -108
3284 -108 36 178 56 23 154 20 315 81 -99 -45 -13 46 25 192 -43 -30 74 84 -148 -15 32 -57 154
3307 154 248 149 -165 -14 -151 -376 -98 50 111 219 -28 -165 223 -86 4 -159 -103 171 123 -78 54 -186
3329 -186 -48 37 -147 138 -73 -5 -183 -16 -263 181 147 -117 -15 -111 226 133 52 19 124 -16 -162 -193 55
3352 55 -25 115 -148 87 60 131 84 142 41 -211 134 40 101 -78 37 21 11 87 101 72 0 56 110 166 43 -27
3378b7j68Q4J80j09L32k17n7K5j06J2M4O6j31N9l0j38K31O9j55K01j51L2p3r7
3402a24J24l2R0o2k39J40J52n9j40J13J60j99K48l86J30k9J84k84M4J82J02k9
3424H6J84k13j86K76j90j5Q6k4Q1p5N5J06m22M49j06nn7K4m9Pr5J35j18J66j10
3449a0k38M6K57m03K50K50k11n7l0KJ49K11k65N2q5Q8J28r6p1P3k6q9J97k68Q5
3474f1KJ56j34K16k81Q6p4q0L37m35Q8M5J11M4L4q2o9p0L62m1k82J64kj38J97
3499I3j47l0J61l10j8K61p1L1J50j27P9p9j52K19k22L07l8r9q5K40k92J00J03
3522G4Ko8M6j03J35n8k4J19j32k2M5LO2r6l8M3Q5p8N4J0j93L10j15j91K72n7P4
3549A59j26P9k63J66J2K1q0J96k24K31j03k79L06Rj56J0J35k34J4Q3k7j45K64
$$ plain form
3378 -27 -195 -111 69 -40 292 75 18 43 -63 -51 -7 59 -72 -13 -43 -181 50 119 -36 165 14 46 -27 -124
3402 -124 0 -32 58 -4 -243 -103 49 -10 -150 -37 123 -76 172 -214 -84 -113 71 -213 -169 13 115 86
3424 86 270 57 -129 147 -43 -58 28 4 85 10 65 171 -251 198 92 87 30 54 5 12 -83 52 -66 100 -10
3449 -10 -248 -202 55 -348 -98 152 -59 -116 -146 -144 5 216 -49 3 -82 6 134 38 -33 40 14 -75 122 -146 -61
3474 -61 -59 97 -37 179 -102 -16 -90 -170 167 -268 -180 -135 -24 20 54 -28 -97 -167 195 154 -128 36 34 -104 93
3499 93 -54 -84 77 -233 -251 10 -61 -30 120 -7 72 -7 -159 60 -162 145 107 8 -77 163 -129 -29 74
3522 74 76 8 54 -49 86 28 4 123 -9 -31 14 17 79 -17 -55 -12 73 -5 49 59 -134 176 61 -130 142 85 159
3549 159 33 112 -151 15 27 48 -32 164 -60 171 68 -211 95 104 -52 -42 93 -141 -127 -44 -71 -216 48
3572D8p2j12K72m3j36L5L9Rj1J4j28kJ86j47N1k06J46L1q5J50l7J09l28L33k97
3597a81L58l81M5J88Q4j85l4J03mK53j98j12oN4p8L4J19q4L2k8Mj04J89j13K40
3622A95j50p4Q3J5k3Q9l42J97j13J59j34k3J85P4j05K6l5j24L29j89k4j02R3n9
3646e2M2m9j7Ol7R5K25j45k11J24Lj84J22o4K25k28J27J38k66J84Rk28K01J38
3670A58j83o7J25J14j47J92k96m6M73m13M2Oj06J65r6Q6j08o4M37l94M50l20o6
3693e8kmK06j2rj03j07R9J16l7j31J18o5j33J21j7j08K89p1k23J53J2J17r6k44
3718a89l2K54k19J56O5Q1k31J40J10J49m77K85J40L8k15r9L2j22K50j82j49K49
3740C4J18k78K82k72O9P6L2l7N8j44o4J68K10j60j90K34j39j34Q9K8J06J74l54
$$ plain form
3572 48 -24 -136 136 93 -43 -8 31 40 29 43 -85 -87 99 -48 3 -203 -57 -26 -111 39 2 111 -217 116 -181
3597 -181 177 -204 -159 29 113 -72 -106 -3 -7 246 48 -64 -70 -16 -94 -60 59 -25 7 -21 -17 -121 68 -45 195
3622 195 45 -29 54 69 46 135 -207 -10 -123 36 -98 -121 64 138 33 59 24 -100 229 40 16 -86 7 -52
3646 -52 -10 -59 -76 -70 -107 -12 213 68 -143 -19 -16 -200 -78 -142 83 -145 -18 120 -146 38 47 -181 20 158
3670 158 -25 -92 33 147 0 192 -104 -150 323 -90 -48 -42 -148 17 -79 7 -101 -165 272 -122 328 8 -58
3693 -58 -60 -64 142 130 121 18 -89 10 126 89 -42 76 11 -122 -1 -18 -126 163 92 -131 22 34 151 55 -189
3718 -189 -221 33 -186 -30 35 116 -115 25 135 284 -193 92 232 270 55 -44 -12 -134 116 -66 -215 34
3740 34 152 -126 156 -116 -47 29 61 24 82 -62 -126 42 252 92 -98 136 -3 -137 -48 -20 86 260 -94
3763i4j6K02o2j26J07j3rm2r1J87p3J03j0r4J33K2j62m0K15j56j33K33m88M73
3787F6j0j38K54k38k9J05m9J36q6l1J56k19J29Q5Q8m21K42J14k52J81l0p5P2k09
3811a59J39L6J09k25J56j8l7J27r9k06L41L9m5j90o3N9%j47J27J19o6q5o7L36
3835A81j80j54O6J24J7L0J25l26k51N55j38m6o7M4j33J11J20m8j43J73J03q2j63
3858h2k1Q9J30j90K20n7k70J21J57r8j53K31j54K05j61O7j19M9pM0J1j21K24q6
3882B5R1r8j75J39j35K92K7j64J28k33p6J88k7nJ75J01j38L2j52N1j42K09k47
3905a34J19J15l01K4J26L12j38j27Qqk6J24j3k04K07j30j41Q8Lj13L82j95Q6l9
3929B5q3L7J00l42L99r3o4P1K30j83m1n2J74j72k39K13K8n9O8k10M4K21k38J47
$$ plain form
3763 -94 -110 92 30 -96 11 -2 -11 -53 -144 43 -30 73 63 -31 102 124 -38 -78 137 -19 -152 81 -407 66
3787 66 56 -82 172 -66 -95 10 -39 97 11 -20 136 -83 46 131 219 -202 40 154 -98 83 53 -22 50 -159
3811 -159 -20 16 125 -100 56 38 1 128 29 -177 164 203 158 -32 -95 -36 -36 -183 -56 63 -3 -88 -155 181
3835 181 1 -153 -87 37 54 84 209 -117 -368 187 49 3 -64 -20 -153 -42 78 30 -113 60 163 81 -82
3858 -82 -103 -14 116 -74 146 89 -181 -60 97 -1 -154 77 -77 128 -33 34 -85 -36 -43 -3 8 -113 111 25
3882 25 116 18 -157 -18 -153 139 166 2 130 -103 -179 9 -18 -23 152 253 115 147 -5 46 -96 113 -134
3905 -134 -15 100 -201 -177 -51 261 123 -4 4 -4 -30 94 81 -123 84 -46 -187 -99 -96 -209 173 -22 64 25
3929 25 -58 -21 79 -263 136 43 -21 50 280 97 56 4 178 6 -233 -20 8 -51 17 -193 -149 72 -166 -19
3953a9M9N5q5n4R9j38K67r6P7m25M35j46j85P6k5J48m9j05J20J79l54q4J54K45
3977A39j13R4j91o3K1o1J66K2K8J67k54K90k42J10q6j4p0R7N8k56J99M2J2Kj48
4002e1L10k89J74K3k12qK03l3j02M1K0P7P1j02j04O0o7l1N3k2J2k5M1Q5k31N5
4028e2L47l36J84l92Q7K39J64r7m33L90M8j75q4J54J5j25JO9j05J85K4k09J65
4051F4o8J00o0l8J41k3k32K27k33o9J99o7K5P5j68J82k5j31J50J32m0q2o8J53
4075A44k51K20ql1j01M9J29l4j67k8nKJ13j98K38O8m27L13r2K47l15R6Q4N2K7
4100A25k65q9L94k59J77on4j0m7J94j07r6L6p7K03k0m7J3n7O2p6j22N7L38k71
4125dJ39n5J81j76p2N0j33J59o4k6j64K50j08j38J11K31k70P4M8J4j51K05Q7k79
$$ plain form
3953 -19 30 85 0 -54 45 -93 174 78 155 -270 165 19 -166 -90 -115 33 -16 -121 -1 178 -176 -260 -106 139
3977 139 26 120 -71 -134 -113 -174 -8 14 42 209 -45 245 3 113 27 13 -57 40 98 -158 41 83 95 97 -51
4002 -51 259 -30 144 167 -45 -53 150 117 15 56 76 153 224 122 18 78 11 -20 33 11 23 -2 39 124 -107 -52
4028 -52 295 -41 143 -249 -162 77 241 144 -289 101 149 -26 -110 44 59 -66 -65 4 -101 84 108 -101 64
4051 64 -4 96 36 -2 139 116 -116 111 -122 -191 8 -59 -34 41 -127 55 30 -101 49 181 141 59 -9 144
4075 144 -107 113 105 74 -27 22 151 117 -50 -78 -83 -81 32 -166 72 140 -287 26 -66 181 -134 -38 46 98 125
4100 125 -140 -229 165 -94 83 77 23 13 -34 160 53 -43 -7 -84 119 99 52 65 8 70 -6 -128 -71 267 -4
4125 -4 135 80 261 85 13 63 -70 89 25 -1 -165 85 -23 -161 -50 181 -89 -15 33 47 -104 101 188 -91
4149i1K48l9p8M3L9o7J06r0o7J13j41o6P3j89L24r7Q8j60J59k05O8J16n1j36L2
4174f8j01J43m2j06J82M2j59R7k87J69J14Kl4R5j45J68nJ24l65O3K16n8k7L0P5
4199A23l2j7k37K70j65J1Q1K50m69J99j57J73M6r5K32j29k43J39p2N3%J7J5m4
4223e1M9k3mj8J79L1k52M8j02J13n2M5J81j17r2L07j27L4j0j06O2q1k08Q5J60
4248E1r6P0j53K63j68j54Q6J6R5L4j64L41l38K6l6L50k58r7J70p8j13o4K20L1
4272C4oJ03J54j21k79J14r0J14J01o7r6K16j27L9j03Q4qo6J61K2o73M07P3nQ0
4297F1j46j58K75J61j87j30p6K72k65K70j22j33K81j37M9J99j49j2lP1j99Q4n6
4320e0K32k59J60q8M19n55Q7QM8O8m3R8j12J01p8j4K6J0k19O1K98p4j79K66j40
$$ plain form
4149 -91 157 118 40 83 122 55 161 71 4 117 -24 -90 -17 -206 118 21 109 -51 108 -97 -29 87 36 -100 -68
4174 -68 -169 -26 -68 -174 8 50 -109 -12 -299 -130 -16 -14 -48 47 -98 70 65 189 -176 -113 103 45 18 48 123
4199 123 91 74 -163 107 -58 -47 34 284 -185 14 -143 30 76 -19 213 84 -159 -20 -92 -39 -39 -22 -7 -51
4223 -51 -2 -25 -29 -47 132 163 -89 -41 -143 -30 -82 -37 144 27 -65 242 115 149 139 33 95 14 -194 -109 51
4248 51 -45 25 -128 135 -33 -187 -101 -85 10 44 -120 221 -117 -91 -127 223 -35 -132 38 -40 -153 -217 3 34
4272 34 28 131 285 164 -115 -1 -91 23 124 57 -39 177 50 89 -14 70 62 -4 157 179 -494 -87 -14 -19 61
4297 61 -85 -243 32 193 6 -124 -200 72 -193 77 -45 -178 103 -34 15 214 65 53 50 121 -78 6 -50
4320 -50 182 -77 83 -5 414 -141 -54 -46 2 70 27 125 13 114 36 22 48 58 -161 -100 198 124 -55 211 71
4345G1k72J84p0N0M8L6L0l40k1J24L65k12R7on4j08J20Q6k17J17o2p5K72k58K11
4370A16j58p2R6k5K61p5m3k31r3j8J94m6p0L7PJ29K07j84J75o5j06k56J41J0N3
$$ plain form
4345 71 -201 -17 -87 -37 11 47 77 -263 -284 -160 205 -7 90 84 30 -78 42 128 -89 28 -34 -109 163 -95 116
4370 116 -42 -114 -18 -43 218 143 100 -131 -224 -242 -48 -94 -164 -127 -120 9 216 32 207 142 36 -220 -79 -69 -16
$$ [...]
8191A50
##END NTUPLES=NMR FID
##END=
