##TITLE=1H_Pr 2DBA-Am 
 200.13MHz,CDCl3,
 8 sc
 
 27.11.2025
##JCAMPDX= 6.0         $$ Bruker NMR JCAMP-DX V2.0
##DATA TYPE= NMR FID
##DATA CLASS= NTUPLES
##ORIGIN= UXNMR, Bruker Analytische Messtechnik GmbH
##OWNER= pz
$$ XWIN-NMR		Version 3.5
$$ Thu Nov 27 15:13:41 2025 Russian Standard Time (UT+4h)  she@DPX200
##.OBSERVE FREQUENCY= 200.1313
##.OBSERVE NUCLEUS= ^1H
##.DELAY= (6, 6)
##.ACQUISITION MODE= SIMULTANEOUS
##.ACQUISITION SCHEME= undefined
##.AVERAGES= 8
##.DIGITISER RES= 18
##SPECTROMETER/DATA SYSTEM= spect
##.PULSE SEQUENCE= zg30
##.SOLVENT NAME= CDCl3
##.SHIFT REFERENCE= (INTERNAL, CDCl3, 0, 14.3821)
##AUDIT TRAIL= $$ (NUMBER, WHEN, WHO, WHERE, WHAT)
$$ ##TITLE= Audit trail, XWIN-NMR		Version 3.5
$$ ##JCAMPDX= 5.01
$$ ##ORIGIN= Bruker BioSpin GmbH
$$ ##OWNER= she
$$ F:/spectra/data/she/nmr/H-C/1/audita.txt
$$ ##AUDIT TRAIL=  $$ (NUMBER, WHEN, WHO, WHERE, WHAT)
(   1,<2025-11-27 15:11:57.60 +0400>,<she>,<DPX200>,
      <created by zg, POWCHK disabled, PULCHK disabled
       configuration hash MD5:
       00 E9 B6 7A A2 85 ED C7 34 08 36 98 17 FE 4E 26
       data hash MD5: 16K
       68 09 33 0B 42 C9 2F B8 AB AD C0 2A 15 BE 3A E0>)
$$ ##END=
$$ 
$$ hash MD5
$$ A8 11 FF 25 A4 29 38 47 37 6A 9E 3B C0 80 91 F2
##$RELAX= 
##$RELAX= 
##$RELAX= 
##$RELAX= 
##$RELAX= 
##$RELAX= 
$$ Bruker specific parameters
$$ --------------------------
##$DU= <F:/spectra>
##$EXPNO= 1
##$NAME= <H-C>
##$PROCNO= 1
##$TYPE= <nmr>
##$USER= <she>
##$AMP= (0..31)
100 100 100 100 100 100 100 100 100 100 100 100 100 100 100 100 100 100 
100 100 100 100 100 100 100 100 100 100 100 100 100 100 
##$AQSEQ= 0
##$AQ_mod= 1
##$AUNM= <au_zg>
##$AUTOPOS= <>
##$BF1= 200.13
##$BF2= 200.13
##$BF3= 200.13
##$BF4= 200.13
##$BF5= 200.13
##$BF6= 200.13
##$BF7= 200.13
##$BF8= 200.13
##$BYTORDA= 1
##$CFDGTYP= 0
##$CFRGTYP= 5
##$CHEMSTR= <none>
##$CNST= (0..31)
1 1 145 1 1 1 1 1 1 1 1 1 1 1 1 1 1 1 1 1 1 1 1 1 1 1 1 1 1 1 1 1 
##$CPDPRG= <>
##$CPDPRG1= <>
##$CPDPRG2= <>
##$CPDPRG3= <>
##$CPDPRG4= <mlev>
##$CPDPRG5= <mlev>
##$CPDPRG6= <mlev>
##$CPDPRG7= <mlev>
##$CPDPRG8= <mlev>
##$CPDPRGB= <>
##$CPDPRGT= <>
##$D= (0..31)
0 0.7 0 0 0 0 0 0 0 0 0 0.03 0 0 0 0 0 0 0 0 0 0 0 0 0 0 0 0 0 0 0 0 
##$DATE= 1764241916
##$DBL= (0..7)
120 120 120 120 120 120 120 120 
##$DBP= (0..7)
150 150 150 150 150 150 150 150 
##$DBP07= 0
##$DBPNAM0= <>
##$DBPNAM1= <>
##$DBPNAM2= <>
##$DBPNAM3= <>
##$DBPNAM4= <>
##$DBPNAM5= <>
##$DBPNAM6= <>
##$DBPNAM7= <>
##$DBPOAL= (0..7)
0.5 0.5 0.5 0.5 0.5 0.5 0.5 0.5 
##$DBPOFFS= (0..7)
0 0 0 0 0 0 0 0 
##$DE= 6
##$DECBNUC= <off>
##$DECIM= 32
##$DECNUC= <off>
##$DECSTAT= 4
##$DIGMOD= 1
##$DIGTYP= 9
##$DL= (0..7)
0 120 120 120 120 120 120 120 
##$DP= (0..7)
150 150 150 150 150 150 150 150 
##$DP07= 0
##$DPNAME0= <>
##$DPNAME1= <>
##$DPNAME2= <>
##$DPNAME3= <>
##$DPNAME4= <>
##$DPNAME5= <>
##$DPNAME6= <>
##$DPNAME7= <>
##$DPOAL= (0..7)
0.5 0.5 0.5 0.5 0.5 0.5 0.5 0.5 
##$DPOFFS= (0..7)
0 0 0 0 0 0 0 0 
##$DQDMODE= 0
##$DR= 18
##$DS= 0
##$DSLIST= <SSSSSSSSSSSSSSS>
$$ [...]
##$SUBNAM0= <"">
##$SUBNAM1= <"">
##$SUBNAM2= <"">
##$SUBNAM3= <"">
##$SUBNAM4= <"">
##$SUBNAM5= <"">
##$SUBNAM6= <"">
##$SUBNAM7= <"">
##$SUBNAM8= <"">
##$SUBNAM9= <"">
##$SW= 18.0517328524113
##$SWIBOX= (0..15)
0 0 2 0 0 0 0 0 0 0 0 0 0 0 0 0 
##$SW_h= 3612.71676300578
##$TD= 16384
##$TD0= 1
##$TE= 0
##$TE2= 300
##$TE3= 300
##$TEG= 300
##$TL= (0..7)
0 120 120 120 120 120 120 120 
##$TP= (0..7)
150 150 150 150 150 150 150 150 
##$TP07= 0
##$TPNAME0= <>
##$TPNAME1= <>
##$TPNAME2= <>
##$TPNAME3= <>
##$TPNAME4= <>
##$TPNAME5= <>
##$TPNAME6= <>
##$TPNAME7= <>
##$TPOAL= (0..7)
0.5 0.5 0.5 0.5 0.5 0.5 0.5 0.5 
##$TPOFFS= (0..7)
0 0 0 0 0 0 0 0 
##$TUNHIN= 0
##$TUNHOUT= 0
##$TUNXOUT= 0
##$USERA1= <user>
##$USERA2= <user>
##$USERA3= <user>
##$USERA4= <user>
##$USERA5= <user>
##$V9= 5
##$VALIST= <valist>
##$VCLIST= <CCCCCCCCCCCCCCC>
##$VD= 0
##$VDLIST= <DDDDDDDDDDDDDDD>
##$VPLIST= <PPPPPPPPPPPPPPP>
##$VTLIST= <TTTTTTTTTTTTTTT>
##$WBST= 1024
##$WBSW= 4
##$XGAIN= (0..3)
0 0 0 0 
##$XL= 0
##$YL= 0
##$YMAX_a= 634266
##$YMIN_a= -393711
##$ZGOPTNS= <>
##$ZL1= 120
##$ZL2= 120
##$ZL3= 120
##$ZL4= 120
##$ABSF1= 10
##$ABSF2= 0
##$ABSG= 5
##$ABSL= 3
##$ALPHA= 0
##$AQORDER= 0
##$ASSFAC= 0
##$ASSFACI= 0
##$ASSFACX= 0
##$ASSWID= 0
##$AUNMP= <proc_1d>
##$AZFE= 0.1
##$AZFW= 0.1
##$BCFW= 1
##$BC_mod= 2
##$BYTORDP= 1
##$COROFFS= 0
##$CY= -3
##$DATMOD= 1
##$DC= 2
##$DFILT= <>
##$DTYPP= 0
##$F1P= 0
##$F2P= 0
##$FCOR= 0.5
##$FTSIZE= 0
##$FT_mod= 4
##$GAMMA= 1
##$GB= 0.15
##$INTBC= 1
##$INTSCL= 1
##$ISEN= 128
##$LB= 0.25
##$LEV0= 0
##$LPBIN= 0
##$MAXI= 10000
##$MC2= 0
##$MEAN= 0
##$ME_mod= 0
##$MI= 1.114404
##$NCOEF= 0
##$NC_proc= 0
##$NLEV= 6
##$NOISF1= 3.799351
##$NOISF2= 2.8
##$NSP= 1
##$NTH_PI= 0
##$NZP= 0
##$OFFSET= 14.38212
##$PC= 1
##$PHC0= -3503.117
##$PHC1= 8.99234
##$PH_mod= 1
##$PKNL= yes
##$PPARMOD= 0
##$PSCAL= 0
##$PSIGN= 0
##$REVERSE= no
##$SF= 200.129724274929
##$SI= 16384
##$SIGF1= 3
##$SIGF2= 2
##$SINO= 400
##$SIOLD= 16384
##$SREGLST= <1H.CDCl3>
##$SSB= 0
##$STSI= 0
##$STSR= 0
##$SW_p= 3205.1282051282
##$SYMM= 0
##$S_DEV= 0
##$TDeff= 0
##$TDoff= 0
##$TI= <>
##$TILT= no
##$TM1= 0
##$TM2= 0
##$TOPLEV= 0
##$USERP1= <user>
##$USERP2= <user>
##$USERP3= <user>
##$USERP4= <user>
##$USERP5= <user>
##$WDW= 1
##$XDIM= 8192
##$YMAX_p= 0
##$YMIN_p= 0
$$ End of Bruker specific parameters
$$ ---------------------------------
##NTUPLES= NMR FID
##VAR_NAME=  TIME,          FID/REAL,        FID/IMAG
##SYMBOL=    X,             R,               I
##VAR_TYPE=  INDEPENDENT,   DEPENDENT,       DEPENDENT
##VAR_FORM=  AFFN,          ASDF,            ASDF
##VAR_DIM=   8192,          8192,            8192
##UNITS=     SECONDS,       ARBITRARY UNITS, ARBITRARY UNITS
##FACTOR=    0.0002768,     1,               1
##FIRST=     0,             0,               0
##LAST=      2.2672688,     0,               0
##MIN=       0,             -393711,         0
##MAX=       2.2672688,     634266,          0
$$ Real data points
##PAGE= N=1
##DATA TABLE= (X++(R..R)), XYDATA
0@%%%%%%%%%%%%MqJ2j6J6j6K4l2L6m4N3o5P6q8J02j22J44j62J85k13K44k76L14
35A68l58M03m52N07n66O31p06P86q73R66j068J181j305J440j586J747j923K120
53A112k335K574k843L144l485L875m324M851n477O234p173Q369r953J2147j5358
68h642K0325l6330L89216j47176o10604n00K31330J883n2806Q2838J2384L5396
80h2686R5927J5511k934J76832J46234o3650j56303j02939L3106K00444L8670
91B98212l00373k01485J49049N1560j84477m5475M7153j18578J6732K77372O6905
102E6595j59921Q9410J84727r5638p4860J89077Q0783j33900l5923K9421o7651
113F2120J3834Q8702j25581k38313l5167R7523M2579n306l5954j2373Q2268K5137
$$ plain form
0 0 0 0 0 0 0 0 0 0 0 0 0 0 4 -4 8 -8 8 -8 16 -16 20 -24 29 -36 40 -48 54 -68 76 -86 99 -114 130 -146 168
35 168 -190 213 -239 268 -298 333 -373 413 -460 506 -562 619 -686 754 -832 915 -1008 1112
53 1112 -1223 1351 -1492 1652 -1833 2042 -2282 2569 -2908 3326 -3847 4522 -5431 6716 -8642
68 -8642 11683 -24647 364569 217393 -393211 -393711 -162381 -160498 -213304 -130466 -118082 -82686
80 -82686 13241 28752 25818 202650 348884 285234 128931 25992 59098 259542 298212
91 298212 -2161 -203646 -54597 -3037 -187514 -232989 -185836 -304414 -287682 -10310 56595
102 56595 -103326 -13916 170811 75173 313 189390 270173 136273 100350 129771 62120
113 62120 75954 164656 39075 -199238 -234405 -136882 -94303 -99609 -135563 -147936 -65668 -40531
125d0531q8453Q1663K16029o8793j96278J69994K52534j42268j70641J43816L9110
136A96182k26808o8145J13130l0972q7465K3083k0478o0271P3089P2057p8298
147i4896n0883O9501P5656O8851M7448m1378o971R3369k4056j36967L7339J11207
159A48220j09171j30416Q4166M2470j05715N853N4696j16752p5779J27874O5050
170i504n9499N1097Q6125n3781j6683J06757J2437p9905P990K5137l8131R387
182D1427L7697l8174m6532k6921p3122j5531R4743n141j05956N5740J24569o3079
194b0280n9232J34144N5342j25070j7115J06894Q327k3406M8560k7191r7461J5728
206g60M6672p3025o2100L3996R102j9607K0525O653m558M0568l169o6677L7294
$$ plain form
125 -40531 -128984 -47321 168708 99915 -96363 73631 326165 183897 13256 157072 196182
136 196182 -30626 -98771 14359 -16613 -104078 -80995 -101473 -161744 -88655 -16598 -94896
147 -94896 -145779 -76278 -622 68229 115677 74299 67328 160697 136641 -326 37013 148220
159 148220 39049 -91367 -7201 35269 -70446 -64593 -9897 -126649 -202428 -74554 -9504
170 -9504 -69003 -17906 68219 14438 -2245 104512 116949 37044 45034 70171 32040 41427
182 41427 79124 40950 -5582 -32503 -105625 -121156 -26413 -31554 -137510 -81770 42799 -20280
194 -20280 -79512 54632 109974 -15096 -32211 74683 83010 59604 108164 80973 -16488 -760
206 -760 45912 -27113 -89213 -55217 -46115 -65722 -45197 -38544 -43102 -2534 -5703 -72380 -35086
219c5086J13486j1391n8122N7739L3464o9417Q611N6987q1354r3235N4964L8365
231A5011o2061J278N0028m3675m7874M2767J4480k8994M1720M9775k5131p28N3943
244F0539J6812r617o796m8426l3378N3303K1994p0926j3875N1189l7965o2228
256g9374M2384K2667o6551J141P2596p38j7145O2680L0249n2695q504L9679j0331
269C6058j4762K7472r602m1189R099K0368k3576k6539k0679k9060J1965M2254
281a8191r460j8755M9618K8011m9296k995O2002q04l9863K0574K4157k0063J1363
294C6298K8704m1678n3867J5822J1665l8202q596K8863J227r303J1265M058q99
307a4643J1855o92q252K0903K3856n042O036K0874j9306l1638J1458J982m1067
$$ plain form
219 -35086 78400 67009 8887 66626 100090 30673 39284 96271 14917 -78318 -23354 15011
231 15011 -47050 -45772 4256 -39419 -87293 -44526 -30046 -59040 -17320 32455 7324 6596 60539
244 60539 77351 67734 60938 12512 -20866 32437 54431 -16495 -30370 20819 -17146 -79374
256 -79374 -36990 -14323 -80874 -79733 -7137 -7875 -25020 37660 67909 15214 6710 46389 36058
269 36058 21296 48768 39166 -2023 7076 27444 3868 -22671 -43350 -72410 -60445 -18191
281 -18191 -27651 -46406 3212 31223 -18073 -21068 40934 40130 267 20841 44998 24935 36298
294 36298 65002 23324 -30543 -14721 -3056 -41258 -49854 -20991 -19764 -29067 -17802 -13744 -14643
307 -14643 -2788 -3480 -11732 9171 33027 27985 34021 54895 35589 3951 15409 17391 -23676
320b3676r658L1980r8k3736M803N476j8325K699K3819n381j4074K1742K6406J832
334B3809M116J2622l338k0303j9078k934J6317J2749j5555k4120r71P574o120
347a5232l992J170j2617r708J6714K3190J2801J1577L583j7705j6466J3776K4561
360C1652j683j9848q255M564L757n83k574j1191k4085j5296J1067J8397R198O132
374A252j252j2217j472J9674J5971n819j1706l385M491J5777J6102p317k2375
387G724j5766j0817p81J4883M759j5785o150R949J965J051J4356j830k3813J372
401a8883K5088O546M483J9086q053l2359j426K0561q93j0886n829j5787l448K9461
415G661R967l0661j1251J3153q679o300K2961J1374m595J1216j18k4926R832L9875
$$ plain form
320 -23676 -33334 -1354 -1452 -25188 -20385 -14909 -33234 -30535 -6716 -12097 -26171 -4429 21977 23809
334 23809 27925 40547 37209 16906 -2172 -5106 11211 23960 8405 -15715 -16686 -9112 -15232
347 -15232 -19224 -18054 -30671 -40379 -23665 -475 12326 23903 27486 9781 -6685 7091 31652
360 31652 29969 10121 1866 6430 10187 9604 7030 -4161 -28246 -43542 -32475 -14078 -4880 1252
374 1252 0 -12217 -13689 5985 21956 16137 4431 1046 5537 21314 37416 30099 7724
387 7724 -8042 -18859 -19640 -4757 2 -15783 -21933 -11984 -10019 -8968 5388 3558 -20255 -18883
401 -18883 6205 12751 17234 36320 28267 -4092 -5518 15043 14150 3264 -2565 -18352 -21800 7661
415 7661 17628 -13033 -24284 -11131 -19810 -26110 -3149 8225 3630 14846 14728 -10198 -366 39509
429C9509j0631m3187K73K0166L303J2409J457l8976j5960L0038j145k9707J6195
442a6256K8343k0472j5203K4157P589m604J7761r191l9223J3326M6837q65j8723
455A3476K919j6614j9464K8584J4043m3359j1271L4029j1394k4137L5869K1033
467B3714l8104j1055K2337p215K461L7685l326l5010J4811K2033k2320K544K4730
480C3285l6089l8601L6738K6117k7367N24J2211l8082j2241N1109O477m1753J2357
493a5315K9858j7663K644L2764j3053j8975K2571j3709m0897L8144N2708m7284
505A1793n2254L1326J7918k3386J1991M570m4691K411N3138k260k3912K4719M054
518A5417l2712J6603K8551k6965J382M4798l1133n8133M5204N2481m5936l6758
$$ plain form
429 39509 28878 -14309 -14036 6130 9433 21842 23299 -15677 -31637 -1599 -2744 -32451 -16256
442 -16256 12087 -8385 -23588 569 8158 3554 21315 12124 -27099 -13773 33064 32199 13476
455 13476 16395 -219 -19683 8901 22944 -20415 -31686 2343 -9051 -33188 2681 23714
467 23714 -14390 -25445 -3108 -10323 -7862 29823 26497 -8513 6298 28331 6011 8555 33285
480 33285 -2804 -41405 -4667 21450 -5917 -5393 6818 -31264 -43505 7604 14081 -27672 -15315
493 -15315 14543 -3120 -476 32288 19235 260 22831 9122 -31775 6369 59077 11793
505 11793 -40461 -9135 8783 -14603 -2612 1958 -42733 -40322 12816 10556 -13356 11363 15417
518 15417 -17295 -692 27859 894 2276 47074 15941 -42192 3012 55493 9557 -27201
530b7201J7712j5030j1531M9015J0504n2369J431L5694j9826p003M2274p940l5804
543b0074K7244J7935l3464K0695M8056m6280n8062L8568L1112l2929L293J9701
555A5795m1386j5886N0178L169l3615J8477L712m4006K3212O6455k0718m1770
567a6383L2951P399m6353K1831N0475l4069l5580K7002n425k6661L5795J9583
579C0565n1933j5554K9762j5080l565N2740q673o1750K6923N5028l3044j9811
591a4392M5153j0530m4138L4882L2983m2160q022L4782l1812l9452L9829K0732
603A7855l5278K987R779l7972J4157O8599j7380o2013K4575L6691k6880P709M3634
616D6463k4220l1405L1399m959m4352L0638M0314n1562l6730L7485L401k2724
$$ plain form
530 -27201 -9489 -24519 -36050 12965 23469 -28900 -27469 8225 -11601 -18604 23670 15730 -20074
543 -20074 7170 25105 -8359 12336 60392 14112 -43950 -5382 25730 -7199 -3906 15795
555 15795 -25591 -41477 8701 11870 -21745 -3268 444 -43562 -20350 46105 25387 -16383
567 -16383 16568 23967 -22386 -555 49920 15851 -19729 7273 1848 -24813 10982 30565
579 30565 -21368 -36922 -7160 -22240 -25805 26935 18262 -43488 -16565 38463 5419 -14392
591 -14392 30761 20231 -23907 10975 43958 1798 -6224 28558 -3254 -42706 -2877 17855
603 17855 -17423 -14436 -4657 -42629 -28472 40127 22747 -39266 -14691 22000 -4880 2829 46463
616 46463 22243 -9162 22237 17278 -27074 3564 43878 -7684 -44414 -6929 -3528 -26252
628b6252L0969M840n6008J2344O3830j9718l8088M0239J9768l4172J4118K8852
640D0722l2711j3333L0537k2363l1344M5558J8295o2577j3658L7953j7663j3065
652c3649M7146l683n2603K2950M4938k5881l138N0737j5317n1958K4275K9750
664C3567k8552L140K6897l6890l0032L4563k380m2455K2337L3041l7612j4675
676c9051M3044k989k3518L6907J6254m0533J1505M1939k9291k6034M3277O804
688C8314m5604N977J8390l9297r298L9888j8219l7846L6079K4138m0997q68L9447
701A0104r853r643L6708k319l4488K6432K9255l7459r496L9017k0363m6074J8889
714i290J4718l0011Q834K4295l7527k1200M7261R900l7094J8655L4678k3496m929
$$ plain form
628 -26252 4717 9557 -46451 -34107 29723 10005 -28083 12156 31924 -2248 11870 40722
640 40722 8011 -5322 25215 2852 -28492 17066 35361 -27216 -40874 -2921 -20584 -33649
652 -33649 13497 9814 -42789 -19839 25099 -782 -3920 46817 31500 -20458 3817 33567
664 33567 5015 8155 35052 -1838 -31870 2693 313 -42142 -19805 13236 -24376 -39051
676 -39051 3993 1004 -22514 14393 30647 -9886 1619 43558 14267 -11767 31510 38314
688 38314 -7290 -1313 17077 -22220 -31518 8370 -9849 -47695 -11616 12522 -28475 -29343 10104
701 10104 251 -9392 27316 24997 -9491 16941 46196 8737 -759 38258 17895 -28179 -9290
714 -9290 5428 -24583 -15749 8546 -28981 -50181 -2920 6980 -30114 -11459 23219 -277 -5206
727e206L9429n117k5126K2764M997l7102Q829L0095l3422l2194K7658M922k9514
740b8987J2559J2786l5481l97M4627l530k0285L1249J2996l2648J1379L9357j6686
753B6939k1941K2238o723l2507J9471K0435l9088j9781K3722j0320k0572K5414
765a2713R120l0726R531L5308j0539p989L1996r85k8368K0907K6799k2570q688
778A1083J8141k0825k5698K3653O782l7991m925K1606j7004j1686L0391M352k3760
791b5881J4638K1335j3974N814L0908r302k1201K2123J2387k6134k603J3486k2879
804a283j6125J9149o160k6711J1290J3411k3287j526K9620l593j6744K1777J6366
817A6184j3224J0313K0936j6353j1463K1716j891k5309M606Q459k2551q450J5528
$$ plain form
727 -5206 34223 29106 3980 26744 31741 -5361 3468 33563 141 -32053 -4395 527 -28987
740 -28987 -16428 -3642 -39123 -39520 5107 1577 -18708 12541 25537 -7111 4268 43625 26939
753 26939 4998 27236 20513 -11994 7477 27912 -11176 -30957 -7235 -17555 -38127 -12713
765 -12713 -3593 -34319 -24788 10520 -19 -8008 23988 23003 -5365 15542 42341 19771 11083
778 11083 29224 8399 -17299 6354 13136 -24855 -29780 -8174 -25178 -36864 -6473 -2121 -25881
791 -25881 -11243 10092 -3882 1932 32840 23538 2337 24460 36847 10713 8110 21596 -1283
804 -1283 -17408 1741 -4419 -31130 -19840 -6429 -29716 -31242 -1622 -5215 -21959 -182 16184
817 16184 2960 13273 34209 17856 6393 28109 26218 909 5515 13974 -8577 -17027 -1499
830a499j0789j8453J3011M810j7014J1305K3919r757p224K2070O846j0027J3367
843B0565J0383k0110n247J8308o672j7351P632k050k4326j374J3250j0127p801
856b4920J3003j815j1604J5399J9041o916j661J3175l034m730J8307N063j7427
869A1881k761N951j3351p065J0387o841k0499J752Q688p636K164J4340n518r997
883a8505J3112J2356j733O896Q694q916n189J2180L041j0632k872l934j4103j264
897a0869J0204n030j1143J086o45m596R548J2088m299l807R780N350j72J0107
911A7602O777j0759q459L135P12j186J489p645j5111l540P522K143l368k179m014
926a6881l17J0179R431J709K999K756m122j058R109P171m014q362o681l809K550
$$ plain form
830 -1499 -12288 -30741 -17730 -12920 -29934 -18629 5290 -4467 -11691 10379 17225 7198 20565
843 20565 30948 10838 5591 23899 17227 -124 7508 5458 -18868 -20242 -6992 -17119 -24920
856 -24920 -11917 -13732 -25336 -9937 9104 2188 527 13702 10668 5938 24245 29308 11881
869 11881 9120 15071 1720 -5345 5042 -1799 -22298 -20546 -11858 -19494 -17330 -2990 -8508 -18505
883 -18505 -5393 6963 5230 12126 20820 11904 6715 18895 21936 11304 8432 4498 -9605 -10869
897 -10869 -665 -5695 -16838 -15752 -16397 -20993 -11445 643 -3656 -7463 2317 7667 7495 17602
911 17602 24379 13620 5161 8296 9008 7822 9311 1666 -13445 -16985 -9463 -7320 -10688 -12867 -16881
926 -16881 -17198 -7019 2412 4121 7120 9876 5754 4696 13805 20976 16962 8600 1919 -1890 660
941F60M569n177j2501o811J517M683N203K677j243j887K260P509P557L024j87
956A1853j507k333l02M591M366n582j2277o510K45J056J103j625o588m126L636
971a4000P117N648K070k820j736O730Q575Q49L24L191n320q633L306N083o661
986C723p007j353n975m934P768O279p604o303L679L710N751R304j073n968O228
1001F225P412l878k95O291n266j1067J100K596n326O70J170j2374o487J0804L792
1016d633n745M196L973o843M585J6701k65r665O054M709r556K104J0982p430j2190
1031c023K883n40p605L583L192j0723l535Q660j546j124J4197J454j5603N427
1045d303J7747l776n472J0535l075j4542P571J1834j2763r704P110n837j1267
$$ plain form
941 660 5229 52 -12449 -19260 -17743 -13060 -7857 -5180 -6423 -8310 -6050 1459 9016 12040 11853
956 11853 10346 8013 7711 12302 16668 11086 -1191 -7701 -7456 -6400 -5297 -6922 -13510 -17636 -14000
971 -14000 -6883 -1235 835 -1985 -3721 3009 11584 12433 12757 15948 10628 1995 5301 10384 3723
986 3723 -3284 -4637 -10612 -15546 -7778 -1499 -9103 -15406 -11727 -8017 -2266 7038 5965 -3 6225
1001 6225 13637 9759 9464 15755 10489 -578 522 3118 -2208 -1538 -368 -12742 -19229 -8425 -4633
1016 -4633 -10378 -6182 -2209 -9052 -4467 12234 11969 2304 8358 13067 3511 5615 16597 9167 -3023
1031 -3023 -140 -680 -8285 -4702 -1510 -12233 -15768 -7108 -8654 -9778 4419 5873 -9730 -4303
1045 -4303 13444 9668 4196 14731 11656 -2886 4685 16519 3756 -5948 1162 -4675 -15942
1058a5942J0085O747j1635j40P693p802L02J9759J352j6225M918J2856n726O42
1072F884J1751j0229j4587J0706M406j5168K264J0721j4638j1384J4793L330j1937
1085a3088Q446Q952j6041m93K3882N76j4262Q644O400j2637K979J2858j0461r621
1099c866J0349m334j5602J0625J0125j8087n250J5039o373q909J9220O262j8791
1112i592M982J8844j0805q681K0218K236k0447M505J1438j2968k594J3429j1646
1125a081j6317J3565O294j7083L470J5792j0868p511J7981J006j3597J3156J0935
1138A5742j7808J97K1434q188j7682J2820N107j9775L200J5534j6433j3327J8169
1151a010J454j6789J1355J3243j7655l774K0404k110j0057J6220M864j9881M064
$$ plain form
1058 -15942 -5857 890 -10745 -10885 -3192 -10994 -10692 9067 10419 -5806 -888 11968 6242 6884
1072 6884 18635 8406 -6181 4525 8931 -6237 -3973 6748 -7890 -19274 -4481 -1151 -13088
1085 -13088 -4642 4310 -11731 -12224 11658 12234 -2028 6616 13016 379 3358 16216 5755 -3866
1099 -3866 6483 2149 -13453 -2828 7297 -10790 -16040 -1001 -7374 -16283 2937 9199 -9592
1112 -9592 -4610 14234 3429 -5252 14966 17202 -3245 1260 12698 -270 -2864 10565 -1081
1125 -1081 -17398 -3833 2461 -14622 -11152 4640 -6228 -13739 4242 5248 -8349 4807 15742
1138 15742 -2066 -1869 19565 11377 -6305 6515 11622 -8153 -4953 10581 -5852 -19179 -1010
1151 -1010 444 -16345 -4990 8253 -9402 -13176 7228 5118 -4939 11281 16145 -3736 328
1164C28J6988j3087q953J6355n867k0645J1748J0944k0171k321K0344r021j6648
1177b0006J7807R592j8185N505K0462j1420r393J9543j003j9084J0512J3133j7428
1190C5n286J5366r929j5937J5237M593j9216N107J5435j5883o345K2976M63j7338
1204a0722J3320J3969j8559k360K1258p229j5274J6868M882k3969N39J6178j4518
1217e617r215J8922k766k0518J0392J3255j5070P41K1426p744j4068J7092N576
1230A2406j6631R365J7035j8045j1026J8202l115k0203J1057J1273k1201m213
1242a5096J9240q540j5246J7668P576j8110O336J9124j1736r347J9192J860j4819
1255a898J1110R096k0506l708J7203r303j3444J6223J637k3925L119J7427j1583
$$ plain form
1164 328 17316 4229 -4724 11631 5764 -14881 -3133 7811 -12360 -14681 5663 -3358 -20006
1177 -20006 -2199 7393 -10792 -5287 15175 3755 -5638 13905 12902 -6182 4330 17463 35
1190 35 -5251 10115 186 -15751 -514 4079 -15137 -10030 5405 -10478 -16823 6153 6616 -10722
1204 -10722 2598 16567 -1992 -4352 16906 9677 -5597 11271 16153 -7816 -7277 8901 -5617
1217 -5617 -14832 4090 1324 -19194 -8802 4453 -10617 -9876 11550 3806 -10262 6830 12406
1230 12406 -4225 5140 22175 4130 -6896 11306 8191 -12012 -955 10318 -10883 -15096
1242 -15096 4144 -4396 -19642 -1974 5602 -12508 -6172 12952 1216 -8131 11061 12921 -1898
1255 -1898 9212 18308 -2198 -5906 11297 1994 -11450 4773 6410 -17515 -14396 3031 -8552
1268h552o081K0215k338j8921J3699J6098j5206o28J9973q489j5685J4901N639
1281A4625j8600L097J3616j5380j0367J5939l641j8363J1298J2354j5336l69J7399
1294F272q512j0701J9560P452j6940N627J5226j4554q503J8945j201j8976P574
1307A269P634j8868k748J7390p940j4170J3885O208j5955M640J5749r420m629
1320f955J8082q43j4366J1239R146j6461p12J6281r724j5345J1728K906j7519
1333a2543M338J3597j3866q047J7180m31j4460J1334J2634j2011l96J5676o155
1346F850j0834J3380M630j5156L313J0325j4734q580J4555j382j4271P006N818
1359I20j4776Q96J7874m372j0382J2295M581j2578P061J4652j0491p938J2173
$$ plain form
1268 -8552 -14633 5582 3244 -15677 -1978 14120 -1086 -1714 18259 9770 -5915 8986 14625
1281 14625 -3975 -878 12738 -2642 -13009 2930 -711 -19074 -7776 4578 -10758 -11127 6272
1294 6272 -2240 -12941 6619 14071 -2869 2758 17984 3430 -5073 13872 12671 -6305 1269
1307 1269 8903 -9965 -12713 4677 -3263 -17433 -3548 2660 -13295 -8655 7094 -2326 -6955
1320 -6955 11127 10284 -4082 7157 16303 -158 -870 15411 5687 -9658 2070 4976 -12543
1333 -12543 -8205 5392 -8474 -16521 659 228 -14232 -2898 9736 -2275 -2671 13005 6850
1346 6850 -3984 9396 14026 -1130 2183 12508 -2226 -10806 3749 2367 -11904 -4898 920
1359 920 -13856 -12960 4914 542 -9840 2455 7036 -5542 1519 16171 5680 -2258 9915
1372I915j801j2205Q546O625j6599n460J2334l844q601R595R38j3495O070J3776
1386E794p063l707J2480k336j0772J0877J0422j1228l656Q502p752q171J2188
1399E578J873j6291j34R081p334l517J2087j374j1132O618Q591o064K784J0998
1413A1764p187q429J1264M854j0423O68N324r758n062R522j459j0051M217L360
1427a396j0038J696J2985l045p657P675M109n700N413Q425p452n215P789p71p885
1442a067M505L202j0666l343O325l513m591O898K52q700L620R215k742j375Q019
1457F039p36o372O041N984n998j454M345n243o233M884J207p596p12K713n134
1472h265j469P809M65n374L971M593k969K248P388j567m206L240J443l456M30
$$ plain form
1372 9915 8114 -4091 4455 11080 -5519 -10979 1355 -2489 -11090 -1495 -557 -14052 -7982 5794
1386 5794 -1269 -4976 7504 5168 -5604 5273 15695 4467 811 9313 1561 -6610 5578
1399 5578 7451 -8840 -8974 107 -7227 -10744 1343 -31 -11163 -4545 4046 -2018 766 11764
1413 11764 4577 -3852 7412 12266 1843 2511 7835 -1923 -6985 2537 1078 -8973 -4756 -1396
1427 -1396 -11434 -9738 3247 202 -7455 220 4329 -1371 4042 12467 5015 -200 7589 6818 -1067
1442 -1067 3438 6640 -4026 -7369 -1044 -4557 -9148 -2250 -1998 -10698 -7078 2137 -605 -1980 6039
1457 6039 5303 -1069 4972 10956 4958 3504 7849 2606 -3627 1257 2464 -5132 -5844 -3131 -8265
1472 -8265 -9734 -1925 -1460 -6834 -2863 1730 -1239 1009 8397 6830 2624 5864 7307 3851 4281
1487D281K022o199m247L439j697m950K166K078m902m16N205J090l72L573J245
1502B316k047L364M946j743k609K264r62l369N15l17l206j984j27k822j783K975
1518d589Q60l299N37M012J218R30L055Q09K16J133J207l72N07r2k453k726m03
1535E50j89k263k198j477r48o2P24R40J072O17J036K203K017J695J913N52j180
1552E002k74J379R2k048j741k361l008j38P55k444j971Q46l63o91L280L333o10
1569i62J97L077O69L18M285J437m533j347J942j689j898P34k913n108N50J475
1585c766k746K50L752k306l403N479N121j572J390L421k497o58N718L27n150N18
1601C878R17o094j757M976k727o489J729R51m035L285N892m013k780O920K536
$$ plain form
1487 4281 6303 104 -4143 -704 -2401 -7351 -5185 -3107 -8009 -8425 -3220 -2130 -2502 1071 2316
1502 2316 269 3633 8579 6836 4227 6491 5529 2160 2675 2358 -848 -2832 -2959 -5781 -7564 -4589
1518 -4589 -3729 -7028 -6491 -2479 -1261 -331 2724 3533 3749 4882 6089 5717 6224 6132 3679 953 550
1535 550 361 -1902 -4100 -5577 -6525 -6587 -5863 -4923 -3851 -3234 -2198 5 2022 3717 5630 6182 5002
1552 5002 4728 6107 6199 4151 2410 49 -2959 -3097 -2342 -4786 -6757 -5911 -6274 -6965 -3685 -352 -962
1569 -962 -765 2312 2981 3299 7584 9021 4488 3141 5083 3394 1496 2230 -683 -5791 -5241 -3766
1585 -3766 -6512 -6262 -2510 -4816 -8219 -2740 2381 809 2199 5620 3123 2465 8183 8510 3360 3878
1601 3878 4795 -1299 -3056 1920 -807 -7296 -5567 -4616 -8651 -5366 526 -3487 -6267 653 3189
1616C189l070M523M428n838j631O312j982n016L798p84r173M04O154m671m778
1631h135M851p86n877O085O966n917j145Q260j171l928P817L038q155K60N589
1646G752n454l738O890k855j1036L278O300p077k009P520l356n865Q348M636o638
1661c304L270Q213o268m011J0722J230r691K787M467q959j588Q314n751q870P105
1676b334K771j0239K298J0018n900m970J0273J477p366P302O832r710r92J1094
1690A0554m234r172P465K556j1964O09Q476q180n971J0197j082j0775O869Q464
1704C812q685n33J1871l299p569J0119M323j1207K675J0223r137p467J0142j249
1718D019j1934N579O668j1521k487J1190m565q166J1637N501j1821K577J1566
$$ plain form
1616 3189 119 4642 9070 3232 1601 7913 5931 915 4713 3929 -5244 -4840 1314 -3357 -8135
1631 -8135 -3284 -4070 -9947 -3862 3104 -2813 -3958 4302 3131 -797 7020 10058 1903 2163 7752
1646 7752 2298 -1440 5450 2595 -8441 -5163 1137 -5940 -7949 -429 -3785 -9650 -1302 3334 -3304
1661 -3304 -34 8179 1911 -2100 8622 9852 161 2948 7415 -1544 -3132 5182 -569 -9439 -2334
1676 -2334 437 -9802 -7504 2514 -3386 -8356 1917 3394 -3972 3330 10162 452 -540 10554
1690 10554 6320 -2852 4613 7169 -4795 -4186 4290 -3890 -9861 336 -746 -11521 -4652 3812
1704 3812 -4873 -5406 6465 3166 -4403 5716 10039 -1168 1507 11730 2593 -4874 5268 4019
1718 4019 -7915 -2336 4332 -7189 -9676 1514 -3051 -11217 420 5921 -5900 -3323 8243
1731H243o933m133J2846j001j2638O343P027j2149j988J2124o340j2169Q829M119
1745B180j1757L565J0652r532n083J4313N90j1534P882Q953j1013j114J3417n529
1759E990j1154R329K987j3330L645J0965j1663q853J2043M77j0478Q582Q008j3052
1773f504j968J4729l271q308J2094L720j4577K616J2091q719o372J1785k713j4082
1787i479P359Q561j3117k489J3398n369r539J2129L881j3585M353J3275q276n377
1801d275J3303j966j3980Q193R631j2042k043J1353q568j1269J2390M718j3553
1814h108L104J0731j0604o021J4747P25j1396Q530P828j3099n14J4590o036j0437
1828e960J1240L520j4156K372J0319j0714o162J3822j325j3378P760P853j2706
$$ plain form
1731 8243 1310 -2823 10023 9022 -3616 2727 9754 -2395 -4383 7741 1401 -10768 -1939 2180
1745 2180 -9577 -6012 4640 -4892 -9975 4338 4928 -6606 1276 10229 -784 -1898 11519 5990
1759 5990 -5164 4165 7152 -6178 -2533 8432 -3231 -12084 -41 436 -10042 -1460 6548 -6504
1773 -6504 -8472 6257 2986 -5322 6772 10492 -4085 -1469 10622 1903 -4469 7316 4603 -9479
1787 -9479 -2120 6441 -6676 -9165 4233 -1136 -10675 1454 5335 -8250 -3897 9378 1102 -4275
1801 -4275 9028 7062 -6918 1275 10906 -1136 -3179 8174 -394 -11663 727 5445 -8108
1814 -8108 -5004 5727 -4877 -10898 3849 4574 -6822 1708 9536 -3563 -4077 10513 4477 -5960
1828 -5960 5280 8800 -5356 -2984 7335 -3379 -9541 4281 2956 -10422 -2662 5191 -7515
1841g515l1J5038m556r237J0602K403j2940N827J2828j0292p043J1933k983j3231
1855i197Q860Q290j2710j788J1194p483q904J3082M324j2841M094J1199r737m844
1869f461J3958j109j1562Q667O825j3298j396J2153o600r383J0936K524j3814
1882h560L013J0139r466l822J3895j573j1800Q094P278j0928R58J3389o086r943
1896e412R763K240j2411M624J0150j0640o332J0958k289j0478Q676O880j1478
1909e749l34J1638n682p135J2093K897j2455M070J0106r053m540J0868k843j0594
1923f713P600N579j1801o52J0508o432p603J1359K997j1311L354Q340p873j672
1937d320J2524k610j1077O597O185r512L98R937o867q404Q519J519r513N092P222
$$ plain form
1841 -7515 -7546 7492 2936 -6301 4301 6704 -6236 -409 12419 2127 -4916 7017 4034 -9197
1855 -9197 -337 7953 -4757 -6545 4649 -2834 -11738 1344 5668 -7173 -3079 8120 -1617 -6461
1869 -6461 7497 6388 -5174 3493 10318 -2980 -4376 7777 1177 -8206 2730 5254 -8560
1882 -8560 -5547 4592 -4874 -8696 5199 3626 -8174 -80 7198 -3730 -2772 10617 4531 -5412
1896 -5412 4351 6591 -5820 -1196 8954 -1686 -8018 2940 651 -9827 -1151 5729 -5749
1909 -5749 -6083 5555 -127 -7262 4831 7728 -4727 -657 9449 396 -4144 6724 3881 -6713
1923 -6713 887 6466 -5335 -5987 4521 -1911 -9514 1845 4842 -6469 -3115 5225 -2648 -4320
1937 -4320 8204 5594 -5483 1114 7299 -2213 -1815 8122 1255 -7149 1370 2889 -6624 -1532 5690
1952E690j0267m079J1500l16q254O470M684r448J393J0530n338o590Q457P24r869
1967d713M349P529q323m350Q099k320p204P551L850j0503L73R944m201n171Q261
1982C171J042q257L970O649o892k146Q343k958p999O347M237q778m83P008m736
1997a482m298P361J89q042M005O775o056k375P854j447o110N606L372o953J096
2012e05O138n301m371O923M80p825K090N277n180k080O191k122n049N709L108
2027C483o394R27O274l358l274N742P45n855K203L630n207j126N874k753n866
2042d955L953K962m902J47M285l021k402N180Q49m564K595L819m190j048N118
2057C826j066m107K434J398l962O37L410l358l116L707P51l725J603K790l203
$$ plain form
1952 5690 -4577 -8656 2844 2528 -5726 744 5428 -4020 -2627 7903 2565 -4025 4432 5156 -4713
1967 -4713 -364 7165 -1158 -5508 2591 271 -6933 618 4468 -6035 -5662 4282 81 -5090 3171
1982 3171 4213 -4044 -74 6575 -317 -2463 5880 2922 -5077 1270 5507 -3271 -3754 3254 -1482
1997 -1482 -5780 1581 1770 -6272 -2267 4508 -1548 -3923 3931 2484 -3626 1980 5352 -1601 -505
2012 -505 5633 332 -4039 2884 3364 -4461 -2371 2906 -2274 -4354 1837 -285 -5334 375 3483
2027 3483 -2911 -1984 4290 932 -2342 3400 4145 -1710 493 4123 -1084 -2210 3664 911 -4955
2042 -4955 -1002 1960 -2942 -2795 1490 -1531 -3933 1247 2096 -2468 127 3946 -244 -1292 3826
2057 3826 2760 -1347 1087 2485 -1477 -840 2570 -788 -3904 -197 554 -3171 -1568 1222 -1981
2072a981n24M035n97k242K842J242l252N67L397j738k578K138P2k822J014J514
2088A087k713q10K305p72j726J822J178j856K94K483o81o99J939n2j703J140J303
2105B539j737r70J008m84j345M81K40j430j20R81o83l40J457M90n34K94Q23M06
2123A076L14K14j48k58n4J9l41m98k40n22n07n38j57M69m5m52L80K76J23J165
2143B76P47m99J21J128j07o59Q38L87j767n20R56j179j305J231m67k107P00J530
2161f96r36k60K039j95j236K092J646j753L36K210j519j674K211p9k930N08J128
2178H92k730r78K572q65k716K301J675k747P17L735j472j579L653O45l152J616
2194A567K695l042j570L111j495l828K351J430m389L8L311k498k123M237P80l707
$$ plain form
2072 -1981 -2505 1530 933 -1309 1533 2775 -477 90 3487 1749 -829 1309 1381 -1441 -427 1087
2088 1087 -1626 -2436 -131 -903 -2629 -807 371 -1485 -1191 1292 611 -88 1851 1799 96 1236 2539
2105 2539 802 -168 840 356 -989 -508 -268 -1698 -1818 -837 -1520 -1860 -403 87 -447 -153 670 1076
2123 1076 1390 1604 1456 1198 1144 1163 822 324 84 -438 -945 -1483 -1640 -1171 -1216 -1668 -1288 -1012 -889 276
2143 276 1023 524 645 1773 1666 1007 1845 2232 465 -55 901 -278 -1583 -352 -819 -2926 -2226 -696
2161 -696 -1632 -1892 147 -48 -1284 808 2454 701 1037 3247 1728 54 2265 2186 -744 -236 892
2178 892 -1838 -2816 -244 -1109 -3825 -1524 151 -2596 -1879 1856 384 -1195 2458 3103 -49 1567
2194 1567 4262 1220 -350 2761 1266 -2562 -211 1219 -3170 -3132 179 -2319 -4442 -205 575 -3132
2210c132K398L665l221n14N354j112m374L276K088m858K32L794l849l620M131
2225B58J32n118K159L751m593j376N921n63l775M480K480n005J399N671l331l539
2241a049M865m1n990K191L903n905k327N407k224m961N060K486o163R48O515k837
2257a22k845O355Q32o223L376N170n570j662N819l017o108M812K319p160L03N478
2273A757m709l762P114P63o620L944N642n668p12P872k056n764N727K827p400
2288a045N52O183n490n050O637m4p812L232M763o672j060Q010k113n549O591L555
2304D688p166J814P696m720m215P349n77q294L915M905p777k141P342l480p095
2319g756O130L661p452J830P484n297l733Q860R14p288M706N495p753j749Q046
$$ plain form
2210 -3132 -734 2931 -290 -804 4550 3438 -936 2340 4428 -430 -198 3596 -253 -3873 258
2225 258 390 -4728 -2569 1182 -3411 -4787 1134 571 -3204 1276 3756 -1249 150 5821 2490 -1049
2241 -1049 3816 3775 -2215 -24 3879 -2026 -4353 1054 -1170 -6131 -1071 1415 -4748 -3800 2715 -122
2257 -122 -2967 3388 4220 -2003 1373 6543 973 -689 5130 2113 -3995 817 3136 -4024 -3721 1757
2273 1757 -2952 -6714 400 1163 -5457 -1513 4129 -1539 -2251 5621 3565 -2199 3528 6355 -1045
2288 -1045 -493 5690 200 -4850 1787 1743 -6069 -2837 1926 -4746 -5806 2204 91 -5458 1133 4688
2304 4688 -2478 -664 7032 2312 -1903 5446 4869 -3425 490 5395 -2382 -4523 2819 -661 -7756
2319 -7756 -1626 2035 -5417 -3587 3897 -1400 -5133 3727 4641 -2647 2059 7554 -199 -1948 6098
2334F098l183p145O010K195r197J186P167o129m316Q576K06p854N039N891p112
2349b568o56R595k473o796O537K758q993J857P598o538n096P446j200q674M762
2364b441N847p687j376Q662l218o358Q031L630q162K812P925o609m628Q683k62
2379D849q393M568N041q950k299Q155l716o414P842K403r494K079Q258n396l194
2394d661R293q0q232M959N442q069o33R051m175p608O553J744r262K267P727o383
2410b067m459Q171r08q053O238O654p585q20Q675l914o168P898K759q617J960
2425b36O669p136m508Q108j019q110N205M813q719p72Q676l617n352Q440K709
2440E151q605J997P174n546k624Q846j482q967M402M357q011o1Q230m840o951
$$ plain form
2334 6098 2915 -4230 1780 3975 -5222 -4036 3131 -2998 -7314 1262 1468 -6386 -1347 4544 -2568
2349 -2568 -3224 6371 3898 -2898 3639 6397 -2596 -739 6859 321 -4775 2671 1471 -7203 -2441
2364 -2441 3406 -4281 -5657 3005 -213 -6571 1460 5090 -3072 -260 7665 1056 -3572 5111 4849
2379 4849 -3544 1024 6065 -2885 -5184 2971 -745 -7159 683 3086 -6408 -4329 3929 -1467 -4661
2394 -4661 4632 4552 -3680 1279 6721 -1348 -1981 7070 2895 -4713 1840 3584 -5678 -3411 4316 -2067
2410 -2067 -6526 1645 737 -7316 -1078 5576 -2009 -2829 5846 1932 -4236 3662 6421 -2196 -236
2425 -236 6433 -703 -5211 2897 1878 -6232 -1027 3786 -4933 -5705 2971 -646 -5998 2442 5151
2440 5151 -3454 -1457 5717 171 -2453 6393 4911 -4056 346 4703 -3308 -3369 4861 21 -6930
2455f930O529K084p525L257P215o248l336Q564o36p100N834M924p557l85P470
2470F160m510o055O598J511p993K491N906p137l658Q110m91o411N507M102p721
2485c591O1Q267k837m392O703R42q251K589O329n932k998O898k347p309M797L946
2501B875o897j56O976l648m726O849J984o820K937O095n264k303P028j584o662
2516c316M556L603o702m69N799m193n004O204J523o712K394N232n328j909P308
2531B986n08n413M242L283n855L67O246l685m703N436P71o641K126M506n339k257
2547d438N929j244n048M291L009n530O52O352k875l728N214P86n253K595M108
2562D820n082k112N147j540m994L701K412n703kN239k698k984M965M68m846K764
$$ plain form
2455 -6930 -401 1683 -5842 -2585 4630 -1618 -4954 3610 2974 -4126 1708 6632 -925 -1310 6160
2470 6160 1650 -4405 2193 3704 -4289 -1798 4108 -3029 -6687 1423 932 -5479 28 4130 -3591
2485 -3591 -3530 4737 1900 -2492 4211 5153 -3098 -509 5820 -112 -3110 3788 1441 -5868 -1071 2875
2501 2875 -4022 -4178 2798 -850 -5576 1273 3257 -3563 -626 5469 205 -2098 4930 3346 -3316
2516 -3316 1240 4843 -1859 -2328 3471 -722 -5726 478 2001 -4711 -2317 2915 -2413 -4322 2986
2531 2986 2478 -2935 1307 4590 -1265 -898 5348 1663 -3040 2396 3167 -3474 -1348 3158 -2181 -4438
2547 -4438 1491 247 -4801 -510 2499 -3031 -2379 3973 1098 -2630 2584 3370 -1883 712 4820
2562 4820 -262 -2374 2773 1233 -3761 -60 2352 -3351 -3353 1886 -812 -3796 1169 1637 -3209 -445
2578d45M408l942j554M740j092m169L536K175n092j29M036l158k861M488L24m778
2594c513J561L600l140r54M524j048l568L526K187m098N53L958k736k625L520
2609A747J20l874J433K456l484j086L842j102l225K823J976l380O33L196j848
2624B27j562L306J25l164J490K379l025j103K935j033k741K164J019l080M26K502
2640H65j682j367K829M11k589J208K194j855l57K516j079k135J958R29k526R2
2656e88J774j640j423J898K20j856Q01J193j658NK429n81j434J351Q67j320M06
2673D44J391j194j195J387J7j498N52O25j603l79J386l07p99P51K78q48N12J412
2691I32l40o63Q02J23o84O96N14r47m39L49k02m95K42Pq13k86N11J94j07L80k24
$$ plain form
2578 -445 3963 21 -1533 3207 2115 -2054 1482 3657 -1435 -1564 2472 -686 -3547 941 1265 -3513
2594 -3513 -1952 1648 -1492 -2446 2078 1030 -2538 988 3175 -923 -370 3588 852 -1773 1747
2609 1747 1867 -2007 -574 1882 -1602 -2688 1154 52 -3173 -350 1626 -1754 -1121 2075 227
2624 227 -1335 1971 2096 -1068 422 2801 -224 -1327 1608 575 -2166 -2 1017 -2063 -1637 865
2640 865 -817 -2184 645 1056 -1533 -325 1869 14 -343 2173 1094 -1041 917 1846 -680 -588
2656 -588 1186 -454 -1877 21 241 -1615 -814 379 -1279 -1274 1155 574 -860 491 1358 38 444
2673 444 1835 641 -554 833 850 -648 -96 529 -1074 -1453 -67 -374 -1173 -422 -144 -992 -480 932
2691 932 592 -71 731 854 170 866 1380 433 -6 343 141 -354 -112 -105 -918 -1204 -693 -499 -606 -226 -450
2712d50j28O05M44J40r2O3J21K4m2J04o3n11m68JJ06j89j93j03l61r0P15J48m19
2735f38L58N11l87K55R52r1o01L58J83p08J66P59r96r71P27K1r86N03O59j124
2755a050l11J265j8o05R96O61j242J89J535o61p60J260k53j682P26J133j437o78
2773i32J210n70j486J430Q45j740J99J777j200p43K328J94j981Q42J538j544m11
2790b44J959r11k058J507Q87k353K13K110j765j474K226L29k007J247J639k056
2806g51l70K839n58k233J959J064k742L37K516j865j728K321r1k724J469J840
2822A283k494p63K959p67k308K515J292k974O59K894j931j664K912J31l138J388
2838fK143k907q09L067j398k786K794J284l427N78L011j949j557L382J10l173
$$ plain form
2712 -450 -578 27 471 611 519 582 703 727 685 789 726 215 -253 -252 -146 -335 -528 -631 -992 -1082 -367 -219 -638
2735 -638 -280 231 -156 99 1051 960 359 717 900 192 358 1117 121 -850 -123 -102 -1088 -585 74 -1050
2755 -1050 -1361 -96 -114 -719 277 938 -304 -115 1420 759 -1 1259 1006 -676 50 1183 -254 -932
2773 -932 278 -292 -1778 -348 497 -1243 -1044 733 -467 -1210 1118 1312 -669 173 1711 167 -244
2790 -244 1715 804 -1254 253 1140 -1213 -1000 1110 -655 -2129 97 426 -1581 -334 1305 -751
2806 -751 -1121 1718 1160 -1073 886 1950 -792 -455 2061 196 -1532 789 698 -2026 -557 1283
2822 1283 -1211 -1974 985 218 -2090 425 1717 -1257 -598 2296 365 -1299 1613 1744 -1394 -6
2838 -6 2137 -770 -1579 1488 90 -2696 98 1382 -2045 -1467 1544 -405 -1962 1420 1530 -1643
2854a643J823K522l218p12L720j327l122K624J108l467M52L010k473j956L530
2869H71L0l637K095K961l313o99L871j265k727L078J293l759O52L421k795k389
2885b312L650j0l975J995K593l695o54M007j446l026L499J621l920P55L695k558
2901B19k011M199j89m181K123K468l918o36M165j802l518L183J304m074J128L910
2917B370k927k171M396K4l924K390L020l617o47L995j881l503L449J463m566Q69
2933a260L797l379k519M268O5l882K662K674m023n70M545j278l178L687J383m634
2949a642Q34L902l101k128M180o04m420K405K639m161m66M559j695l374L666J393
2965A987m431J481M268l068k003M182o20m239K804K844m096p73M021k270l525
$$ plain form
2854 -1643 180 2702 -516 -1228 2492 1165 -1957 667 1775 -1692 -1240 1770 -703 -2659 871
2869 871 901 -2736 -641 2320 -993 -1692 2179 914 -1813 1265 2558 -1201 -549 2872 77 -2312
2885 -2312 1338 1328 -2647 -652 1941 -1754 -2408 1599 153 -2873 626 2247 -1673 -918 2777 219
2901 219 -1792 2407 2218 -1963 160 2628 -1290 -1926 2239 437 -3081 102 1406 -2668 -1540 2370
2917 2370 -557 -2728 1668 1692 -2232 158 3178 -439 -1086 2909 1028 -2475 974 2437 -2129 -1260
2933 -1260 2537 -842 -3361 907 972 -2910 -248 2426 -1597 -2167 2378 1100 -2078 1609 2992 -1642
2949 -1642 -808 3094 -7 -2135 2045 1441 -2979 -574 2065 -2096 -2562 1997 302 -3072 594 1987
2965 1987 -2444 -963 3305 237 -1766 2416 1796 -2443 361 3205 -891 -1664 2357 87 -3438
2980c438L847J425m334J142L674l370j967M553ol802K893K590m225o18M480j801
2996A043l194L771R66m830Q45L567l126j680M336o69m325K552K826l845p4M541
3012B704j921l117L619J092m245J587L655l303j996L873o96m195K667K687l970
3027a559m53L876k291k939M011J350l937J323L416l366j641M362j56l782K476
3042F90K169m240l36L966j890k963L476Q18m297J204L298k847j477M258m40l853
3058b464K527K349l584J71L964k035l016L140P19l814J437L162l205j888L665
3073A128m81l354K629K153l547j3L602j846k466L449R13l581J135K880k974j610
3089a983L599n22l199K296J657l644j14L542j505k362L035P22l541J209L063k446
$$ plain form
2980 -3438 409 1834 -2500 -1358 2316 -1054 -3021 1532 1526 -2276 617 3207 -1018 -1636 2844 1043
2996 1043 -2151 1620 2586 -2244 -1399 2168 -958 -2638 1698 1029 -3296 -744 2082 -1763 -1837 2704
3012 2704 783 -2334 1285 2377 -1868 -281 3374 71 -1925 1948 1252 -2943 -276 2411 -1559
3027 -1559 -2012 1864 -427 -3366 645 1995 -1942 -619 2797 -569 -2210 2152 1996 -1786 690
3042 690 2859 -1381 -1717 2249 359 -2604 872 1690 -2607 -1403 1895 -952 -2429 1829 1389 -2464
3058 -2464 63 2412 -1172 -1001 2963 928 -2088 1052 1771 -2043 -606 2556 -649 -2537 1128
3073 1128 647 -2707 -78 2075 -1472 -1485 2117 271 -2195 1254 2167 -1414 -279 2601 -373 -1983
3089 -1983 1616 1094 -2105 191 1848 -1796 -1910 1632 127 -2235 800 1522 -2019 -810 2253 -193
3105a93j268L359o28l102K313J689l241j14L085j691k341K726O95l309J075K741
3121A796k432j166L187n83k716K195J821k845j21K850j519k141K621O65l012R09
3137d91K122k366j084K906m91k531J713J628k587n0K802j230j880K452O32k711
3153a166R31K141k097j006K452m43k368J459J408k419j65K504j285j742K195N77
3169I76k314R17J961j791q74K347l20k010J465J230k224q0K119j261j567J914
3185D88L13k112P53J584j598p76K050k40j672J418J142j967J7J913j004j173J643
3202G79K23j809N31J418j504n58J558l23j622J126Q97j522MJ662q79r66J473M22
3220I10j496M64J246j104n09J329k30j507R80O62j301m5J188p56q24J136L32j194
$$ plain form
3105 -193 -1461 1898 1270 -1832 481 2170 -1071 -1185 1900 209 -2132 594 1289 -2020 -945 1796
3121 1796 -636 -1802 1385 802 -1914 281 2102 -743 -864 1986 467 -1674 947 1612 -1400 -491
3137 -491 1631 -735 -1819 1087 596 -1935 -222 1406 -1181 -1231 1571 341 -1539 913 1545 -1166
3153 -1166 -235 1906 -191 -1197 1255 812 -1556 -97 1311 -1108 -1273 1231 -54 -1796 399 976
3169 976 -1338 -421 1540 -251 -1125 1222 902 -1108 357 1587 -637 -717 1402 141 -1426 488
3185 488 801 -1311 -558 1026 -572 -1348 702 462 -1210 208 1350 -617 -600 1313 309 -864 779
3202 779 1002 -807 -276 1142 -362 -920 638 315 -1307 -181 716 -806 -802 860 -19 -985 488 910
3220 910 -586 -122 1124 20 -489 840 610 -897 83 745 -556 -601 587 -169 -993 143 475 -719
3238g19L22R75q19l22J228r2j027N95N54r03M4R02o56p28P54K56q57K74N81p22
3258c60m02J013m3o79N12K48n89J07P47l17m88M85J45o24K01N50n39l62N16j01
3278B0l66L59J55m92k6M98p5k40K79J32m25J68L24j57j53J87j31j86J85J08k07
3299d3q8N5K6j43J47P1p1m3rO8P7J6Q4K7j78L2J19l2j11K1l1j13J2J33m4k71K26
3326f3N2k19J64L55l23k01L33N5k91K93K47m53q4M45j58m33M28J14o63P4O29m36
3348a35k30N43j21n87M40N64n96j52O71k60o11Q34K26q84J77O22o20l13Q18p8
3368C08q87L50O53q50q3R95m59p85R79L20r74L26Q43p64m79J037M8j081N10O84
3388F91j115r9J161n21j003J033K49j114L19J113q71n52J190Rj150P71Q90j311
$$ plain form
3238 -719 -397 578 -241 -563 665 573 -454 141 695 -208 -164 738 82 -646 108 364 -493 -219 362 -360
3258 -360 -762 251 208 -471 41 289 -300 -193 554 237 -251 234 379 -245 -44 506 -33 -395 121 20
3278 20 -346 13 168 -324 -350 148 73 -167 112 244 -181 -13 311 154 1 188 57 -129 56 164 -43
3299 -43 -131 -76 -50 -193 -46 25 -46 -89 -98 -30 47 63 147 174 -4 28 147 115 4 25 -6 -119 -107 26 -18 -289 -63
3326 -63 -11 -230 -66 289 -34 -235 98 153 -138 155 402 -51 -135 310 152 -281 147 261 -402 -328 301 -135
3348 -135 -365 178 57 -530 -90 474 -122 -274 397 137 -474 360 586 -298 -121 501 -119 -432 386 308
3368 308 -579 -229 424 -426 -509 486 27 -758 221 541 -433 -107 736 -28 -507 530 578 -503 7 691
3388 691 -424 -523 638 117 -886 147 396 -718 -399 714 -157 -709 481 490 -660 111 1001 -310
3406c10k22J417n92j078J139L23j442L09J215r89o70J326l5j438R31R85j338j91
3424f60J601o57j069J246N17j603L43J351j180q08J639j93j639Q47J116j476k00
3441h25J622p43j219J460O24j686M54J567j229r05J774j41j624R97J038j774k47
3458h57J794p82j461J485O73j885M29J665j336q82J976r9j793J208J239j809l03
3475g38J988p71j564J567N70k097L75J834j449j064J996j55j938J197J305j666
3491f10j93K018q92j569J846O93k115N62J792j642j101K079j97k008J222J282
3507A167k034k96K042q13j611J934P92k233N30J892j502r40K282j36k189J223
3523A08J272k005l79K254r74j701J708N43k194N78K077j551r94K054m5k102J352
$$ plain form
3406 -310 -532 885 293 -785 354 677 -765 -456 759 -230 -900 426 391 -1047 -116 869 -469 -660
3424 -660 941 284 -785 461 978 -625 -282 1069 -111 -919 720 527 -1112 -265 851 -625 -825
3441 -825 797 54 -1165 295 919 -767 -313 1254 25 -880 894 753 -871 126 1164 -610 -857
3458 -857 937 155 -1306 179 852 -1033 -604 1061 -275 -1157 819 720 -1073 135 1374 -435 -738
3475 -738 1250 479 -1085 482 1052 -1045 -670 1164 -285 -1349 647 492 -1446 -249 1056 -610
3491 -610 -803 1215 323 -1246 600 1293 -822 -260 1532 -110 -1211 868 671 -1337 -115 1167
3507 1167 -867 -1163 879 66 -1545 389 1181 -1052 -522 1370 -132 -1072 1210 1074 -1115 108
3523 108 1380 -625 -1004 1250 276 -1425 283 826 -1368 -790 1287 -264 -1258 796 751 -1351 1
3540AJ518j916l34K295j055j858J926O35k195N27J794j712j233K183m9k029J418
3557h4J437k208l48K393q25j620K035O71k356N02J924j640j046K187q0k298J134
3574b22J393k217k52K319q96j635J895N45k256P05K206j478j139K171k88k186
3590a335J397J512k099k34K044j136j805J911P74k257N58J871j618j111K294p9
3606F87j961J449J399k141k75K205r28j569J917N28k305M00J788j575j017K251
3622H53j87k155J197J329j993n4K320q91j620J831N59k163N50K063j550j102J988
3639I75l09k096J254J347j934j91J975r94j735J934Q07k055O13J765j552r26K147
3656A025j24j897J307J200k073l68J991p84j653J682N89k096M44J808j529q42
$$ plain form
3540 1 1519 -397 -731 1564 509 -1349 577 1212 -983 -456 1338 -374 -1607 576 527 -1502 -84
3557 -84 1353 -855 -1203 1190 365 -1255 780 1451 -905 -403 1521 -119 -1165 1022 942 -1356 -222
3574 -222 1171 -1046 -1298 1021 125 -1510 385 930 -1326 -621 1585 107 -1032 1139 851 -1335
3590 -1335 62 1574 -525 -759 1285 149 -1656 255 1029 -1228 -670 1201 -417 -1528 766 687
3606 687 -1274 175 1574 -567 -842 1363 435 -1134 783 1311 -994 -594 1194 -381 -1398 853
3622 853 666 -1489 -292 1037 -956 -1010 1310 419 -1201 630 1189 -974 -424 1639 89 -1013 975
3639 975 666 -1430 -176 1171 -763 -954 1021 27 -1708 226 1033 -1022 -409 1356 -196 -1122 1025
3656 1025 901 -996 311 1511 -562 -930 1061 277 -1376 306 895 -1201 -757 1051 -478 -1320
3672a320K155p7j873J099J218j677j88K018p33j650J529N45k004M76J711j416
3688a87j046J796j56j749J115J253j697k73J969p47j406J600O15j802O02J512
3704A399j454q98J692j05j670R55J119j685m07J742n95j344J603M66j772M81J518
3721A045j072p99J631L5j662R22J082j554k66J594p59j302J329M69j681L12J457
3738G81r93q53J645r6j452R34J093j368k59J521o43j085J226M35j563L60J139
3755H22j037p71J357J9j399P69R34j179k15J424o28r00J165M15j274L53J122r00
3773G7o95J164j1j306P42O90j196j52J250n63q94R72L87j072K56J036p12n26J174
3792F21j10j076P19O37j063q0R32m14q03P58L18j055K53Q35o55n30J060p7r21
$$ plain form
3672 -1320 835 758 -1115 -16 1202 -475 -663 1355 622 -1028 501 1046 -958 -482 1229 -187
3688 -187 -1233 563 407 -1342 -227 1026 -671 -944 1025 278 -1128 472 1087 -715 -113 1399
3704 1399 -55 -953 739 634 -1036 -81 1038 -647 -1054 688 93 -1251 352 818 -954 -473 1045
3721 1045 -27 -826 805 840 -822 100 1182 -372 -638 956 197 -1105 224 693 -988 -676 781
3738 781 -212 -1065 580 484 -968 -34 1059 -309 -568 953 310 -775 451 886 -677 -317 822
3755 822 -215 -986 371 390 -1009 -240 694 -485 -700 724 96 -804 361 776 -498 -145 977 77
3773 77 -618 546 535 -771 -29 661 -535 -687 563 0 -894 78 465 -607 -351 685 -27 -553 621
3792 621 511 -565 154 791 -272 -352 580 166 -637 121 439 -616 -363 472 -183 -713 347 270 -651
3811f51O38N72p45q2R37l85o80O99K25q66Q2P57n70m97P69q9p13L97N45o76j08
3832d41P36k04m52N45K96o44K34M84n38k50N79n2n98K52L08m87j51M55j73l70
3852d71M54J52m22J72M31k94j44L84M2l25J06K89l73j02L24j69l70L14O1l59P6
3873b24J83j34r9J93J05j09J61Q6r8MK37q9k13J12O3j83J2np7r7J8K2Pr1P4J2
3899a30R7OK6J20m9l8J72jq1M6J5j87n7J60j46j11J30j44j13J20K05l00k3L60
3923G7j01j54L36J10l35J42L27k23k23L12pm41J19L26m23j71M15k46l38M14J88
3944A04l61O5M47k89k00N66K4n63L54L96n50j28N80l11n18M36J99o67R4N82n00
3965b40l51P10Qo47M75N23o79m0Q18k81n80N90K55q43K13P10p35m82Q82l9r92
$$ plain form
3811 -651 -13 559 -186 -268 669 284 -396 303 528 -338 -256 501 -69 -566 203 114 -599 -202 343 -333 -441
3832 -441 295 91 -361 184 480 -164 70 554 16 -234 345 293 -305 -53 255 -232 -383 72 -101 -471
3852 -471 -17 135 -287 -115 316 22 -122 262 304 -21 85 374 1 -101 223 54 -316 -2 59 -300 -224
3873 -224 -41 -175 -274 -81 24 -85 76 162 64 68 305 216 3 115 178 -5 7 2 -75 -172 -154 -132 -125 -216 -142 -130
3899 -130 -33 -27 -1 119 70 32 204 203 122 168 183 -4 -61 99 -47 -158 -28 -172 -285 -165 40 -260 -283 77
3923 77 -24 -178 158 268 -67 75 402 179 -44 268 261 -180 -61 265 -158 -329 86 -160 -498 -84 104
3944 104 -257 -192 255 -34 -234 332 356 -207 147 543 -7 -135 445 134 -384 52 251 -416 -322 260 -240
3965 -240 -591 119 127 -520 -45 478 -201 -241 577 296 -284 306 561 -282 -69 641 -94 -576 306 267 -725
3986g25N27O04q20j83R65l03o72Q14K91r24K17J004p15n35J033p3j063O07N90
4005F39j003j89J020m19q91Q99M27j166K87J056q08n72J299m7j166P46P98j121
4023b11j94J210n26j011R69L54j269K20J185r63o30J306o3j203P90P75j177j62
4041f00J452m96j079J134M32j510L36J295j121o32J343j56j347Q15R40j326k58
4058g78J474n14j083J153N50j521L85J410j068q50J503q4j462R35R55j456l10
4075g61J561p25j255J400N77j643L69J463j236p10J656n2j520R69R37j535j92
4092f97J677p18j230J357M26j728M16J511j218p47J616j43j632R96J160j591j10
4109f55J740q35j301J438M91j656N43J428j326q54J629j81j558J112J067j710
$$ plain form
3986 -725 -198 406 -414 -597 368 65 -607 207 498 -426 -209 795 80 -455 578 505 -558 49 639
4005 639 -364 -553 467 48 -843 56 483 -683 -396 660 -148 -720 579 532 -634 112 910 -211
4023 -211 -405 805 279 -732 237 591 -678 -458 727 -236 -866 440 377 -826 -36 739 -438 -600
4041 -600 852 356 -723 411 843 -667 -331 964 -157 -789 554 398 -949 -134 806 -520 -778
4058 -778 696 182 -901 252 802 -719 -334 1076 8 -842 661 577 -885 50 1005 -451 -761
4075 -761 800 75 -1180 220 797 -846 -477 986 -250 -960 696 644 -876 93 1030 -505 -697
4092 -697 980 262 -968 389 815 -913 -497 1014 -204 -951 665 522 -1110 -114 1046 -545 -655
4109 -655 1085 250 -1051 387 878 -778 -235 1193 -133 -987 642 461 -1097 15 1082 -628
4125f28k48J788q40j262J629M89j782M68J500j391p18J912k17j738J111J005j833
4142g55l9J868q91j275J515L47j847N75J620j338p19J797l34j735J254J142j788
4159f03nJ789r74j396J601N00j826N65J593j549q60J866k25j667J305J064j843
4176f65r7J766q96j219J764L95j901M76J577j573o73J928k72j719J077R65j799
4193h66j5J966q69j320J600L17j855O26J666j382p40J798l80j704J242J029j749
4210f36pJ633r55j292J664L38j793P12J548j504p27J811l33j437J192R99j802
4227e89j07J716r27j200J771L01k010O52J394j425n78J902m03j627J197R10j705
4244g28J36J742r63j243J659J94j725O66J402j444m25J611m80j592J268Q91j636
$$ plain form
4125 -628 -876 912 72 -1190 439 928 -854 -386 1114 -277 -995 917 700 -1038 73 1078 -755
4142 -755 -794 1074 183 -1092 423 770 -1077 -502 1118 -220 -939 858 524 -1211 43 1185 -603
4159 -603 -608 1181 207 -1189 412 912 -914 -349 1244 -305 -1165 701 476 -1191 114 1178 -665
4176 -665 -762 1004 108 -1111 653 1048 -853 -377 1200 -373 -1046 882 610 -1109 -32 933 -866
4193 -866 -881 1085 216 -1104 496 813 -1042 -416 1250 -132 -872 926 546 -1158 84 1113 -636
4210 -636 -643 990 35 -1257 407 745 -1048 -336 1212 -292 -1019 792 459 -978 214 1213 -589
4227 -589 -696 1020 93 -1107 664 965 -1045 -393 1001 -424 -1002 900 497 -1130 67 977 -728
4244 -728 -592 1150 187 -1056 603 797 -928 -262 1140 -304 -729 882 402 -1190 78 969 -667
4261f67J07J569j041j115J599L18j572P42J168j490n37J731l52j401J187P71j739
4278g22R9J548r42r68J491J41j605P44J155j315m24J577l35j389J099P08j588
4295g26J93J568r39r45J318J51j471O85J118j232m84J511l86j351J169O37j382
4312e66K04J216q74q21J315R2j336O65J050j346l10J402m15j139J035N27j324
4329f25K28J171q14p23J193O1j200N89Q67j079k14J206m26r81R70M41j282K98
4347c20J047p59o38J091j6j102O27Q26j059k41J119l91q58Q51M04j023J03J004
4365F65p07n54J076kj112N70O62q33j78R32m03p78Q68K17q33J66P91n60n82R00
4385C05Lq08M12O06p30j21Q12l43o40O57K89p98J12P78n86m34P50k3p11M34L88
$$ plain form
4261 -667 -560 1009 -32 -1147 452 770 -802 -60 1108 -382 -919 812 460 -941 246 1017 -722
4278 -722 -623 925 -17 -985 506 647 -958 -214 941 -374 -798 779 444 -945 154 862 -726
4295 -726 -533 1035 96 -849 469 620 -851 -166 952 -280 -764 747 361 -990 179 816 -566
4312 -566 -362 854 -20 -841 474 566 -770 -105 945 -401 -711 691 276 -863 172 699 -625
4329 -625 -397 774 -40 -763 430 491 -709 -120 747 -332 -546 660 234 -747 223 664 -618 -320
4347 -320 727 -32 -670 421 405 -697 -70 756 -303 -544 575 184 -674 177 581 -442 -339 665
4365 665 -42 -596 480 478 -634 -64 598 -235 -413 519 116 -662 206 423 -410 -244 547 -13 -595 305
4385 305 308 -500 -88 518 -212 -333 479 136 -504 153 442 -356 -244 534 -52 -486 264 241 -470 -36 352
4406C52n93j24P17k67n27N33K40n76P3O31m99k33N23j6o06M17K28m96K0M06j41
4427F2m77N12J48n56J72M87l52k86N37r7l51K72K18l84pL72k06k70L02R1l46O
4449a53L25k39j36K99j2k88J95K03j83q3K60p9k50K30Q5k57P3J81j98o7J34p8
4471c8q0N2O6m2q1J28lp5M2R3o2Q8J0m3j0J5o9O2p5O2J7m3l3m4P2j37M3Q3J4j04
4501i2J00K6j58Q0J96p3r0J83m8j28j3K05k12j02J95j01j87K32O0k72P4K80k33
4524g8m0K85k7l09K36K64l77n1M19k67l08L65Q1m17O8L69l75j96M93m7m03L31
4546A6L37m88p7N65k81l65N22J21n56J97L39l85k95N52n0n79L44M06o49j2O38
4567C00j89n41Q38J27p13J91N10m89l66P53j42o80M11M49p27o0O74m00n06O39
$$ plain form
4406 352 -241 -365 352 85 -442 91 331 -245 -172 459 -40 -273 250 234 -372 45 273 -223 -203 203 62
4427 62 -415 97 245 -311 -139 348 -4 -290 247 150 -201 71 289 -95 -102 270 64 -206 96 187 -159 -153
4449 -153 172 -67 -203 96 84 -204 -9 194 11 -72 188 109 -141 89 174 -83 -10 171 -27 -94 40 -38
4471 -38 -118 -66 0 -42 -123 5 2 -73 -31 62 0 88 98 55 45 60 -9 53 -22 40 57 14 -19 -63 9 -128 -85 -2 12 -92
4501 -92 8 34 -124 -44 152 79 -11 172 124 -4 -17 188 -24 -126 69 -32 -219 13 73 -199 -125 155 -78
4524 -78 -118 167 140 -169 67 331 -46 -97 322 55 -253 112 193 -224 -156 213 -162 -358 135 88 -315 16
4546 16 353 -135 -212 353 72 -293 229 350 -206 -9 330 -55 -350 202 152 -427 -83 323 -326 -338 300
4567 300 111 -430 408 535 -178 13 523 34 -332 421 279 -401 10 459 -268 -328 346 -54 -560 79
4587G9J54o79K01P10n53l23Q01o6p73N77M82q46o2Q30m32o22P33J66r01K39P30
4608D45o96m14R89r9q90O48M93p61LR19m89o08Q28K07r80K69Q01q38m41J035j71
4629B50r95P83M79r71J0R42m44p03R94K08j047L58Q85r42k95J117k51j018P61
4648A21N40j143J4J029n40p65R80J52j080N09R25j006l29J243k78j009Q42N79
4666G84j138M6J093o92q03J076J01j139M31R08r92m10J237l06r88R47N48j200
4684d97J13J145o63p62J167J79j303O01Q22j082l25J257l62j149R24M85j288K13
4702e25J211o94p37J216N3j288O67R74j001l17J204m84j027R13N26j233K11J063
4720G32q48p62J199Q1j197O56R14j134k42J304m40j038J136M50j286J30J126q17
$$ plain form
4587 79 233 -446 -245 465 -88 -411 390 324 -449 128 610 -236 -298 532 100 -522 211 377 -524 -285 445
4608 445 -251 -665 324 225 -665 -17 476 -285 -282 637 148 -460 368 575 -405 -136 665 -173 -614 421 250
4629 250 -745 38 517 -454 -444 498 54 -649 345 553 -494 -136 749 -193 -488 629 378 -640 121
4648 121 661 -482 -468 561 21 -744 236 388 -692 -183 742 -264 -593 650 372 -637 205 784
4666 784 -354 -308 785 93 -710 366 467 -672 -241 667 -325 -735 502 196 -792 155 703 -497
4684 -497 -384 761 98 -664 503 682 -621 -20 802 -280 -605 652 290 -859 65 550 -738 -525
4702 -525 686 -8 -745 471 524 -764 -97 877 -124 -441 763 279 -748 165 691 -542 -331 732
4720 732 -116 -878 321 402 -795 -139 775 -359 -601 703 263 -775 361 811 -475 -345 781 -36
4738c6o95J304m3j366O64Q35j122k62J365m04j066R75M80j349M19J173q28o69
4756f25J232r6j278P68Q37j112k04J188o29j042J116L84j165K32J161r49o76J271
4774D13L1j123P66Q33j259k26J339n26q90J042L35j314K41J069r69n63J264p2
4792C91j234P11P72j169l1J316n30r53J052K92j197L54J064q73n92J184k12j155
4810h10P40Q16j235LJ052o20q16J072M02j159M05Q79q95n08J217p2j044P00O16
4829G43j209J6J136n73p89R33K35j187L59R65q70m16J159r3j107P73N77r95j4
4848c57J078o12p50R59J61j067M41Q57r03l96J027k26r48P47N37r87M4J018o22
4867Ao80R77J75r43L52P79q87l27J050k00r01O89M62r79L3R09m61o94Q64J54r11
$$ plain form
4738 -36 -731 573 530 -836 -172 663 -459 -721 644 240 -826 149 629 -720 -301 872 44 -625
4756 -625 607 511 -767 1 838 -274 -478 710 81 -961 155 539 -626 -394 767 -182 -858 413
4774 413 444 -679 87 920 -339 -565 774 248 -642 400 735 -579 -338 731 -238 -801 463 391
4792 391 -843 -132 640 -529 -560 756 226 -727 325 617 -580 -226 838 -35 -627 557 345 -810
4810 -810 -70 746 -489 -486 566 -54 -870 202 604 -555 -150 729 -166 -674 543 471 -573 127 743
4829 743 -466 -450 686 113 -676 257 492 -695 -336 629 -241 -657 502 409 -698 75 652 -343 -357
4848 -357 721 109 -641 318 479 -588 -147 710 -193 -589 438 212 -736 11 548 -439 -395 623 1
4867 1 -679 298 473 -470 -118 661 -226 -553 497 297 -604 85 547 -432 -399 510 49 -645 219 373 -538
4888e38M22P03p36k31R67l15p73O24M40r11O0P88m79o00P77J45r11M00P01o98
4908a65k97Q92k81o66O63L44p56O6O81m63m38P36L5q42L59O13o89j74P18j95o83
4929e42N56M54p91M7P00m13m41P40L6p16L16N05n74j63O13k08n71M98K98o65R9
4950b22N79m30l15O05K3n73L02M49n46j04N51j40n07M57K22o43J05N79m20l26
4970c54N59r6m65K82M02m31j69N25j80m04M56J95n01R7M09m03j59M61k5m47K07
4991d1K83l96o1M23k29k85L33J81l87J11K78k52j89M10J8l88J97K52l39o3L06
5012A62j20k54K51P5k63R1J67j17k23L07Nk47J41K33k49p7K54j16j69K16N6k37
5034a14K7J77p7n8J28p3q8P0P9j50J9J31n5k5L9K3q0LQ0j9j13J41pr6M2L3q3L2
$$ plain form
4888 -538 -116 587 -149 -380 587 272 -501 123 563 -348 -288 500 21 -579 198 343 -568 -168 533 -165
4908 -165 -462 430 149 -517 146 490 -266 -200 481 18 -420 316 351 -491 -132 481 -208 -382 336 141 -542
4929 -542 14 468 -323 -276 424 11 -430 310 346 -370 -54 451 -123 -286 327 119 -452 46 344 -321 -222
4950 -222 357 -73 -388 217 240 -333 -31 418 -128 -232 319 179 -328 129 351 -292 -187 392 -28 -354
4970 -354 205 109 -356 -74 328 -103 -272 253 73 -331 125 320 -181 -84 325 -78 -237 224 199 -248 -41
4991 -41 242 -154 -215 208 -21 -306 27 208 -179 -68 210 -42 -231 179 197 -191 6 258 -81 -144 162
5012 162 42 -212 39 114 -149 -58 109 -8 -231 76 81 -166 -25 208 -41 -118 136 20 -149 67 123 -114
5034 -114 -87 90 13 -45 83 10 -78 -8 71 -79 -60 71 16 -9 30 53 -27 -24 56 37 -76 65 58 -38 4 37 -46 -14
5062a4O0k6m8J5N5j04K6K4K1j2jK0lj8NL7L3r8L6Pn5PO5r8QP1j1m4jR7rr3J43
5095I5p9r0J05R3k07J8K02j18q9P1J02j41NJ36o2j18J48o0j67J47P8j24PJ39q1
5120A0r3J58N4j79n3L00j94j53K79m4k11Q4J26j51j18K86r3j85K68L3k59O0K55
5143A80j64j99L27o2k61J76K31k89oK86j87k65K31K05l56Q0L35l73j03L63o3l24
5165b38K12K14l04J5L12j70k82L35J85m93J67K73k25k71M09p5l80K69L09m31P
5186a62M31j92l96M51L2m25J56M38l88j93M29Rm24K36K43m60j8M51k33l08M32
5207A09N8m97K07M36m15j46M13J1m84L70K82m56j5M78l47l64M85J31n50J86L76
5228B68l57j99N10j00m16L17K53n35R4M98l04l21M75R7n56J88M01l83k56O56j21
$$ plain form
5062 -14 46 20 -28 -13 42 -62 -36 -12 9 -3 -4 16 13 -5 0 37 70 -28 8 15 -40 -33 32 -66 -58 13 2 -42 -43 54 45 -48 95
5095 95 16 -74 31 124 -83 -65 137 19 -70 1 103 -38 -33 103 41 -77 71 11 -156 -9 69 -55 -48 91 10
5120 10 -83 75 129 -50 -103 197 3 -150 129 85 -126 -42 84 -67 -185 101 8 -177 91 124 -135 -75 180
5143 180 16 -183 144 82 -179 -3 228 -61 -67 219 32 -233 -2 203 -153 -73 262 -111 -214 149 86 -238
5165 -238 -26 188 -116 -101 211 41 -241 94 279 -214 -47 226 1 -270 139 64 -316 -47 262 -169 -162
5186 -162 269 77 -319 132 164 -261 -105 333 -55 -248 181 190 -234 2 245 -215 -233 218 -15 -323 109
5207 109 167 -330 -123 313 -102 -248 165 176 -308 62 344 -112 -127 351 4 -360 125 256 -294 -108 268
5228 268 -89 -288 222 122 -294 23 276 -259 -165 333 29 -292 183 280 -276 -88 313 -70 -326 330 209
5249B09n56L50K50n16M0N40l21l76N40Q9n48K15M83m86k05N61j20m79M48J91m65
5270a56%M91l21m15N45P3n16J60M72m58j87N61j03m95M52K27n69O4M90l34l39
5291c58N80N1n06J71M06n04j53O23j92m75L98K27n26K0O31m00k56M93l4m53J95
5312f2M94n21j32N43k19m36M30J86m50l0N23l96l31O34k7n16K69M13n36p4N66
5333C28j26n18M38J88o03R6N45l91k51N18ln74L47L01m66k8N36k20m57L96J99
5354B55n11J07N81m45l02N47mn91L55L84n15j10N46k87l68M23K16n69J28M72m14
5375a02k09N27k5m78M09K09n05o5N19j46l91N11J04q23K60L32k41j61N19j13m63
5396c32K51L81m72j5N80l56l96M56J63m96J60L96l24k55M47p6m50L84K53n22j
$$ plain form
5249 209 -347 3 253 -263 -223 317 -4 -380 160 249 -299 -84 399 -87 -292 269 149 -330 118 309 -156
5270 -156 -156 335 14 -401 144 217 -299 -139 333 -125 -312 249 146 -349 103 330 -239 -175 315 -19 -358
5291 -358 222 273 -233 -62 344 -160 -313 310 118 -357 41 268 -258 -238 393 -7 -263 230 196 -257 -62
5312 -62 432 -89 -221 322 103 -333 97 283 -167 -197 326 -70 -401 233 206 -310 -41 372 -164 -238 328
5333 328 202 -316 122 310 -293 -197 348 -43 -294 224 221 -353 -6 295 -171 -199 337 117 -340 56 255
5354 255 -256 -149 432 -13 -315 232 228 -363 -8 376 -139 -249 297 10 -358 65 281 -288 -160 312 -102
5375 -102 -311 216 191 -287 122 331 -174 -239 280 134 -257 254 358 -465 -205 127 -114 -275 244 131 -332
5396 -332 -81 300 -172 -187 393 37 -359 97 260 -236 -76 320 -4 -259 188 112 -338 46 299 -223 -224
5417b24M12j81l69N38J24n14J58L44m05j22M75r5l24J85K80m54k0M28j96l33L94
5438A01O8m45J81L30k92j89M87j19l83K91K40m51O4M41l17k42L08O9l97K11L17
5459B73l29j58L69j3l52K26K31l45n4L98k22k86L72O1l76K01J79k36q7K60L0l58
5481b16K22J64l34KL72j86k54L51M1l33J12L18k86j37L54o5l45K45J29k29l4L17
5503B08k09k05L23m3k51K00K26l09j00L18j04k50K92J56l39m6L12j70j49K29N9
5524A48l09J35J40j84q0K92j13j37J21J01k42N3K41j38j18J59P5l23J62J70j48
5545Er0J94q8r8J18Q9k48M2J49p3j15K07Ok02O8J40j29j4J48p6j46J41J3j36O8
5570b7J11j10r1J82n8r6R2Q9r8n6J07L8j32M5R4j41l0J90k8k04J97J0j80J18P3
$$ plain form
5417 -224 188 7 -362 176 300 -214 -56 288 -117 -239 236 141 -183 2 282 -172 -192 236 40 -293 101
5438 101 169 -276 -95 235 -57 -246 241 122 -261 30 270 -181 -117 324 7 -235 73 142 -255 -44 273
5459 273 -56 -214 155 142 -210 16 247 -98 -152 246 24 -262 110 171 -205 -4 175 -61 -148 112 142 -216
5481 -216 6 170 -164 -162 210 24 -230 121 162 -171 -59 259 -27 -164 190 125 -220 25 154 -75 -109 208
5503 208 -1 -206 117 74 -177 23 249 -60 -160 158 54 -196 96 252 -87 -133 179 9 -140 89 148
5524 148 -161 -26 114 -70 -150 142 29 -108 13 114 -128 -75 166 28 -90 69 144 -179 -17 153 5
5545 5 -85 109 21 -77 41 130 -118 -76 73 0 -115 92 98 -104 -36 104 -25 -39 109 33 -113 28 41 -95 -27
5570 -27 84 -26 -117 65 7 -89 3 92 -6 -62 45 83 -49 -4 90 -51 -81 109 81 -123 74 84 -96 22 95
5595I5j15J3J6kp9R9K7o1l6J34j14r7J79Rj03O4L5j12K0Q4j1j21R5N9j34kR2l5
5623an1O8L3o0J1K9j4p3Q9k1l5N1J7p6L9j2K2m2L1k5oM6pk7j5K0L5j2M1l3o1M1
5655BOj7rO5Kj49O3P4j3k7K9k6l6L5m0P2m9KrN2K6m5O3p7mK8j0m5KN5o4l4J27
5688D9q6k9N1R7j71N7O6p1P1n2R1o9nL9j7m6Q7r1k1N8J2j47R6J03p2m6Q1Qj03
5717f0J04k2n4MJ14k3r0N4l2K4oM0m3n4J07m8p1O8M2j18K3N0j2p7J24jn9K1J03
5746A08r5q8J04J0p8PM4k1k9J06m4j15J05L2j05rJ81j35j11J85l1j38J69P3j69
5771d4L2J08p4q9J04Mj1r6J26j15q4J99N3k48J19J28j31j9J14r6m9J06K8j52N6
5796c1J43j34j03K02m0j79J56Q3j78L7J16p3r3J47K2j48J9K45j92r0J88o3j89
$$ plain form
5595 95 -20 -7 9 7 -72 27 54 -7 -43 91 -23 -120 59 68 -35 29 64 -48 -28 56 45 -76 19 78 -56 -58 34 -1
5623 -1 -52 16 49 -11 0 29 15 -58 31 10 -25 26 43 -33 6 -6 16 -26 5 -20 -26 20 13 -14 -29 -9 26 14 55 22 -39 2
5655 2 8 -9 -18 47 49 -100 -37 37 24 -3 26 0 -36 -1 -41 31 -18 -16 -25 27 53 8 71 -6 -10 18 8 -37 -35 20 -44 -78 49
5688 49 -37 -66 -15 82 -89 -32 34 -37 34 -18 73 4 -1 38 21 -25 62 -29 -50 8 20 -127 -31 72 0 -46 35 43 -60
5717 -60 44 22 -32 -28 86 63 -27 27 -5 19 13 53 10 -44 63 15 -56 12 54 -64 -41 9 -3 -80 44 43 -16 5 108
5746 108 13 -75 29 39 -39 -32 12 -9 -38 68 24 -91 14 46 -59 -68 113 -22 -133 52 21 -117 52 125 -44
5771 -44 -12 96 22 -67 37 41 30 -66 60 -55 -139 60 113 -135 -16 112 -19 -38 76 -20 -69 37 65 -87 -31
5796 -31 112 -22 -125 77 37 -142 14 97 -81 -44 72 -1 -94 53 75 -73 -54 191 -1 -91 97 34 -155
5819a55J56P8j23p5K05o7j11J55Nk02J26J22j36q7J86K7j59N6J11j48m1J82j4
5842I1j83J93j0j46k2J73j35n2J34j5j07J08L3r8J5J45j30j18J63O6j70L5J57
5865A27j38p2J85ok52J52R7j62m6K15j56L2Q1qo7n5J73j24j8J18o5m2K3J04j92
5890i6j4K38j43q8J38l4j41R9J11j63N1N2mj03J99K8j86L9J62j26j36K56j25o5
5914e1N9J50j99p7J42J8j70J26J21j60j7J47n7j10J33L9j93J01J02j20k3J21p9
5937Cq1J50L6k32M9J63r4j10J47L2j70M9J81j25n4J50j15r7J49P6j69K9J05p8
5961fj00J69l3j33J15J12j90J0J29p2j03J14J17j48j6J17r0p7J70J2j64N5J36
5984A24j59p3K29j31k1j32K37p4j3P4l89L42J16p3j06K19j96J85l11O6J32m35
$$ plain form
5819 -155 1 79 -44 -119 86 19 -92 63 68 -134 -8 114 -22 -109 77 104 -55 1 112 -36 -77 105 91
5842 91 -92 101 91 -55 -77 96 -39 -91 43 28 -79 29 62 -36 -21 124 -6 -124 39 105 -65 -30 127
5865 127 -11 -83 102 96 -156 -4 93 -69 -115 100 -56 -24 57 49 -18 -73 100 -24 -42 76 11 -31 -8 96 -96
5890 -96 -110 128 -15 -103 35 1 -140 -41 70 -93 -42 10 6 -97 102 130 -56 -17 145 19 -117 139 14 -51
5914 -51 8 158 -41 -118 24 42 -128 -2 119 -41 -58 89 32 -78 55 94 -99 2 104 -16 -39 82 3
5937 3 -78 72 108 -124 -75 88 -6 -116 31 63 -107 -58 123 -2 -56 94 -21 -118 31 107 -62 -33 72 -6
5961 -6 -106 63 30 -103 12 124 -66 -56 73 1 -102 12 129 -19 -35 82 -8 -85 85 97 -67 -12 124
5984 124 -35 -108 121 -10 -31 -163 74 0 -13 61 -328 14 130 57 -49 170 -26 159 -152 -86 46 -389
6006c89K75L02j57j7Q2j23k0o2m5K17ql4j41j23P31l97P9k63J49l9j65j8m8j5
6030b29L50Q3l46M38n16L64p2n9K60M0l6p55K78M9n1r8jM39l8O8j68J28l84L38
6054H2j90k00L20j02R1j37qJ34q8j5J41R8j26k8L05m35K76j0J35l03o5L43m27
6077b09J21O1l1K24l12L97l65J36m9r2J42l1j32P0O4J50O9m34J29m0K53l29L15
6100A07j83J41P7q0N2k34J59K8pj93J15N1J66j42k14L8R7p8j04M71j29l75M20
6123A83p9l80K46k52K69p5p6L50l45L08q1j29J23j52K8K0M12j67l37Q2m7j16M14
6146A99j09%Q6n91M79l9m0K32j19Kj01j08K19j17m1m0kK16j43K06j39p9l1K69
6170B09k12j53J84k0K67j17m7J18k64J05J07l48N1rJ02m35M28J46j21o1L03l30
$$ plain form
6006 -389 -114 188 31 14 96 -27 -47 -109 -154 63 55 21 -120 -243 488 91 170 -93 56 17 -148 -166 -214 -229
6030 -229 121 204 -142 296 -220 144 72 13 273 313 277 -478 -200 -151 -202 -300 -301 138 100 168 0 128 -256 82
6054 82 -108 -308 12 -90 1 -136 -144 -10 -98 -113 28 126 0 -28 277 -158 118 108 243 -60 -125 218 -209
6077 -209 -88 -27 -58 166 -146 251 -114 22 -27 -119 23 -8 -140 -70 -6 144 213 -221 -92 -132 121 -208 107
6100 107 -76 65 142 62 114 -120 39 67 60 -133 -18 33 199 57 -157 -119 -22 -100 -204 267 138 -237 183
6123 183 104 -276 -30 -282 -13 -88 -164 186 -159 149 68 -61 62 -90 -62 -42 370 203 -134 -52 -99 -215 199
6146 199 90 90 176 -415 64 25 -15 217 98 100 -1 -109 110 -7 -48 -88 -90 126 -17 189 50 -29 -60 209
6170 209 -3 -156 28 8 275 158 111 229 -35 70 177 -171 -120 -129 -27 -462 -34 112 -9 -70 233 -97
6192i7J6J26l0j9K86O1n53qR4k15L01m4j96K67L57ml07N8rJ2j90j37K96o0JO3
6218F9m0j23L0m4K8P8l2N0K9o1J0PO9nl2j2Pk4Ql0O3n5P0o0rk9O6l5p5J03O3j04
6250b0L0M4m6J4l2K8l7K7%m2L1m5N9Rn7JL0L7l1n0j3P2k3M2j4l5N1k4L4K1o1l7
6282c7L5L6m9LM8l3k5K3j1k5K4J0on5L6K3j1K6Noj07J12J1l8J3qj3J0N4m0Rk6
6314a2L9lj8k1oM2lJ7J1m9L3L6o9jM6n9l5N4j7K3%j1o9O3O4n8j1O1q2J8L7k8J0
6347Bo4J14o4J8K3j0l4nRm0KM5Kn2P7Ol4j2R5q3m4P2K3l5jL9r7K3QK9l8K5K1j40
6381a20J26K6k5m2J08j01nM1L7r2OJ43j00n4O6ml2k1J19n5m8O6o8k5P2M0r0M1
6409IM3k1q9N2P2j37l6J98p7k7M3J9p5J6K8n6M6M8qj12P0M7q9Q0J7j21K1Q3k5
$$ plain form
6192 -97 -81 45 15 -4 282 343 -210 -218 -124 -339 -38 -82 -278 -11 346 342 35 93 84 96 -94 -231 65 5 6 69
6218 69 29 -94 -64 -108 -80 -2 -34 16 45 -16 -6 1 70 65 33 21 28 4 12 -18 45 -10 60 0 -9 -38 28 -7 -82 21 84 -20
6250 -20 10 54 8 22 -10 18 -19 8 8 -34 -3 -48 11 20 -37 -36 -6 31 0 -50 -63 9 -14 28 14 -21 30 6 40 61 0 -37
6282 -37 -2 34 -15 -12 36 3 -22 1 -10 -35 -11 -1 -7 -62 -26 -3 -14 12 17 11 -96 16 27 -11 2 -6 -19 -9 45 5 14 -12
6314 -12 27 24 6 -15 -21 21 18 35 46 -3 30 66 -3 -4 42 -17 -52 2 -15 8 8 -3 -72 -9 55 -3 -14 47 -35 -17 20 -8 2
6347 2 -62 52 -12 6 29 19 -15 -20 -11 -51 -49 -4 -2 -54 23 29 -5 -17 78 -5 -49 23 46 11 10 49 -48 -25 -17 12 -26 -1 20 -120
6381 -120 6 32 7 -35 73 -28 -33 8 45 -47 -41 102 2 -52 14 10 -22 -43 76 21 -27 39 -29 -54 18 58 -32 9
6409 9 52 31 -58 -6 66 -71 -107 91 14 -13 30 49 -26 -10 18 -38 8 56 48 -64 6 53 -36 44 61 -60 -39 44 19
6438A9r7R3O4j26j1P0J9n5O0K5p6LO7o9J2M4n5m2R6K0q8J2P3J8j35N8M6o5J3Q
6468Ap6Q7J3l7n4R7Ro6mO9rp7R4J3m9l0J05q5p5J10K7n9NJ5m7k7J04l6q2Q8kj19
6500i7P2P1l0o2Q6k6o0P9J4o1l2P4l3m9M3Q7j20MR5q7PP8o3l8R9J0p0oO4p0L7
6531A6k5L7n3N3J01j01q6P7O5r1K5K4n9L1K0J2o1N3n7rj3J00q3J9Q7r1n4O4Qk9
6561b0j3O0o5J5O8j6m3L6P1j33j7J12j04M6J1P4j30K2O1q8L0O8l5m9JJ13o7j2
6589dK2LLk8K5o4M3J28r9r4J30q7M4n2P4j4p8R8m5m4M1K1p4OQ7p3jK8J1k3L7q
6621A3j9k8R2k9o2M7K4n9L9J6lr2Q8n6l1P3M5j11J06j6n5J0L2k2m3l7Q9mK0l5
6651hM0n7M3Kl9NL9l2q7J73q2L8p0K2M3k8pK5k9rJ15q3m1J16j09kK1M9j13Q4M2
$$ plain form
6438 19 -78 15 79 -47 -58 12 31 -24 36 61 -15 -12 55 -14 -2 42 -13 -55 41 61 -27 -15 58 76 -59 -1 45 -20 -7 1
6468 1 -75 12 25 -12 -66 31 40 -26 -30 39 30 -47 47 60 11 -19 86 1 -74 36 63 4 9 24 -23 -50 54 18 -64 24 22 -97
6500 -97 -25 46 16 -46 40 14 -46 33 47 -14 -46 28 -5 -54 -11 76 -44 -40 55 -32 -25 53 -10 -48 51 61 -9 -15 49 -21 16
6531 16 -9 28 -25 28 129 28 -58 19 84 -7 18 42 -17 14 34 46 -15 38 -19 -28 -41 59 -24 -5 82 -9 -63 1 9 -20
6561 -20 -33 27 -38 -23 45 29 -14 22 93 -40 -57 55 -49 -3 8 82 -48 -26 35 -53 -23 45 10 -39 -38 75 8 -4
6589 -4 18 21 24 -4 21 -43 0 128 29 -65 65 -22 22 -30 44 30 -48 50 5 -39 2 23 -51 -45 42 -31 -32 -4 7 -16 21 13
6621 13 -6 -34 58 29 -33 14 38 -21 18 34 31 -61 27 -29 -60 13 58 -53 53 37 -18 -8 24 2 -41 -78 11 7 27 -8
6651 -8 32 -25 18 20 -19 -14 25 -7 -94 79 -3 35 -35 -13 30 2 -5 20 -9 -18 97 14 -27 89 -20 -22 -1 48 -65 19 61
6682F1q0j4M1pj19J63m8k8j0J38j04p0R3O7o4j4J01p9j3J4k7l3N6j7Rq3M2rk3
6711e7O4oj1j7P0j5r7Q8j6k7O1l7mL6l3NJ4L7l5nn6R4j32O6O7p1N7Nm3l5k1N2
6743bl9O3M9j3r0K1rL8n0J00k7j02R8Qrp8R0q2K7j8Q4p7L6J1l8m3P5L4p7M2k5
6774cj0Mmk2jpO5l8J8l1K1lj1L4p7L0N2l2O3Rl7k9j7M9o3O1Q7o6o0K4omK7l9n6
6809g2O3Kj5J7jm8lL2O0m2L9kj0J2j01P0M9q9M7L2q6L0Q0n8l7O2m4P9j03M0K8
6840C1j4%j7k1j2QJ0K1%nn7J28j6q1%K0%j0L8l2lk7R4n6m5P0j8Rkj3j0M0lMLq
6876B6K1m8Ol0k9P5q8J33n1n8L0J6rQk1Jk5J7K1q7O9M7j4j2O2p1J7Nl6L1l0Q8
6908F4r0M7jj5j4N1l5l7J1kJ5L2K2m4J5N0m5j3K6n0m9M3Nqp0P7O1p7k4Q6l2j1
$$ plain form
6682 61 -19 -33 8 1 -118 45 -3 -31 -41 97 -7 -77 16 83 19 5 106 27 14 28 1 -32 24 7 16 -67 -25 -34 -57
6711 -57 7 1 -10 -27 43 28 -69 19 3 -24 37 0 -4 32 -1 4 18 55 20 15 -41 53 -79 -13 54 -17 40 45 2 -33 -54 -2
6743 -2 -41 22 71 58 -32 -11 -20 18 -32 68 41 -61 37 45 36 -42 48 -34 -7 -25 59 -18 18 29 -9 -52 23 57 -20 22 -3
6774 -3 -13 -9 -13 -35 -36 -43 22 -16 2 -29 -8 -11 -22 12 -65 -35 17 -15 48 57 20 -9 -26 23 -40 21 108 42 -18 6 0 -4 23 -16 -72
6809 -72 -9 -7 -22 -5 -6 -54 -57 -25 35 -7 32 30 20 32 -69 1 50 -39 8 40 -46 -16 64 6 -31 31 -13 66 -37 3 31
6840 31 17 17 0 -21 -33 -25 -15 6 6 1 -56 72 56 -25 -25 -5 -5 -15 23 -9 -12 -39 55 -1 -46 24 6 15 13 0 -10 30 27 31 34 26
6876 26 47 -1 5 -25 -54 21 -67 66 15 -43 -13 3 -6 2 -19 -18 -43 -26 -5 -92 -23 24 10 -2 60 -11 6 11 -25 6 -24 64
6908 64 -26 21 20 5 -9 42 7 -30 -19 -21 -6 26 48 4 19 69 24 11 37 -13 -62 -19 -14 -22 -92 -15 46 -31 -55 31 -1 -12
6940a2n4R5o1N0j9L1o6R5p3k3M5QLoQ1p6k0k7J9j9K1N4q5K6O4j2q3M9N9l6l5N0
6972D3k2j8L2m7m8k4J80q9n7P4qo0M7M4j6n6Q5J3j12M1L5j8JM2j07k4N0N1j04
7001g2M7P3p2N4J6o3l5O8l2j1M1P0q3n2O3L6l9K9n3n0K4M5L8n9M6Mj01N4Pk2K9
7032@J0M4q9M3N1r1mQ9j5o1O7k9p4J1P9o1m4J06k6k7L7M7p8K7J2j0o1Q1jp9L4
7063a2P1k0q0P3j7j29J31P3r5p0R4J4p6R5Kp9K4R4p7j3NJ7j04R4M0q5lM3k1j7
7093b8Q4k2q1P1P9r5p6J14k7j05J12K7r9o3J50m0j02J03P3j20K8M9j26N8N4j8
7119@r2J09P9j74L0R1o9mJ06k6j09M5N3j23L8J26n9j16J46J8p7K6J7n4l9Q1J8
7146D1p2J9N9m7l6J31p4j21R5N7r7K6O4%q1K9O9j00J3J12j14l2J31p1o0R7J8j10
$$ plain form
6940 -12 -66 29 -32 18 -1 30 -36 59 -14 -37 8 16 19 13 94 18 -2 -29 -10 -29 -8 46 -39 -13 51 39 -44 5 64 28 -7 43
6972 43 21 3 35 -12 -60 -84 96 7 -50 24 16 -44 3 47 31 -25 60 73 -39 2 37 19 20 62 -45 -69 -19 32 -72
7001 -72 -25 48 -24 30 46 -17 -52 16 -16 -27 14 84 1 -51 12 48 9 38 -15 -65 -41 4 42 -17 29 33 -68 -14 -7 -29 0
7032 0 10 54 -35 8 59 -32 -36 53 38 -23 44 15 -59 -48 31 -30 -74 32 6 -21 16 63 -15 12 24 14 -47 34 33 -46 -12
7063 -12 59 39 -41 32 15 -114 17 90 -5 -75 19 33 -43 52 54 -25 -1 93 16 3 8 25 -79 15 55 -30 -33 10 -11 -28
7093 -28 56 34 -47 24 103 8 -68 46 19 -86 26 53 -46 -109 41 1 -101 2 75 -45 -17 32 -94 -36 18 0
7119 0 -92 17 96 -78 -48 43 -26 -30 76 50 -59 -14 39 -84 -46 80 21 -95 51 69 -8 18 35 -19 -58 23 41
7146 41 -31 -12 47 0 -36 95 21 -100 -5 52 -45 -19 45 45 -36 -7 62 -38 -25 87 -27 -59 72 1 -59 38 56 -54
7174e4M8N6j17j4R3rj08J11K3n3p0J43m8j08J60k2j07L9O7m6m2K7O6j09O1P5p1
7201io2P8J7o0Q7J1q1K3P9m8r3R5M9j53M0J12o0r3J43j12K5M0l1l3kN0m4k7J50
7230I1p0l3j0J23j25rN3on3K5O1j29N7O3k2l2Q0k8q9K2Q7j03OP1Jn2L4R4j74K4
7260d3J25r0nL8Pp6N1N3r9k6K07j40JMMm0pO7Mn1K1K9n3M5O0r4k1R2q9PN2K1j18
7293f4L2J34j47R3K8o2j12J30Rp1N2Rl0l7Q3m7K0l9O0m6l1M0N4j56R7N3q7N7K9
7322E1o2j3M0kp5M3L9p5L7M7ll4M6Lj08K6O3l3qJ5mM2m2Nm4k0P7o0M2nL8n1M4
7355A9K9k4m0kN3n8pJ3M2q9R8o6M9m3M4n8L6j0K7JKK7j1m4M4o6K2j3pj3Q2qm0
7388a1K3k3Rl2Q3Jj7LJ4p6J0M5l0L6nK1q1L1O2o8j8Pm1P3j5OK3l0M5k6j1K2l1
$$ plain form
7174 -54 -6 50 -67 -81 12 3 -105 6 29 -24 -94 49 1 -107 53 31 -76 -37 30 -16 -58 -31 35 -74 -13 62 -9
7201 -9 -71 7 24 -36 51 62 -19 4 83 35 -58 37 86 -67 -27 85 25 -68 75 -37 -12 28 -3 -36 -38 12 -32 -59 91
7230 91 21 -12 -22 101 -24 -33 20 14 -39 -14 47 -82 -25 38 16 -16 64 36 -53 -31 56 -47 -41 30 31 -21 13 107 -67 -43
7260 -43 82 -8 -13 25 32 -44 7 60 -39 -65 142 2 3 7 11 -29 -36 31 35 -16 5 34 -19 26 86 -8 -29 63 -26 -19 33 54 -64
7293 -64 -32 102 -45 48 76 14 -98 32 41 -30 22 31 1 -36 47 0 20 -19 41 -5 -36 4 58 -98 -1 52 -35 22 51
7322 51 -11 -24 16 14 -61 -18 21 -54 -17 30 27 -7 39 42 -66 -40 23 -10 -18 -3 -7 35 -7 -2 -46 -66 11 -49 -7 -12 26 -25 19
7355 19 48 24 -16 -18 35 -23 -30 -17 25 -64 34 -32 17 -26 18 -40 -4 -14 13 14 16 43 32 -12 32 -34 -12 -25 -32 -45 37 29 -11
7388 -11 12 -11 -2 -34 49 50 33 36 50 -26 -16 29 -1 35 30 51 -30 1 63 -5 -23 -16 -57 16 1 7 30 0 45 19 8 30 -1
7421aK6J5l8k5K4K1km9O9j2n0NK0k1N8j4q0P0o2K9NPJ0j1M1n1rQ2J7j20N5k8j7
7454c6M5M4n7jM6l1K5j8j1lj3J5j1K9n6M8l9mK3p9J1J9O6p7K7M7j3j1j6M8m5M3
7486A5m0N3j5k1l2j4R1o7J7L3oon9P9jj9k8J4m6K7M1j3l9O2j0q6N0N3l1j5l2L2
7518a3l4J0M9l6M0J6n3j6O9j0RL3l7k8kk5Q4j07M1O6r3J9J9n1k2J12k4ok1O0k8
7549B1j5mK8n1k0O5o1LL3Mj3L6L5o2o4J05m7l1J6j3NO0Oj5n0J00l4m6N0j0o7L7
7581AN9o4o5R2m6q1J05N0j38P0J17j05jmK1n9j8R9r7K5R1j7j09L7P0q6K5P3Kr4
7611d7J21j3j07L2P5n5l6P0m4m5O7Mo0K2M3K0j44J47k2m7K9Q1j67J01M0m8j9M7
7639D5M1j32L4M9l7l2M2M1r2N3N0r3k0P4M2j48J05J9l6mJ02j27l5O8M5j32R4M2
$$ plain form
7421 -1 25 40 2 -23 1 22 20 -29 40 28 -22 -17 3 -18 40 26 -54 16 -46 -17 -12 -5 5 -6 35 -16 -25 57 74 -46 9 -19 -36
7454 -36 9 53 -4 -5 41 10 35 17 6 3 -10 5 -6 23 -33 15 -24 -28 -5 -84 -73 -54 12 -65 -38 9 -4 -15 -31 17 -28 15
7486 15 -25 28 13 -8 -40 -54 37 -30 -13 20 14 8 -51 28 27 8 -20 -6 -52 -25 16 3 -36 26 16 -70 -20 33 2 -13 -45 -13
7518 -13 -47 -37 12 -24 16 32 -21 -37 32 22 31 64 27 -1 -3 -28 56 -51 -10 56 -37 -18 1 -50 -72 40 16 10 -11 49 21
7549 21 6 2 30 -21 -41 24 -37 -34 -1 3 -10 26 61 -1 -65 40 -7 -38 -22 -35 -30 30 36 21 -29 71 37 -9 41 31 -36 1
7581 1 60 -4 -69 23 -23 -104 1 51 -87 -17 100 -5 -6 -10 11 -48 -66 33 -64 -39 52 35 -74 -37 33 -53 -28 45 47 -47
7611 -47 74 61 -46 -14 61 6 -30 40 -4 -49 18 22 -38 -16 27 47 -97 50 28 -19 10 91 -76 25 65 17 -2 45
7639 45 86 -46 -12 37 0 -32 10 51 -41 12 62 -31 -51 23 65 -83 22 41 5 1 103 -24 -59 9 54 -78 16 58
7667E8l8r0J44r7jN9m1m5J9O1O7j63J08J9j49J16L2m3p1R2Qj07J09J7q0J4Q5m3
7695D0j20J51n6l9K6K0j8j0K8L4j36J01K6j68J26J8k8PN3K2j30L7P9j10O2nN9
7722F9j17J0J34j59qJ27n8p4J34k3j79J78nq0Q9nl9q0R1P1j05pK5j8J0kK6j04
7750i9P5M4Np9J00l7r1P8R1j09P7J8l9o9J42q0j14J12k3k0L0M8n9p6J15n0Ml9
7778d5J17o8qM8k3o8M3P9j74J06K9J0q0N7M5j27M7kk5m4J31jr9O9J8k7l4O7qq6
7808e3O7O2j32J4Q6o2L0K9j6p9O0J1o3L5N6j9m1mJ0j1L6rj00M3Q1m3l5J2N3p9
7838f1O0K8J5o4M8J2r1N4J7n4j0Q2l7j4L8K5j34J25l5K8n3K8K1q8N1M9o4Q0n9
7867cK0n7K3O4p3L7po1mQ5K0j08K7R4r7kO1n0qN1N9l4n2l6Q5m9k7O1k0j7Q1r3
$$ plain form
7667 58 20 -70 74 -23 -24 35 -6 -51 -32 29 96 -67 41 60 -89 27 59 16 -55 37 45 -62 47 64 -16 -2 83 40
7695 40 -80 71 15 -24 2 22 4 -6 22 56 -80 21 47 -121 5 23 -5 2 55 77 -53 -16 63 -47 15 10 69
7722 69 -48 -38 96 -63 -71 56 -2 -76 58 35 -144 34 29 -51 38 33 -6 -86 5 76 -29 -36 -11 -29 -19 -21 5 -99
7750 -99 -24 20 25 -54 46 9 -82 -4 87 -22 55 73 34 -35 107 27 -87 25 2 -18 12 60 1 -75 40 -10 -6 -45
7778 -45 72 4 -4 44 21 -47 -4 75 -99 7 36 46 -34 23 68 -59 -12 -14 -39 -83 48 47 -52 17 35 8 -26 41 33 -53
7808 -53 14 76 -56 -42 44 -18 12 41 25 -54 6 17 -46 -11 45 26 -15 -19 -9 -20 16 7 -93 -50 31 -12 -47 -35 18 -61
7838 -61 -1 27 42 -22 26 38 -53 1 18 -36 -46 36 -1 -15 23 48 -86 39 4 32 -21 7 28 -60 -9 40 -24 56 -3
7867 -3 17 -40 -17 47 -26 11 4 -57 -61 24 44 -64 -37 57 -40 -42 19 -31 -39 12 71 37 -15 -51 34 -15 -42 19 -1 -18 63 -30
7899c0n7J30l1o3L6L5q1Q2L7n5p4O7K7q0O7N3p8mJ9K0l9M6l3l5P0j6nJJK2l0N7
7931E9j03j8L2L6N9o3jN1j13L3K8m4O2j7J7m2K7Mm2J7N9J0m2Lk1j4J9jp0Q8jm3
7963c1%kR9r7jJ2k8N8Lm5N7k8p1Q6m6L3l8M6qK4r2J07Rk4m3N1m9m1J1M3k0K2m
7996gloM0L1l8j10R7k9m5N2P6l4lp9Q5l2K3j8M4j1o3M4j0p2L0M9K0l4K9l0K7k4
8028aK4j8k6Rlk2M5nJ7Kl3k6N0j0L5n3O2n8N9o9PM4j9m1M7l0oj4j3P4p1qj5P7
8062A1J0m0pL3m0PK0J2QP2m9k4k6N4l5l7L6n7L3K0L2o6K6L3l6MM9j5Rm4LK4k8
8095hM8m0l8PNo9Q7J5Ln9L9K5l0kO9o2mkM0J6l9K5j7m1R7o2j5k2K5k6O6n3n2P3
8129am7J01j22N7P5p8j9M8l9M0j9m4N7l7K5Kl0OP7m5l4O6o3K0M3q0K2O3Kl7l9
$$ plain form
7899 -30 -87 43 12 -51 -15 20 -61 21 58 3 -71 -4 23 -57 10 63 -15 -19 0 20 -19 27 -6 -41 29 13 8 9 10 32 2 59
7931 59 -44 -62 -30 6 65 2 1 52 -61 -28 0 -44 18 1 18 -24 3 7 -35 -18 41 51 9 12 -9 -23 -4 -5 -75 13 12 -31
7963 -31 -31 -33 66 -31 -32 -20 -48 10 13 -32 25 -3 -74 12 -34 -1 -39 7 -1 23 -69 38 47 23 -20 31 -18 -59 -48 -5 -25 -3 -7
7996 -7 -10 -16 24 55 17 -93 4 -25 -70 -18 58 24 21 -58 27 -5 18 0 44 33 -30 14 4 -68 -38 11 31 -3 26 -4 23 -1
8028 -1 23 5 -21 -12 -15 -37 8 3 20 22 -11 -37 13 3 38 -15 47 -11 48 -21 -14 30 11 -30 17 -13 -19 -33 -46 28 -43 -51 -66 11
8062 11 21 -19 -26 7 -33 -26 -6 6 14 86 37 13 -13 41 6 -31 5 -52 -19 1 33 -33 -7 26 -10 -6 43 28 37 -7 -4 20 -8
8095 -8 40 0 -38 -31 -26 -95 -8 7 10 -49 -10 15 -15 -17 52 -10 -14 -16 24 40 1 26 9 -32 65 3 -12 -34 -9 -35 31 -22 -74 -1
8129 -1 -48 53 -69 -12 63 -15 -34 14 -25 15 -4 -48 9 -28 -3 -1 -31 -25 52 7 -27 39 -24 -4 39 -41 -19 44 46 9 -30
8160c0P3o4m5O1K8m1K6N1j16J4N1M9r1L8Qll0N2n0rK7Lk5J8nk0K4O6q7J0N2
$$ plain form
8160 -30 43 -21 -66 -5 23 -18 8 59 -57 -43 8 57 -34 4 12 9 -21 31 -19 -28 -1 2 -23 -5 -10 -30 -6 60 -27 -17 35
8191C5
$$ Imaginary data points
##PAGE= N=2
##DATA TABLE= (X++(I..I)), XYDATA
0@%%%%%%qQqJ6j6K4l2M0m8N6p2Q8j11J35j60J92k28K68l19L75m32N04n84O67p63
31d08Q72r92J125j271J433j611J807k020K255k512K794l101L434l802M204m641
47b434N118n642O215o848P545q314R170j0130J1210j2431J3829j5448J7350j9619
61a0429K2383k5835L0290l6293M4866n8189Q1908j36857M95896K26526q35722
72b01456O8292K72308k6027k46238L107o3604m7907P883J5340l9001J41124J11181
84d998o4453j01919P1176J71570K33773M5598k29784j32010K22215J03150k06398
95A07920j09808O2401r5733o2532J52811k1208k74590k2925J59684q4158j00527
106b88665J96066J32825j06464K848J47391L8753L4996J00312p4395j81494L3302
$$ plain form
0 0 0 0 0 0 0 0 -8 0 -8 8 -8 16 -16 24 -24 32 -40 48 -63 72 -88 104 -124 144 -175 200 -232 272 -312 355 -408
31 -408 464 -528 597 -674 759 -852 955 -1065 1190 -1322 1472 -1629 1805 -1997 2207 -2434
47 -2434 2684 -2958 3257 -3591 3954 -4360 4810 -5320 5890 -6541 7288 -8160 9190 -10429
61 -10429 11954 -13881 16409 -19884 24982 -33207 48701 -88156 407740 634266 -201456
72 -201456 -133164 139144 113117 -133121 -130014 -193618 -241525 -233642 -218302 -257303 -116179 -4998
84 -4998 -69451 -171370 -100194 71376 305149 350747 120963 -11047 211168 314318 107920
95 107920 -1888 60513 -35220 -97752 55059 33851 -240739 -263664 -103980 -188138 -288665
106 -288665 -92599 40226 -66238 -63390 84001 122754 157750 258062 183667 2173 35475
117C5475J51635O608r7194r7480p1658N31k0517j13176J0971J53082o0620j81781
129b84124J60621K75981j12698j75163J80982J37228j59951k7282J90003J9527
139B05124j14097M154k002q4865N460K2570j22278r4453O0561N8690J763l794
151f3167m3111j1761R5358K7465p9973O7432J61051m7504j06051J08092Q7469
162A95300j11538m4393M8859r8144r6761J02340N1296j16467k4928O1258n9809
173i2987m7537R6911L3346p2452K8160Q6432P302K0541N8355k0538m8755j574
185D7204k3516q495O9733j3411j27204M301R5367p8960j08817R1313N4869j27691
197a25307k0489J43534M0401m0212M2660J3507o2462L4047Q2164m4120n8597M8364
$$ plain form
117 35475 187110 193718 96524 -956 -72614 -72083 -92600 -205776 -194805 -41723 -102343 -284124
129 -284124 -123503 152478 39780 -135383 45599 182827 22876 -4406 185597 205124
139 205124 91027 95181 93179 8314 13774 36344 -85934 -180387 -119826 -61136 -59373 -63167
151 -63167 -106278 -118039 -22681 4784 -75189 -7757 153294 105790 -261 107831 195300
162 195300 83762 39369 88228 -9916 -106677 -4337 46959 -69508 -94436 -33178 -92987
173 -92987 -140524 -43613 -10267 -82719 -54559 31873 39175 59716 118071 97533 48778 47204
185 47204 23688 15193 84926 71515 -55689 -51388 43979 -34981 -143798 -52485 2384 -125307
197 -125307 -145796 -2262 38139 -2073 40587 54094 -8368 25679 107843 63723 5126 53490
209E3490K3386m5037j3335j0184m0185o091j4667o3071K0566J00706j2457p4978
221h1857N0639O5172m6809M132P9352l4587o6487P9637P2323o2486k9418L8857
233F8468m6712p3272K5343J6162m9076P090L7035l4931k0503N0819J8646k2340
245b3271J965k981M711P1550M5175n4818j8027N7675k1988p2165K5071K6423p2248
258c2928k4382O1059r323n2016K8106K1173n8436j2539O0841J5760r461L7435
270B5289J6991k4221J8355L4397k1218l1832p351j0999P246K7776k1116m4552
282c1235J6392J2904n8363j9146N9441P760m1843K4949M8013o348N717L3067k3347
295B7961m0183L0954L4048k9205j3993K7295o297l2128p569o475j7496k681k232
$$ plain form
209 53490 76876 31839 18504 8320 -31865 -37956 -52623 -115694 -95128 5578 -6879 -81857
221 -81857 -31218 33954 -12855 -8723 70629 36042 -30445 49192 121515 59029 29611 68468
233 68468 21756 -51516 -26173 -10011 -59087 -51997 -14962 -49893 -70396 -19577 -931 -23271
245 -23271 -21306 -24287 -19576 51974 97149 42331 24304 81979 59991 -12174 12897 39320 -32928
258 -32928 -57310 3749 -5574 -57590 -29484 -8311 -66747 -79286 -18445 -2685 -12146 25289
270 25289 42280 18059 36414 70811 49593 17761 10410 -589 6657 34433 13317 -31235
282 -31235 -14843 -1939 -60302 -79448 -20007 -12247 -54090 -29141 18872 12524 18241 51308 27961
295 27961 -12222 18732 52780 23575 9582 36877 30580 -1548 -9117 -15592 -33088 -35769 -38001
308c8001q765J7085K5561l842p75K1204n313k0079K2827K4276k0848j559L8751
321E0522J339l6212q293K821k3149j1002J3866r638k1879J4715K3206o809p112
334a7625R207L2j0059J780J9766K8258J5098j3606k0307L522J1180r282j4374
347C590n101j2505j1269J2259J4876m447r374q142j5389n955K4227L0290R70j5054
361a024L024J7928J0364j316n970j0574j5974n798J5324J4429o170j3691j3406
374a2854j5690l116J6196J0487j0592j0341P527J6363J7746J1985r433j9533l566
387d821P952R944J4314J228k0286j1455P451j004j0214N47o027k2176K317K8934
401c296P206p120Q588m901k3830Q121L2770M766j3423q41j368J293K2071L653
$$ plain form
308 -38001 -46766 -29681 -4120 -7962 -8737 12467 7154 -12925 9902 34178 13330 11771 50522
321 50522 51861 15649 7356 10177 -12972 -23974 -10108 -19746 -41625 -26910 -3704 -10513 -17625
334 -17625 -8418 -8386 -18445 -16665 3101 31359 46457 32851 12544 16066 27246 17964 3590
347 3590 -1511 -14016 -25285 -13026 1850 -2597 -11971 -20113 -35502 -41457 -17230 13060 14030 -1024
361 -1024 2000 19928 30292 28976 23006 12432 -3542 -9340 5984 20413 14243 552 -12854
374 -12854 -28544 -31660 -15464 -4977 -15569 -25910 -18383 -2020 15726 27711 18278 -1255 -4821
387 -4821 3131 13075 27389 28617 8331 -3124 4327 3323 -6891 -6344 -12371 -34547 -32230 -3296
401 -3296 3910 -3210 5378 477 -23353 -15232 17538 22304 8881 8040 6672 7965 30036 33689
415C3689l6961j7789J7353j907j1471J5744P688j6458k121K209j6696Q358L6900
428A8538p156l9116J0584L8710N980k209j766k9511j2043L3971O674l2398N908
441c834K5746k3218k6070K0768R866j6994L857k067k6987J7315N1090k642l1633
454d803L302K910r185K5895J9037l7533j5142L8077j615l2723K0112J7188m4829
467a9309k1181K9427K333q394K5271j509l6248J2271L4156j4819o850K6923j7442
480D629k9544M1326L5643l4405j7596J4610k5413j6576M3005O255n1758K51L5942
493F369j5666j2712K8057p065k5839K1712Q668k5794L2810N2174m2738n4502L9911
506E385L5298l0599o795R510l4502m044M9131m836m3732J0159J1667l0539Q700
$$ plain form
415 33689 -3272 -21061 -3708 -5615 -17086 -1342 6346 -10112 -12233 -10024 -26720 -18362 18538
428 18538 11382 -27734 -17150 21560 27540 25331 23565 -5946 -17989 15982 22656 -9742 -3834
441 -3834 21912 -1306 -27376 -6608 3258 -13736 -9879 -11946 -38933 -21618 29472 26830 -4803
454 -4803 -1501 1409 -7776 18119 37156 -377 -15519 22558 20943 -11780 8332 25520 -19309
467 -19309 -40490 -11063 -8730 -17124 8147 6638 -29610 -17339 16817 1998 -4852 22071 4629
480 4629 -24915 16411 52054 17649 53 14663 -10750 -27326 15679 21934 -29824 -29573 6369
493 6369 -9297 -22009 6048 -1017 -26856 -5144 3524 -22270 10540 62714 19976 -34526 5385
506 5385 40683 10084 3289 12799 -21703 -25747 23384 18548 -25184 -15025 -3358 -33897 -25197
519b5197L6415j7516j0520M0738j2353m8438M3849N9495m7533m7981L1159J0595
531A2713j4842L2064P167n9246j0737M1559j3545k3624L1622j123m0426K0852
543a7566L2681k6542N101M4271l3028n2499M7770N0313l4564j4545K4709k6579
555d78k0995M5466O138m9198K335J5865l3277J0933N8161k2784n7312K7401K7684
568I939l6249J3346N4880k6256m2522L4205J8018k5883K1922K1479n0397k2667
580c0185M0133r87j9561L1331p072o3684J5747O0344k9807l7353M2355P756m1534
593c2517K9191M4910l6520j9323M1068j1336l7058L8407L0209m3044j4189J8964
605H762k5138j321N1265k1098p2104J9745N2407k2692j0292M0165j4138l6513
$$ plain form
519 -25197 11218 -6298 -16818 23920 11567 -36871 6978 66473 18940 -29041 2118 12713
531 12713 -2129 29935 37102 -22144 -32881 8678 -4867 -28491 3131 2008 -38418 -17566
543 -17566 15115 -11427 -6326 37945 4917 -47582 188 50501 15937 1392 26101 -478
555 -478 -21473 23993 30131 -19067 -16732 -867 -34144 -23211 34950 12166 -45146 -17745 9939
568 9939 -26310 -12964 41916 15660 -26862 7343 25361 -522 21400 42879 -7518 -30185
580 -30185 9948 8961 -10600 20731 13659 -50025 -34278 26066 -3741 -41094 1261 9017 -32517
593 -32517 -3326 41584 5064 -14259 26809 15473 -21585 16822 47031 3987 -10202 8762
605 8762 -16376 -17697 33568 12470 -59634 -39889 12518 -10174 -20466 19699 5561 -30952
617c0952L2972J9427l3642K2709M5661m3250m1427M4490J8381l5214Q481P737
629A5373n1098n53N9297j8263n3664L1306L1295l5615J678L7487j9825j6851L8860
642A9427J263k7786L7185K5011n9412k0858M8443n696l0987K7623k259n8016J0354
655c5708M9738k4350k3615M0821m358m9037K7530N0663k0083p935L2263j9761
667A6168k9738L6702J3015m2919Q098L2860l8154l1477L6193J920l7693J8922
679a6103K0403l9104P88M8155j4491k7877M4801K2856m1570K592L4968k2883j5210
692b675L8736q905m6332K1078K4761m7188j8681L7722p288k6414K5142O305l2854
705c6593K0886M0553k5654j3597M5113j557m0905K2989L2521k7015p096K1626
$$ plain form
617 -30952 2020 21447 -12195 10514 56175 12925 -28502 15988 34369 -845 7636 15373
629 15373 -35725 -36278 23019 4756 -48908 -17602 13693 -21922 -20244 17243 -2582 -19433 19427
642 19427 20690 -7096 30089 55100 -4312 -25170 23273 17577 -13410 14213 11954 -46062 -35708
655 -35708 14030 -10320 -33935 6886 2528 -46509 -18979 31684 11601 3666 35929 16168
667 16168 -13570 23132 36147 -6772 1326 34186 -3968 -35445 748 2668 -35025 -16103
679 -16103 4300 -34804 -34016 14139 -352 -28229 16572 39428 -2142 450 35418 12535 -2675
692 -2675 36061 27156 -19176 1902 26663 -20525 -39206 -1484 -8772 -35186 -10044 -3739 -36593
705 -36593 -15707 24846 -808 -14405 30708 29151 -11754 11235 43756 16741 9645 31271
717C1271l1648l1120L7047J0100m9173L07L4770k2347j8530L6598M669k7863K1328
730d591K3069k3709Q482L9856j8779l0953L1123J6785l4608k847J4152l2895j3647
743b8562L6231o417l7905J5101J6308l1215L664M3525p714k4606K7450J5497k1411
756e4J8998L0291l0716k2953K9090J6k8738J1507P462l6957o356K9168j4107k4756
770c8105K1912N741k6794J8526L6711j4703j1041K7564o53j8127K6108J7344l4033
783A0450j0145K5550j2608k4135J7055J94l5667k06K0198j5631o678K6487l198
796h334k0812K3527K5128j7669j208K5995o533j2936K2511L432k7790L280J3693
809B2284k5450j5294K0027p279k8631J0373J6464j6947j80K2437q221r843K7292
$$ plain form
717 31271 -377 -31497 5550 15650 -33523 -33216 1554 -20793 -39323 -2725 1944 -25919 -4591
730 -4591 18478 -5231 3251 43107 24328 -6625 24498 41283 6675 3828 17980 -14915 -28562
743 -28562 7669 1252 -36653 -21552 -5244 -36459 -32795 10730 3016 -21590 5860 21357 -54
756 -54 18944 49235 18519 -4434 24656 24672 -4066 7441 14903 -22054 -28410 758 -13349 -38105
770 -38105 -16193 -10452 -37246 -18720 17991 3288 -7753 19811 19158 1031 27139 44483 10450
783 10450 305 25855 13247 -10888 6167 6361 -29306 -29512 -9314 -24945 -31623 -5136 -8334
796 -8334 -29146 -5619 19509 1840 632 26627 20094 7158 29669 33101 5311 8591 22284
809 22284 -3166 -18460 1567 -5712 -34343 -23970 -7506 -24453 -24633 -2196 -10417 -20260 7032
822G032J2237j7677R066K1070j2184q674J7335n423k3582N544N213k2310k905
835a5258J5559j5477j8981J6249Q530j3783Q151J5962j0781o13K6799N618j3616
848H359J0026Q852j7301j661J6233r315j7174M672l258j8652M083J2268j4071
861a6939j1798J1682K445l977J7238J1198j2487J322J7251r22l819J3500p99j8934
875D961O60J0694j0078r497M848j0163j7364P070J0691p131j106Q214m172j752
889a4125J7007J0229o683R55O582l611K456J2299m766j5722k278j90q049M89M010
904a397j1064j0926O451O033k572N783P423o688k838J2883J0088K063K895k882
918A5252r217P81R496p24j0680p752n600l485M329L053o207m356O06j543K053
$$ plain form
822 7032 19269 1592 10658 31728 19544 10870 28205 22782 -800 4744 9957 -12353 -15258
835 -15258 301 -15176 -34157 -17908 -9378 -23161 -15010 952 -9829 -10442 16357 21975 8359
848 8359 18385 27237 9936 8275 24508 15193 -1981 2691 -567 -19219 -15136 -2868 -16939
861 -16939 -28737 -17055 -14610 -18587 -1349 9849 -2638 -1316 15935 15013 11194 24694 23895 4961
875 4961 5621 16315 6237 -3260 1588 -8575 -25939 -18869 -8178 -15309 -16415 -8201 -12373 -14125
889 -14125 2882 13111 6428 7383 13965 10354 12810 25109 20343 4621 2343 2153 -5896 -5407 -1397
904 -1397 -12461 -23387 -16936 -10903 -13475 -7692 -269 -6957 -9795 3088 13176 15239 18134 15252
918 15252 6035 6816 16312 15588 4908 -2844 -8444 -11929 -7600 -4547 -10754 -15110 -14504 -16047 -13994
933a3994J1802R186k307l990K413N963P462N184n297j1726m047L811K276k036
947D700n840q068o111l61M254L281q36j955O95L272N814Q489O489k492o876O58
963E113P194L469j348m784q386n663J385K159k460n853o622k701N836P812K14
978d635j202M569Q73k020Q411J0364l209n604K282n59l441M370K061j2571j1072
993a1383K379K556q63J854m136p754N365R805j669j86Q696O84n782O295R391k283
1009A2969j489J635r379o903R103J959j2198l414J952p649m69J2108j767j2359
1023a5901N272J0574m149K725J4222k422j0130O719O707n679J100L458j0515o946
1037d965P190j598q045N206q68j6801K045J8724k746r722R946M113r518Q871J6456
$$ plain form
933 -13994 -2192 6994 4687 697 3110 9073 16535 21719 16422 4696 649 4460 6736 4700
947 4700 -1140 -9208 -15319 -15680 -11426 -8145 -8981 -10936 -10241 -6969 -1155 7334 13823 11331 4455 5113
963 5113 12307 15776 14428 9644 1258 -4405 -3020 -861 -3321 -9174 -15796 -18497 -12661 -4849 -4635
978 -4635 -5837 -1268 -395 -2415 5996 16360 13151 7547 9829 9270 5829 10199 12260 -311 -11383
993 -11383 -9004 -6448 -7311 -5457 -9593 -17347 -11982 -2177 -3846 -4032 4664 5348 -434 5861 15252 12969
1009 12969 11480 13115 3736 -3167 5936 7895 -4303 -7717 -5765 -13414 -13883 -1775 -3542 -15901
1023 -15901 -10629 -55 -4204 -1479 12743 10321 191 6910 13617 7938 9038 12496 1981 -4965
1037 -4965 2225 627 -7418 -2212 -3080 -19881 -17836 888 -1858 -11580 -1634 2479 -7039 1832 18288
1052A8288q720j0331J0460J673j0408O849O910j4716p176O791o484n692J2981
1065D25m51j8995K727J7180k772l456J1630l315j1262J3331J2138j2034r23J2618
1079A6841j0384j3396J3006N247j6717n17Q131j4609n879K0704Q53j9190N438
1092a0472J2581q495J398J6308m682r910J2215L752j3172P302J2116j7170j0646
1105h875J4630k863j4496J1187O058k1134j472J9881o997j2522J8172P737j8748
1118i442L669J9141p073n794J4438m940j6377J1999J0294j7795l992J4445r996
1131a423j4350J3398L454j6812O540J3807j4466l424K2766k008j7922J3079J3586
1144A6225j5461l20J8200j1044j6296J6260N650k0445K615J2953j7429j0148J9186
$$ plain form
1052 18288 9568 -763 9697 11370 962 7811 14721 5 -7171 -380 -6864 -12556 425
1065 425 -26 -19021 -16294 886 -1886 -5342 6288 2973 -8289 5042 17180 5146 4223 16841
1079 16841 6457 -6939 6067 11314 -5403 -5920 2211 -12398 -18277 2427 3280 -15910 -10472
1092 -10472 2109 -6386 -4988 11320 6638 -3272 8943 12695 -477 6825 18941 1771 -8875
1105 -8875 5755 2892 -11604 -417 5641 -15493 -16965 2916 -4081 -16603 1569 9306 -9442
1118 -9442 -5773 13368 6295 501 14939 9999 -6378 5621 15915 -1880 -5872 8573 -1423
1131 -1423 -15773 -2375 1079 -15733 -9193 4614 -9852 -13276 9490 7482 -10440 2639 16225
1144 16225 764 444 18644 7600 -8696 7564 13214 -7231 -4616 8337 -9092 -19240 -54
1157e4R86j5206J0362R071j7038J826K1887o262j1432J6896K550j8660R043J5869
1171A9838j7820r000J8721o012k1918J2118J1670k0192k227K0267q731j4803J7753
1184c36N870j7113Q483J9083j2494p653J7441k264j6022J2301R484j9692k362
1197e274J5469j3280j3396J8943K389k1794O478J6234j5973o291K3181j58j6714
1210a0186J4629J2134j9135j156K1034p523j4546J6106J442k2601L700J5584j4933
1223e451p955J7096n562j8549J3324J1753j5752M501J9763j2453j2780K0880O175
1236A4990j8636Q206J6104j7693r519J8781m388k0478J1587R823k0783j842J8514
1249D666j0429j3724J7325P531j5308O972J4555j4290m638K1709j206j5405J2883
$$ plain form
1157 -54 932 -14274 -3912 5159 -11879 -10053 11834 5572 -5860 11036 13586 -5074 3969 19838
1171 19838 2018 -6982 11739 5727 -16191 -4073 7597 -12595 -14822 5445 -3286 -18089 -336
1184 -336 5534 -11579 -3096 15987 3493 -4160 13281 11017 -5005 7296 16780 -2912 -5274
1197 -5274 10195 -3085 -16481 2462 4851 -16943 -10465 5769 -10204 -16495 6686 6528 -10186
1210 -10186 4443 16577 -2558 -3714 17320 9797 -4749 11357 12799 -9802 -6102 9482 -5451
1223 -5451 -13406 3690 -1872 -20421 -7097 4656 -11096 -6595 13168 715 -12065 8815 14990
1236 14990 -3646 4560 20664 2971 -6548 12233 7845 -12633 -1046 8777 -12006 -13848 4666
1249 4666 -5763 -19487 -2162 5369 -9939 -2967 11588 -2702 -7340 14369 13163 -2242 10641
1262A0641O557k2591j006J9577r708j4459J3912l33k2042P463J8282j4285p595
1275a5587J9710k348j6200J4828J3684j5159N82J7950r265j2676J5414K234j9484
1288f317N767J3763j6506r153J4791n853j5466J4561R925j8030K50J8533q091
1301a826r734K0072O017j8019N647J4508j3724n673J7890m521j8551Q772P870
1314H728j7863k815J5048q263j1027J4633K805j5560Q192J4524j1963k622J9132
1327A2949l009j5146J1849R601j5605l26J4470j1670j3713J3739J761j8220M727
1340h593J3103j2600o559J5076j758j1907J2523J0504j2582J214J4810q221q985
1353c975J5433L321j6330K492Q356j3374m354J4951m623j6223P428P425j2563
$$ plain form
1262 10641 17198 -5393 -6399 13178 3470 -10989 2923 2590 -19452 -11989 6293 -7992 -15587
1275 -15587 4123 1775 -14425 403 14087 -1072 -490 17460 8195 -4481 10933 13167 -6317
1288 -6317 -550 13213 -3293 -12446 2345 -3508 -18974 -4413 5512 -12518 -12268 6265 -1826
1301 -1826 -11560 8512 14529 -3490 2157 16665 2941 -2732 15158 10637 -7914 858 8728
1314 8728 -9135 -11950 3098 -5165 -16192 -1559 1246 -14314 -6122 8402 -3561 -6183 12949
1327 12949 9940 -5206 6643 16244 639 313 14783 3113 -10600 3139 4900 -13320 -8593
1340 -8593 4510 -8090 -14649 427 -1331 -13238 -715 9789 -2793 -1579 13231 5010 -3975
1353 -3975 11458 14779 -1551 941 9297 -4077 -8431 6520 1897 -14326 -6898 527 -12036
1366a2036K340J5654p482r870J3952N326j0576P092J0640j2677o267J4507j46
1379A0457j2461N007K742j4299Q87J2801q180j0043R835R62j0892Q641J2980r654
1393a217n554J2044k39o996J1471N453j5229j970J1941n256q158P951j252j4000
1407a1011K609R459o908k994R224m215q597J1643R147r233l02R592m304m550J0438
1422I998J450j1411J273N051r223k743J0092m237j2248M667N804o492J822Q469
1436B272n126n208R914M568o054M265O614p707l567Q292j174p176L395J28j0264
1451f828j29P879m270o297N328P31o316N236Q565m273j754P302k70m207O238M185
1467A1120o951j991L821l871m200M755j230q887J08M123l918r01O122r49m301
$$ plain form
1366 -12036 -9696 5958 -1524 -11394 2558 7884 -2692 4400 15040 2363 -3904 10603 10457
1379 10457 -2004 3003 5745 -8554 -7667 5134 -3046 -13089 -3254 -2292 -13184 -4543 8437 -1217
1393 -1217 -6771 5273 5034 -1962 9509 14962 -267 -2237 9704 4448 -3710 4241 2989 -11011
1407 -11011 -8402 1057 -5851 -8845 379 -3836 -12433 -790 8357 -876 -1178 8414 4110 -440 9998
1422 9998 11448 37 1310 6361 -2862 -5605 4487 250 -11998 -7331 -1527 -8019 -6197 2272
1436 2272 -2854 -8062 1852 6420 366 4631 11245 3538 -29 8263 7089 -87 3308 3436 -6828
1451 -6828 -6957 922 -3348 -9645 -4317 -3586 -9902 -4666 3899 -374 -2128 5174 4904 697 6935 11120
1467 11120 4169 2178 5999 2128 -2072 2683 1453 -7434 -7326 -3203 -7121 -8022 -1900 -2849 -7150
1482g150M338N350j417J699M263k569k382N288J367n627L80J647n889l449L037
1497a114p15m532R8O02k577K002N173r07j857M034K610m31K559K579j510j100
1513D914J324j430k361R65q87n164k285J566q77k156O37M86r41J353K407J573
1529h76J496K256Q8N72K512J674r91j765p77j170j118j094j730j965j929j342
1545f159L9M16J00Q88P04K49J779L629K312O2L28Q67m8R78J364k443l287l97j271
1564A10k902R6K92l238k444J744Q52j15L455K311k714O09N695J637n84K174m09
1581F569l464J025K316l351k663J107l516n678K743L501m166k060L093r38m40
1596e922O351K579l628J806M805k080n42O025r73p129P75K270m897p02L159n697
$$ plain form
1482 -7150 -2812 2538 1121 2820 7083 4514 2132 7420 8787 3160 3540 5187 -702 -4151 -1114
1497 -1114 -1829 -6361 -6263 -5661 -8238 -6236 -1063 -1970 -3827 207 2817 2386 4945 7524 6014 4914
1513 4914 6238 4808 2447 3412 2525 -2639 -4924 -3358 -4235 -6391 -5754 -5268 -6209 -4856 -2449 -876
1529 -876 620 2876 2964 3536 6048 7722 6731 4966 4189 3019 1901 807 -923 -2888 -4817 -6159
1545 -6159 -6120 -5704 -5604 -4716 -4012 -3763 -1984 1645 3957 4019 4347 5214 5166 6144 7508 5065 1778 1381 110
1564 110 -2792 -2696 -2404 -5642 -8086 -6342 -5490 -5605 -2150 161 -2553 -1944 3751 5388 4804 6978 6569
1581 6569 3105 4130 6446 3095 432 1539 -1977 -7655 -4912 -1411 -5577 -7637 -4544 -5482 -5922
1596 -5922 429 3008 -620 1186 5991 3911 3369 9394 8421 1292 2067 4337 -560 -1262 1897 -3800
1612c800n948M773K722m901J650M976l989j344Q462K019m247M292L270o212O81
1627B404P578l531p154L145J44p422J951N147p500n167P096K73n401N922N081
1642B566o666K47R054j106l508P307P69r520K699Q267o644o020N805k548q609
1657g907M809M513q564j010P876m152n180J0307M516q989K409Q788m883k190R487
1672I830k246r532N610M805j0437j868Q802n902r248P494K882r291L322Q128p847
1687e498k569J2442J0q886P469P098r375p02J0602n164q424Q151J099j2566K513
1702c800Q639r284n516J0134j546r749P884P351r680O72J2677m689p920J0979
1716F152M009j1324L327R032r929o151J0275k385j1452P111N916j3083j986J2428
$$ plain form
1612 -3800 -9748 -4975 -2253 -7154 -5504 -528 -4517 -5861 2601 4620 373 4665 7935 1723 2404
1627 2404 9982 6451 -703 2442 2586 -4836 -2885 2262 -5238 -10405 -3309 -3036 -8437 -2515 2566
1642 2566 -4100 -3853 5201 4095 587 7894 8663 -857 1842 10109 3465 -2555 3250 702 -7907
1657 -7907 -3098 1415 -7149 -8159 -283 -4435 -9615 692 5208 -3781 -1372 7416 2533 343 9830
1672 9830 7584 -1948 3662 8467 -1970 -3838 4964 -938 -10186 -2692 190 -9101 -5779 2349 -5498
1687 -5498 -8067 4375 4385 -4501 2968 10066 691 -11 10591 5427 -2997 5154 6253 -6313 -3800
1702 -3800 4839 -4445 -9961 173 -1373 -11122 -3238 4113 -5567 -4895 7782 3093 -4827 6152
1716 6152 10161 -1163 2164 11196 1267 -4884 5391 3006 -8446 -1335 4581 -8502 -10488 1940
1730A940m345p258J1435K897j1903N179J1531q187l795J3030k300j3080P158P648
1744I950j1840j636J0144q277r394J1570K420j3653L992J1155q778m123J3955
1757E485j131j1583Q889Q499j1018P20J2439q599j0913J1298L957j2773K844Q295
1771F409j2469n960J4223n08j1617Q432O888j3078O12J5223m694q494J1325K295
1785H587j3325N189J1479j1261o609J2733k577j3028Q001O168j4059J39J4024
1798E461o340r231J1734K463j3110O431J3437r561n549J2432l352j1767J0782
1811C830P959j4151j952J1380q184r437J2635L138j3880L802R972j0920l680J5346
1825E858j918j2108R927P982j2679p3J2932o858q749J2367J766j5108L734J0101
$$ plain form
1730 1940 -2405 -9663 1772 4669 -7234 -2055 9476 1289 -2506 10524 8224 -4856 2302 9950
1744 9950 -1890 -3526 6618 -1659 -11053 517 2937 -10716 -6724 4431 -4347 -8470 5485
1757 5485 4354 -7229 1660 10159 -859 -139 12300 3701 -7212 4086 8043 -4730 -1886 6409
1771 6409 -6060 -12020 2203 1695 -9922 -1490 5398 -7680 -7068 8155 3461 -5033 6292 8587
1785 8587 -4738 451 11930 669 -5940 6793 4216 -8812 -811 5357 -8702 -8563 5461
1798 5461 -879 -10110 1624 4087 -9023 -2592 10845 1284 -4265 8167 4815 -6952 3830
1811 3830 11789 -2362 -4314 7066 -1118 -10555 2080 5218 -8662 -4860 5112 -5808 -9488 5858
1825 5858 3940 -8168 1759 9741 -2938 -3011 9921 3063 -5686 6681 8447 -6661 -2927 7174
1839G174j1290m666J4077k816j3022P866O386j1607K751J4489p586r655J2209
1852D310K676j2509O662J1328j1608n905J1559l829j1090R997O149j4265q50J2137
1866D762p406q110J2879K645j2528N879J0196j0661l475J3909k121j0961Q966
1879C974N869j3546n09J1810p211q045J1412M66j4102M691J0005r616k694J3231
1893E735k977j1424Q902P190j0656J926J2127q051q885J0856J599j1625N013Q254
1907G984j1304m506J1313l091r851R303N535j2452J222J2335o090o785J1086J340
1921F039j0668N706Q477j0355l525J1081l518r973Q545M753j2555l85R931n893
1935b340m910J0766j85j1805N285R731p545k273J0459l587r464Q153N199r532
$$ plain form
1839 7174 -4116 -8782 5295 2479 -10543 -2677 3709 -7898 -5147 9342 1756 -7899 4310
1852 4310 6986 -5523 1139 12467 859 -5046 6513 2684 -8406 1591 7740 -6525 -7375 4762
1866 4762 -2644 -10754 2125 4770 -7758 -1879 8317 -2344 -5819 8090 5969 -4992 3974
1879 3974 9843 -3703 -4212 7598 387 -7658 3754 4220 -9882 -5191 4814 -4802 -7496 5735
1893 5735 2758 -8666 236 7426 -3230 -1304 10823 2772 -6113 4743 6342 -5283 -270 7984
1907 7984 -3320 -7826 3487 396 -9455 -152 5383 -7069 -5847 6488 398 -6387 4699 6039
1921 6039 -4629 1077 9554 -801 -4326 6755 3237 -6736 1809 6562 -5993 -6378 3553 -2340
1935 -2340 -7250 3516 3331 -8474 -3189 6542 -1003 -3276 7183 3596 -5868 2285 7484 -2048
1949b048J371Q110q646o626J0797J600j0670L099O580q344j431J0810l006q509
1963f913P671M408q911K534R329o412o280Q489Q09q250M699N158j0008k367J0156
1978D112k760p944O291L156q555J924Q164n107m189Q449J28q077N153O675p926
$$ plain form
1949 -2048 -677 7433 -1213 -7839 2958 4558 -6112 -3013 3567 -4777 -6208 4602 1596 -6913
1963 -6913 758 5166 -3745 -1211 8118 1706 -4574 3915 4724 -3526 1173 6331 -3677 -6044 4112
1978 4112 1352 -6592 -301 2855 -5700 -3776 4388 -719 -4908 3541 3669 -4408 745 7420 -506
$$ [...]
8191B7
##END NTUPLES=NMR FID
##END=
