##TITLE=1H_Pr 2Am-TF-TEA
 200.13MHz,CDCl3.
 8 sc
 
 12.12.2025
##JCAMPDX= 6.0         $$ Bruker NMR JCAMP-DX V2.0
##DATA TYPE= NMR FID
##DATA CLASS= NTUPLES
##ORIGIN= UXNMR, Bruker Analytische Messtechnik GmbH
##OWNER= pz
$$ XWIN-NMR		Version 3.5
$$ Fri Dec 12 15:34:14 2025 Russian Standard Time (UT+4h)  she@DPX200
##.OBSERVE FREQUENCY= 200.1313
##.OBSERVE NUCLEUS= ^1H
##.DELAY= (6, 6)
##.ACQUISITION MODE= SIMULTANEOUS
##.ACQUISITION SCHEME= undefined
##.AVERAGES= 8
##.DIGITISER RES= 18
##SPECTROMETER/DATA SYSTEM= spect
##.PULSE SEQUENCE= zg30
##.SOLVENT NAME= CDCl3
##.SHIFT REFERENCE= (INTERNAL, CDCl3, 0, 14.3821)
##AUDIT TRAIL= $$ (NUMBER, WHEN, WHO, WHERE, WHAT)
$$ ##TITLE= Audit trail, XWIN-NMR		Version 3.5
$$ ##JCAMPDX= 5.01
$$ ##ORIGIN= Bruker BioSpin GmbH
$$ ##OWNER= she
$$ F:/spectra/data/she/nmr/H-C/1/audita.txt
$$ ##AUDIT TRAIL=  $$ (NUMBER, WHEN, WHO, WHERE, WHAT)
(   1,<2025-12-12 15:32:46.50 +0400>,<she>,<DPX200>,
      <created by zg, POWCHK disabled, PULCHK disabled
       configuration hash MD5:
       00 E9 B6 7A A2 85 ED C7 34 08 36 98 17 FE 4E 26
       data hash MD5: 16K
       B0 4A E5 4D 1F 6C 18 E7 5A AC 9B 65 95 9E 7A EB>)
$$ ##END=
$$ 
$$ hash MD5
$$ C4 CB 92 86 F5 B4 44 DC 6D C0 DA 5F DA 88 59 24
##$RELAX= 
##$RELAX= 
##$RELAX= 
##$RELAX= 
##$RELAX= 
##$RELAX= 
$$ Bruker specific parameters
$$ --------------------------
##$DU= <F:/spectra>
##$EXPNO= 1
##$NAME= <H-C>
##$PROCNO= 1
##$TYPE= <nmr>
##$USER= <she>
##$AMP= (0..31)
100 100 100 100 100 100 100 100 100 100 100 100 100 100 100 100 100 100 
100 100 100 100 100 100 100 100 100 100 100 100 100 100 
##$AQSEQ= 0
##$AQ_mod= 1
##$AUNM= <au_zg>
##$AUTOPOS= <>
##$BF1= 200.13
##$BF2= 200.13
##$BF3= 200.13
##$BF4= 200.13
##$BF5= 200.13
##$BF6= 200.13
##$BF7= 200.13
##$BF8= 200.13
##$BYTORDA= 1
##$CFDGTYP= 0
##$CFRGTYP= 5
##$CHEMSTR= <none>
##$CNST= (0..31)
1 1 145 1 1 1 1 1 1 1 1 1 1 1 1 1 1 1 1 1 1 1 1 1 1 1 1 1 1 1 1 1 
##$CPDPRG= <>
##$CPDPRG1= <>
##$CPDPRG2= <>
##$CPDPRG3= <>
##$CPDPRG4= <mlev>
##$CPDPRG5= <mlev>
##$CPDPRG6= <mlev>
##$CPDPRG7= <mlev>
##$CPDPRG8= <mlev>
##$CPDPRGB= <>
##$CPDPRGT= <>
##$D= (0..31)
0 0.7 0 0 0 0 0 0 0 0 0 0.03 0 0 0 0 0 0 0 0 0 0 0 0 0 0 0 0 0 0 0 0 
##$DATE= 1765539165
##$DBL= (0..7)
120 120 120 120 120 120 120 120 
##$DBP= (0..7)
150 150 150 150 150 150 150 150 
##$DBP07= 0
##$DBPNAM0= <>
##$DBPNAM1= <>
##$DBPNAM2= <>
##$DBPNAM3= <>
##$DBPNAM4= <>
##$DBPNAM5= <>
##$DBPNAM6= <>
##$DBPNAM7= <>
##$DBPOAL= (0..7)
0.5 0.5 0.5 0.5 0.5 0.5 0.5 0.5 
##$DBPOFFS= (0..7)
0 0 0 0 0 0 0 0 
##$DE= 6
##$DECBNUC= <off>
##$DECIM= 32
##$DECNUC= <off>
##$DECSTAT= 4
##$DIGMOD= 1
##$DIGTYP= 9
##$DL= (0..7)
0 120 120 120 120 120 120 120 
##$DP= (0..7)
150 150 150 150 150 150 150 150 
##$DP07= 0
##$DPNAME0= <>
##$DPNAME1= <>
##$DPNAME2= <>
##$DPNAME3= <>
##$DPNAME4= <>
##$DPNAME5= <>
##$DPNAME6= <>
##$DPNAME7= <>
##$DPOAL= (0..7)
0.5 0.5 0.5 0.5 0.5 0.5 0.5 0.5 
##$DPOFFS= (0..7)
0 0 0 0 0 0 0 0 
##$DQDMODE= 0
##$DR= 18
##$DS= 0
##$DSLIST= <SSSSSSSSSSSSSSS>
$$ [...]
##$SUBNAM0= <"">
##$SUBNAM1= <"">
##$SUBNAM2= <"">
##$SUBNAM3= <"">
##$SUBNAM4= <"">
##$SUBNAM5= <"">
##$SUBNAM6= <"">
##$SUBNAM7= <"">
##$SUBNAM8= <"">
##$SUBNAM9= <"">
##$SW= 18.0517328524113
##$SWIBOX= (0..15)
0 0 2 0 0 0 0 0 0 0 0 0 0 0 0 0 
##$SW_h= 3612.71676300578
##$TD= 16384
##$TD0= 1
##$TE= 0
##$TE2= 300
##$TE3= 300
##$TEG= 300
##$TL= (0..7)
0 120 120 120 120 120 120 120 
##$TP= (0..7)
150 150 150 150 150 150 150 150 
##$TP07= 0
##$TPNAME0= <>
##$TPNAME1= <>
##$TPNAME2= <>
##$TPNAME3= <>
##$TPNAME4= <>
##$TPNAME5= <>
##$TPNAME6= <>
##$TPNAME7= <>
##$TPOAL= (0..7)
0.5 0.5 0.5 0.5 0.5 0.5 0.5 0.5 
##$TPOFFS= (0..7)
0 0 0 0 0 0 0 0 
##$TUNHIN= 0
##$TUNHOUT= 0
##$TUNXOUT= 0
##$USERA1= <user>
##$USERA2= <user>
##$USERA3= <user>
##$USERA4= <user>
##$USERA5= <user>
##$V9= 5
##$VALIST= <valist>
##$VCLIST= <CCCCCCCCCCCCCCC>
##$VD= 0
##$VDLIST= <DDDDDDDDDDDDDDD>
##$VPLIST= <PPPPPPPPPPPPPPP>
##$VTLIST= <TTTTTTTTTTTTTTT>
##$WBST= 1024
##$WBSW= 4
##$XGAIN= (0..3)
0 0 0 0 
##$XL= 0
##$YL= 0
##$YMAX_a= 961066
##$YMIN_a= -990225
##$ZGOPTNS= <>
##$ZL1= 120
##$ZL2= 120
##$ZL3= 120
##$ZL4= 120
##$ABSF1= 10
##$ABSF2= 0
##$ABSG= 5
##$ABSL= 3
##$ALPHA= 0
##$AQORDER= 0
##$ASSFAC= 0
##$ASSFACI= 0
##$ASSFACX= 0
##$ASSWID= 0
##$AUNMP= <proc_1d>
##$AZFE= 0.1
##$AZFW= 0.1
##$BCFW= 1
##$BC_mod= 2
##$BYTORDP= 1
##$COROFFS= 0
##$CY= -3
##$DATMOD= 1
##$DC= 2
##$DFILT= <>
##$DTYPP= 0
##$F1P= 0
##$F2P= 0
##$FCOR= 0.5
##$FTSIZE= 0
##$FT_mod= 4
##$GAMMA= 1
##$GB= 0.15
##$INTBC= 1
##$INTSCL= 1
##$ISEN= 128
##$LB= 0.25
##$LEV0= 0
##$LPBIN= 0
##$MAXI= 10000
##$MC2= 0
##$MEAN= 0
##$ME_mod= 0
##$MI= 1.114404
##$NCOEF= 0
##$NC_proc= 0
##$NLEV= 6
##$NOISF1= 3.799351
##$NOISF2= 2.8
##$NSP= 1
##$NTH_PI= 0
##$NZP= 0
##$OFFSET= 14.38212
##$PC= 1
##$PHC0= -3862.62
##$PHC1= 7.39234
##$PH_mod= 1
##$PKNL= yes
##$PPARMOD= 0
##$PSCAL= 0
##$PSIGN= 0
##$REVERSE= no
##$SF= 200.129724274929
##$SI= 16384
##$SIGF1= 3
##$SIGF2= 2
##$SINO= 400
##$SIOLD= 16384
##$SREGLST= <1H.CDCl3>
##$SSB= 0
##$STSI= 0
##$STSR= 0
##$SW_p= 3205.1282051282
##$SYMM= 0
##$S_DEV= 0
##$TDeff= 0
##$TDoff= 0
##$TI= <>
##$TILT= no
##$TM1= 0
##$TM2= 0
##$TOPLEV= 0
##$USERP1= <user>
##$USERP2= <user>
##$USERP3= <user>
##$USERP4= <user>
##$USERP5= <user>
##$WDW= 1
##$XDIM= 8192
##$YMAX_p= 0
##$YMIN_p= 0
$$ End of Bruker specific parameters
$$ ---------------------------------
##NTUPLES= NMR FID
##VAR_NAME=  TIME,          FID/REAL,        FID/IMAG
##SYMBOL=    X,             R,               I
##VAR_TYPE=  INDEPENDENT,   DEPENDENT,       DEPENDENT
##VAR_FORM=  AFFN,          ASDF,            ASDF
##VAR_DIM=   8192,          8192,            8192
##UNITS=     SECONDS,       ARBITRARY UNITS, ARBITRARY UNITS
##FACTOR=    0.0002768,     1,               1
##FIRST=     0,             0,               0
##LAST=      2.2672688,     0,               0
##MIN=       0,             -990225,         0
##MAX=       2.2672688,     961066,          0
$$ Real data points
##PAGE= N=1
##DATA TABLE= (X++(R..R)), XYDATA
$$ [...]
1548A053J0130j7616k223J7880o463j1012J1680p42j0082J1882K309j7110P549
$$ 1053 11183 -6433 -8656 9224 2761 -8251 3429 2687 -7395 4487 6796 -10314 -2765
1561b765J4818j4194o715J4744l242q620J0496j711j2193J2108P401j7885J096
$$ -2765 12053 -2141 -8856 5888 2646 -5974 4522 2811 -9382 2726 10127 -7758 -6662
1574f662J5817q555p341J1018l580p191J2100n27j5167R182J1633j4286l441J3402
$$ -6662 9155 600 -6741 4277 697 -6494 5606 5079 -10088 -906 10727 -3559 -7000 6402
1588F402n716n646J0557m679r711J3084L702j6281L968J2835r446m468J0254n487
$$ 6402 686 -4960 5597 918 -8793 4291 7993 -8288 -4320 8515 -931 -5399 4855 -632
1602f32n080J2178l288j2752J0876P587j3565K69J0328o882k776R389o292o852
$$ -632 -5712 6466 3178 -9574 1302 8889 -4676 -4407 5921 -961 -3737 5652 -640 -7492
1616g492J2892M79j4038O349R160j0010p41Q145o637k479J0697m830r632J0457
$$ -7492 5400 5879 -8159 -1810 7350 -2660 -3401 4744 -1893 -4372 6325 1495 -8137 2320
1630B320M529j1735K270P680p134j79P299o891l867J1064j908j0423O838N596
$$ 2320 6849 -4886 -2616 5064 -2070 -2249 5050 -1841 -5708 5356 3448 -6975 -137 5459
1644E459q469J028O223o706l96Q717n946o254R672J193r096L733M675o211J323
$$ 5459 -3010 -1982 4241 -2465 -2861 5856 -90 -6344 3328 4521 -4575 -842 3833 -2378 -1055
1659a055N292o566j534Q822l428p308O958K392o695K725L383n781J621N950n905
$$ -1055 4237 -2329 -3863 4959 1531 -5777 1181 3573 -3122 -397 2986 -2795 -1174 4776 -1129
1674a129l373P837o48o636M243K474n311K479L367n870K51O166l576l974N051
$$ -1129 -4502 3335 2687 -3949 294 2768 -2543 -64 3303 -2567 -2316 3850 274 -3700 1351
1689A351P76m572K601J954m574J984M037n036j104N475j849l831L655O98l527
$$ 1351 2127 -2445 156 2110 -2464 -480 3557 -1479 -2583 2892 1043 -2788 867 1565 -1962
1704a962K237J714m099P82M087l109k214L999n53k693K482M48k895K000J855l282
$$ -1962 275 1989 -2110 -1328 2759 -350 -2564 1435 882 -1811 671 1119 -1776 224 2079 -1203
1720a203j21L354j748k130K857l90k117K157L86k771J539J919k415o06K359q22
$$ -1203 -1324 2030 282 -1848 1009 619 -1498 659 1045 -1726 -187 1732 -683 -1289 1070 248
1736B48j425J827P7j832J394J049k203M33J737j365p63J507m70r86J190l1j312
$$ 248 -1177 650 727 -1105 289 1338 -865 -432 1305 -60 -823 684 214 -772 418 387 -925
1753i25P77J098j498j17J401r12l42J013l68o11P57J80p81J60P59p33l54R26m40
$$ -925 -148 950 -548 -665 736 -176 -518 495 127 -484 273 453 -328 -168 591 -142 -496 430 -10
1772a0l59P82m82m50O94l1n16K63L75l09j14M86j75m85N45N4n47M13J25m35J87
$$ -10 -369 413 -69 -519 175 144 -372 -109 266 -43 -157 329 154 -331 214 268 -279 134 259 -176 11
1793A1Ql4k9M3k4k23J10J76l2N6Q9k73J63J37k22J57Q2j09l5p8J08j67j7J71k33
$$ 11 19 -15 -44 -1 -25 -248 -138 38 6 62 151 -122 41 178 -44 113 195 86 51 -27 81 -86 -103 68 -165
1818a65j3L33l80J88l2j8J74n1p9nJ64R6j35p4K17l24p3L25j15k09K73qj70MM3
$$ -165 -178 155 -225 -37 -69 -87 87 36 -43 -48 116 212 77 3 220 -104 -177 148 33 -176 97 89 -81 -77 -34
1843c4j5p5J87m3k58N10j37l79L28J90m44K50J49k61j14L30k37k64M49J43o05
$$ -34 -49 -124 63 20 -238 272 135 -244 84 274 -170 80 229 -32 -146 184 -53 -317 132 275 -330
1864c30K38M39o28J34N51n77p9P09j74p51N91L71p68J25O43q30P6Q30q59l47J045
$$ -330 -92 347 -281 -147 404 -173 -252 457 283 -468 123 494 -274 -149 494 -336 -260 570 -289 -636 409
1885D09j59r64N98O60j050K62Q39q54l27J438o40j188J512J08j257O79N17j157
$$ 409 250 -714 -116 544 -506 -244 595 -259 -586 852 212 -976 536 644 -613 66 583 -574
1903e74J85J215j128p75J877l03j666J484M69j602Q59Q40j658K45J735j030j385
$$ -574 -389 826 -302 -1077 800 497 -1169 315 784 -818 41 881 -777 -532 1203 173 -1212
1920a212J815J82j763J230P56k127R68J650k299m40K538r84j680J772L35j736
$$ -1212 603 785 -978 252 1008 -1119 -151 1499 -800 -1240 1298 314 -1366 406 741 -995
1936i95J209R58k364O49K407k201j255K904o52k049K054J09k215J705J514l043
$$ -995 214 1172 -1192 -543 1864 -337 -1592 1312 660 -1389 665 774 -1441 264 1778 -1265
1952a265J45L029j766j885K791m48k126K333L91l188J892K308k954r05L247j041
$$ -1265 -1120 1909 143 -1742 1049 601 -1525 808 1199 -1989 -97 2211 -743 -1648 1599 558
1968E58k165K661m34k495K650J093l951J060L318k609j430L002q54k025K831r2
$$ 558 -1607 1054 620 -1875 775 1868 -2083 -1023 2295 -314 -1744 1258 404 -1621 1210 1118
1984A118l519K541K434m088p2L535j881j537K851j216k196L445L23m336J829L357
$$ 1118 -2401 140 2574 -1514 -1586 1949 68 -1469 1382 166 -2030 1415 1738 -2598 -769 2588
2000B588l399r27L423j906j246L509j343l262L378J778m407O46L428k791p99L169
$$ 2588 -811 -1738 1685 -221 -1467 2042 699 -2563 815 2593 -1814 -1168 2260 -531 -1330 1839
2016A839k181j888M114l96m524K897K735l851R5K926k308o60L460k181k828M231
$$ 1839 -342 -2230 1884 1488 -3036 -139 2596 -1255 -1160 1766 -542 -1202 2258 77 -2751 1480
2032A480Q58m674J614K921l127rK902k868j128M329j282l926L387J857l983Q61
$$ 1480 2338 -2336 -722 2199 -928 -937 1965 -903 -2031 2298 1016 -2910 477 2334 -1649 -788
2048g88K668k993J45L464k999k117M415k3m237K270K181l255Q69K354l204m05
$$ -788 1880 -1113 -968 2496 -503 -2620 1795 1772 -2465 -195 1986 -1269 -400 1954 -1250 -1655
2064a655M322k422l073L839Q37l647J605J805l083R87K956l330j323M469j106
$$ -1655 2667 245 -2828 1011 1848 -1799 -194 1611 -1472 -485 2471 -859 -2182 2287 1181
2079A181l577K931J085l130J449J653l260M79L719k613k589L836K82l162J921
$$ 1181 -2396 535 1620 -1510 -61 1592 -1668 -1189 2530 -83 -2672 1164 1446 -1716 205
2094B05J223k972J547K255l535o38M073j465k743K544P75k600J635J212l248R86
$$ 205 1428 -1544 3 2258 -1277 -1915 2158 693 -2050 494 1269 -1331 304 1516 -1732 -746
2110g46L181l029j522L604n56k482K076L87k499J792J781l300m0L574k018k010
$$ -746 2435 -594 -2116 1488 932 -1550 526 913 -1586 206 1987 -1313 -1353 2221 203 -1807
2126a807K704k09k186K208L53k845J516K322k791q39K976r11j841K076o0k031
$$ -1807 897 688 -1498 710 1063 -1782 -266 2056 -735 -1574 1402 491 -1350 726 666 -1365
2142a365K021Q88l062P63K459j842j303K274m63j435J774P5k410J769J578k639
$$ -1365 656 1544 -1518 -755 1704 -138 -1441 833 370 -1065 709 784 -1626 143 1721 -918
2158i18k3K282j263j082J822m95j490J712M68k287R15J776j721o33J844r39r58
$$ -918 -941 1341 78 -1004 818 323 -1167 545 1013 -1274 -359 1417 -304 -937 907 -32 -990
2175i90J768m03j595J567P32k025K43J853j344m94J467p43q74J448L0j586R94
$$ -990 778 375 -1220 347 1079 -946 -703 1150 -194 -688 779 36 -838 610 640 -946 48
2192D8Q78j457o2J263o97n23J211m00j221J356k1j275J451K97j059m89J380o90
$$ 48 926 -531 -593 670 -27 -550 661 261 -960 396 375 -900 551 848 -211 -700 680 -10
2210a0o24J155K58j027K93Q20j459M84M77o81j07R35o27k67O22K63j029O31K87
$$ -10 -634 521 779 -248 45 865 -594 -110 367 -314 -421 514 -113 -380 242 505 -524 107 394
2229C94m78n58J196n99n53R34M50p78P91j83j328R48K45n27j70J029o68o38P31
$$ 394 -84 -642 554 -45 -598 336 786 8 799 616 -712 236 481 -46 -216 813 145 -493 238
2248B38R1n61K95J52l35J5L47k48l4K15j26l23M41Lm66K44J86l01J84k9j19J87
$$ 238 329 -232 63 215 -120 -105 242 -6 -40 175 49 -274 167 170 -296 -52 134 -167 17 -12 -131 56
2270E6j42M72l33O6K87o30RK29j5l23M70j08J05n68J28J74J79j15N90m47L93m51
$$ 56 -86 386 53 119 406 -224 -215 14 -1 -324 146 38 143 -425 -297 -123 56 -59 531 84 477 26
2292B6k99M08k6p7L3M3l0k7J04o5j56K03m7k29Q9j83J44j40O37n13L58l44P00
$$ 26 -273 135 109 32 65 108 78 51 155 90 -66 137 90 -139 -50 -233 -89 -229 408 -105 253 -91 609
2315F09Q9j193Q52Q5l87K82K7j49k87l26N32n00K7Q50j101M64p4K41m99K23j6
$$ 609 698 -495 357 442 55 337 364 215 -72 -398 134 -366 -339 511 -590 -126 -200 41 -458 -235 -251
2336b51K70l93Q62k71k45j63j11J9J4Q73P1r72J63M52l12r4O21p20NK45j25K06
$$ -251 19 -374 488 217 -28 -191 -302 -283 -269 604 675 -297 -134 318 6 -88 533 -187 -182 63 -62 144
2358A44J10J07k62P03p44J09k34M27n20J56K1L25n7K04q05J3J73L12J90Q6J66
$$ 144 254 361 99 802 58 167 -67 360 -160 -4 17 342 285 489 -316 -303 -130 182 372 458 624
2379F24q80Q68m74R9k97K10K05l63K57o2m10Q6L18n8l51L04J42m99K05M52o54
$$ 624 -256 612 138 237 -60 150 355 -8 249 187 -223 -137 181 123 -228 76 218 -281 -76 376 -278
2400b78J24M34k62l07O06j97m05L98J47n25J87N34o63q8P30m69m56P69o1o14N40
$$ -278 -154 280 18 -289 317 120 -285 113 260 -265 -78 456 -207 -295 435 -34 -490 279 218 -396 144
2421A44K39o44Q9O84p05j67P85l61n89Q31n7q64O70N86r81N7P70n04l85P80k79
$$ 144 383 -261 -172 512 -193 -360 425 64 -525 306 249 -615 55 641 -340 -283 487 -17 -402 378 99
2442I9o59P82K88j129N15Q70j054j44R81n90l47P85j42r89Q08O10j283L16R50
$$ 99 -560 222 510 -619 -104 766 -288 -432 549 -41 -388 397 255 -734 74 684 -599 -283 667
2461F67p73l39R55o34m90J104k5j247O89Q22j113O3J029q22l84J166n51r86J266
$$ 667 -106 -445 510 -124 -614 490 465 -782 -93 729 -384 -321 708 -114 -498 668 117 -869 397
2480C97K12j367M13R65q88j41R58o45n30J355l39j213R22O60j296K79R46r82r1
$$ 397 609 -758 -345 620 -268 -409 549 -96 -626 729 390 -823 99 759 -537 -258 688 -294 -385
2499c85J163p54q97J415Q8j460N09J067j175J15J037j073l77J497m80j278J253
$$ -385 778 24 -873 542 630 -830 -321 746 -429 -314 723 -350 -727 770 290 -988 265
2516B65M64j302L74R54j274J76J288j096p63J680l27j344R91M61j052M92P69j231
$$ 265 729 -573 -199 755 -519 -343 945 -151 -914 766 439 -905 86 547 -505 -13 756 -475
2534d75p3J510p96j163J420K24j423Q41O47j347M00J158j366m95J792m40j358
$$ -475 -548 962 166 -997 423 647 -776 65 712 -635 -235 923 -443 -938 854 414 -944
2551i44J247M43j337O86O20j369K22J585j316q09J576j22j164P98N09j329N89
$$ -944 303 746 -591 95 715 -654 -432 1153 -163 -972 604 482 -682 116 625 -704 -115
2568a15R87j406k25J791r44j046J297J02j186Q80M94j383M98J311j313o31J579
$$ -115 872 -534 -759 1032 88 -958 339 441 -745 135 629 -754 -256 1055 -258 -889 690
2585F90m58j011J083R4j145R38O06j522J26J475q66q26J291j99j027J161J73j270
$$ 690 232 -779 304 398 -747 191 797 -725 -599 876 10 -816 475 276 -751 410 583 -687
2603f87P59Q73j202l38J328n67p98J002j54r04Q39N10j341L23J109r13m00J051
$$ -687 72 945 -257 -595 733 166 -632 370 216 -688 151 661 -680 -357 752 -161 -561 490
2621D90k95q41R51J1r03O22O31j050j34J218q11n04J113l57q09R09J34r45L01
$$ 490 195 -646 305 316 -587 35 666 -384 -518 700 -111 -615 498 141 -668 241 375 -570 -269
2640b69R65q92k63R61m56n56R73j97j005R00L18r60J61Q68o17l25P59l81o66R43
$$ -269 696 -196 -459 502 46 -510 463 266 -739 161 479 -481 -320 548 -69 -394 365 -16 -682 261
2660B61J19r96N41N91o67j76Q19n57l56Q72k78o70O52L99r48K93O13p45r3P19
$$ 261 380 -616 -75 516 -151 -327 492 -65 -421 451 173 -497 155 554 -394 -101 512 -233 -326 393
2680C93m80k07O31j11o39M61M82p35j6O41n44r0O51m11m27O15J11q25N84J84n01
$$ 393 -87 -294 337 226 -413 48 530 -205 -221 420 -124 -214 437 26 -401 214 325 -500 84 268 -233
2701b33N6L71k76j87N25k01n39N57K72n29J68K70m08KK80j56l44O23L8m80K16
$$ -233 -177 194 -82 -269 256 55 -484 73 345 -184 -16 254 -154 -152 128 -28 -372 251 289 -191 25
2722B5J92m03J61J53k95l4L77k66j53L59Q3l64R6L02j77j38M09m01q6M27j20l19
$$ 25 217 -186 -25 128 -167 -201 176 -90 -243 116 199 -165 -69 233 56 -82 327 -74 -160 267 147 -172
2744a72J65Km3n9K34k53J7L17l09J0J62Lj02j0J91k39M3J81p7q6M8l6j83J71J7
$$ -172 -7 -5 -48 -107 127 -126 -109 208 -101 -91 71 74 -28 -38 153 -86 -43 138 61 -25 23 -13 -196 -25 -8
2769hp1Q1l2L3o8R4P7j93J05L9n6l7K21k18N4J9m0j9J75k46L7LR7j30M5N2j40
$$ -8 -79 2 -30 3 -65 29 106 -87 18 57 1 -36 185 -33 21 40 0 -19 156 -90 -53 -50 47 -83 -38 14 -126
2796a26Q8J32j04mJ07oj25O0O6j13K0O9J6j54J98r2j44J72J4k09K00q9Q1n3K6
$$ -126 -38 94 -10 -14 93 87 -38 22 88 -25 -5 64 80 -74 124 32 -112 60 74 -135 65 -24 57 4 30
2821C0K0k8O2j0j89J74lj65L3J74o8n6Q5m1k9L1L3p6mJ82k79J3J69j76J51K1p2
$$ 30 50 22 84 74 -115 59 56 -109 -76 98 30 -26 59 18 -11 20 53 -23 -27 155 -124 -111 58 -118 33 54 -18
2848a8k8J27q7j09J46O1j69j7J50j34m6J94J5j52jJ37j08J01Q4j55r1K61j75j73
$$ -18 -46 81 -6 -115 31 92 -77 -94 56 -78 -124 70 85 -67 -68 69 -39 62 146 -9 -100 161 -14 -187
2872a87K85q6j28K15P2k60Q2K23l41qL11l06l9J51J36j85J69J10l04J84J44m54
$$ -187 98 12 -116 99 171 -89 -7 216 -125 -133 178 -128 -167 -16 120 -65 104 214 -90 94 238 -216
2894b16J75K64k68p0K26K8l94L11J19l78J36K41k86j06M33j78k59L53m9l35L23
$$ -216 -41 223 -45 -115 111 139 -255 56 175 -203 -67 174 -112 -218 215 37 -222 131 82 -253 70
2915G0R4k53KL59k78k49N04k10l17L62J4n16M33K00l75n9N07k49l04N93l03l30
$$ 70 164 -89 -87 272 -6 -255 249 39 -278 84 98 -418 15 215 -160 -219 288 39 -265 328 25 -305
2937c05N07P1l93J00L06k59j75M44k90k77N37j09m83L55L97p48K37M26m53K1M66
$$ -305 202 273 -120 -20 286 27 -148 296 6 -271 266 157 -326 29 426 -322 -85 341 -112 -91 375
2958C75l74l87N92K8o79M82L65o06l3O33n31j46N82k37n82P80J20o94K43L90m54
$$ 375 1 -386 206 234 -445 37 402 -204 -237 396 -135 -281 301 64 -518 262 382 -312 -69 321 -133
2979a33j24O92n52k39P81j62q04O99K41p08Q2N26o17O7O41l31o20Q39J54q97M48
$$ -133 -257 435 -117 -356 425 263 -541 158 399 -309 -227 299 -318 -251 390 59 -561 278 432 -465 -17
3000a7M58p48K57N75o78k76R12k99q55Q41J17o66M22M01q14J60P48o96m72J045
$$ -17 441 -307 -50 525 -153 -429 483 184 -671 170 287 -379 43 444 -370 -210 538 -158 -630 415
3020D15j8r45N23M99q78L86N53q38q9J014n18p01Q71Pp28O11K25q64K53P72p01
$$ 415 397 -548 -25 474 -404 -18 535 -303 -392 622 104 -597 274 281 -447 164 389 -475 -222 550 -151
3041a51l46R36k47o88P95K7p88N39M32r37K89O34n21n17Q95q9q22P23K08r57N76
$$ -151 -497 439 192 -496 299 326 -462 77 509 -428 -139 495 -26 -543 352 263 -559 164 372 -585 -9
3062iN82q71j07J067o50n34P48J65q21P09J28q73J82Q34o82l82R12k90n29O55
$$ -9 573 -298 -405 662 12 -522 226 391 -430 279 407 -466 -284 550 -132 -514 398 108 -421 234
3082B34J7q48P08M68q86n9Q82n72l59P87k01o99P55R7q91N15N71q27q3O79k28
$$ 234 251 -597 111 579 -307 -366 516 -56 -415 372 171 -528 227 324 -567 -52 519 -308 -391 288 60
3103F0m05O51j32o92O87L63r25K74O18o60j01O91k29p36P53N2p99N79L30o56o4
$$ 60 -345 306 174 -518 169 532 -393 -119 499 -161 -262 429 200 -536 217 269 -530 49 379 -277 -341
3124c41P87n20k15N91k21n94P05K75r31L81N23n63k39P62m03m88P07j80m83N00
$$ -341 446 -74 -289 302 81 -513 192 467 -464 -83 440 -123 -362 400 -3 -491 216 36 -447 53
3144E3J92o31K97N66o19j38P01l78m31P07j87n28M18L79n52o6O24n81j82O89j47
$$ 53 245 -386 -89 477 -142 -280 421 43 -388 319 132 -396 22 401 -151 -217 407 -174 -356 333 186
3165A86p09O79L5n20K76L09m65L5M65l97r3L81m0n53L78L83n99J67K83l20m8M20
$$ 186 -523 156 191 -329 -53 256 -209 -174 291 -106 -199 182 142 -411 -33 350 -249 -82 201 -119 -167 253
3187B53j92l11L52k9k73J50J72l09J34M29m35j02M36k10l57M49K7m81K72J46k11
$$ 253 61 -250 102 73 -200 -50 122 -187 -53 376 -59 -161 275 65 -292 157 184 -297 -25 121 -90
3208i0o6L72k43j91M16j44l48K90K93m22J40J25j91q1M08j55l00L04k2l69M49
$$ -90 -156 216 -27 -218 198 54 -294 -4 289 -133 7 132 -59 -140 268 113 -187 117 95 -274 175
3229A75J2j95n3K06j64j51K97Ql48K04J50k40N0L08k86M2K02j93q2N1O5j35J69
$$ 175 187 -8 -61 145 -19 -170 127 135 -213 -9 141 -99 -49 259 -27 15 217 24 -58 -7 58 -77 92
3252I2m0p7n3J51j55p5K37p4k24L11l3j71J01J92k24J7K35j88j03M3J47k37R9
$$ 92 52 -25 -78 73 -82 -157 80 6 -218 93 60 -111 -10 182 -42 -25 210 22 -81 -38 109 -128 -29
3275b9J37k22M3J08k4M8m8k4m0J59l8j46J02P0m3j35K41j40J9l2R6j01j03J55
$$ -29 108 -114 -71 37 13 61 13 -11 -51 108 70 -76 26 96 53 -82 159 19 38 6 102 1 -102 53
3299E3j06n0J41j9p6K07j77m3K08j21n6M3m1O3J7j03M1r7J2N1r6K47K8k06J54
$$ 53 -53 -103 38 19 -57 150 -27 -70 138 17 -39 4 -37 26 43 -60 -19 -116 -104 -53 -149 98 126 -80 74
3324G4o5q3M6J35j88nJ02K7ln9N9q7O2O4j46K2J57k06M6R2j7o0O9J26j70q5J68
$$ 74 9 -74 -28 107 -81 -86 16 43 40 -19 40 -47 15 79 -67 -45 112 -94 -48 44 27 -33 36 162 -8 -93 75
3351G5r0n8J55m9n3Q3q9P1p5J16r6m2J11m2J5Q8j43j32J80km6J6P3j9n7Q1j24
$$ 75 -15 -73 82 33 -20 63 -26 45 -30 86 -10 -52 59 17 32 120 -23 -155 25 23 -23 -7 66 47 -10 71 -53
3378e3m5J93q8r7J74J2j54J84o6j76K0Q6r6m5J78j3m4M8O1j79P0K28l48R1K56
$$ -53 -98 95 7 -90 84 96 -58 126 60 -116 -96 -10 -106 -151 27 14 -30 18 79 -100 -30 198 -150 -59 197
3403A97k27p5J05J65l03J21J93m58K00K77l40J5L19k46r6L35j80j08K70L8l67
$$ 197 -30 -105 0 165 -138 -17 176 -282 -82 195 -145 -130 189 -57 -153 182 2 -106 164 202 -165
3424a65L8L67k89j52L33m2k50L35j07k05Q0K37k71K3L47l93l2L12m9m04M54Mk99
$$ -165 -127 240 -49 -201 132 90 -160 175 68 -137 -57 180 -91 -68 279 -114 -146 166 117 -287 167 171 -128
3447a28L5J99j80o0M01l29j32L13K6l08K61J17m01L7L35k27j19K91j89k45O00
$$ -128 -93 106 -74 -134 267 -62 -194 119 145 -163 98 215 -186 -149 186 -41 -160 131 -58 -303 297
3468B97j68l79K32J83l67J76L55m54o5L04j27l73L73J72n16L94J62m47J30N01
$$ 297 129 -250 -18 165 -202 -26 329 -125 -190 114 -13 -386 -13 159 -357 37 199 -248 -118 383
3488C83m86j33M92j39k98K88R3l96K03K60m37m6O37m15l06N51O9n06L47J49m65
$$ 383 -103 -236 256 117 -181 107 200 -196 7 267 -170 -216 421 6 -300 251 320 -186 161 310 -155
3509a55P9L27l04j72M86j67l24M30j2n93L42L06o02J99N08m07l63O68j44m13M77
$$ -155 -76 251 -53 -225 261 94 -230 200 188 -405 -63 243 -359 -160 348 -59 -422 246 102 -311 166
3530A66J26o19K16N87p21j8N09k74k14L79q3l62L76K48m85J21M57n02k43N87j80
$$ 166 292 -327 -111 476 -245 -263 246 -28 -242 137 54 -308 68 316 -169 -48 409 -93 -336 251 71
3551G1k42K51Kl82K81L76o25J29L98k84l27O52k97k67L12K04n70K69N35o47j01
$$ 71 -171 80 82 -300 -19 357 -268 -139 259 -25 -352 300 3 -264 48 252 -318 -49 486 -161 -262
3572b62N70l56j57M24j3n20M96J06o16k3P30m38j64L88k05l27N76m6n80M67K91
$$ -262 308 -48 -205 219 206 -314 182 288 -328 -351 379 -59 -223 165 -40 -367 209 163 -417 50 341
3593C41m63p6N83n26q0M79k66l75N59J23p06K72M28l66j82M61k89j58M67j65m72
$$ 341 -122 -198 385 -141 -221 258 -8 -383 176 299 -407 -135 293 -73 -255 206 -83 -241 226 61 -411
3614d11N17K01m37m2N36n28K4M14k81j96M64l0n08K74L19n24R5L16k88j31L65
$$ -411 106 307 -130 -172 364 -164 -140 274 -7 -203 261 231 -277 -3 316 -208 -113 203 -85 -216 149
3635A49q7k33J16M07n90J86L21m09K3M71l39k05L48q9k46L03J13l40lL91l62j9
$$ 149 62 -171 -55 352 -238 -52 269 -140 -117 354 15 -190 158 69 -177 126 239 -101 -104 287 -75 -94
3657i4K99k41j63L90M6m34J67K67m02J46J77j92j75L99j54k29K27M8j91mJ93k28
$$ -94 205 -36 -199 191 237 -197 -30 237 -165 -19 158 -34 -209 190 36 -193 34 82 -109 -113 80 -148
3679a48%K73j80j11L16l9k15J04J47k04J00J28l27J31J90j79o5Q2J57k53j0L49
$$ -148 -148 125 -55 -166 150 111 -104 0 147 -57 43 171 -156 -25 165 -14 -79 3 160 -93 -103 246
3701B46l24P6K44l57L4K01j08j45L19p3j55j6K20j76j28K94k03j14K06J2q2kJ93
$$ 246 -78 -2 242 -115 -81 120 12 -133 186 113 -42 -58 162 -14 -142 152 -51 -165 41 53 -29 -31 162
3724A62j87m5J28k7p0N8KJ1j54J51o8M7J4j23j5J48o0K2J17n9j13J3K56j88j00
$$ 162 -25 -70 58 31 -39 19 21 32 -122 29 -39 8 22 -101 -116 32 -28 -6 111 52 -61 -48 208 20 -80
3749h0K77j83j60K15o3k5O3M9r1M4q1l3n3J50l4m1J50j14p1j0R7m4K7N4qj06J35
$$ -80 197 14 -146 69 6 -19 44 93 2 46 -35 -68 -121 29 -5 -46 104 -10 -81 -91 6 -38 -11 43 35 -71 64
3776F4l5j55J00R2j91J61N4j58J10n2M9q8J41J14k66R9N7j28j00K30o9n7J23p7
$$ 64 29 -126 -26 66 -125 36 90 -68 42 -10 39 -49 92 206 -60 39 96 -32 -132 98 29 -28 95 18
3800A8r0P6j08O0J49jj13j4J73p5o1J01o2o4R2J6p5m0PjJ7m5J5p3OJ24q2J41r9
$$ 18 -72 4 -104 -44 105 104 -9 -23 150 75 14 115 53 -11 81 97 22 -18 -11 -12 5 -40 -25 -98 -92 32 -50 91 -8
3829hm6K9R2%m7Q7o6j49P3O5j0M9O4k13J26J4j46P5J0O6j35K7n2P4L8Q6j79J02
$$ -8 -54 -25 67 67 20 107 41 -108 -35 30 20 69 133 -80 46 60 -86 -11 -1 65 -70 -43 -95 -21 17 103 -76 26
3857B6N2j86O6J50r1J30m8L3j40M2k2o7n8J13l7L6R1o7n1J06k3j55J05J16j71
$$ 26 78 -108 -42 108 17 147 99 132 -8 34 12 -55 -113 0 -37 -1 90 23 -28 78 55 -100 5 121 -50
3882e0j5J76j7j93J75ok31K09l4j13N3L1n5L3K07r7k15P2L9r3J18O2k12K03j0
$$ -50 -65 111 94 -99 76 70 -161 48 14 -99 -46 -15 -70 -37 170 73 -142 -70 -31 -124 -6 56 -156 47 37
3907C7n2pJ2k0j02K44r9q8N7R6j20lK26k53M7K49j40o1NO3j83N0K13k56o5K52
$$ 37 -15 -22 -10 -30 -132 112 13 -75 -18 78 -42 -45 181 -72 -25 224 84 23 28 91 -92 -42 171 -85 -150 102
3933A02q8r6K95k55l0J77l6j62Q2J72j22r2J36o9j39J94m0j58K13N7k83J35J73
$$ 102 14 -82 213 -42 -72 105 69 -93 -11 161 39 -53 83 14 -125 69 29 -129 84 141 -142 -7 166
3956A66k85N8J35K9k80K96o4j84Q0J92k12L4R9j73R0J77j48j71K07J22k65M1K19
$$ 166 -119 -61 74 103 -177 119 55 -129 -49 143 -69 -35 64 -109 -19 158 10 -161 46 168 -97 -56 163
3979A63j74r3K90k60j31K86K7k29Q6J61k85J33Q0p6j80M27j84j87K82r8k24K53
$$ 163 -11 -104 186 -74 -205 81 108 -121 -35 126 -159 -26 54 -22 -202 225 41 -146 136 38 -186 67
4001F7J8j87rK68k09j12K66M7k93J89P0k20P3J97l40P8K79k08k58K54J10k61K09
$$ 67 85 -102 -111 157 -52 -164 102 149 -144 45 115 -105 -32 165 -175 -97 182 -26 -284 -30 80 -181 28
4024B8J3m9j00K46k79j1K36Mj07N5J75l21P2R8rj63K52j60j25L64j46j80J10R9
$$ 28 41 -8 -108 138 -141 -152 84 88 -19 36 211 -110 -38 60 51 -112 140 -20 -145 219 73 -107 3 102
4048A02k96J27K26k50n6K99j36l00M74j15k43J47J58k86L0K68k85N9K32j73k18
$$ 102 -194 -67 159 -91 -147 152 16 -284 190 75 -168 -21 137 -149 -119 149 -136 -77 155 -18 -236
4069b36K53l2j63J66K30m30K31K56k25r5J38k5k30J26J48l29J87L39l50j05L21
$$ -236 17 -15 -178 -12 218 -212 19 275 50 -45 93 68 -162 -36 112 -217 -30 309 -41 -146 175
4090A75k28j08J52J36k55J24J87m05J93K72l06n0J99n1j93K31n2j24J24O5j47
$$ 175 -53 -161 -9 127 -128 -4 183 -222 -29 243 -63 -113 86 35 -158 73 21 -103 21 86 -61
4111f1m1J43Oj15J50j03m3Q6J69l77K91J20l14M0J25o8j63K43n8j04L7J95k17
$$ -61 -102 41 47 -68 82 -21 -64 22 191 -186 105 225 -89 -49 76 8 -155 88 30 -74 -37 158 -59
4134e9Q1K35m40J24J14O1j59R5J7j96J88J15k30jK03j06p0J61j72r5J24Q9j53
$$ -59 22 257 -183 -59 55 116 -43 52 69 -127 61 176 -54 -55 148 42 -28 133 -39 -134 -10 79 -74
4157g4J00J12j44r5K13j53j64M00k12q3L17j05j51O4R6j97k5J11Q3k84L55o6l04
$$ -74 26 138 -6 -101 112 -41 -205 195 -17 -100 217 112 -39 25 121 -76 -101 10 93 -191 164 98 -206
4180b06J58Q3m4OJ24L1k12K07j34k6M1Q9j66K8J60k44L4J37p4r7J75q7p8J63m5
$$ -206 -48 35 -9 -3 121 152 -60 147 13 -13 28 117 -49 -21 139 -105 -71 66 -8 -105 70 -17 -95 68 23
4205B3j71J15J34q0p3K11j48j24J97o4l4O3n7jq1J46l4j74J57J25l25J37Q3K2
$$ 23 -148 -33 101 21 -52 159 11 -113 84 20 -14 49 -8 -9 -90 56 22 -152 5 130 -195 -58 25 47
4229D7JQqq9j6O4lJ6J5o6KN7q5L0k0J7j5K18r3j02J47R8l09J11Q3j04Kj6P1n3
$$ 47 48 56 48 -41 -57 7 4 20 35 -31 -29 28 -57 -27 -47 -30 -45 173 80 -22 125 223 -86 25 108 4 6 -10 61 8
4259HK4M1l5j46J00k6J1j04J67r3J63k14K6J35k1Q6r7L6j9o6R0j9r5l7N2j3J34
$$ 8 32 73 38 -108 -8 -34 -23 -127 40 -53 110 -104 -78 57 36 122 25 61 42 -24 66 47 -48 -85 -33 -46 88
4286H8j03j7m6J7Q7m0k9Q5p0P2L7o9J03k1m8j3K6K7j43O4p5J01m6J87j62j34K19
$$ 88 -15 -32 -78 -61 26 -14 -43 42 -28 44 81 12 115 94 46 33 59 86 -57 7 -68 33 -13 174 12 -122 97
4313I7j15N7R8p6j20J38o5P2K8n4j0Pl3J13k39J16ql2R2L2j22L2J26q7n6M3k0
$$ 97 -18 39 137 61 -59 79 14 86 114 60 50 57 24 137 -102 14 6 -26 66 98 -24 8 134 47 -9 34 14
4340A4q3Q0j10J24M2j15k0O1Rk7MJ29j40R5p0m7N9J0m0k7l6J06ql7R8n4j18J34
$$ 14 -69 11 -99 25 67 -48 -68 -7 2 -25 -21 108 -32 63 -7 -54 5 15 -25 -52 -88 18 10 -27 71 17 -101 33
4368C3n2L1l4q5n9P9P4n7m3J55jp6j30K46j43M0J9m0lR1K2j24j3Q7r0J34rj11
$$ 33 -19 12 -22 -107 -166 -87 -13 -70 -113 42 41 -35 -165 81 -62 -22 -3 -43 -46 45 67 -57 -70 17 -73 61 52 -59
4396e9L5j9R5j04J59j51p3J42J15j87J0J24k3n3n9N5k2J62k06k7J31L0m9o0J32
$$ -59 -24 -43 52 -52 107 -44 -117 25 140 -47 -37 87 64 11 -48 7 -15 147 -59 -86 45 75 26 -34 98
4421I8r2r1J38p9m5Q9r6Q5J4L8j08j1J26j6p8L2n5J1P7m1P4O7Lk4j32M3r2O3J7
$$ 98 6 -85 53 -26 -71 18 -78 7 21 59 -49 -60 66 50 -28 4 -51 -40 37 -4 70 137 140 116 -16 27 -65 -2 15
4450A5J4j34J13J74j88M5L3k14J28M7j55J42J03j50j61J90L1p5Q0O9j64j3O9J5
$$ 15 29 -105 8 182 -6 39 72 -142 -14 33 -122 20 123 -27 -188 2 33 -42 38 107 -57 -70 -1 14
4474A4o2L5M3j79J46n8k6j1J42j07o3L47j71j50J86nj66J25p9q4J31Q9j14p3K10
$$ 14 -48 -13 30 -149 -3 -61 -87 -98 44 -63 -126 221 50 -100 86 81 -85 40 -39 -123 8 97 -17 -90 120
4499A20J3k86J71M4j20J29M6j14l3J36j60L9k9J55k61K46m4j04N5L5j05jK13j26
$$ 120 133 -153 18 62 -58 71 117 3 -30 106 -54 -15 -44 111 -150 96 52 -52 3 38 -67 -68 145 19
4523A9r4O5J11j81O3J25j75M0K26k01q2L07k62r5J84K4o1m2M9j25j5K97j59o1
$$ 19 -75 -10 101 -80 -17 108 -67 -27 199 -2 -84 223 -39 -134 50 74 13 -29 20 -105 -120 177 18 -43
4547d3N9q0r4J10J08k44J47J77p1j58K86j58j80J98o6l7J02J16j70j42K69j72
$$ -43 16 -64 -158 -48 60 -184 -37 140 69 -89 197 39 -141 57 -9 -46 56 172 2 -140 129 -43
4569d3j47K32l3J5k7J02j71K29n5j3p9J67k75M8J00J2o0J19o1r9R4O2j04j61K97
$$ -43 -190 42 9 24 -3 99 -72 157 102 89 10 177 -98 -50 50 62 2 121 60 -39 55 117 13 -148 149
4594A49j01k65K76O6k87K55o7q2m6J82j04o9J73r3j44J98k2j45J17J33k28o0K10
$$ 149 48 -217 59 125 -162 93 26 -56 -102 80 -24 -93 80 -13 -157 41 19 -126 -9 124 -104 -164 46
4617D6Q3k00J15Lj78J80n7k3K9Q2m2j53J58l0q1J08K9p2q5J90j99r3K62l6q9J08
$$ 46 129 -71 44 47 -131 49 -8 -31 -2 80 38 -115 43 13 -68 40 69 -3 -88 102 -97 -190 72 36 -53 55
4643E5r1m8K18j32j31P5J74k00M4J69j36j25J58J2j90J78J0j52J00L0n7J23j6
$$ 55 -36 -84 134 2 -129 -54 120 -80 -36 133 -3 -128 30 42 -148 30 40 -112 -12 18 -39 84 68
4666F8k8j11J39J4k13L4J51m0q2J14N1j14R7k0j45J33M7j33o2J63j49o3K45j58
$$ 68 40 -71 68 82 -131 -97 54 14 -68 46 97 -17 80 60 -85 48 95 -38 -100 63 -86 -149 96 -62
4690f2L1J89r5Mj47K43k33O7N7j19J29j8k5j40J82m5RO0l5p5J8N1O2j71J17l1
$$ -62 -31 158 63 67 -80 163 -70 -3 54 -65 64 46 21 -119 63 18 27 87 52 -23 -5 46 108 -63 54 23
4716B3L4o0o4K9j1J5K5m9J99j36n5RM5j35R8Q1o7k3Q8j13O3R6j01j08J59l5q5
$$ 23 57 -3 -67 -38 -49 -34 -9 -58 141 5 -50 -41 4 -131 -33 48 -19 -42 46 -67 -4 92 -9 -117 42 7 -78
4743g8J47m4p0L5J34k25pJ85m4m8J03j41O5k4j1QM2j6k6J32l9j37JL9J0m5j7N3
$$ -78 69 25 -45 -10 124 -101 -108 77 33 -15 88 -53 12 -12 -23 -15 27 11 -15 117 78 -59 -58 -19 -9 -54 -71 -18
4771a8j4o5K07l1n3J8o1j5M2O8j25m4J48MR6j77J1N1qj7n8R1j03N0N0l7o4J05
$$ -18 -32 -97 110 79 26 44 -17 -32 10 78 -47 -91 57 61 157 -20 -9 42 34 17 -41 50 -53 -3 47 10 -54 51
4799E1M8j48O0j4P0m6l8J75q9Oo6j09L0Q8K7n6o1J0N9l1Q9Mo3J21m2Qn0oqJ2j11
$$ 51 99 -49 11 -3 67 21 -17 158 69 75 9 -100 -70 18 45 -11 -72 -62 -3 -34 55 59 -4 117 75 83 33 27 19 31 -80
4830h0J54q3q6N2m8rJ64j73J51p8m3Q2oJ14j04J07k5p4J5J8m3K8p5r3J14J37o0
$$ -80 74 -9 -95 -43 -91 -100 64 -109 42 -36 -79 3 -3 111 7 114 89 15 30 48 5 33 -42 -135 -21 116 56
4857E6j35J83j53k3L8M1OL9lq0J46J4r2j41K34j17o2J03kq0O5r8M6L8k7n0Q0j
$$ 56 -79 104 -49 -72 -34 7 13 52 49 -31 115 129 37 -104 130 13 -49 54 52 -28 37 -61 -15 23 -4 -54 26 25
4885B5L5n7R3m0j47O5J18j29o1Q6rp9J88P3j49l7J09j45J07P8j60K0J04n1m3R1
$$ 25 60 3 96 56 -91 -26 92 -37 -98 -12 -21 -100 88 161 12 -25 84 -61 46 124 -36 -16 88 37 -6 85
4911H5n3m8J13O6j33m9O9r1J5qm0J08o5kkm7P5P4j73O0M4r1Q8k1L1j7J11j71J3
$$ 85 32 -16 97 163 30 -19 50 -41 -26 -34 -74 34 -31 -33 -35 -82 -7 67 -106 -46 -2 -93 -5 -26 5 -12 99 -72 -59
4940e9J95j91l8J12R7k28J66n7p2L6Q2Mq3J14k32J84M6p3j16J29Or1K21J5k31
$$ -59 136 -55 -93 19 116 -112 54 -3 -75 -39 43 47 -36 78 -154 30 76 3 -113 16 22 -69 152 167 -64
4965f4P8o9J53p7J01m7k08J81Rj66N3J92j80N9l3q8J27k5J3q1J51np6r0J78k2
$$ -64 14 -55 98 21 122 75 -133 48 57 -109 -56 136 -44 15 -18 -106 21 -4 9 -72 79 74 -2 -92 86 64
4991F4j59J71j43p5K04q3j16J62l4o4L8J30j20p3K58j48q6R0J14l95K73R6j46
$$ 64 -95 76 -67 -142 62 -21 -137 25 -9 -73 -35 95 -25 -98 160 12 -74 16 130 -265 8 104 -42
5014d2J04l2K8k01J20L1q9J27K7j67J91J3j56J0J12m9r4Q1q4J3M1L2q2K9N9j54
$$ -42 62 30 58 -143 -23 8 -81 46 73 -94 97 110 -46 -36 76 27 -67 14 -70 -57 -16 16 -66 -37 22 -132
5040a32P3J18n4p2K42j36j46M1P1q4O9J50k08n2J70rj51J98k6j86J45J12k33R6
$$ -132 -59 59 5 -67 175 39 -107 -66 5 -79 -10 140 -68 -120 50 41 -110 88 62 -124 21 133 -100 -4
5064dJ98k81j1K41j81PP2K6k6mN9k18J01J41j29l3P3R4k60J86L7m8j0R4j98k3
$$ -4 194 -87 -98 143 -38 -31 41 67 41 37 96 -122 -21 120 -9 -42 31 125 -135 51 88 40 30 124 -74 -97
5090i7R8kl8J0J25j93M8J60j52q3K12Oj29J26j12j74K70L7j71O0L3K7j54K15j12
$$ -97 1 -1 -39 -29 96 -97 -49 111 -41 -124 88 94 -35 91 -21 -195 75 112 -59 1 34 61 -93 122 10
5115A0M1m7j3kk2J63j87M8J67k31K9L5J00k01K49L5k48L9K2lJ6j8j19P8J97o5
$$ 10 51 4 -9 -11 -33 130 -57 -9 158 -73 -44 -9 91 -110 139 174 -74 -35 -13 -16 0 -18 -137 -59 138 73
5141G3j04L2O9j23m2lOJ77q6J7o5J16p1j45K77j80P9N4J69k48j10P4O3j59J41
$$ 73 -31 1 70 -53 -95 -98 -92 85 -1 16 -49 67 -4 -149 128 -52 27 81 250 2 -108 -34 29 -130 11
5166A1Q8q0ml2M5j50J05l3r1K14o5J3J7k3r2J40M5k43R1Q8n6l4J09j17r4J00N
$$ 11 99 19 15 -17 28 -122 -17 -50 -141 73 8 21 38 15 -77 63 108 -135 -44 44 -12 -46 63 -54 -148 -48 -43
5193d3K1j7Q3p7o9OJ53r9l0J86j31L9K5p9P4L4j00P6j07M7R4j01J51j41j0N0j06
$$ -43 -22 -39 44 -33 -102 -96 57 -42 -72 114 -17 22 47 -32 42 76 -24 52 -55 -8 86 -15 136 -5 -15 35 -71
5220g1R9O7Q8k20R1m5n2P1L4p6o0L5O2j31J58r0k5l5J15oK7J5r0K7J02o1l7q2
$$ -71 28 95 183 -37 54 9 -43 28 62 -14 -74 -39 23 -108 50 -40 -65 -100 15 9 36 51 -39 -12 90 29 -8 -90
5248i0J33K9j28R7q5J68j12k09J32Q3nOj7O2o1J0Rj05Q0Kj09M5N2j4M5M0o7j4
$$ -90 43 72 -56 41 -44 124 12 -197 -65 18 13 19 2 64 3 13 22 -83 -3 -1 -110 -65 -13 -27 18 58 -9 -23
5276b3lL4J00k89J74j4LkJ06r7M2l0J00j39O6l0K1J02L9j29J4m1r2J02op7P2q9
$$ -23 -26 8 108 -181 -7 -21 -18 -20 86 -11 31 1 101 -38 28 -2 19 121 160 31 45 4 -88 14 8 -69 3 -86
5304h6J20n1l5L1K1O4p5k3M2R2j96K18o7m6o3n1M4K7L9K5O1j21J14q9N3q9%M9
$$ -86 34 -17 -52 -21 0 64 -11 -34 8 100 -96 122 55 9 -54 -105 -61 -34 5 30 91 -30 84 -5 48 -41 -41 8
5332HO9p7j12J27j7l0k3Qk2p9K0M8K9J54r2J9l3J23j59K6n0J94j95L1Q2o3k3L4
$$ 8 77 0 -112 15 -2 -32 -55 -47 -69 -148 -128 -80 -51 103 11 30 -3 120 -39 -13 -63 131 -64 -33 49 -14 -37 -3
5360clP6j20k5J01j04J63n7M1j29J21J5L2j59Q8j6m2M7Q8p0r7P0m7mJ9l4O3o4
$$ -3 -6 70 -50 -75 26 -78 85 28 69 -60 61 76 108 -51 37 21 -21 26 114 44 -53 17 -30 -34 -15 -49 14 -50
5388e0R8p8K8O7j38J87j63J27n7m2O0n7Q9Ko6Ol1M5rq2J9L2M2O3j51M2j1N8m7
$$ -50 48 -30 -2 65 -73 114 -49 78 21 -21 39 -18 71 73 7 13 -18 27 18 -64 -45 -13 29 92 -59 -17 -28 30 -17
5417a7Q2n4m2J3R5j6qq4L7J0L8q8o1Q2j08N4LJ34pl6mj6j0p3J43m0j4M3j57P1
$$ -17 65 11 -31 -18 77 61 53 -31 6 16 54 -34 -95 -13 -121 -67 -64 70 63 27 23 7 -3 -76 67 27 13 56 -101 -30
5447c0J48Nj43O2j7j25J55m2q7Q0p5K9O5P8k3j15J09j08J5J56k04J25N4k03m1
$$ -30 118 123 -20 42 25 -100 55 13 -74 6 -69 -40 25 103 80 -35 74 -34 -19 137 -67 58 112 -91 -132
5472a32J77L2r1k0nn9J12n4RK4n8J02r8R0M6n2jml4Q3j52J87j70J00J01k1j45
$$ -132 45 77 -14 -34 -39 -98 14 -40 -31 -7 -65 37 -61 29 75 23 22 18 -16 67 -85 102 -68 32 133 112 -33
5499c3n4Q1j4P1q3P1j2mr9J07p0mo2L2K8Kp3P8N4r9Q5L1j35QN1O2m0J88m6j0j93
$$ -33 -87 -6 -20 51 -32 39 27 23 -76 31 -39 -43 -105 -73 -45 -43 -116 -38 16 -83 2 33 -102 -94 -43 19 -21 167 121 111 -82
5530h2L5J22p6j26J93m8k6n8O2R9j07k6l6Q6RMo9j7K3o5K4J35l9P4n6l6J4m1Q9
$$ -82 -47 75 -1 -127 66 18 -8 -66 -4 95 -12 -38 -74 12 21 25 -44 -61 -38 -103 -79 56 17 91 35 -1 13 -28 61
5559F1j52Q3J2o0O6rJ9q4k0O3kj6N7K6k4M3pk0m3O1q2N0J2j5q3P1p9N8J32o3p4
$$ 61 -91 -8 4 -56 10 1 20 -64 -84 -21 -23 -39 18 44 20 63 56 36 -7 54 -28 22 34 19 -64 7 -72 -14 118 55 -19
5590a9M5j7l3K5Mj30J8J84r6o4P6K6J3oJ8j21Q2lLm6L5j24O4Q7N3r9O3m3P5j42
$$ -19 26 9 -24 1 5 -125 -107 77 -19 -83 -7 19 32 26 44 -77 5 2 5 -41 -6 -130 -66 21 74 -25 38 -5 70 -72
5620g2P5j98J78L1R3k4j79J52j20K20p4o5n5R6j1J2q8rl8J18J16k04Q9O1j42K2
$$ -72 3 -195 -17 14 107 83 -96 56 -64 156 82 17 -38 58 47 59 -29 -38 -76 42 158 -46 43 104 -38 -16
5646a6L7j5lJ8J6r0oP9o6M0j8M9j3J0N2j29L0N2o2J8K5q3J10p3J17r6j2M3m9p7
$$ -16 21 6 3 21 37 -53 -59 20 -46 -6 -24 25 12 22 74 -55 -25 27 -35 -17 8 -75 35 -38 79 -17 -29 14 -35 -112
5676a12J04PQ5j7q0j05J20m0%P0n3R2r2LJ2NO4j62R0J18k9m3M9j31J17n0o9O8
$$ -112 -8 -1 84 67 -13 -118 2 -38 -38 32 -21 71 -21 -18 -6 -1 63 -99 -9 109 80 37 86 -45 72 22 -47 21
5704B1nQ1j20J30k6j34R2m8L5O8j17j6J89l5j08L5j08R7jl7J18j56K6J5P7L1j13
$$ 21 16 97 -23 107 81 -53 39 -9 26 94 -23 -39 150 115 7 42 -66 31 30 -7 111 -45 -19 -4 73 104 -9
5731iJ7K5K0j49J44k4M8K3j23QJ5q8J22p3N1N1o4K2j5m6J56j05k8M3r0O2R1j15
$$ -9 8 33 53 -96 48 24 72 95 -28 -20 -5 -93 29 -44 7 58 -6 16 1 -45 111 6 -22 21 -69 -7 84 -31
5759c1oj6J55j24M3N3p9p1J9P8M4o2P9o9oJ9M4p0l9K2M7M6p5p0L3p5J04L3q6k3
$$ -31 -37 -53 102 -22 21 74 -5 -76 -57 21 65 3 82 13 7 26 70 0 -39 -17 30 76 1 -69 -36 -111 -7 26 -60 -83
5789h3L3P9o1J69j46K4P7j68P9l6J00j00JnP2j4q5P5r6O9J9o7L3Q3j67K59k00
$$ -83 -50 29 -32 137 -9 15 92 -76 3 -33 67 -33 -32 -37 35 21 -64 11 -85 -16 3 -64 -31 52 -115 144 -56
5816e6R0j4p8Q4j9L8L6N7j32oj1Om1Q1q1oJ9K7j6J73k02L5N1l2n2J04j31M4m3
$$ -56 34 20 -58 26 7 45 81 138 6 0 -11 -5 -46 35 -46 -52 -33 -6 -22 151 -51 -16 35 3 -49 55 -76 -32 -75
5845g5J08l1r2K5k4L3PN4q1N6K5J0q7N3P3n2n7L3m0J1J04j9N1o5Rk1J17k19J49
$$ -75 33 2 -90 -65 -89 -56 -49 5 -76 -20 5 15 -72 -19 54 2 -55 -22 -62 -51 53 34 85 20 29 8 125 -94 55
5874E5j25J49r1K0P0n7p6O2O9r8o4J38j58J16R6r7k6n2O0o5P3K8N7m1j01j6RQ9
$$ 55 -70 79 -12 8 78 21 -55 7 76 -22 -86 52 -106 10 106 9 -17 -69 -9 -74 -1 27 84 43 -58 -74 -65 24
5902B4N3m2o8N6j36N2O4M4l0j16J20j26J89j22J16lp9j1J4m3K7oN5N5j43J32n3
$$ 24 77 35 -33 23 -113 -61 3 47 17 -99 21 -105 84 -38 78 75 -4 -15 -1 -44 -17 -23 32 87 -56 76 23
5929B3KJ2K6mj25J12J6j6M9j14P3q9P9l4k2Q5r8oR4p3J4K2q4J08j1R3j45RK5k3
$$ 23 25 37 63 59 -66 46 62 46 95 -19 54 -35 44 10 -12 73 -25 -31 63 -10 4 26 -58 50 39 132 -13 -4 21 -2
5959bn9P2K6j07P5j6j1k1J17k9n4n0q6K17q8l1k3J72qj33M4k6n2L8M0K3j18P2
$$ -2 -61 11 37 -70 5 -11 -22 -43 74 45 -9 -59 -145 72 -16 -47 -70 102 94 -39 5 -21 -73 -35 5 28 -90 -18
5987a8k1k8J21k0m7o7J51p3M1j3N5j10Q2n5k9K9JJ18j38N5j13M4Q2k9o3M7L4m8
$$ -18 -39 -67 54 34 -13 -80 71 -2 39 26 81 -29 53 -2 -31 -2 -1 117 -21 34 -79 -35 47 18 -45 2 36 -12
6015a2O8q8Kl5J28o5M4Q4o3m3r4J41m7KJ61j23n4Q2j4P1j54o0K7L3j9Q2r1j17
$$ -12 56 -32 -30 -65 63 -2 42 126 63 20 -74 67 20 22 183 60 6 88 74 145 -9 -69 -42 -9 -28 54 -37 -154
6043a54J77Pj8p9J54r8n0R4M0m1o0m0J65o9m5n2J03k2J9k5Q1o9n6N5N6Pj29L8
$$ -154 23 30 12 -67 87 -11 -61 33 73 32 -28 -68 97 28 -17 -69 34 12 31 6 87 18 -38 17 73 80 -49 -11
6071a1l0O4r0P2k0Q2q3N4k3j3n0J07q5p3J05j8l8j8J20R4j97N2n0OM6J51r5n0
$$ -11 -41 23 -67 5 -15 67 -16 38 15 2 -48 59 -26 -99 6 -12 -50 -68 52 146 -51 1 -49 -43 3 154 59 9
6099Im0M1o6kKL8R0j02j5LK5P7r1k0K2J30j62J47j57LJ02k4j5K0k1L8m4nq2J85
$$ 9 -31 10 -56 -58 -56 -18 72 -30 -45 -42 -17 60 -31 -51 -29 101 -61 86 -71 -68 34 10 -5 15 -6 32 -12 -17 -99 86
6129H6N8k57Q4M1J6J11j48K4j42P0Q1L0n5L8j7n8M9J3k9n1R5L3j80J09p5QJ70
$$ 86 144 -113 -29 12 28 139 -9 15 -127 -57 24 54 -1 37 20 -38 11 24 -5 -56 39 72 -108 1 -74 -66 104
6156A04m5J3p7n3o9J05J8k5j3K8j0lJ2j13J45N5j59J80l2P1k19k6J13k7R7j68
$$ 104 59 72 -5 -58 -127 -22 -4 -29 -42 -14 -24 -27 -15 -128 17 72 -87 93 61 132 -87 -113 0 -27 70 -98
6182i8J85j38Q6r6k8R8N1n1k8QN2j3K6r3k7J66j35J30j34K11k23K1m8J24M6j35
$$ -98 87 -51 35 -61 -89 9 60 9 -19 -11 41 28 54 -39 -66 100 -35 95 -39 172 -51 -30 -78 46 92 -43
6208d3O8o5M5n8nQ7m8L2r3Q0J1k3M1J0rj6L4k7n1O0K7m1l4M6Lk0j25L8kJ35n2
$$ -43 25 -40 5 -53 -58 29 -19 13 -80 0 11 -12 29 39 30 14 48 21 -30 30 57 16 -18 28 31 11 -114 -76 -78 57 5
6239EQ6m3k8J9n2n0R1j8mP8r3l3P6j3J9j06M4K6q9K3Q8j60Q1O4P9j99R1R3j12
$$ 5 91 48 20 39 -13 -63 28 10 6 84 -9 -42 34 21 40 -66 -22 4 -85 -62 26 -134 -53 11 90 -109 -18 75 -37
6268c7J6M3J17k59J39P5k12K31j30j8J3P3j74R6j5N8r2Q4R6j77L6n6Q4J40p7j48
$$ -37 -21 22 139 -120 19 94 -118 113 -17 -35 -22 51 -123 -27 -42 16 -76 8 104 -73 -37 -93 -9 131 54 -94
6294i4M6m6J57n2l7L3N3j47pJ34q3Q5j38J64r8M5R3j26l3K6N6J14m9np9K1o8O1
$$ -94 -48 -94 63 11 -26 7 60 -87 -94 40 -43 42 -96 68 -30 15 108 -18 -51 -25 31 145 96 91 12 33 -35 26
6322B6M6p2Q0j18rJ08N2j5o0kor0J07k2L9p5mQ5m3l0J03p4o2P4K0m6qr0J32L3
$$ 26 72 0 80 -38 -47 61 113 98 38 36 30 -60 47 25 64 -11 -15 70 27 -3 100 26 -36 38 58 12 4 -86 46 79
6352G9j46K03j61lK5j43K01k6J5R5q4l1M5n3k7j03J04o4R6k0L3j49J78Pj16Q3
$$ 79 -67 136 -25 -28 -3 -146 55 29 44 139 55 24 69 16 -11 -114 -10 -74 22 2 35 -114 64 71 -45 38
6378C8k0P5j67K07j45M2J7j12QK2J24l7o0p8Q6k8mL9j10J47l9k7mJ7J02j66J95
$$ 38 18 93 -74 133 -12 30 47 -65 -57 -35 89 52 -8 -86 0 -28 -32 7 -103 44 5 -22 -26 -9 93 -73 122
6405A22k7Mp9L3P0j01N5n8MK5J6k23J74o0j3mJ59j01m6N0q2Q7Nj04J22Pp8rJ17
$$ 122 95 99 20 53 123 22 77 19 23 48 64 -159 15 -45 -58 -62 97 -4 -50 0 -82 5 10 -94 28 35 -43 -52 65
6434F5m0m8j9P1j71K49m4o8j4RO5r7j7M7M0K3j2K5m3Mp8J5j3J48j83R7j1L9r8
$$ 65 25 -23 -42 29 -142 107 63 -5 -19 -10 55 -42 -59 -12 28 51 39 64 21 25 -53 -38 -51 97 -86 11 0 39 -59
6463e9KL1J04j62J31j10R6p6N5J7nM6k2l8l3l5P2j41J37J4K9q3J0N3q1K08k21
$$ -59 -57 -26 78 -84 47 -63 33 -43 12 29 24 70 48 10 -23 -58 14 -127 10 24 53 -30 -20 33 -48 160 -61
6490f1J01m6m2L2jp1O9J35k3L5Jj61qO9K0r2J15M7j99K25r7r1J60q7j06M3N2j4
$$ -61 40 -6 -48 -16 -17 -88 -19 116 93 128 129 -32 -40 29 49 -43 72 119 -80 145 48 -43 117 30 -76 -33 19 5
6518En5J07rL8k8j80J48M3j17J19j72J11Om3L8K2j37J62M4o2Q7k28J29l4J5q3
$$ 5 -50 57 48 86 58 -122 26 69 -48 71 -101 10 16 -27 11 33 -104 58 102 40 127 -101 28 -6 9 -74
6544g4m9J07p0J64r1Lm4N8M2p9J66n6m2k8P8j6J1j18k7Q7K7j04P6k6J22k01J65
$$ -74 -123 -16 -86 78 -13 -10 -54 4 46 -33 133 77 35 7 85 69 80 -38 -65 22 49 -55 21 -5 117 -84 81
6571H1L5l7K5n8L2r0Q3q3M5qL4o5qO6J0q6M8K7q8L1J10j73M1R3o8m3k8R9K0j26
$$ 81 116 79 104 46 78 -12 71 -12 33 25 59 -6 -14 52 62 -24 24 51 -37 -6 104 -69 -28 65 -3 -46 -74 25 45 -81
6601h1J08mp2J03r7M9L0l5j5J5j28J53n0Q5j05O4l2m1Q3kLj39R3RJ6o8k9K46j38
$$ -81 27 23 -49 54 -43 6 36 1 -14 1 -127 26 -24 61 -44 20 -12 -53 30 28 31 -108 -15 -6 10 -58 -87 159 21
6630B1n0J03j25Q5n8J2k1n0NO0j9pQ1m0M6k0L4j0L7j39J41j42P2K7L8q9k2O2k5
$$ 21 -29 74 -51 34 -24 -12 -33 -83 -78 -18 -37 -44 37 -3 43 23 57 47 84 -55 86 -56 16 43 81 -8 -30 32 7
6659GK0j38K28j85J12k2j3j1M2j02N0J6r6O8L8J1p9Q5o2P8k00K14p5lo2J39n7
$$ 7 27 -111 117 -68 44 22 9 -2 40 -62 -12 4 -92 -24 14 25 -54 31 -31 47 -153 61 -14 -17 -79 60 3
6686Cq2J46n7O1j01pP5n9q4O6J11p3J44m7m6J5j23J0N8k8Q6j8k6N1q4O6m8N4j60
$$ 3 -79 67 10 71 -30 -37 38 -21 -105 -39 72 -1 143 96 50 65 -58 -48 10 -18 68 50 24 75 -9 57 9 63 -97
6715i7J28k0j33J23j5rj4p7J67j0j3l1M2kj10M9L0k1p3Q1k3J10p9Q3m0j44J78
$$ -97 31 11 -122 1 -14 -23 -37 -114 53 43 30 -1 41 39 -71 -22 8 -13 -86 -5 -28 82 3 86 46 -98 80
6742H0j8j35J6R4kj41J14PN3o5N3n5RJ3m4P8K5r7P5m9j7M0k5n7O9O2r4L4p7N1
$$ 80 62 -73 -57 37 35 -106 8 15 68 3 56 1 10 23 -21 57 82 -15 60 11 -6 34 9 -48 21 83 -11 23 -54 -3
6772cL9j4Nn1J22k27J08Q6o4pLj4L1jK5m3Po2P4j5p0J02j24j1J31Q6k4q6K8j03
$$ -3 36 22 27 -24 98 -129 -21 65 1 -6 -3 -17 14 13 38 -5 2 -60 14 -1 -71 31 -93 -104 27 113 89 3 31 -72
6802g2L6J32k19J26r5L3J13r4J13k5o6O0m4J02j55O4J40j76J15j30R4J9o0Pl6
$$ -72 -36 96 -123 3 -92 -59 54 -40 73 48 -18 42 -2 100 -55 9 149 -27 88 -42 52 71 11 18 -18
6827a8k3N6N5q1J64k17m7R9N3K5j55L2M3L4r4J58j38R4j05O5K5j44K26k27P4J27
$$ -18 -41 15 70 -11 153 -64 -111 -12 41 66 -89 -57 -14 20 -74 84 -54 40 -65 0 25 -119 107 -120 -46 81
6853H1n8p0J9J06l1k4n4M0l9M0l4J33m0nj9k4jj25K4J39l0o3k9lO8j7J03p7K11
$$ 81 23 -47 -28 78 47 23 -31 9 -30 10 -24 109 69 64 45 21 20 -105 -81 58 28 -35 -64 -67 1 -16 87 10 221
6882B21k18k9MO1l6%k9L8O1k8j26O5Q7j13J10q1JP2l8K2N2r3jJ5O1l5l3L8J1J6
$$ 221 3 -26 -22 39 3 3 -26 12 73 45 -81 -16 71 -42 68 -13 -12 60 22 44 96 3 2 17 78 43 10 48 59 75
6912G5o4M5l9k2l8O4O5p7o8K8K7m0J12n9lj5m7J50j62R9j07Q2L7j89J93o9p5P1
$$ 75 11 56 17 -5 -43 21 86 9 -59 -31 -4 -44 68 9 6 -9 -56 94 -68 31 -76 6 43 -146 47 -22 -97 -26
6940b6J18j74K08j01j16M4J33n1n6O9o9J04k1Pq0j8L7l9O8q0J32p2k2o4R8k3j3
$$ -26 92 -82 126 25 -91 -47 86 35 -21 48 -21 83 62 69 -11 -29 8 -31 37 -43 89 17 -5 -69 29 6 -7
6967gL8p3p0J58O2J13j50j8j11Q9j9K0m2K7k3J36j24N1j16P0J18j89J27o7J2n8
$$ -7 31 -42 -112 46 108 221 71 53 -58 31 12 32 -10 17 -6 130 6 57 -59 11 129 -60 67 0 12 -46
6993d6L9l0K2O4K5r4J01p2o8J11n3J9n7N4p9J37j53O4Jo3P1M2o3PM6k7O9j24O1
$$ -46 -7 -37 -15 49 74 -20 81 9 -59 52 -1 18 -39 15 -64 73 -80 -16 -15 -78 -7 35 -28 -21 25 -2 67 -57 4
7022Dm2J32j33J3k5R3J1j44K7J09l2J04j09J8nM0o4L8k2k3M4n1j26P0M6l0M2j9
$$ 4 -38 94 -39 -26 -51 42 53 -91 -64 45 13 117 8 26 21 61 -3 35 13 -10 34 -17 -143 -73 -27 -57 -15 -34
7050c4J07m8q8P6o0J22Lm8l3j3k5O7k5l8J19J8J1m6M4j18l6P2q3j2N0J11p7l9
$$ -34 73 25 -63 13 -47 75 78 30 -3 -16 -41 26 1 -37 82 100 111 65 109 -9 -45 27 -56 -68 -18 93 16 -23
7078b3J34p4Kj7p5R0J0Kj44Mn3j6J17p8N4P9n2R6l4q6K3m7Q4M6o0j9J04l4l8M7
$$ -23 111 37 39 22 -53 37 47 49 -95 -91 -144 -160 -43 -121 -67 12 -40 56 22 -64 -41 -88 -4 42 -18 -37 67 33 -5 42
7108D2o6k8J13J1k0j04J0K8r7J52qn7L9j7O5l2mp1M7O5r0q2R3R0j69Q7J8O2j26
$$ 42 -24 -52 61 72 52 -52 -42 -14 -111 41 33 -24 15 -2 63 31 27 -44 3 68 -22 -104 -11 79 -90 -3 15 77 -49
7137d9P1l5l1P8R5l8j23O1q8l9J47J4p1M6j45J44o3J3M7k0R0p9J0J4nn8J22j23
$$ -49 22 -13 -44 34 129 91 -32 29 -59 -98 49 63 -8 38 -107 37 -26 -13 34 14 104 25 35 49 44 -14 108 -15
7165a5J70k68J59m7L8j09O6K8o4L5j3Q6j12O8Pj2lk3J82k29J15j2p8P9j8l5J59
$$ -15 155 -113 46 -1 37 -72 -6 22 -42 -7 -20 66 -46 22 29 17 14 -9 173 -56 59 47 -31 48 30 -5 154
7192A54j35q8P8Q4j11R7N5k26J28l2J25j60J23o1m7P9l6L4n9L3k9q0O7Mq1M7Q6
$$ 154 19 -69 9 93 -18 79 134 -92 36 4 129 -31 92 31 -16 63 27 61 2 35 6 -74 -7 -3 -84 -37 49
7219D9n6Q2q0j9Q2r1J19j53M4J03o0L4J6j38P5P7j88oJ05O3j48L4Q8Oj27O1NN3
$$ 49 -7 75 -5 -24 58 -33 86 -67 -23 80 20 54 70 -68 7 84 -104 -110 -5 58 -90 -56 32 38 -89 -28 -23 30
7247C0l5n8N7MkN9M6j58L4J27j16k1qO5l3L8M9q6J3N2n6M8n8m2J1j0n8J12Ml1
$$ 30 -5 -63 -6 -2 -4 55 101 -57 -23 104 -12 -33 -41 24 -9 29 78 -8 5 57 1 49 -9 -51 -40 -50 -108 4 8 -23
7277b3k9lM1nM4n3J42p1Rk0k8l7P3l0L0q1J1R0rj20J03n6O6j03R7o2O7J2L1n1
$$ -23 -52 -55 -14 -19 25 -28 114 43 52 32 4 -33 40 10 40 -41 -30 60 51 -69 34 -22 44 -59 38 -24 43 55 86 35
7307C5n1M1Q8r3K2j00RJ11q6P4qO6j13k8J01K8q2j09J96j29R2j0R7j18J05j56
$$ 35 -16 25 113 20 42 -58 -49 62 -24 50 42 108 -5 -33 68 96 14 -95 101 -28 64 54 151 33 138 -18
7333a8K0k1l7J32j67N1K4o9N9R4p4J1P3j01M7l0m6JQr2J89l0O7o8j00J56j05N9
$$ -18 2 -19 -56 76 -91 -40 -16 -85 -26 68 -6 5 78 -23 24 -6 -52 -51 -43 -135 54 24 91 23 -77 79 -26 33
7361C3O1j64qJ7J4m9K7R2J5r1O0k6N2j33M7Q4o7l1J04K8p5L6j2P0n3Rj04K2L9
$$ 33 94 -70 -78 -61 -47 -96 -69 23 38 -53 7 -19 33 -100 -53 31 -36 -67 37 65 -10 26 14 84 31 40 -64 -42 -3
7390cM2m5%L1n6Km0N4pPnn8J42n4N4r4M2k1M3lj1L9j15J37j8j27J08k3K4qo0K5
$$ -3 39 -6 -6 25 -31 -29 -69 -15 -22 -15 -20 -78 64 10 64 -30 12 -9 34 31 20 59 -56 81 63 -64 44 21 45 37 -23 2
7422BM9p3J9J5j2K7o5P2rp4J32j05L2j0J1l9J31j59j8P4r5J36m2m8O9k4M3l2n3
$$ 2 51 -22 -3 12 0 27 -38 34 25 -49 83 -22 10 0 11 -28 103 -56 -74 0 -95 41 -1 -49 20 -4 39 7 -46
7451d6M0k5K6k7L6Q3r2QK6l2K8p7PO3Lp1jR9p7o6O0K3j0m5M8qn2O8P6r1O7j0j02
$$ -46 -6 -31 -5 -32 4 87 -5 3 29 -3 25 -52 -45 18 21 -50 -51 48 -29 -95 -35 -12 -22 -67 -19 -27 -79 -11 65 -26 41 31 -71
7484g1P9O9r4o9P3k8R6j11K4J6k2O4n3O0Nl5lo1J83o3k7l2N4k21J72o9J06j17
$$ -71 8 77 -17 -86 -13 -41 55 -56 -32 -16 -38 26 -27 33 38 3 0 -61 122 59 32 0 54 -167 5 -64 42 -75
7512g5R3n0M4J02n7r3J01lj58R1l7L5j42K07J0K0n8K4j5p9P7K2mJ6k9r8J02M0
$$ -75 18 -32 12 114 57 -36 65 62 -96 -5 -42 -7 -149 58 68 88 30 54 39 -40 37 59 55 71 42 -56 46 86
7540H6n3j26J25k1k4J00k6j21RO9j9n9J49j11J25j32J06j06N9J43j76KP6q3oo4
$$ 86 33 -93 32 11 -13 87 61 -60 -51 18 -1 -60 89 -22 103 -29 77 -29 30 173 -3 -1 75 -8 -14 -78
7566g8mJ03L9J0j4jl8J15k02o4K56j20j5OJ79j41Kj17O9L4L0j7N8l5K8j12p3J15
$$ -78 -82 21 60 70 56 55 17 132 -70 -134 122 2 -13 -7 172 31 33 -84 -15 19 49 32 90 55 83 -29 -102 13
7594A3P5j23m1jL5K2RO8oj43R8m9Q9m8m8N5m0R7lk6p6N0L3M8o8p0J00m1j50J77
$$ 13 88 -35 -76 -77 -42 -20 -11 57 51 -92 6 -43 46 -2 -50 5 -35 62 59 33 -43 7 40 88 20 -50 50 9 -141 36
7624C6n4R9j27J09j31N1M0M4j10J8j1lm6J23q8M1J1l2J17j77K3J56j17Oj45R0
$$ 36 -18 81 -46 63 -68 -17 23 67 -43 -25 -36 -39 -85 38 -50 -9 2 -30 87 -90 -67 89 -28 -22 -167 -77
7650g7j02J98L0k1k5p9P8M3k07P0P2O1Q9j40m5J15o5oq7J11j34J71k6p4J13q8
$$ -77 -179 19 49 28 3 -76 2 45 -162 -92 -20 41 130 -10 -55 60 -5 -11 -98 13 -121 50 24 -50 63 -25
7676b5J9J2o2J42j25nJ18n3K5nP8j49O0m8k6K2%P0jj28J05j65J50J3j53K31j30
$$ -25 -6 6 -56 86 -39 -44 74 21 46 41 119 -30 30 -18 -44 -22 -22 48 47 -81 24 -141 9 22 -131 100 -30
7703c0n4Q3k1O2oK3m3L3K4nr6p5N3k0N6L2j6L8o3j3j4O8M3j61J38m1L5l5J4J25
$$ -30 -84 -1 -22 40 34 57 14 47 71 66 -30 -105 -52 -72 -16 16 0 38 -25 -38 -52 16 59 -102 36 -5 30 -5 9 134
7733A34k06J42r8M7K3p5LJ15j09J25j12J01M5l17J31R3mq8J08j10L5J0Q2L5j30
$$ 134 -72 70 -28 19 42 -33 -30 85 -24 101 -11 90 135 -182 -51 42 38 -50 58 -52 -17 -7 75 110 -20
7758b0J11j85J24n6R9l1j1L3m8p6R0j6J2OlJ8n5M0N3j71J12J5r3R0p7j7ML8J33
$$ -20 91 -94 30 -26 73 42 31 64 16 -60 30 14 26 32 29 47 -8 32 85 -86 26 41 -52 38 -39 -56 -52 -14 119
7787A19j13NJ6m2j8mK6O0k6J7p0J27nrp5Jo8M0j1K8k8j49J08J2P5J0p0M8l4J5
$$ 119 6 11 27 -15 -33 -37 -11 49 23 40 -30 97 92 83 8 9 -59 -19 -30 -2 -30 -179 -71 -59 16 26 -44 4 -30 -15
7817a5k0N8q1l4K56k93R4qm9J57k6q5J57L1k3m0m6l5K0j4o9Q5J7p7k6Q3j03J4
$$ -15 -35 23 -58 -92 164 -129 -35 -43 -92 65 39 -46 111 142 119 79 33 -2 18 4 -65 20 37 -40 -66 17 -86 -72
7845g2P0l9k2O3Q3j68J01m7QK0J85j58L8k3n6p6K9Q0M1q1j3K4O3J8q5L1%O3j44
$$ -72 -2 -41 -63 0 83 -85 16 -31 -23 -3 182 24 62 39 -17 -93 -64 16 57 -24 -37 -13 50 68 -17 14 14 77 -67
7874f7R2j53J16j2OO4r6J02l5N0n7J6o7PpO3N1k17J67p9m6J77q2p8R7L0j5jl3
$$ -67 25 -128 -12 -24 -18 46 -50 52 17 67 10 26 -41 -34 -41 22 73 -144 23 -56 -102 75 -7 -85 12 42 27 26 -7
7903g%J01j6K8j19Nj12J22m5J2J5M5j11J22j17o5J84j81L1Q4j7R6j23R1O6j38
$$ -7 -7 94 78 106 -13 -8 -120 2 -43 -31 -16 29 -82 40 -77 -142 42 -139 -108 -24 -41 55 -68 23 89 -49
7929d9N2J3r2l1k9J67m3R8q3j8L9N8j36P3rk3L2Q2m2L2j55kR9m4J17j44N0M0o0
$$ -49 3 16 -76 -107 -136 31 -12 86 3 -15 24 82 -54 19 10 -13 19 101 59 91 -64 -66 33 -11 106 -38 12 52 -8
7958hl9J2J5j0Q4q6ql1N1K7o4K7K2LRRq1J26r7J6K7O7r7L4l7L0O6j29J63j76J40
$$ -8 -47 -35 -20 -30 54 -32 -40 -71 -20 7 -57 -30 -8 -5 4 13 -68 58 -39 -23 4 71 -26 8 -29 1 67 -62 101 -75 65
7989F5p0M0J7n8qp4J51p9m0N5M1k9P2Qo6o1k7J17q7j9N1o2J8J27r9J2Mp3j0N9
$$ 65 -5 35 52 -6 -14 -88 63 -16 -56 -1 40 11 83 91 25 -36 -63 54 -33 -52 -1 -63 -45 82 -17 -5 -1 -74 -84 -25
8019b5L6P3j16M3n6Q1J3k6Q8q7n6%J4N2m4N5j03J47j46R7l0j32J91j28R0p4P4
$$ -25 11 84 -32 11 -45 36 49 23 111 24 -32 -32 -18 34 -10 45 -58 89 -57 40 10 -122 69 -59 31 -43 31
8046C1n5m4M2l0P7J0o7j6M7j16J35j7l9J10j73J00n6Q2k4l0Q9k8%L3k3J7m9k0
$$ 31 -24 -68 -26 -56 21 31 -36 -52 -5 -121 14 -3 -42 68 -105 -5 -61 21 -3 -33 56 28 28 61 38 55 6 -14
8074a4N0N7N1j76L8M8o7J9M2m9l1P9M0r1j13K14r3n6n2P4J09j64Q3M9q9O1J6p5
$$ -14 36 93 144 -32 6 54 -13 6 48 -1 -32 47 87 -4 -117 97 4 -52 -104 -30 79 -85 -2 47 -42 19 35 -40
8102d0k3J24L9j70N3M3o7lP5n5O9j25m0Q9K2k0J13m1q3Q9p2N0rl7j5k1K1k1N8
$$ -40 -63 61 100 -70 -17 26 -41 -44 31 -24 45 -80 -120 -31 -9 -29 84 43 -40 49 -23 27 18 -19 -34 -55 -34 -55 3
8131CMn4K0p0N5p3J02l8L2r4kL5J03r3J77o2q1K5j2N7l6J12j16Mj5N7j52J62p6
$$ 3 7 -47 -27 -97 -42 -115 -13 -51 -19 -113 -115 -80 23 -70 107 45 -36 -11 -23 34 -2 110 -6 -2 -17 40 -112 50 -26
8160b6J3lo1QR7M7r0n9J16m5P1l2j37j1J08J5q9K6r6J60j26P3QR9J5r6K0N1q9
$$ -26 -13 -16 -77 -69 28 75 -15 -74 42 -3 68 36 -101 -112 -4 11 -78 -52 -148 12 -114 -41 -33 66 81 -15 5 56 -33
8189c3lK0
$$ -33 -36 -16
8191a6
$$ Imaginary data points
##PAGE= N=2
##DATA TABLE= (X++(I..I)), XYDATA
0@%%%%%%qJ6j6J6k4L2m0N6p2Q8j04J28j60J93k33K82l38M00m72N52o40P44q61
$$ 0 0 0 0 0 0 0 -8 8 -8 8 -16 16 -24 32 -40 48 -56 72 -88 105 -128 154 -184 216 -256 296 -344 400 -461
29d61R88j128J286j463J660j876K112k375K666k984L328l704M118m571N067n606
$$ -461 527 -601 685 -778 882 -994 1118 -1257 1409 -1575 1753 -1951 2167 -2404 2663 -2943
45b943O193o836P540q310R159j0088J1108j2244J3509j4920J6506j8305K0363
$$ -2943 3250 -3586 3954 -4356 4803 -5285 5823 -6421 7088 -7832 8674 -9631 10732
58A0732k2750K5551k8887L2947l8021M4561n3343O5826q5079J18851j94597O42873
$$ 10732 -12018 13533 -15354 17593 -20428 24133 -29210 36616 -48463 70388 -124209 518664
70E18664j15965j392924R37225O01194m37924j72785o667l18997N71955L72708
$$ 518664 402699 -990225 -53000 548194 110270 -62515 -69182 -388179 183776 556484
80E56484q21222l57373Q22305J31150m34367q833o9079k5126O21383j25493q95500
$$ 556484 -264738 -622111 200194 331344 -103023 -111856 -180935 -206061 415322 289829 -605671
91f05671L56439R18336n49083n73948N58376Q4722l37579L98570r0421o44157
$$ -605671 -249232 669104 120021 -453927 104449 189171 -148408 250162 159741 -484416
101d84416N11324N69602p90360k84650P35519m8858m36918K32494j0795k12684
$$ -484416 26908 596510 -193850 -478500 257019 208161 -228757 3737 -7058 -219742
111b19742L91115K1523n59885K44723M79171l92300j79631L54084j55752p7437
$$ -219742 171373 192896 -366989 -122266 356905 -35395 -215026 139058 -16694 -94131
121i4131M17130k96943m82486O43150L49331q26430r8733P50126j64939m55993
$$ -94131 322999 26056 -456430 186720 536051 -290379 -389112 361014 196075 -259918
131b59918K66084K3781j89107L26802m2900m84715K78942M10208l97676j68383
$$ -259918 6166 29947 -159160 167642 124742 -359973 -81031 329177 -68499 -236882
141b36882L33900q3475p3482K51932k42670k25929N02551O1226n63051J60934
$$ -236882 97018 13543 -59939 191993 -50677 -276606 225945 287171 -275880 -114946
151a14946M21990l12449j56309L08356j45089j77783L45570n6873m05539K61438
$$ -114946 307044 -5405 -161714 146642 1553 -176230 169340 112467 -293072 -31634
161c1634K87380l71684p9977L16252j03731j22595J87495j03528j24458K88159
$$ -31634 255746 -115938 -195915 120337 16606 -105989 81506 -22022 -146480 141679
171A41679j4640l17618J86726K08900k71518O067K21782k20099n2478L30283j67370
$$ 141679 127039 -190579 -3853 205047 -66471 -60404 161378 -58721 -111199 219084 51714
182E1714l23645L07176J93844l41502m0286K35706q9477n0951J27909j44848o6337
$$ 51714 -271931 35245 229089 -112413 -152699 83007 -6470 -57421 70488 -74360 -140697
193a40697K76097l2282k68849J25932J68698j33738o441P4425j25170M8892J89965
$$ -140697 135400 103118 -165731 -39799 128899 -4839 -11280 63145 -62025 -13133 176832
204A76832j82696j69337K55539O4422k45932M4339J32163j23463M742J17098j27854
$$ 176832 -5864 -175201 80338 144760 -101172 -56833 75330 -48133 -43391 73707 -54147
215e4147n6293J87578k5859j67791R7824R3518j07481J7533P0590q3310J6324
$$ -54147 -110440 77138 51279 -116512 -18688 74830 -32651 -15118 55472 -27838 -11514
226a1514R4650q8995m5994J21082k5655j04189Q3288L6198j21292L7456R8803
$$ -11514 83136 -5859 -51853 69229 43574 -60615 22673 58871 -62421 -24965 73838
237G3838j06045m2896J20231l0532q9195P2804L1595o9823K9018M4926n7576K394
$$ 73838 -32207 -75103 45128 14596 -74599 -1795 29800 -40023 -11005 33921 -23655 -21261
249b1261O4037l6967k9180N7596j1861l8401M1777o832m3773M3130J7458o4963
$$ -21261 42776 5809 -23371 34225 22364 -16037 25740 18908 -24865 18265 35723 -29240
261b9240Q515N6540m2117m2327N6760J1451n5039J7152L1215k8819N51K4354j4548
$$ -29240 -20725 35815 -6302 -48629 8131 19582 -35457 -18305 12910 -15909 -15358 8996 -5552
274e552k334K4126o061j9243J4036J4984r534k090j329p800J6893q5l5084Q753
$$ -5552 -7886 16240 10179 -9064 4972 19956 10422 8332 7003 -797 16096 16011 -19073 -10320
288a0320L2561j9875k8158J4914J5121j4917o616J3774k448n390J2706j117r895
$$ -10320 22241 2366 -25792 -10878 4243 -10674 -17290 -3516 -5964 -11354 1352 235 -9660
301i660R106J2207n37q881J61J3084k491j1954M558O997m724j0310k66O336r106
$$ -9660 -554 11653 11116 2235 2396 15480 12989 1035 5593 12590 7866 -2444 -2710 3626 -5480
316e480p555J0669L1j0939L65P142J189n691L559J0982l638k613P673L0j167L891
$$ -5480 -13035 -2366 -2335 -13274 -12909 -5767 -4578 -10269 -6710 4272 634 -1979 5694 5724 4557 8448
332H448K977l21o854m54O461n693q620L427N273p149j1550Q001O239j5659L159
$$ 8448 11425 11104 4250 3796 10257 4564 -4056 -629 4644 -2505 -14055 -6054 185 -15474 -12315
347a2315J7019j0969q199J5205K370q602Q141P288r595L931J2879j5011o215K0253
$$ -12315 4704 -6265 -14464 741 3111 -5491 2650 9938 343 4274 17153 2142 -4073 16180
361A6180p024j2506J2305q865j2485K1064k560l0297J4975K7256k9213j5307L5083
$$ 16180 9156 -3350 8955 90 -12395 8669 6109 -24188 -9213 18043 -11170 -26477 8606
374H606p376k2783L2844o20l5955L0837K4086m4524J977M3882k2470k4712L4629
$$ 8606 1230 -21553 11291 10671 -25284 5553 29639 -14885 -12908 30974 8504 -16208 18421
387A8421q149l1544L8969L373n5631L2200L9865o0893q010N7497k8094k8437N0639
$$ 18421 10272 -21272 17697 21070 -34561 -2361 37504 -23389 -31399 26098 -1996 -30433 20206
400B0206j6276m9511O2879K4392q7646K1540Q0717n6833l3160O3290k6435l1891
$$ 20206 3930 -45581 17298 41690 -45956 -24416 56301 -532 -33692 29598 3163 -28728
412b8728P3434j9785q7778O8780O3857r7129j5865Q0665m0667k3845P0792n7853
$$ -28728 44706 24921 -62857 5923 69780 -27349 -43214 37451 -3216 -27061 43731 -14122
424a4122o0949J19456J5592j34506L8769R9593p1001k4516O7472n7330j8126J19403
$$ -14122 -75071 44385 59977 -74529 -35760 63833 -7168 -31684 35788 -21542 -39668 79735
436G9735n3863j24773J17758P4849j35089J641R1681o6208q220Q6019q9099o1207
$$ 79735 25872 -98901 18857 93706 -41383 -39742 51939 -14269 -22489 63530 -25569 -86776
448h6776J54461m348j63440P4541J03004j09457L28Q2437r6077K722J48077r9407
$$ -86776 67685 63337 -100103 -25562 77442 -32015 -31687 50750 -45327 -42605 105472 6065
460F065j31899J69854O6364j75347K2902J08485q8678J1455R2744j37919l6433
$$ 6065 -125834 44020 110384 -64963 -42061 66424 -22254 -10799 81945 -55974 -92407
471i2407K06579n2437j94811J16953J05150j27024J7573O8515j25322M1941J75861
$$ -92407 114172 61735 -133076 -16123 89027 -37997 -20424 48091 -77231 -35290 140571
482A40571j54700j44359K18088N7686j86813L9614P7099r2729O9617Q0735j96103
$$ 140571 -14129 -158488 59600 117286 -69527 -29913 47186 -45543 24074 104809 -91294
493i1294j2512K49711p8858k12782J38501R2923j31471M9137M7028j53411P8988
$$ -91294 -103806 145905 67047 -145735 -7234 85689 -45782 3355 50383 -103028 -24040
504b4040J75425j87100j16953K30715J5048j80329Q3420N4116j23322J04241Q3878
$$ -24040 151385 -35715 -152668 78047 93095 -87234 -3814 50302 -73020 31221 115099
515A15099k24202J7709K54638j24423j87665J73808N6641j39975P6968K6962j60094
$$ 115099 -109103 -91394 163244 38821 -148844 24964 81605 -58370 18598 45560 -114534
526a14534J17205J56661k33191p5195K61943l5636j81312J11387L0155j13254
$$ -114534 2671 159332 -73859 -149054 112889 77253 -104059 7328 37483 -75771
536g5771J31548M3807k36574O6312K47615j57107j64397J79474K6009j09220J00259
$$ -75771 55777 99584 -136990 -70678 176937 19830 -144567 34907 60916 -48304 51955
547E1955k8015j62386J72844J36161k60956m9831K51774m9590j48228J06232r764
$$ 51955 23940 -138446 34398 170559 -90397 -140228 111546 61956 -86272 19960 10196
558A0196r2060J61193Q405k38757J02494K14606j77618j07431J77577k7139r1659
$$ 10196 -81864 79329 87734 -151023 -48529 166077 -11541 -118972 58605 31466 -60193
569f0193J29551m4725j57187J76560J01676k45453L321K15244r9783j02500J30587
$$ -60193 69358 24633 -132554 44006 145682 -99771 -96450 118794 19011 -83489 47098
580D7098m5701q0403J61303k6137k04055J40404J59815k03869n4153J85465n8428
$$ 47098 1397 -79006 82297 56160 -147895 -7491 152324 -51545 -105698 79767 21339
591B1339q1169J24332o2082j11884J83065L7836k28481N4386J83814j17451p2781
$$ 21339 -59830 64502 2420 -109464 73601 111437 -117044 -62658 121156 3705 -69076
602f9076J13787o0744m1886J56027p0855j77558J66162J21861j95988k5717J45333
$$ -69076 44711 -16033 -57919 98108 27253 -150305 15857 137718 -58270 -83987 61346
613F1346n9279l1958R7260r5557p1251J90327K62k08613P7786J44717j16176l1417
$$ 61346 2067 -29891 67369 -28188 -99439 90888 91150 -117463 -39677 105040 -11136 -42553
625d2553Q8782p9515r496J39829q8248j34904J56546P2092j65690J3951J05468
$$ -42553 46229 -33286 -42782 97047 8799 -126105 30441 102533 -63157 -49206 56262
636E6262p8117K029Q7939j06697l9398J66450l4188j57551R5191R1831j11325
$$ 56262 -21855 -19826 68113 -38584 -77982 88468 54280 -103271 -8080 83751 -27574
647b7574L59P3184p9805M895J11309r0658q6627J39388K3579j29785L8941O6908
$$ -27574 -27215 45969 -33836 -28941 82368 -8290 -94917 44471 68050 -61735 -22794 44114
659D4114p1156J9609O0846r4508j3417J30469m6387j12099Q8539N0862q6165K2673
$$ 44114 -27042 -7433 53413 -41095 -54512 75957 29570 -82529 6010 56872 -29293 -6620
671f620L9827p3346K7935Q2842q6599n5362J12496N919r4897L9140L8431n7306
$$ -6620 33207 -40139 -12204 70638 -15961 -71323 41173 47092 -47805 -8665 29766 -27540
683b7540L1778L7962q3484O609R5092n0451o7642P1311J8620n9484L0892J9979
$$ -27540 4238 42200 -41284 -34675 60417 9966 -57676 13635 32255 -27229 3663 23642
695B3642o0005L2553N6696p3935k3685Q4263j7217o0106M2790J6157m4025K8154
$$ 23642 -36363 -3810 52886 -21049 -44734 39529 22312 -37794 4996 21153 -22872 5282
707E282K2294n6112J0922N7631m2095l4289N4024k097l9680L0859O803l9139K7294
$$ 5282 27576 -28536 -17614 40017 -2078 -36367 17657 15560 -24120 6739 13542 -25597 1697
720A697K7703m6912m378M8975j9628l1294L4369K460l1023K5446J1131l8773J2864
$$ 1697 29400 -17512 -21890 27085 7457 -23837 10532 12992 -18031 7415 18546 -20227 -7363
733g363L2531k9555j5205L0816m981k0408J8787J310k2543J9121J4080l0432L188
$$ -7363 25168 -4387 -19592 11224 6243 -14165 4622 5932 -16611 2510 16590 -13842 -10654
746a0654K7373j6109j2079J9875m118j2858J6102J201k1164J0948J7764k0540
$$ -10654 16719 610 -11469 8406 4288 -8570 7532 8733 -12431 -1483 16281 -4259
758d259p242K0105o027j1146J1135j899p913R081K553j1574K898J0931o501m795
$$ -4259 -11501 8604 2577 -8569 2566 667 -7246 1835 4388 -7186 -4288 6643 142 -4653
772d653Q155j150o291Q959k599p306O852L509q093L45O523m237l973N433M64o028
$$ -4653 3502 2352 -3939 5020 2421 -4885 1967 5476 -2617 -2272 4251 14 -3959 1474 1938 -4090
788d090L512K356l860K89K729j633N82J066j035j02O88Q63j113j26J346j433K24
$$ -4090 -578 1778 -2082 -1793 936 -697 -115 951 -84 -186 502 1365 252 126 1472 39 263
805B63O86k161R94J740k093m18O24M94k05j399J500P61j753J054L94j068O19L3
$$ 263 949 -1212 -218 1522 -571 -989 -365 129 -76 -1475 25 786 -967 87 481 -587 32 65
823F5O12l1j808J296O90j053R2j85P67J13j055J116r44r59L569j005l574K022
$$ 65 677 646 -1162 134 824 -229 -137 -322 445 558 -497 619 -325 -1284 2285 1280 -2294 -272
841b72K049j726j245Q56N21p12J332r15l324M438J719n681K220L456m389R51L872
$$ -272 1777 51 -1194 -338 183 -529 803 -112 -3436 1002 2721 -2960 -740 2716 -1673 -722 3150
858C150m003j610O112q06p128M520M887q589J251P567p897j762R220n603n735
$$ 3150 -853 -2463 3649 2843 -4285 235 5122 -3467 -2216 5351 -2546 -4308 4912 -691 -6426
873f426R398Q28j0114N124P700r874j012J2025q392m744J4721o851j2710J5038
$$ -6426 2972 3800 -6314 -1190 6510 -3364 -4376 7649 -743 -5487 9234 2383 -10327 4711
887D711M076j6242M350J1066j1766j499J4410j2134r545K2002j655k2488J3582
$$ 4711 8787 -7455 -3105 7961 -3805 -5304 9106 -3028 -12573 9429 7774 -14714 -1132
900a132J2101j7466L432J2775j6342m41K2681j2928j9656K3929P097k5777R577
$$ -1132 10969 -6497 -3065 9710 -6632 -7073 15608 2680 -16976 6953 14050 -11727 -2150
913b150J3624k1729O804K0509k5946q593L4185p972k9038K2368J2266k5665R046
$$ -2150 11474 -10255 -3451 17058 -8888 -17481 16704 8732 -20306 2062 14328 -11337 -2291
926b291J7609k7527K928L2576k5779k0006L7196p95l2458J9613J3154k8265J2212
$$ -2291 15318 -12209 -9281 23295 -2484 -22490 14706 13911 -18547 1066 14220 -14045 -1833
939a833K2529l4927l811M4122k0414l3938L6252Q711l2930J7667J3075l3526J5342
$$ -1833 20696 -14231 -18042 26080 5666 -28272 7980 16691 -16239 1428 14503 -19023 -3681
952c681L3121l9846j7443N0544p157m0131K7657J0900l2330K3899J7382m8047
$$ -3681 29440 -10406 -27849 22695 15538 -24593 3064 13964 -18366 5533 22915 -25132
964b5132R092N0950l3038l3657M3489L674l3674K6571N221m2498L1068L5905n7633
$$ -25132 -16040 34910 1872 -31785 11704 15378 -18296 8275 13496 -29002 2066 37971 -19662
977a9662j0703O0180j7749l8668L4726K108l2802L4797J1678n7100K0463N4278
$$ -19662 -30365 29815 12066 -26602 8124 10232 -22570 12227 23905 -33195 -12732 41546
989D1546m6714k7671N2635q710l2644L6717m362m4269M2161K9877o5377j439O3218
$$ 41546 -5168 -32839 19796 11086 -21558 15159 10797 -33472 8689 38566 -26811 -28250 34968
1002C4968k7873l5156M0745p066k9572M4400j130o0193L6261M9850n7491k0172
$$ 34968 7095 -28061 12684 5618 -23954 20446 19316 -40877 -4616 45234 -12257 -32429
1014c2429N5562j4580k8403L8752j4316m0637N4586J8997p3145J2774O0937l7345
$$ -32429 23133 8553 -19850 18902 4586 -36051 18535 37532 -35613 -22839 38098 753
1026G53k5404M0960j8692k1005N2463j3755o2833M8838M5829o5350j0318N3887
$$ 753 -24651 16309 -2383 -23388 29075 15320 -47513 1325 47154 -18196 -28514 25373
1038B5373k4152j6951M0547k8202l3082O2727O316p2474K4568N3298m4456j3920
$$ 25373 1221 -15730 24817 -3385 -36467 26260 32576 -39898 -15330 37968 -6488 -20408
1050b0408M1210l0096j2876N5614k5102n4804N6023L1530o3489J803M5297k9091
$$ -20408 20802 -9294 -22170 33444 8342 -46462 9561 41091 -22398 -20595 24702 -4389
1062d389p765L8530l5991k3295O5402p382o7504L5671M2083m6269l548L3324l1830
$$ -4389 -12154 26376 -9615 -32910 32492 25110 -42394 -6723 35360 -10909 -14457 18867 -12963
1075a2963k235N0105l4678m4411O1074J8469o2238J3423L6766l3755M753L2459
$$ -12963 -15198 34907 229 -44182 16892 35361 -26877 -13454 23312 -10443 -5690 26769
1087B6769m3210j2159O3651j6819n8813L9265L1443m3709O059K5205l6506R163
$$ 26769 -16441 -28600 35051 18232 -40581 -1316 30127 -13582 -7523 17682 -18824 -9661
1099i661M5630m2577l1743N9320M618n1349K0053K4466l2206J2425K6123m4535
$$ -9661 35969 -6608 -38351 20969 25587 -25762 -5709 18757 -13449 -1024 25099 -19436
1111a9436l441N6794k3775m5206M0193J6708l6742J3652J5383l3319J4602L5621
$$ -19436 -22877 33917 10142 -35064 5129 21837 -14905 -1253 14130 -19189 -4587 31034
1123C1034m0648k0623N1802l434m1655K3731J3886k8712J8198J6129m0339N942
$$ 31034 -9614 -30237 21565 18131 -23524 207 14093 -14619 3579 19708 -20631 -14689
1135a4689M4454k6953l1173L7099O660l0575J8123Q335l0674J9571K6105l9154
$$ -14689 29765 2812 -28361 8738 15398 -15177 2946 11281 -19393 178 26283 -12871
1147a2871q528M2074j1080k8279K3064M396k2442K0023Q798l4885J1537L3232
$$ -12871 -21399 20675 9595 -18684 4380 8776 -13666 6357 15155 -19730 -8193 25039
1159B5039k8280j7359L1736l745k0326J9307M40k3404J9831J6223l2167j311L1809
$$ 25039 -3241 -20600 11136 7391 -12935 6372 6812 -16592 3239 19462 -12705 -14016 17793
1172A7793j3653j8372K0937j992j5895J8658J687k5056J3009K0549k2802q319
$$ 17793 4140 -14232 6705 4713 -11182 7476 9163 -15893 -2884 17665 -5137 -13456
1184a3456K3177o286j3385J6446k942j6652J8139P903k4549M644K0428j3555q937
$$ -13456 9721 3435 -9950 6496 3554 -13098 5041 12944 -11605 -6961 13467 -88 -9025
1197i025J5449m520j0137J4798q47j7950J2163J2266j8286j302J5257q074n786
$$ -9025 6424 1904 -8233 6565 5718 -12232 -69 12197 -6089 -7391 7866 -208 -5994
1210e994J1795m851r499J3288K836j6077N514J2340j1508l177J1226o186n289
$$ -5994 5801 950 -8549 4739 7575 -8502 -2988 9352 -2156 -5333 5893 -293 -5582
1223e582J1029k831j0433Q863N758j1180L57R043n677l066P904m051n024Q781
$$ -5582 5447 2616 -7817 1046 6804 -4376 -4019 5024 -653 -3719 4185 134 -4890 3891
1237C891n38q790N272N142o893l79N490l687k465O287k287n848O201K312p099
$$ 3891 3353 -5437 -165 4977 -1916 -2295 3195 -492 -2957 3330 1043 -4805 1396 3708 -3391
1252c391K003M382m137k14L616k643j738M090l55m152K604K489l986P03K547l016
$$ -3391 -1388 2994 -1143 -1357 2259 -384 -2122 1968 1613 -2539 65 2554 -1432 -729 1818 -1198
1268a198J25K922k114j728K870M2k337J066J823k054j96K258j413j187K259n83
$$ -1198 -1073 1849 -265 -1993 877 919 -1418 -352 1471 -583 -779 1479 66 -1121 1138 555
1284E55j310J200p7n86J1M37l28l73O86l72o42J120l02p17R68j18o34N66L14o6
$$ 555 -755 445 368 -218 -207 230 -98 -471 215 -157 -799 321 19 -698 270 152 -482 84 398 332
1304C32l77K16M70p35M7M59o00j1L08l50J97k72p4N76m52J15L69k95K01k64K64
$$ 332 -45 171 641 -94 -47 412 -188 -199 109 -241 -44 -316 -390 186 -266 -151 218 -77 124 -140 124
1325A24L54n87K51N50p97J55M33p20N1K52K7l55l43P33k26m29Q71m59k35R08o57
$$ 124 478 -109 142 692 -105 50 483 -237 -186 66 93 -262 -605 128 -98 -527 344 -115 -350 558 -99
1346i9l90J159l57o96M93M84p98k02J380j066j240K219j66k312J562Q94j849N78
$$ -99 -489 670 313 -383 110 594 -204 -406 974 -92 -1332 887 721 -1591 -29 865 -984 -406
1364d06J237j418j41K112j006k017K431P14k900J614J266l052J215K694l320j025
$$ -406 831 -587 -728 1384 378 -1639 792 1506 -1394 220 1486 -1566 -351 2343 -977 -2002
1380b002L928r52l456K832J268l796K008K919n000N44N220l580k933M969k07m141
$$ -2002 1926 974 -2482 350 1618 -2178 -170 2749 -2251 -1707 3513 -67 -3000 1969 1762 -2379
1396b379L028J455m744K198M213n709j389O940k705m780N431J64n172M549K164
$$ -2379 649 2104 -2640 -442 3771 -1938 -3327 3613 908 -3872 1559 1723 -3449 1100 3264
1411C264o915J952P007n937l877P826j286n965N731N78p071N391M482r286L63
$$ 3264 -3651 -1699 5308 -629 -4506 3320 2034 -3931 1800 2378 -4693 698 5180 -4106 -3743
1426c743R080m911n359P595p37o587P358J396j0479N517Q416j0140k449R900l666
$$ -3743 5337 426 -4933 2662 1925 -4662 2696 4092 -6387 -870 7546 -2594 -5043 4857 1191
1441A191n574P872j970q096Q943M254j3062K356J1515q123m626R549l842n727
$$ 1191 -4383 3489 1519 -6577 2366 6620 -6442 -4086 7429 -694 -5320 4229 387 -5340
1455e340J0279j507j1632Q525Q489j2809j530J1785o250m873J0239m853q460J2717
$$ -5340 4939 3432 -8200 325 8814 -3995 -5525 6260 10 -4863 5376 523 -7937 4780
1469D780J828j5047N435J1403j0470l124J0474o129m897J2740m286j3142J3095
$$ 4780 6608 -8439 -3004 8399 -2071 -5195 5279 -850 -5747 6993 2707 -10435 2660
1482B660O897j5986K013J1626q865k500J0831q240p050J5805r37j7038R352J0860
$$ 2660 9557 -6429 -4416 7210 -1655 -4155 6676 -1564 -8614 7191 6254 -10784 -1432 9428
1496I428j3445k5J0388r529j506J3829q667j1733J6052M599j7337M502J0982j0866
$$ 9428 -4017 -4042 6346 -3183 -4689 9140 473 -11260 4792 9391 -7946 -3444 7538 -3328
1510c328L54J0960j1936m532J7948m853j6337J2120Q400j3625K169Q896j0945
$$ -3328 -2974 7986 -3950 -8482 9466 4613 -11724 396 8796 -4829 -2660 6236 -4709
1523d709R85J4171j1746j0059J8189J107j6918P784P987j1501L548R084j3703
$$ -4709 -3724 10447 -1299 -11358 6831 7938 -8980 -1196 6791 -4710 -1162 7922 -5781
1536e781j621J8151p895j4830J4403N593j4244N513O582j2488M954J2477j4661
$$ -5781 -7402 10749 2854 -11976 2427 8020 -6224 -711 5871 -6617 -1663 10814 -3847
1549c847o358J8493k320j5100R490N529j1776O583O807j5529K738J6915j1373
$$ -3847 -10205 8288 5968 -9132 358 5887 -5889 694 7501 -8028 -5290 11625 252
1562B52j1322J5418J662j2435P490L887j2310P196J0605j5803l462J7896n250
$$ 252 -11070 4348 6010 -6425 1065 4952 -7358 -162 10443 -5360 -8822 9074 3824
1575C824j2268J0571J788r860Q378L634j4382M928J4243j2223q061J4792j297
$$ 3824 -8444 2127 3915 -5945 2433 6067 -8315 -3387 10856 -1367 -9428 5364 4067
1588D067j0275R022O55j0942R345P095j5386J0J5295p177r166J0648o06q411R409
$$ 4067 -6208 2814 3469 -7473 1872 8967 -6419 -6409 8886 1709 -7457 3191 2585 -5826 3583
1603C583J163j3491P609J0938j3022l964J2870l785o892Q551j793q700J0265L931
$$ 3583 4746 -8745 -1136 9802 -3220 -7184 5686 1901 -4991 3560 1767 -6933 3332 7263
1617G263j4452L225J2347q896n293R735l156n623R083j340j0665Q014P560j1632
$$ 7263 -7189 -3964 8383 -513 -5806 3929 773 -4850 4233 2893 -7772 242 7802 -3830
1631c830j132J0330n159m095P808l686n928R744P19j1200M543Q454q020k629P891
$$ -3830 -4962 5368 209 -3886 3922 236 -5692 4052 4771 -6429 -1886 6568 -1452 -4081 3810
1646C810m205l523Q255k977p916Q484L735r854J558P103n251j808O312m317l703
$$ 3810 -395 -3918 4337 1360 -6556 1928 5663 -4191 -2633 4470 -781 -2589 3723 -594 -4297
1661d297Q172q45q654N406N164p382L09N389m737q69O214l887m910P199J528p665
$$ -4297 3875 3030 -5624 -218 4946 -2436 -2127 3262 -1475 -2344 3870 -17 -4927 2272 3800 -3865
1677c865K575M934n100R2M580m513j591O369k077n476M653K451n093J053L336
$$ -3865 -1290 3644 -1456 -1364 3216 -1297 -2888 3481 1404 -4072 581 3032 -2061 -1008 2328
1692B328l891P8M667l842k587N619m71m855L026K209l722R24K819l408o30M437
$$ 2328 -1563 -1485 3182 -660 -3247 2372 1901 -2954 72 2281 -1441 -517 2302 -1106 -1736 2701
1708B701k149l478M054O39l683J809J587k871Q10K537k793r40L391o45l067K532
$$ 2701 552 -2926 1128 1767 -1916 -107 1480 -1391 -581 1956 -837 -1777 1614 969 -2098 434
1724D34R59k749J314J467k661O42K347j973j466K536K1k162J299R40j893O26J459
$$ 434 1393 -1356 -42 1425 -1236 -594 1753 -220 -1686 850 871 -1291 8 948 -945 -319 1140
1741A140j698k86K073j068j164J558j2j092P89M76j373L68J217j228o29J510m31
$$ 1140 -558 -844 1229 161 -1003 555 543 -549 240 716 -657 -289 928 -300 -929 581 150
1758A50r94J084K0q82P10L79q32J2R88p03l90P66J0o97N23J86o78M60J80n29J9
$$ 150 -844 240 260 -622 88 467 -365 -353 635 -68 -458 308 318 -379 144 330 -348 112 292 -237 -218
1779b18M75k83k60K61J54l52K42K67m57J58M12m67J23J50k40ONR5k75NL00j23
$$ -218 257 -26 -286 -25 129 -223 19 286 -171 -13 399 -68 55 205 -35 -29 -24 71 -204 -199 101 -22
1801b2j24L08j72jl9j30J58P5j12J34j01N4m7p7J63l7k23M34k17p9J34j58R7l7
$$ -22 -146 162 -10 -11 -50 -180 -22 53 -59 75 -26 28 -19 -96 67 30 -193 241 24 -55 79 -79 18 -19
1825a9j45J94j0J9j81J3K98qk60K97K3k97P4Q2K4j65P0l0m1K0N7k68K53N7k83
$$ -19 -164 30 20 39 -142 -129 169 161 -99 198 221 -76 -2 80 104 -61 9 -21 -62 -42 15 -253 0 57 -226
1850b26R4M32m49R5K73k81k8L46j31l71L11K89o44J05O79o17j17O12m43m06P15
$$ -226 -132 300 -149 -54 219 -62 -90 256 125 -246 65 354 -290 -185 494 -123 -240 372 -71 -477 238
1871B38m6o39L29N38n81j77Q50n05m92R95m25p22J049O7j055M38P57r49m4Q08
$$ 238 192 -447 -118 420 -161 -338 512 7 -485 510 85 -637 412 479 -576 -138 619 -330 -374 434
1891D34m04q05J290j82j352J030P36j479M05J099j145j33J436q22j188J627K52
$$ 434 30 -775 515 333 -1019 11 747 -732 -327 772 -373 -506 930 108 -1080 547 799
1908G99j882R65J259j787J77J297j297k59J788p97j589J659O96j948O02J472j773
$$ 799 -1083 -118 1141 -646 -469 828 -469 -728 1060 263 -1326 333 1029 -919 -317 1155 -618
1925f18J3J978j764r53K398l24k127J404J143k080N72J442j907j48K544j497j797
$$ -618 -605 1373 -391 -1344 1054 730 -1397 7 1150 -930 -358 1084 -823 -971 1573 76 -1721
1942a721K658K94k641J529J075k243Q59J859k357q95L273r97k643K436P87k697
$$ -1721 937 1231 -1410 119 1194 -1049 -190 1669 -688 -1583 1690 693 -1950 486 1273 -1424
1958a424J533J342k976Q28K796k566j641L457k45k793J965J060k744J378K081
$$ -1424 109 1451 -1525 -697 2099 -467 -2108 1349 1104 -1689 276 1336 -1408 -30 2051
1973B051l496n9L746j991k452L059J90k665K032R21l158J262L124l426j196L919
$$ 2051 -1445 -1504 2242 251 -2201 858 1048 -1617 415 1336 -1822 -560 2564 -862 -2058 1861
1989A861j049k590K569J56k829K510J421m077O73M050k843k179L546n15k531K913
$$ 1861 812 -1778 791 947 -1882 628 2049 -2028 -1355 2695 -148 -2327 1219 704 -1827 1086
2005A086L3l656K594K698m237m70M206j801k341L185o75k902L504P69m497J670
$$ 1086 1119 -2537 57 2755 -1482 -1952 2254 453 -1888 1297 622 -2280 1224 1993 -2504 -834
2021h34L674l447j480L644j250k061L170p24l389L344K053m711N27L940k576j533
$$ -834 2840 -607 -2087 1557 307 -1754 1416 692 -2697 647 2700 -2011 -1484 2456 -120 -1653
2037a653L248j474k094L651j51m350K380L254l812p48L565k087j233L413j710
$$ -1653 1595 121 -1973 1678 1527 -2823 -443 2811 -1001 -1749 1816 -271 -1504 1909 199
2052A99k884L895J074m560J301L387k853r14L110k180j484M009r74l991L210K089
$$ 199 -2685 1210 2284 -2276 -975 2412 -441 -1355 1755 -425 -1909 2100 1126 -2865 345 2434
2068B434l870L39K933k631l50L137k078k467M273K38m362K040K513k989J71K390
$$ 2434 -1436 -1097 1836 -795 -1145 1992 -86 -2553 1720 1958 -2404 -364 2149 -840 -669 1721
2084A721k578m88L485j730l091L380J447l769Q79K433k670J33K849k609j538M117
$$ 1721 -857 -1345 2140 410 -2681 699 2146 -1623 -744 1689 -981 -848 2001 -608 -2146 1971
2100A971o74l442K102J967l018N05K133k577j46L363k154k456L394O03k982J235
$$ 1971 1297 -2145 -43 1924 -1094 -589 1544 -1033 -1179 2184 30 -2426 968 1571 -1411 -176
2116a76J390k284P35K222k745r09L684j062k984K543R63k502J141J402k621M54
$$ -176 1214 -1070 -335 1887 -858 -1767 1917 855 -2129 414 1377 -1125 16 1418 -1203 -749
2132g49K846k425j572L174j86k731J729J091k329J061J580k545k2K840j355k018
$$ -749 2097 -328 -1900 1274 1088 -1643 86 1177 -1152 -91 1489 -1056 -1078 1762 407 -1611
2148a611K246L32k116J434P60k253Q25K072k221r49K676p53j724J780J82j643
$$ -1611 635 967 -1149 285 1045 -1208 -383 1689 -532 -1481 1195 442 -1282 498 680 -963
2164i63J161J026k158K98K118j364j455K066j64j648J530P1j461Q96J217j870
$$ -963 198 1224 -934 -636 1482 118 -1337 729 565 -1083 447 518 -943 -47 1170 -700
2180g00j66J777p53j104J498p3j381J261L53j664O57J379j383m79J408l65q40
$$ -700 -866 911 158 -946 552 479 -902 359 712 -952 -295 1084 -299 -778 630 265 -575
2197e75R72M0j326J012O17j151o68K155j545o22J519p96j98R54L18j447N91J076
$$ -575 397 437 -889 123 740 -411 -1079 1076 -469 -1091 428 -368 -566 388 706 -741 -150 926
2215I26j174k40J112n95n91R90j96q53P50K06p44J62P79p75K07n8J09n36R62l10
$$ 926 -248 -488 624 29 -562 428 232 -621 129 335 -409 -247 532 -243 -36 -94 15 -521 441 131
2235A31n30J94J96m20K45P88j49l88k56O85o70O07kp35K44M66n47M1K52p9k31
$$ 131 -399 -205 -9 -429 -184 604 455 67 -189 496 -174 433 431 -304 -60 406 -141 -100 152 73 -158
2256a58M39k41l30L39K07m41J25K31l25Q1J52l3p8J61j46o9O8P9l0k40L01k06
$$ -158 281 40 -290 49 256 -185 -60 171 -154 -73 79 46 -32 129 -17 -86 -18 61 31 -209 92 -114
2278a14L1J36J92j18m2K61k63K03M83j282Q81m26k08J45R3R1j87K68q3Nj5O9q6
$$ -114 -83 53 245 127 85 346 83 286 769 -513 368 -58 -266 -121 -28 63 -124 144 61 66 51 120 34
2301C4N7j7No2N9P1j75J29M61p30L98P5k79o5M7K22P49r78J13J24m62J293j383
$$ 34 91 74 79 17 76 147 -28 101 562 -168 230 305 26 -39 8 230 979 1 114 238 -224 1069 -314
2324c14k44L37K47L61k24J23p42J47L44L04k71k89m0L13K83j76m29O07k31oL38
$$ -314 -558 -221 26 387 163 286 -456 -309 35 339 68 -221 -261 52 335 159 -270 337 106 100 438
2345D38j13j026N12J50J50K38j066R63m97L68l23m6N61l22l32Q26p85k71K28M73
$$ 438 325 -701 -189 -39 111 349 -717 246 -251 117 -206 -252 309 -13 -345 481 -304 -575 -347 126
2365A26K72l75L44l72k53RM87m02Q12n09l63L84P6o1m98J43P09o86J47K60l14
$$ 126 398 23 367 -5 -258 -249 238 -164 648 139 -224 160 236 175 -323 -180 529 -157 -10 250 -64
2386f4j4M74n48r2N08n8k88R2K80l73q8N32m55j56N35k04m25M09J63n16L22J83
$$ -64 -78 396 -152 -244 264 206 -82 10 290 -83 -171 361 -94 -250 285 81 -344 65 228 -288 34 217
2408B17n56K52M71l31m46O61m9n56M90J61n61K71L04n00k13P75l93m54O78N9o68
$$ 217 -339 -87 384 53 -393 268 219 -337 153 314 -247 24 328 -172 -385 390 -3 -457 221 280 -388
2429c88M43K30p37L94P10q42k85P94j72o05O84l1n91M45L68q19kJ051p28m61Q60
$$ -388 55 285 -452 -58 652 -190 -475 319 147 -458 226 195 -396 49 417 -402 -404 647 -81 -542 318
2450C18j21p01Q05J04r35M65P70r67j85J110n91n53R06k78q62R69J73j130L46
$$ 318 197 -504 301 405 -530 -65 705 -262 -447 663 72 -481 425 147 -715 254 427 -703 -357
2469c57J135j003m38J099l76o91R68L4j020Q16P14j360M0J147p55m92J043m17
$$ -357 778 -225 -663 436 60 -631 337 371 -649 167 881 -479 -439 708 -47 -539 504 87
2487H7q16J041K18j391P68J012j259l30J294o12n95J154l24j141J234O20j595
$$ 87 -729 312 530 -861 -93 919 -340 -670 624 12 -583 571 247 -894 340 960 -635
2504f35Q6J463j095l24J069o27p14J416k54j449J084R28j353j28J185r15k57J267
$$ -635 -549 914 -181 -505 564 -63 -777 639 385 -1064 20 948 -405 -533 652 -263 -520 747
2522G47p08j096J591J84j625P21J017j130k44J215q11n25J463n03j337J300O59
$$ 747 39 -1057 534 718 -907 -186 831 -299 -543 672 -139 -664 799 296 -1041 259 918
2539I18j553L23J072j117j36J336q42q72J541m5j508P23J016j325%J147j100j78
$$ 918 -635 -312 760 -357 -493 843 1 -871 670 625 -883 -160 856 -469 -469 678 -422 -600
2557f00J506p20j323J470L38j245N03P71j105P7J217j083o76J633l15j316R61
$$ -600 906 186 -1137 333 671 -574 -71 700 -405 -328 889 -194 -870 763 448 -868 93
2574I3O12j303K09J093j168l8J402q71j093J674Oj364Q07N88j158M97R25j369
$$ 93 705 -598 -389 704 -464 -502 900 29 -1064 610 616 -748 59 647 -511 -14 911 -458
2592d58k80J691o20j243J132K36j144O46O06j297L70J291j069p04J348q1j163
$$ -458 -738 953 333 -910 222 458 -686 -40 566 -731 -361 930 -139 -843 505 424 -739
2609g39Q34M50j123N33P79j240j54J512q54p43J125nj084Q30M50j155M22R21q78
$$ -739 95 545 -578 -45 734 -506 -660 852 -2 -745 380 375 -709 121 571 -584 -162 759 -119
2628a19n26J282k26j062R75L7r70P37M95j172K20R83p21o02J122l34o80P86J90
$$ -119 -645 637 411 -651 324 361 -609 128 623 -549 -329 654 -67 -669 453 119 -561 225 415
2647D15j020N37Q15j153r3J116n91n09Q30j17p86P14L30j003K49Q78q09l77R86
$$ 415 -605 -68 747 -406 -499 617 26 -483 347 230 -556 158 488 -515 -266 612 -197 -574 412
2666D12m15l82O32l3p68N23O09r70r1R80n13l40P85l59n60O47K22q40L36P15q21
$$ 412 -3 -385 247 214 -554 -31 578 -392 -483 497 -16 -356 429 70 -490 157 379 -461 -125 590 -231
2687b31j14O21k00m70O60q4o10N60L04q24K10M80l40k16M67j48m25N80k7m81K78
$$ -231 -345 276 76 -394 266 182 -428 132 436 -388 -178 302 -38 -254 213 65 -360 220 193 -288 -10
2708a0K77n07O0L76l16m1L38Q0o47L74L10m43J37L54l88j49L97k57r2L12q0l44
$$ -10 267 -240 -180 196 -120 -161 177 257 -390 -16 294 -149 -12 342 -46 -195 202 -55 -147 165 85 -259
2730b59J34L33k77l2L80l44j14L70j69k68L28P2l14J24J62j94nK43n6l19M26p3
$$ -259 -125 208 -69 -101 279 -65 -179 191 22 -246 82 154 -160 -36 126 -68 -73 170 114 -205 221 148
2752A48l27J14J98l05J50J45j30k4J68j50p1K8J38k43Q8K83k56NJ30r6K%J3j1
$$ 148 -179 -65 133 -172 -22 123 -7 -31 137 -13 -84 -56 82 -161 -73 210 -46 -41 89 -7 -5 -5 8 -3
2776cN6J38j17j12J04l4pJ02o8n4k6M7q1QQ3o4m1J26k2o2J92j41j10N9J16l5j25
$$ -3 53 191 74 -38 66 32 25 127 59 5 -21 26 -55 -47 36 -28 -69 57 35 -27 165 24 -86 -27 89 54 -71
2803g1J79j07n9J8J75j61M3J03k23R1P5j2p2N1L4r1Q7p0l7J1R1j05K8J00j57J58
$$ -71 108 1 -58 -40 135 -26 17 120 -103 -12 63 51 -21 30 64 -27 60 -10 -47 -36 55 -50 -22 78 -79 79
2829G9O5j12j61K60q0l6K1j10J1l8J75k39R2O0j31N4J78k9p0R6o9m7M4J14q5M
$$ 79 144 32 -129 131 51 15 36 -74 -63 -101 74 -165 -73 -13 -144 -90 88 59 -11 85 16 -31 13 127 42 46
2855D6R3j49j25J11Lj58K12O0j58rQ7j17J00J26q0j43J56Q6k41J39J31k40O3J69
$$ 46 139 -10 -135 -24 -21 -179 33 93 -65 -74 13 -104 -4 122 42 -101 55 141 -100 39 170 -70 -7 162
2879A62j53l2K41j78k50K66Q2k28L1J59l41K34J27j21q4K08Rl60K72J59j14j40
$$ 162 9 -23 218 40 -210 56 138 -90 -59 100 -241 -7 120 -1 -85 123 132 -228 44 203 89 -51
2901e1K09l06J38K50j44l86L81O1l61K02J62l77J65K97l68n3N12k51l28N07j83
$$ -51 158 -148 -10 240 96 -290 91 152 -209 -7 155 -222 -57 240 -128 -181 331 80 -248 259 76
2922G6k51L33M5m87K45L27l43k32M71j22j77J71J68l68J12L54n73J09L94k77k27
$$ 76 -175 158 203 -284 -39 288 -55 -287 184 62 -115 56 224 -144 -32 322 -251 -142 252 -25 -252
2943b52N08j96k90K28K17m67J29N49p19K8O61l46l91O23j18m41L96K68o10Q4O37
$$ -252 256 60 -230 -2 215 -252 -123 426 -293 -265 396 50 -341 282 164 -277 119 387 -223 -139 498
2964D98o48j55N46k14n33Q02q5p18N36L64p02Q4P58o45l02Q64m06m27P18Kq12
$$ 498 -150 -305 241 27 -506 296 211 -507 29 393 -309 -225 533 -112 -414 450 44 -383 335 337 -475
2985d75L16O36p12N3N56m77k54O60k24p03Q51K50r92L56N61o20r6Q20n77k86P82
$$ -475 -159 477 -235 -182 374 -103 -357 303 79 -624 227 477 -515 -159 402 -218 -314 506 -71 -357 425
3006D25j30q84N08M56o67l0P28n24k65Q68n41m97Q69R7q66L20N60o57j8P52p33
$$ 425 295 -589 -81 375 -292 -322 406 -118 -383 485 -56 -553 316 413 -453 -133 427 -230 -248 504 -229
3027b29k27R53k94q39R42J53q47K45M55n51p7R07o30o12R85N0j021O59L38o63
$$ -229 -456 497 203 -636 306 459 -388 -143 312 -239 -316 591 -39 -651 334 384 -637 22 360 -303
3047c03K30O00q02j50J105o56p52R34K70r86L98O03r35K84P17o56l66J040m02
$$ -303 -73 527 -275 -425 680 24 -728 206 476 -510 -112 491 -444 -160 557 -99 -465 575 173
3066A73p58N88L30p24K09P25r15K7J001o86n99J009J8p75M25L14p67L16N29o93
$$ 173 -585 3 333 -391 -182 543 -372 -345 656 -30 -629 380 398 -377 48 362 -405 -89 440 -253
3086b53k75J034m63o52R16mo31M57L16r29L16P51p04l40P70k4q02O77J50p40M28
$$ -253 -528 506 43 -609 307 303 -328 129 445 -484 -168 583 -121 -461 309 285 -517 160 310 -430 -2
3107bM64q51J30Q61o92k78O76j03p37P77P5o97K11P69q39k56Q21k42n18O16J42
$$ -2 462 -389 -259 602 -90 -368 308 205 -532 245 320 -377 -166 603 -236 -492 329 87 -431 185 327
3128C27q69N26M00p47J41O85n25k04N88j66m60N70np57N78L80o66q2O88m64l07
$$ 327 -542 -16 384 -363 -222 463 -62 -266 322 156 -304 266 261 -496 82 462 -204 -286 402 -62 -369
3149c69O36j81m04M58R4o60M28M65n27k29N51k09l79M95R2o14K83M39o55J39M62
$$ -369 267 86 -318 140 234 -426 2 467 -60 -289 262 53 -326 169 261 -353 -70 369 -286 -147 315
3170C15m06r6L45j70l74N32J03m96K55L82m98m8M68m45j05M78j00o01M86J53l27
$$ 315 -91 -187 158 -12 -386 146 249 -247 8 390 -108 -156 312 -133 -238 240 140 -461 25 178 -149
3191a49P8L24l04q5M02k03k74L99j15l41L40J28l31L5L68k11j83K37j44j61L79
$$ -149 -71 253 -51 -136 266 63 -211 188 73 -268 72 200 -131 -96 272 61 -122 115 -29 -190 189
3212A89J92o63K18K43l39j7K94j79j75M79j16l35K96M1k91J51J49k03o5K88r4
$$ 189 381 -282 -64 179 -160 -177 117 -62 -237 242 126 -209 87 128 -163 -12 137 -66 -131 157 63
3233F3j69J52Q6l24J90Q8j64k5J69j80J2J51j23m5K27j1j16J2K8q8p0L11j38j67
$$ 63 -106 46 132 -192 -2 86 -78 -103 66 -114 -102 49 -74 -119 108 97 -19 -7 21 -67 -137 174 36 -131
3257a31K24nk79J21J16r3m8J80p6j67J20J16j97J58L4j80K16l2j39o1K25j83K7
$$ -131 93 88 -191 -70 46 -47 -95 85 9 -158 -38 78 -119 39 73 -107 109 77 -62 -123 102 -81 -54
3280e4J63q5n2K8K7j12L3J62r1j6K33j40l8k5%j37J45j05M4PJ10M3j71Q4r5O0
$$ -54 109 24 -28 0 27 -85 -52 110 19 3 236 96 58 33 33 -104 41 -64 -20 -13 97 140 -31 53 -42 18
3306A8l5J79k38Q4R3r6j01O3K06k12J44r8l5R5kp6k7L9n8J6j3L3j10J72P8k07
$$ 18 -17 162 -76 8 101 5 -96 -33 173 -39 105 7 -28 67 65 -11 -38 1 -57 -41 -54 -21 -131 41 119 -88
3332h8N6J00q8J77j2k21J10n0M0lM3J9j62kO2m6O8R3k9j39J78j59QJ50nj52l4
$$ -88 -32 68 -20 157 145 -76 34 -16 24 21 64 83 -79 -81 -19 -65 3 96 67 -72 106 -53 -45 105 100 -52 -86
3359h6P1K3m4K21q7k03K08p7j88J97J10l54L14K1k34P4J55j24q1J67r7j07K39
$$ -86 -15 8 -36 185 98 -105 103 26 -162 35 145 -209 105 126 -108 -34 121 -3 -84 83 -14 -121 118
3382A18Rj68m0K57j83m9R1k9q9M8K5j01J54J87l19L1K43k41M2J02q2p8J11kj73
$$ 118 127 -41 -81 176 -7 -56 35 6 -83 -35 -10 -111 43 230 -89 -58 185 -56 -14 88 6 -72 39 37 -136
3407a36Q8K31k99n1L29k61j41L42j06j34K06R0l45K06O1l8j08K51j37k12L00q2
$$ -136 -48 183 -116 -167 162 -99 -240 102 -4 -138 68 158 -187 19 80 42 -66 185 48 -164 136 54
3429E4k22K30L2k10J8K32k16j27M50k35k72K63J09k82L30J55m77O7L46k80k25
$$ 54 -168 62 94 -116 -98 134 -82 -209 241 6 -266 -3 106 -176 154 309 -168 -101 245 -35 -260
3450b60M14j56j47J58K81n17Q7M32k99k22N04l29k22M44q7l06L15J00l90R2N00
$$ -260 154 -2 -149 9 290 -227 -140 292 -7 -229 275 -54 -276 168 81 -225 90 190 -200 -108 392
3471C92m55j46N40l58k39N12o2n47L30J81l46J49L48l95o9N06k63m80N73Rm11
$$ 392 -63 -209 331 -27 -266 246 184 -363 -33 148 -198 -49 299 -96 -165 341 78 -402 171 180 -231
3492b31J75K25l23J00L85l87k02N76k74l95M11K90o65L33K62n31J15M29k86k66
$$ -231 -56 169 -154 -54 331 -56 -258 318 44 -351 60 350 -315 18 280 -251 -136 293 7 -259
3512b59N31m0m78L09J62m92J43N19m95j57O76m00l76N05N3l85J88K49n24J25M76
$$ -259 272 232 -246 63 225 -267 -124 395 -100 -257 419 19 -357 148 201 -184 4 253 -271 -146 330
3533C30l84k93P24j91m28M90k6n48K72M21m98j05N28k95l88N77M7n90N33P4n38
$$ 330 -54 -347 377 186 -242 248 222 -326 -54 367 -131 -236 292 -3 -391 186 233 -357 176 250 -288
3554b88K78M08n73RM83j75l97L86M1m56L54L08o76K18N03n61k89O50j63k66L17
$$ -288 -10 398 -175 -166 317 142 -255 131 172 -284 70 378 -298 -80 423 -138 -427 223 60 -206 111
3575A11O0n20K84M94n82j2N75l90k69M25r2l40L03J61m83J37M72m10j79N13k23
$$ 111 171 -349 -65 429 -153 -165 410 20 -249 176 84 -256 47 208 -275 -138 334 -76 -255 258 35
3596C5k39M30K1m79L35Q6l84L0M90l63k66N57r6m05L65J10m98K17K27l65j7M73
$$ 35 -204 226 247 -232 103 189 -195 -165 325 -38 -304 253 157 -248 117 227 -271 -54 173 -192 -209 264
3618B64k62k10M80l11k37L16J94l88o4N77m63j01M22j65k14K25Ok70K04K15l50
$$ 264 2 -208 272 -39 -276 40 234 -154 -218 359 -104 -205 217 52 -162 63 69 -201 3 218 -132
3639a32N2K89j78k19L29j42k31L19K9k07R7J04j74j3K62j89j77L44j16m40M54
$$ -132 -80 209 31 -188 141 -1 -232 87 116 -91 6 110 -64 -77 185 -4 -181 163 47 -393 61
3660F1K18m97R4L25k83O1L17k91j42K49R1l67R7L28k58j84K10j51k6J08K06l10
$$ 61 279 -218 -124 201 -82 -21 296 5 -137 112 203 -164 -67 261 3 -181 29 -122 -148 -40 166 -144
3682a44J99O6k40Q8J49k23j8K52p5j48K35q1k98K41J46l35R1J62o8j38K40j35
$$ -144 55 121 -119 -31 118 -105 -123 129 54 -94 141 60 -238 3 149 -186 -95 67 -1 -139 101 -34
3704c4j56K97j18J9m4J04j31J04P8q6j51J67j19j36K74L6k74N2K55j41l0J41q3
$$ -34 -190 107 -11 8 -36 68 -63 41 119 33 -118 49 -70 -206 68 104 -170 -118 137 -4 -34 107 24
3727B4q9R0J5j03N7N4j77J01J70j55j2N7J13j65n8J16o3M4J45j35p7J92j64m0
$$ 24 -65 25 40 -63 -6 48 -129 -28 142 -13 -25 32 145 -20 -78 38 -25 19 164 29 -48 144 -20 -60
3751f0J17m8l4kN1k03K16n0M4j19K43j73q3P9J7j20J22L9r8Q3J3j51M7J45n4j31
$$ -60 57 9 -25 -27 24 -179 37 -13 31 -88 155 -18 -101 -22 -5 -125 -3 36 -62 21 34 -117 -70 75 21 -110
3777a10J29J4j00N8J39q9j06N7p4K5K7J97j89j07K30j58m8J34k8j4J44n2j26O8
$$ -110 19 33 -67 -9 130 41 -65 -8 -82 -57 -30 167 -22 -129 101 -57 -105 29 1 -13 131 79 -47 21
3801B1n3N6Rq2J52j48P3n7o5J29j31j2K29o3j29L5Q8rpn1K5L6r6J37j87R3K5r0
$$ 21 -32 24 33 -49 103 -45 28 -29 -94 35 -96 -108 121 58 -71 -36 52 43 36 -15 10 46 -50 87 -100 -7 18 -72
3829g2N5P7q5j12R9Q6j57J12N1n9J3P4p0r%n2J05J09j13r6K6P5j47K06k9o4q3
$$ -72 -17 60 -25 -137 -38 48 -109 3 54 -5 8 82 12 3 3 -49 56 165 52 -44 -18 57 -90 116 87 23 -60
3856f0L2P6q5j2J16m5j06J52r0R7j7n1KJ4m4j73J52J8k3J44o1o9oQ2m0p2J21P
$$ -60 -28 48 -37 -49 67 22 -84 68 -22 75 58 7 9 23 -21 -194 -42 -24 -47 97 36 -33 -39 43 3 -69 52 59
3884E9j79J75O4k68J65K3q0pJ68k06P2J08l8j34J17k1n1K8oj7K6J60j26K5P9k31
$$ 59 -120 55 119 -149 16 39 -41 -48 120 -86 -14 94 56 -78 39 18 -33 -5 -11 -28 -2 158 32 57 136 -95
3910i5lR6N7p1N5J07k95M2J93q5j95K95k4j65J08Pk3k1O7k5j05J65j54j32L32
$$ -95 -98 -2 55 -16 39 146 -149 -107 86 1 -194 101 77 -88 20 27 4 -17 50 25 -80 85 -69 -201 131
3935A31p5j35J77M1k74j8L28k28l4K61o7k04R7J00k60N8K66k90L3K56j64o1J39
$$ 131 56 -79 98 139 -135 -153 175 -53 -87 174 107 -97 0 100 -160 -102 164 -126 -93 163 -1 -62 77
3958G7k7j07J72M6l64R6K34j73l6J39k04J7K30Rk62J47J49k68L1K92l01pK41p2
$$ 77 50 -57 115 161 -203 -107 127 -46 -82 57 -147 -130 100 109 -153 -6 143 -125 -94 198 -103 -110 131 59
3982E9k64K27J19j75o8L28k34j33K60j87q6K49K4l22K32J14j59p5L24j74j73K39
$$ 59 -205 22 141 -34 -102 226 -8 -141 119 -68 -154 95 119 -203 29 143 -16 -91 233 59 -114 125
4004A25n9j84J46O5j46O2J61l39J56K33k61q9L41j30j79K00N1l00N5K55k53m6
$$ 125 66 -118 28 93 -53 9 170 -169 -13 220 -41 -130 211 81 -98 102 153 -147 -92 163 -90 -136
4026a36K99j98n2J56jk09J53J07j44k7K64k66k1K42j13k84L59jl76K36J34l73
$$ -136 163 -35 -87 69 68 -141 12 119 -25 -52 212 -54 -75 167 54 -230 129 128 -248 -12 122 -251
4048b51J28L08j89j28K79j40k41L22q2j57J42J31j90l5K08j53j43K91P0k62R7
$$ -251 -123 185 -4 -132 147 7 -234 88 6 -151 -9 122 -68 -103 105 -48 -191 100 170 -92 5
4069EJ85l63J42K16l93QL26k13rJ63N4k30Q7R4q2j82M89l01j59L21j64p3J96J7
$$ 5 190 -173 -31 185 -208 -200 126 -87 -96 67 121 -109 -22 72 -10 -192 297 -4 -163 158 -6 -79 117 134
4093A34k61K27l2j69p0L75j34k11K38L7k16J30M9k53M8L17k73p0J48J0j63O9J46
$$ 134 -127 100 68 -101 -171 204 70 -141 97 134 -82 48 97 -156 -108 209 -64 -134 14 24 -139 -70 76
4116G6k67K01J64m35J76J97p3k03K82q4j60K45r5j51P5J88j59%K23j16k64K03
$$ 76 -191 10 174 -261 -85 112 39 -164 118 34 -126 119 24 -127 -52 136 -23 -23 200 84 -180 23
4138B3Nj27J82K8k36K4J52q0n1J95K2j42K14j56k13K42pj35M3J10Mj91O2J7o8
$$ 23 28 -99 83 111 -125 -101 51 -29 -80 115 137 -5 209 53 -160 82 75 -60 -17 93 97 -94 -32 -15 -83
4163h3J63O3k13J3O9n7k4J76j10j45K52qk30K19P8k29l2J85r5l8J79q4k00K11
$$ -83 80 143 -70 -57 12 -45 -69 107 -3 -148 104 96 -134 85 163 -66 -98 87 -8 -46 133 49 -151 60
4187F0mk43J67J70j95m5K17r7j90K31m0q9L1J63k52Q3P1rj88K01l3j77J72K0j12
$$ 60 56 -187 -20 150 -45 -90 127 30 -160 71 31 -58 -27 136 -116 -33 38 29 -159 42 9 -168 4 24 -88
4212h8M5K34j63K5L3o0j27J23L1j23L7J44j91M2J05j19KR3lRK5J25k95J49L6o9
$$ -88 -43 191 28 53 86 26 -101 22 53 -70 -33 111 -80 -38 67 -52 -50 43 40 49 74 199 -96 53 89 20
4238B0n3Q2k15J31J68k31%J92k6n6n7mo3Q4J2R3n2q4R8l7J29r2j69J63J04j46
$$ 20 -33 49 -166 -35 133 -98 -98 94 68 12 -45 -49 -112 -28 -16 77 25 -59 39 2 131 39 -130 33 137 -9
4264iN5q3M5m7j1J54j73OJ50j95R3m3J01KK1lk05J23P2l7Q7N3j41j81J96o4K8
$$ -9 46 -37 8 -39 -50 104 -69 -63 87 -108 -15 -58 43 45 66 63 -142 -19 53 16 103 156 15 -166 30 -34 -6
4291fk1j6Q8nJ3j03j5J2K1q0J31N8k16Q0R8j58J11j12J23l7l3L8J46l1j6q5J7
$$ -6 -27 -43 45 40 53 -50 -65 -53 -32 -112 19 77 -139 -59 39 -119 -8 -120 3 -34 -67 -29 117 86 70 -15 2
4318Bn7N7N8l1m2%j6R1p2MJ4p5R1j2n4l8N6P9r6J02j19M7j8ro8K10j10km0J05
$$ 2 -55 2 60 29 -13 -13 -29 62 -10 -6 8 -67 24 12 -42 -80 -24 55 -41 61 -58 -11 -29 -38 -106 104 -6 -8 -48 57
4348E7P3k23J85p9m5l6J39q5L5K4N1j62Q5q2r2K11k2o0m1J16mn0K6j8oN0o8O9
$$ 57 130 -93 92 13 -32 -68 71 -14 21 45 96 -66 19 -63 -155 56 34 -26 -67 49 45 -5 21 3 -3 47 -21 48
4376D8m9L4j15N0O4p9M4j15J97j07L5L7j0J9Q4k12J95m5j50NJ16j04L2K4O9j85
$$ 48 -1 33 -82 -32 32 -47 -3 -118 79 -28 7 44 34 53 137 -75 120 75 -75 -70 46 -58 -26 -2 67 -118
4402a18J15J44k36J15K7j46O6J57j02m6P0k1o4J01J79l15Q7J33j19j01K11j13
$$ -118 -3 141 -95 20 47 -99 -33 124 22 -24 46 25 -39 62 241 -74 13 146 27 -74 137 24
4424B4r8J87j26J2J4P2k6p6J9J04k66K52Lm2L8k1j17L0Q9k53P3J64j77N9J76k05
$$ 24 -74 113 -13 -1 13 85 59 -17 2 106 -160 92 95 53 91 70 -47 -17 72 -181 -108 56 -121 -62 114 -91
4450i1J8K1R7j62J2K38q3j10J00l7J0n9K41k97O7K15k76j6J97j20o8J50n2j52
$$ -91 -73 -52 45 -117 -105 133 50 -60 40 3 13 -46 195 -102 -35 180 -96 -112 85 -35 -103 47 -5 -157
4474a57K19M0l05K63P3k58O6N9k1jJ40kj03q9J35k33J73O5k22P2J49k07P3J64
$$ -157 62 102 -203 60 133 -125 -59 0 -21 -22 118 116 13 -76 59 -174 -1 64 -158 -86 63 -144 -71 93
4498I3Kk68J36J21j73P0J28k23J17P8P5k85J89J4j60J19K5j81R0J19p7p8J65K5
$$ 93 95 -173 -37 84 -89 -19 109 -114 3 81 156 -129 60 74 -86 33 58 -123 -33 86 9 -69 96 121
4522A21j78K07q8p5K1J82k47r1J48k9j22R2J06j92K10L3j01P1L2j9r6J39l9j43
$$ 121 -57 150 62 -13 8 190 -57 -148 0 -29 -151 -59 47 -145 65 98 -3 68 100 81 -15 124 85 -58
4546e8J37p0qN6N2j72oJ89j66JK7O6k14J96J63l25M2K28j71O7P3n6j84K97o7j78
$$ -58 79 9 1 57 109 -63 -69 120 -46 -45 -18 48 -166 30 193 -132 -90 138 -33 34 107 51 -133 164 97 -81
4572h1J26J02k42pK36k60Q9M3n4o1J25n7M7m5P5r8K1J72j12k13L21r9o1R9p4j71
$$ -81 45 147 -95 -102 134 -126 -37 6 -48 -109 16 -41 6 -39 36 -62 -41 131 19 -194 127 28 -33 66 -8 -179
4598a79J24J77k42Q7O0J4j20N6J58k26R6J26j80p8L17l02m4L23k03p7J59J10k36
$$ -179 -55 122 -120 -33 27 41 -79 -23 135 -91 5 131 -49 -127 190 -112 -156 167 -36 -113 46 156 -80
4621h0N5J18j21r1J97p1MK4N6j54L7R4j62M2R6j01J01L5j34jJ64k4k96J67K6p
$$ -80 -25 93 -28 -119 78 7 11 35 91 -63 -26 68 -94 -52 44 -57 44 79 -55 -56 108 84 -212 -45 -19 -26
4647b6KJ01m3j13J45m8k5N1l8L0p4Q9j48j5J09q8jJ28k7j11J40nj87R8J85j0j52
$$ -26 -24 77 34 -79 66 18 -7 44 6 36 -38 51 -97 -112 -3 -91 -92 36 9 -102 38 33 -154 -56 129 119 -33
4674c3R0n9j8J2N7j82J28Q0j25jJ34j38n7P7O2p8J27m0j74J96l7J1j30P1O2j26
$$ -33 57 -2 -20 -8 49 -133 -5 75 -50 -51 83 -55 -112 -35 27 -51 76 36 -138 58 21 32 -98 -27 35 -91
4700i1K02r8q8R6m1K3q4Q9j3%k1jn7J4J51j37J00J9j55J52J6l4q0K31k50n9J57
$$ -91 111 13 -75 21 -20 3 -81 8 -5 -5 -26 -27 -84 -70 81 -56 44 63 -92 60 76 42 -38 193 -57 -116 41
4727D1m2R5j06J6j01K28r2p5j2K8J04p0j17J51o9l0K28l6j48O3j15m7P6K4Q4j59
$$ 41 -1 94 -12 4 -97 131 39 -36 -48 -20 84 14 -103 48 -21 -51 177 141 -7 56 -59 -106 -30 -6 78 -81
4753h1J28k1n1kJ28q0K9k6j10J25p5K2J17j26j0l2R9k7l2O8j33O8J26j87J80o4
$$ -81 47 26 -25 -27 101 21 50 24 -86 39 -36 -14 103 -23 -33 -65 34 7 -25 43 -90 -22 104 -83 97 33
4779C3j41R4lOl1k8l1J19%j47J90k19K11K6j15J32nl3L9l5r1Q2n0J65k24QM4o4
$$ 33 -108 -14 -17 -11 -42 -70 -101 18 18 -129 61 -158 53 79 -36 96 91 58 97 62 -29 53 3 168 -56 -48 -4 -68
4807f8Q9P5o7j9%q1J06k1jo4L4l2MJN1Lp0R3J4j73J83m7r8n1K07L3j70J43o9m
$$ -68 21 96 29 10 10 -71 35 14 13 -51 -17 -49 -45 -44 7 10 -60 33 47 -126 57 10 -88 -139 68 101 -69 74 5 1
4837Aj13M2lM9k8J08q8m2Km2J74J7j1j98J52n2l1J35j30o0O5O6j42L2J07k4l0
$$ 1 -112 -70 -73 -24 -52 56 -32 -74 -72 -114 60 77 66 -132 20 -32 -63 72 -58 -118 -53 13 -129 -97 10 -14 -44
4864d4K0L7j41R4J8M4q7OJ64j40Q1n4pJ63k08J8J42k9m8Q8j57L3N4M3j36J4J4
$$ -44 -24 13 -128 -34 -16 28 -59 -53 111 -29 52 -2 -9 154 -54 -36 106 77 29 117 -40 -7 47 90 -46 -32 -18
4891a8J1l5J09J1p6l3P8q8R0mj66J36LJ5o8P8j5n0kQ3j59pJ00l4m3Q0j09J38M4
$$ -18 -7 -42 67 78 2 -31 47 -41 49 45 -121 15 18 33 -35 43 28 -22 -24 59 -100 -107 -7 -41 -84 -4 -113 25 69
4920F9OL7r7J5N1k06K37j49l5J68p6kL1k5j33M4J88j69o6J19j6j5J7k0q9J91L2
$$ 69 75 112 15 30 81 -125 112 -37 -72 96 20 18 49 24 -109 -65 123 -46 -112 7 -9 -24 -7 -27 -116 75 107
4947A07j25j33K52k30J52Q8j61q6K24l8l8l5J59j88l0J51j49K5J76j72K2qK5m9
$$ 107 -18 -151 101 -129 23 111 -50 -136 88 50 12 -23 136 -52 -82 69 -80 -55 121 -51 -29 -37 -12 -61
4971f1L7O3q9l2J78j87n8K93j09j08J41M9j08j7J27j63p7J31K3j47K11J7k39J42
$$ -61 -24 39 -50 -82 96 -91 -149 144 35 -73 68 117 9 -8 119 -44 -121 10 33 -114 97 114 -125 17
4995A7%q0Q8k4J4m1J93k67k3K91j19q8o0J91k08J37K1O0k58K28j1p6k7O1o8j9
$$ 17 17 -63 25 1 15 -26 167 -100 -123 168 49 -39 -99 92 -116 21 42 102 -156 72 61 -15 -42 19 -49 -68
5021f8K17j20L9Jl2j66L28j09j55K30p1j42j8J90j99M3J45j09oO4L7k62K38m5
$$ -68 149 29 68 69 37 -129 199 90 -65 165 94 -48 -66 124 -75 -32 113 4 -2 62 99 -163 75 30
5045C0j76R9K58k36P5jK1q9J99j31j50J17o7OJ4K24k57n1N3P0p6J71r4k79K43
$$ 30 -146 -47 211 -25 50 49 70 -19 180 49 -101 16 -51 -45 -31 193 -64 -115 -62 8 -68 103 9 -270 -27
5070b7Q6p8k6O3k0q3J44nj48N7J54k14R6J0n4l4J25o1m2Q3rn5K9Lp6j7J85j59
$$ -27 59 -19 -45 18 -2 -85 59 54 -94 -37 117 -97 -1 9 -45 -79 46 -15 -57 26 17 -38 -9 -6 -82 -99 86 -73
5098g3N3N0p0k5P8k5n5O1Q0n0j22Q2j8j0o1J69j99j0P0M2J7J09m6k4Lq3P3l5N8
$$ -73 -20 30 -40 -65 13 -12 -67 -6 74 24 -98 -16 -34 -44 -105 64 -135 -145 -75 -33 -16 93 47 23 26 -57 16 -19 39
5127C9j44N5O1k05J64L1j1KJ02Pj9j23R7j04J7J32r2oM0q4k3R1q3n9J03n0P3M3
$$ 39 -105 -50 11 -194 -30 1 -10 -8 94 101 82 -41 56 -48 -31 101 9 3 43 -41 -64 27 -56 -115 -12 -62 11 54
5155E4P0j22oj3L7n5J34j57O8P2Nl4rO6q4n3LK2L8m2l3M3L0j0j12lJ63m5o2K64
$$ 54 124 2 -4 -17 20 -35 99 -58 10 82 87 53 44 110 26 -27 -24 -2 36 -6 -39 4 34 24 -88 -91 72 27 -35 229
5185B29j49j07R2J25k26NM6k9O6L1M1k42J29r2L6K9j9L3q1J48j15p4J96j32J43
$$ 229 80 -27 65 190 -36 -31 15 -14 52 83 124 -118 11 -81 -45 -16 -35 -2 -83 65 -50 -124 72 -60 83
5210H3j30Lj00R2J18m3k6o8P4q6J06K4j85J89k0o1L7K8j10O7k1J1k7O3q7ql8J81
$$ 83 -47 -44 -144 -52 66 23 -3 -71 3 -83 23 47 -138 51 31 -30 7 35 -75 -8 -29 -18 -45 18 -69 -77 -115 66
5238F6j07l5J90k34L4J92j65k7N4J41j14%J31q6r4Q6k5j39J34P3r7O1M1j62O4
$$ 66 -41 -76 114 -120 -86 106 -59 -86 -32 109 -5 -5 126 40 -54 32 7 -132 2 75 -22 39 80 -82 -18
5263a8m3R0M7j43R1J0q5M4L6n0r5J21p7R6K8j02O9N5j9p5N7j78K08lj16R6p7q1
$$ -18 -61 29 76 -67 24 34 -51 -7 29 -21 -116 5 -72 24 52 -50 19 74 55 -20 37 -141 67 64 -52 44 -33 -114
5291a14P6O6K6l2Q1Om7m3k5j08J15O9n1m3J2K8j10J8J41m9N0j00M1MK2k4N4n0
$$ -114 -38 28 54 22 103 109 62 19 -6 -114 1 70 19 -24 -12 16 -94 -76 65 16 66 -34 7 11 33 9 63 13
5319A3Rlk8O6j29J32k5N6j7J7q0m8L8K5o6j8Q5J9j24N0J56j83LR1K4r5lJ5L9n9
$$ 13 22 19 -9 57 -72 60 35 91 74 91 11 -37 1 26 -40 -58 27 46 -78 -28 128 -55 -52 39 63 -32 -35 -20 19 -40
5349d0M1Qk7m1R5l4N4j42J48k6P7j00lR2j06M3k6L5j05J67q0r3J51j05k9J55r8
$$ -40 1 9 -18 -59 36 2 56 -86 62 36 113 13 10 102 -4 39 13 48 -57 110 30 -63 88 -17 -46 109 11
$$ [...]
8191a12
##END NTUPLES=NMR FID
##END=
