##TITLE=1H_BnNH2
 200.13MHz,CDCl3,
 8 sc
 
 26.11.2025
##JCAMPDX= 6.0         $$ Bruker NMR JCAMP-DX V2.0
##DATA TYPE= NMR FID
##DATA CLASS= NTUPLES
##ORIGIN= UXNMR, Bruker Analytische Messtechnik GmbH
##OWNER= pz
$$ XWIN-NMR		Version 3.5
$$ Wed Nov 26 13:39:55 2025 Russian Standard Time (UT+4h)  she@DPX200
##.OBSERVE FREQUENCY= 200.1313
##.OBSERVE NUCLEUS= ^1H
##.DELAY= (6, 6)
##.ACQUISITION MODE= SIMULTANEOUS
##.ACQUISITION SCHEME= undefined
##.AVERAGES= 8
##.DIGITISER RES= 18
##SPECTROMETER/DATA SYSTEM= spect
##.PULSE SEQUENCE= zg30
##.SOLVENT NAME= CDCl3
##.SHIFT REFERENCE= (INTERNAL, CDCl3, 0, 14.3821)
##AUDIT TRAIL= $$ (NUMBER, WHEN, WHO, WHERE, WHAT)
$$ ##TITLE= Audit trail, XWIN-NMR		Version 3.5
$$ ##JCAMPDX= 5.01
$$ ##ORIGIN= Bruker BioSpin GmbH
$$ ##OWNER= she
$$ F:/spectra/data/she/nmr/H-C/1/audita.txt
$$ ##AUDIT TRAIL=  $$ (NUMBER, WHEN, WHO, WHERE, WHAT)
(   1,<2025-11-26 13:38:41.95 +0400>,<she>,<DPX200>,
      <created by zg, POWCHK disabled, PULCHK disabled
       configuration hash MD5:
       00 E9 B6 7A A2 85 ED C7 34 08 36 98 17 FE 4E 26
       data hash MD5: 16K
       FA 80 45 DF 45 3D 80 9F E7 B5 8C E4 D7 41 38 E8>)
$$ ##END=
$$ 
$$ hash MD5
$$ A4 9E F4 DA 63 B5 DD FE DE 06 63 A4 6C 26 C1 38
##$RELAX= 
##$RELAX= 
##$RELAX= 
##$RELAX= 
##$RELAX= 
##$RELAX= 
$$ Bruker specific parameters
$$ --------------------------
##$DU= <F:/spectra>
##$EXPNO= 1
##$NAME= <H-C>
##$PROCNO= 1
##$TYPE= <nmr>
##$USER= <she>
##$AMP= (0..31)
100 100 100 100 100 100 100 100 100 100 100 100 100 100 100 100 100 100 
100 100 100 100 100 100 100 100 100 100 100 100 100 100 
##$AQSEQ= 0
##$AQ_mod= 1
##$AUNM= <au_zg>
##$AUTOPOS= <>
##$BF1= 200.13
##$BF2= 200.13
##$BF3= 200.13
##$BF4= 200.13
##$BF5= 200.13
##$BF6= 200.13
##$BF7= 200.13
##$BF8= 200.13
##$BYTORDA= 1
##$CFDGTYP= 0
##$CFRGTYP= 5
##$CHEMSTR= <none>
##$CNST= (0..31)
1 1 145 1 1 1 1 1 1 1 1 1 1 1 1 1 1 1 1 1 1 1 1 1 1 1 1 1 1 1 1 1 
##$CPDPRG= <>
##$CPDPRG1= <>
##$CPDPRG2= <>
##$CPDPRG3= <>
##$CPDPRG4= <mlev>
##$CPDPRG5= <mlev>
##$CPDPRG6= <mlev>
##$CPDPRG7= <mlev>
##$CPDPRG8= <mlev>
##$CPDPRGB= <>
##$CPDPRGT= <>
##$D= (0..31)
0 0.7 0 0 0 0 0 0 0 0 0 0.03 0 0 0 0 0 0 0 0 0 0 0 0 0 0 0 0 0 0 0 0 
##$DATE= 1764149921
##$DBL= (0..7)
120 120 120 120 120 120 120 120 
##$DBP= (0..7)
150 150 150 150 150 150 150 150 
##$DBP07= 0
##$DBPNAM0= <>
##$DBPNAM1= <>
##$DBPNAM2= <>
##$DBPNAM3= <>
##$DBPNAM4= <>
##$DBPNAM5= <>
##$DBPNAM6= <>
##$DBPNAM7= <>
##$DBPOAL= (0..7)
0.5 0.5 0.5 0.5 0.5 0.5 0.5 0.5 
##$DBPOFFS= (0..7)
0 0 0 0 0 0 0 0 
##$DE= 6
##$DECBNUC= <off>
##$DECIM= 32
##$DECNUC= <off>
##$DECSTAT= 4
##$DIGMOD= 1
##$DIGTYP= 9
##$DL= (0..7)
0 120 120 120 120 120 120 120 
##$DP= (0..7)
150 150 150 150 150 150 150 150 
##$DP07= 0
##$DPNAME0= <>
##$DPNAME1= <>
##$DPNAME2= <>
##$DPNAME3= <>
##$DPNAME4= <>
##$DPNAME5= <>
##$DPNAME6= <>
##$DPNAME7= <>
##$DPOAL= (0..7)
0.5 0.5 0.5 0.5 0.5 0.5 0.5 0.5 
##$DPOFFS= (0..7)
0 0 0 0 0 0 0 0 
##$DQDMODE= 0
##$DR= 18
##$DS= 0
##$DSLIST= <SSSSSSSSSSSSSSS>
$$ [...]
##$SUBNAM0= <"">
##$SUBNAM1= <"">
##$SUBNAM2= <"">
##$SUBNAM3= <"">
##$SUBNAM4= <"">
##$SUBNAM5= <"">
##$SUBNAM6= <"">
##$SUBNAM7= <"">
##$SUBNAM8= <"">
##$SUBNAM9= <"">
##$SW= 18.0517328524113
##$SWIBOX= (0..15)
0 0 2 0 0 0 0 0 0 0 0 0 0 0 0 0 
##$SW_h= 3612.71676300578
##$TD= 16384
##$TD0= 1
##$TE= 0
##$TE2= 300
##$TE3= 300
##$TEG= 300
##$TL= (0..7)
0 120 120 120 120 120 120 120 
##$TP= (0..7)
150 150 150 150 150 150 150 150 
##$TP07= 0
##$TPNAME0= <>
##$TPNAME1= <>
##$TPNAME2= <>
##$TPNAME3= <>
##$TPNAME4= <>
##$TPNAME5= <>
##$TPNAME6= <>
##$TPNAME7= <>
##$TPOAL= (0..7)
0.5 0.5 0.5 0.5 0.5 0.5 0.5 0.5 
##$TPOFFS= (0..7)
0 0 0 0 0 0 0 0 
##$TUNHIN= 0
##$TUNHOUT= 0
##$TUNXOUT= 0
##$USERA1= <user>
##$USERA2= <user>
##$USERA3= <user>
##$USERA4= <user>
##$USERA5= <user>
##$V9= 5
##$VALIST= <valist>
##$VCLIST= <CCCCCCCCCCCCCCC>
##$VD= 0
##$VDLIST= <DDDDDDDDDDDDDDD>
##$VPLIST= <PPPPPPPPPPPPPPP>
##$VTLIST= <TTTTTTTTTTTTTTT>
##$WBST= 1024
##$WBSW= 4
##$XGAIN= (0..3)
0 0 0 0 
##$XL= 0
##$YL= 0
##$YMAX_a= 191205
##$YMIN_a= -196702
##$ZGOPTNS= <>
##$ZL1= 120
##$ZL2= 120
##$ZL3= 120
##$ZL4= 120
##$ABSF1= 10
##$ABSF2= 0
##$ABSG= 5
##$ABSL= 3
##$ALPHA= 0
##$AQORDER= 0
##$ASSFAC= 0
##$ASSFACI= 0
##$ASSFACX= 0
##$ASSWID= 0
##$AUNMP= <proc_1d>
##$AZFE= 0.1
##$AZFW= 0.1
##$BCFW= 1
##$BC_mod= 2
##$BYTORDP= 1
##$COROFFS= 0
##$CY= -3
##$DATMOD= 1
##$DC= 2
##$DFILT= <>
##$DTYPP= 0
##$F1P= 0
##$F2P= 0
##$FCOR= 0.5
##$FTSIZE= 0
##$FT_mod= 4
##$GAMMA= 1
##$GB= 0.15
##$INTBC= 1
##$INTSCL= 1
##$ISEN= 128
##$LB= 0.25
##$LEV0= 0
##$LPBIN= 0
##$MAXI= 10000
##$MC2= 0
##$MEAN= 0
##$ME_mod= 0
##$MI= 1.114404
##$NCOEF= 0
##$NC_proc= 0
##$NLEV= 6
##$NOISF1= 3.799351
##$NOISF2= 2.8
##$NSP= 1
##$NTH_PI= 0
##$NZP= 0
##$OFFSET= 14.38212
##$PC= 1
##$PHC0= -3340.332
##$PHC1= 4.592339
##$PH_mod= 1
##$PKNL= yes
##$PPARMOD= 0
##$PSCAL= 0
##$PSIGN= 0
##$REVERSE= no
##$SF= 200.129724274929
##$SI= 16384
##$SIGF1= 3
##$SIGF2= 2
##$SINO= 400
##$SIOLD= 16384
##$SREGLST= <1H.CDCl3>
##$SSB= 0
##$STSI= 0
##$STSR= 0
##$SW_p= 3205.1282051282
##$SYMM= 0
##$S_DEV= 0
##$TDeff= 0
##$TDoff= 0
##$TI= <>
##$TILT= no
##$TM1= 0
##$TM2= 0
##$TOPLEV= 0
##$USERP1= <user>
##$USERP2= <user>
##$USERP3= <user>
##$USERP4= <user>
##$USERP5= <user>
##$WDW= 1
##$XDIM= 8192
##$YMAX_p= 0
##$YMIN_p= 0
$$ End of Bruker specific parameters
$$ ---------------------------------
##NTUPLES= NMR FID
##VAR_NAME=  TIME,          FID/REAL,        FID/IMAG
##SYMBOL=    X,             R,               I
##VAR_TYPE=  INDEPENDENT,   DEPENDENT,       DEPENDENT
##VAR_FORM=  AFFN,          ASDF,            ASDF
##VAR_DIM=   8192,          8192,            8192
##UNITS=     SECONDS,       ARBITRARY UNITS, ARBITRARY UNITS
##FACTOR=    0.0002768,     1,               1
##FIRST=     0,             0,               0
##LAST=      2.2672688,     0,               0
##MIN=       0,             -196702,         0
##MAX=       2.2672688,     191205,          0
$$ Real data points
##PAGE= N=1
##DATA TABLE= (X++(R..R)), XYDATA
$$ [...]
2300C102o93k138k377j013P12J412O36j40j211p78L91K267K304J570m76j777j985
2317a94l92Q04J591L47o71k251k099m02P50J716J123j89j309j371K63K155K185
2334B056J854J84j637j834o83O36J007O7j232j970k261m06J159K102J122J1j298
2351a123j041O37J825K662J646l69j714j646j235J55J201M2r14k046j849p7J061
2368b785J681J606m6j088j130N95J591K357J390j38j581j896n54J06R83o3j014
2385A4k567j595m18J053K221J955M17p89p73J50J076J696J067l80j489j654n31
2402e47N58J367%r92k328j737o14J042K350J484O10q17j227P5J143J742J271m64
2420B916j252j575p43M46J240M70j083j990j628o91J065K023J551j87p15j173
$$ plain form
2300 3102 2409 271 -2106 -3119 -2407 -995 -359 -499 -1710 -2488 -2097 170 2474 4044 3568 1791 -194
2317 -194 -586 218 1809 2156 1485 -766 -2865 -3267 -2517 -801 322 133 -1176 -2547 -2284 -129 2056
2334 2056 3910 4094 2457 623 -60 576 1583 1650 418 -1552 -3813 -4219 -3060 -958 164 175 -1123
2351 -1123 -2164 -1527 298 2960 4606 4237 2523 877 -358 -203 998 1040 126 -1920 -3769 -3846 -2785
2368 -2785 -1104 502 456 -632 -1762 -1167 424 2781 4171 4033 2452 556 2 108 1091 1028 14
2385 14 -2553 -4148 -4566 -3513 -1292 663 1080 291 -482 -332 744 2440 3507 3127 1638 -16 -547
2402 -547 11 1378 1378 386 -1942 -3679 -4293 -3251 -901 583 1193 376 -851 -776 367 2109 3380 2916
2420 2916 1664 89 -654 -208 1032 1502 419 -1571 -3199 -3890 -2825 -802 749 562 -153 -1326
2436a326P30R61K073J402p25j715j764o26P17J211R18r54j765j570p85P11J339
2453a168J190J98o49p66O94J238J780R74o91j815j575q26Q39R36Q19m77j651j672
2471b622k34O69J726J112J4o63j131L01J447J913L90n44j245j696q20N85R57N92
2489G51o15j249j434%R73J801J267j27p82j169j85J157J795P75m14j924j593j151
2507b124l1J068R32k80o33j102J17J438J876J240j53j412j279k20P19J363P12
2524B231p49j797j605j057N23J523P02j41m21o80K32J337J977J172k62r49j410
2541F26j081J65R80N44j000j663r97p71Q04J422R47L79o10r43L32J595J716J047
2559C492K11j630j302j191K0N30K49q16j373j082n40J015J514J100r0k67m86J37
$$ plain form
2436 -1326 -596 365 2438 3840 3115 1400 -364 -990 -273 938 1856 902 -863 -2433 -3218 -2507 -1168
2453 -1168 22 220 -429 -1195 -501 737 2517 3491 2800 985 -590 -1416 -577 359 1178 701 -950 -2622
2471 -2622 -2856 -2187 -461 651 665 2 -1129 -828 619 2532 2922 2378 1133 -563 -1383 -798 159 751
2489 751 136 -1113 -2547 -2547 -1574 227 1494 1367 585 -584 -769 388 2183 2958 2544 620 -973 -2124
2507 -2124 -2155 -1087 -155 -435 -1068 -2170 -2053 -615 1261 2501 2348 936 -343 -563 156 1519 2231
2524 2231 1482 -315 -1920 -2977 -2454 -931 -229 -370 -791 -1471 -1239 98 2075 3247 2985 2036 626
2541 626 -455 -290 690 1234 234 -1429 -2426 -3197 -2393 -971 -24 355 -255 -1198 -866 729 2445 3492
2559 3492 3703 2073 771 -420 -400 130 379 -437 -1810 -2892 -3432 -2417 -903 197 107 -160 -646 -509
2577e09J497J765O54J49j564j668p67p2N04J01k11j709j211j41Q41J531J241K76
2595G07o55o13K08L95J808J195k93r26j102o41J69N84Q9q19j570j548j78Q04J744
2614f42J125L07o16j081k79J129J425J095J40o46j068o29K51R21j17q41j605j015
2632b146q74R96J042M51L72o47j008K12Q54J946J212J96p02o94o80N22Q13K76
2650B141o75j576j864r14N14Q43P21l1n06n88R5J290J885R82J69r57q11k11M70
2669I77R49O68r68j356j796j363N54K89J213K07p70o60K97J215J392J396J69q48
2687A565p09n92Q16Q24J90m27j595j433r10K55P56J073m00o83m62K99R40J032
2705E39J455o1n91j037m89N41M94Q35k97j113j218k93p2R67P48o22n46j133K8
$$ plain form
2577 -509 988 2753 3407 3556 1992 324 -443 -515 -11 90 -121 -1830 -3041 -3182 -2341 -810 431 707
2595 707 52 -561 -353 42 1850 3045 2752 1826 724 83 252 836 925 106 -1464 -3012 -3190 -2386 -642
2614 -642 483 790 174 -907 -1186 -57 1368 2463 2603 1957 889 260 511 1432 1315 474 -1131 -2146
2632 -2146 -3020 -2024 -982 -531 -159 -806 -1814 -1602 -748 1198 2410 2606 1904 1210 530 1052 1865 2141
2650 2141 1466 -110 -1974 -2888 -2374 -1531 -810 -841 -1347 -1935 -1840 -550 1335 2317 2486 1529 718 507 977
2669 977 1926 2594 1626 270 -1526 -2889 -2335 -2046 -833 -626 -1396 -2056 -1759 -544 848 2244 2413 1565
2687 1565 856 264 1080 1904 2094 1667 72 -1361 -2271 -2016 -1260 -187 -587 -1270 -1732 -1433 -493 539
2705 539 1994 1933 1342 305 -184 357 851 1686 1389 276 -942 -1235 -1307 -340 408 -214 -760 -1893 -1865
2724a865J038J306J192J44q20j124p82L31R67R35K77j300j054r2k1Q50M91j20
2742C53r86o53l03O82Q89P35L0q80p07l46Q87J049P71O1q35r55o92J125K78Q30
2762A333l28j156j394k83L08J055O08L19l86o34j49L63J046P26k87q21p23k9L78
2781e4J070N40m16r76j152r94M56J079O27J06o18o24j46N75J228L90L0q68p54
2800e01j17J82J187M47j29p82r64n23M19J038N94M6r92p66k68K45J030N96J52
2819H94r58q34j70M33J003J009J62m61j015k23J0R00K37l29p91r52k90L51O39
2838c85R19l27o62r02j03P11R91J380j57j8j080r6M76O28P7l53j209j045n09m63
2858b127O36R93K40o05m55N2Q86J312P27L92n83o00j82L4N00k93j11j156j118
$$ plain form
2724 -1865 -827 479 1671 1815 995 -129 -911 -580 387 1322 1599 299 -755 -847 -868 -18 473 353
2742 353 -633 -1286 -1589 -907 -18 717 747 -133 -840 -1186 -299 750 1521 1582 747 -208 -900 225 503 1333
2762 1333 1005 -151 -1545 -1828 -1520 -465 143 462 76 -558 -707 -344 702 1428 1141 320 -403 -432 -54
2781 -54 1016 1556 1140 164 -988 -1982 -1526 -447 180 286 -332 -956 -1102 -527 701 1091 1121 253 -501
2800 -501 -618 -436 751 1198 1069 287 -677 -1200 -781 257 851 897 -95 -861 -1129 -884 146 742 894
2819 894 -64 -898 -1068 -635 368 1377 1539 1078 63 -160 -150 750 987 658 -133 -1085 -1375 -1024 -385
2838 -385 534 207 -455 -1357 -1460 -749 242 1622 1465 1447 367 271 747 1375 1452 1099 -110 -1155 -1664 -2127
2858 -2127 -1491 -498 -258 -863 -1318 -1266 -380 932 1659 2051 1468 868 686 720 1220 927 816 -340 -1458
2877a458p00K69N53R15j09k22n48M1O73J110J056J31l87n24k77K46P92R6k04j322
2897A31j379j052M14O78Q57L7k98n15O7L48J397P46K01o76o63m50K75R68L55k55
2917A186q91r30n02J28N51M42l3l94r81m18J010J017J030J56q67n28l13N94Q19
2936A076N05p1p27q50o65p0N58M33l60n49o13j78M14Q38N21j68l1p57p1O53Q91
2957G79Q22M07n66q01n43m7N82k70m83p66r50n30M35Q71R84K48k32o47M15M92
2977B00Q35P81K72p34r16m27j8O39K73k02j033j317n24J99J037O56J22l40l99
2996h96J37O36J013Q87p0N6o67q51L81n1N30r54o68r01m66J89O26J117m2j49n06
3017f49m73M32J188N89M99m97o17m52O92L68K09R4r85r98o55p7M93K86L4k90o29
$$ plain form
2877 -1458 -2158 -1889 -1336 -421 -530 -752 -1300 -1259 -586 524 1580 1711 1324 800 523 769 1561 1657 1453 131
2897 131 -1248 -2300 -1886 -1208 -351 -314 -612 -1127 -1060 -712 685 1431 1632 956 293 -157 118 1086 1441 1186
2917 1186 295 -635 -1137 -1009 -458 -16 -49 -443 -1424 -1842 -832 185 1215 1371 504 -24 -337 257 1076
2936 1076 1581 1510 783 -67 -732 -802 -244 189 -171 -720 -1333 -1511 -1097 -259 262 94 63 -694 -765 -112 779
2957 779 1601 2008 1442 641 98 51 633 363 -120 -886 -1836 -2366 -1931 -1060 -76 172 -60 -707 -292 200
2977 200 1035 1816 2088 1354 438 11 -7 632 905 703 -330 -1647 -2171 -1972 -935 -279 -157 -497 -896
2996 -896 -759 -123 890 1777 1707 1763 1096 245 626 575 1105 151 -517 -1418 -1884 -1695 -1069 48 6 -143 -649
3017 -649 -1122 -690 498 1087 1586 1089 472 20 712 1080 1289 1383 398 -600 -1255 -1332 -839 -553 -519 -809 -1438
3038a438M17K16J275O77N15o33n48p12N32O44O77j07r17q02n29k25K72O00kr49
3058a037m43l0K38P54Q74P40n09j50k56O35N60M27N7q33j005n15n28M29J72j69
3078e89j82p68J20J85J032P85L81l51m34k21K67O33K69L08o59q29n60K30K47L15
3098A79j84q32n33j96J38Q23J141J89L05j018j71L89N77K09K44q97j019O9l5M57
3118a65N89k9l05p56j65K55Q24L01r4j27m26p65J75O66N93J6n57n66J90J76M66
3139B96M74L91p28p28l54n3O61L39k08r2n07m97J39M89Q09k54l07n62n3L11J002
3160E68Q15K87n81r36l45j8K05M55j52p13r02J3J53K94J021j1q0k64l27O39O45
3181G66N14J59o06p45K0R4J54L43j70p38r42q4k05R13N01k5k15n15j92N19R85
$$ plain form
3038 -1438 -1021 -805 470 1147 1662 1029 481 -231 301 945 1622 1515 598 -204 -733 -958 -686 -86 -88 -1037
3058 -1037 -1480 -1510 -1272 -518 356 1096 587 437 181 816 1376 1803 1860 1027 22 -493 -1021 -592 -420 -589
3078 -589 -771 -1539 -1419 -1234 -202 583 964 613 179 -42 225 858 1127 1435 776 -53 -613 -383 -136 179
3098 179 -5 -837 -1370 -1566 -1428 -605 536 725 1030 12 -159 230 807 1016 1260 363 -656 -587 -622 -165
3118 -165 424 395 90 -666 -831 -576 248 549 455 328 -98 -863 -688 -22 571 587 30 -536 -346 -170 296
3139 296 770 1161 433 -295 -649 -702 -41 298 90 -2 -509 -1006 -867 -378 431 177 -130 -692 -745 -434 568
3160 568 1383 1670 1089 153 -192 -210 -5 450 298 -415 -1317 -1304 -1151 -857 164 153 73 -191 -518 121 766
3181 766 1280 1439 833 88 108 202 356 699 529 -209 -1151 -1235 -1440 -527 -26 -51 -266 -781 -973 -454 531
3202E31P07N84n53m34j53n1J01K00m55q41l75m73j85Q23J38J75m91l83q2L51J071
3223B05Q69J01kr8q19P64K31K91j97q69p55p48r1J14J87j60o39k18J01N17R95
3244b21R95O72p5J4l19K21M50K97n34n58j384p26l01PnQ0j50m47J01Q48O90J083
3266G38R59k58P6j83K84N38j12k05j009j289r05k70j60K45j19k30Q8L6Q60R16
3286@J008Q52k79j57J09o1L15l7m31l95j375r40l71l1N43p8k6l84J78O32J044
3307A16R54L96K04m95k35L11K12k00o5q43o38q03l73L28K21K57j61m73K7M20J058
3328B18Q29N25n40r5o20J26L99l6O1m47j119n17K72K14N00J32l71k69j29L1R17
3349H1M34N6J91k59j92m15M46P0K87j89q76l17K63K52L89m6J8o23l34K79K94P03
$$ plain form
3202 531 1238 1822 1269 835 682 631 732 932 477 -364 -739 -1212 -1397 -574 -436 -261 -752 -1135 -1217 -866 205
3223 205 1074 1175 1173 1075 256 1020 1251 1542 1345 476 -279 -1027 -1118 -1004 -817 -977 -1616 -1834 -1733 -1216 -221
3244 -221 774 1446 1371 1385 1066 1287 1737 2034 1500 942 -442 -1168 -1469 -1462 -1467 -1387 -1537 -1984 -1883 -1035 -345 738
3266 738 1697 1439 1515 1332 1616 2154 2042 1837 828 -461 -1366 -1636 -1796 -1551 -1670 -1900 -1812 -1776 -916 0
3286 0 1008 1860 1581 1424 1533 1472 1787 1750 1319 924 -451 -1391 -1762 -1793 -1250 -1328 -1354 -1738 -1560 -928 116
3307 116 1070 1466 1670 1175 940 1251 1463 1263 1198 355 -283 -1086 -1459 -1131 -910 -653 -814 -1287 -1260 -840 218
3328 218 1047 1572 1032 937 317 443 842 806 867 420 -699 -1216 -944 -730 -230 -98 -469 -738 -867 -836 81
3349 81 515 571 762 503 311 -104 342 412 699 510 -366 -683 -420 -168 221 175 193 -430 -764 -485 -191 512
3371E12R5j8m97m44K55M82J93k50j53k30n20J11M91L71m1j99l32n26J38N53M75
3392D66J80m75m51r1J4K81N24L7l00m75l53J0J66O85M98l73k60j41p8M96L96l07
3414D49k28k16m36k94N44M93o7o50k17M8l10P23N89j07J84l97K1K66L21K24j34
3435H06j04q93k70r4J79K10l50M2l62l50K74M05O90L03k1j29k31N88K92L48j9
3456A314q13p00q3n83J42O8j9r3n70r1N99Q10L05N00L6j06q4J68O19O3l45m96
3478F41n87p94j22o0J9K43m61j92k83L35R53P48Q9K89J73j06K62M7K61o2n59q11
3500B3p18j06j33o1L83l69p54N51J61N68Q57N20j79K6q6M19L89R9p0p53o77m16
3522c26m00j02J39n86J37m80J17L00P56M12P53l6j20q7L79L66K54N0m91o53p38
$$ plain form
3371 512 607 589 92 -352 -97 385 578 328 175 -55 -575 -464 27 398 357 158 -174 -700 -562 -9 466
3392 466 646 171 -280 -371 -357 -76 448 485 185 -290 -643 -633 -467 218 716 343 83 -58 -136 360 756 449
3414 449 221 5 -431 -725 -181 312 245 -405 -622 -574 -884 -161 428 321 505 108 129 395 716 940 806
3435 806 702 -191 -461 -555 -376 -166 -516 -474 -836 -1186 -912 -507 183 486 465 336 105 693 985 1333 1314
3456 1314 501 -199 -282 -865 -723 -655 -674 -767 -1337 -1428 -829 -19 286 786 822 716 632 800 1419 1482 1137 641
3478 641 54 -740 -862 -922 -903 -660 -1121 -1313 -1596 -1261 -308 440 529 818 991 885 1147 1194 1455 1393 834 23
3500 23 -695 -801 -934 -995 -612 -981 -1735 -1184 -1023 -455 402 922 743 769 683 1102 1491 1590 1520 767 90 -326
3522 -326 -726 -828 -689 -1275 -1138 -1618 -1501 -1201 -445 -33 720 684 564 477 856 1222 1476 1526 1035 382 -356
3543c56r2o3oj47k87m60k45L95Q68L93M38k11j9M04Q4K58N05j41o83l23j89o08
3565d85K69k42j01k17p21M0L82K10R83K30j10j95P5L75M94K21r2m54n58m35R5
3586b36L24l31j01l43l04l4L8O18N79Q3L1l09j99M48J58M12L5m69j56k23n9LN23
3609D88k78n15j66l31K73J9M15L23l69om5j09J84K90L06k26r0k20L69L6J39J69
3631F56l03m98p3j37J4J64J08k81k53k07N6K97L68M08l54J15Lk9L91L04M30n29
3653F50m43j66l80J09Q1L5l65m01O3J17J59M21K03N3k01N2P5K98N34K05l43n00
3675B56l82K04j99P9L5l16m84m12L07K54M26J98k81L88n6q9L64N13k6m7n07J25
3697C50m53L47j27Q2k96m67n4j15M73P0j21J63m01J27J44L08N09J42j70k85o6
$$ plain form
3543 -356 -448 -511 -517 -664 -951 -1411 -1656 -1261 -393 0 438 227 208 612 696 954 1459 1318 635 312 123 -485
3565 -485 -216 -458 -559 -776 -1497 -1457 -1075 -865 118 348 238 43 118 493 987 1208 1116 662 104 -331 -236
3586 -236 88 -243 -344 -687 -991 -1025 -987 -369 210 293 324 15 -184 264 422 834 869 400 244 21 -38 -35 488
3609 488 210 -305 -471 -802 -529 -510 -95 228 -141 -147 -192 -301 -117 173 479 253 163 -57 312 348 487 656
3631 656 353 -145 -218 -355 -341 -177 -69 -350 -603 -810 -754 -457 -89 319 -35 80 83 54 445 749 1179 650
3653 650 207 41 -339 -230 -149 -114 -479 -880 -817 -700 -541 -120 83 136 -65 -13 62 360 894 1099 756 256
3675 256 -126 78 -121 -42 -7 -323 -807 -1219 -912 -658 -232 -34 -315 73 17 -72 292 805 779 732 225 350
3697 350 -103 244 117 199 -97 -564 -618 -733 -260 -190 -311 -148 -549 -422 -278 30 539 681 511 226 160
3718A60L8K44J31l06m5j75m91j01J2L2J4j74J52k79M5L54L59O35j18l56K05R6
3740D32K39L75j32j53p20pm62q2J81l45J31l60m16J12R23K47L97k48M43n3M13
3761I15L8L02j03n46k28o13k87L71m78J02n34j49n6L63L02K91K23L32J21k0N31
3782H77J09J53j40j86l78o68Q3l4l12J84l14l78J29j63N28M01K16J81j29J80n3
3803B86M33K66J5l68k30m24L64j21n27K89q6l58k92J27l4L31L16k39L0nL3K57
3825F3N17J04k79J62j61n0K87j39K3l46n76j99r2J31j10J73j46k04j63M44N36
3846b5K29J84M7J91J45R9K82J18l46m06l53q53L50o01M42o33j0J4j48J51Q24N29
3868B30J09L65L03j64M00k9Nn67k31m25j44j48m29j76m23M9L48n06L43N55R4P66
$$ plain form
3718 160 198 442 573 267 222 47 -444 -545 -533 -501 -487 -661 -509 -788 -743 -389 -30 605 487 131 336 432
3740 432 671 1046 914 761 41 34 -428 -510 -329 -674 -543 -903 -1319 -1207 -284 -37 360 112 555 502 915
3761 915 953 1255 1152 606 378 -235 -522 -151 -629 -527 -1061 -1210 -1266 -903 -601 -310 -87 245 366 346 877
3782 877 986 1139 999 813 435 -233 -150 -184 -496 -312 -626 -1004 -875 -1038 -510 -109 107 288 159 339 286
3803 286 719 985 1000 632 402 -22 342 221 -306 -17 -103 -461 -753 -626 -660 -329 -13 -252 -222 -227 -194 63
3825 63 580 684 405 567 406 356 643 504 527 181 -395 -594 -686 -555 -665 -492 -638 -842 -1005 -561 -25
3846 -25 204 388 435 626 771 870 1152 1270 924 518 165 -688 -338 -939 -497 -1130 -1140 -1126 -1274 -1123 -299 230
3868 230 339 704 1007 843 1243 1214 1219 652 421 -4 -148 -296 -725 -901 -1324 -1275 -927 -1433 -1090 -535 -441 325
3890C25K09K26J15K38J62l79L01n03l59m68n85K09j18M7l93j92J37Q0R5P15M08
3911B70m4JM75j5N68n3k03O8n31o12j09R7k81l32M2l92j6m2L93J66K20L41j6J21
3935A16K47N32J13k45J14j77j87l99k34M0l01m7l82J39j77j90L27M89L0p7M65
3956A96m0L38K15J82j21qn3k86o8O7l72l03m92l17K33l5J11K77J33K20n3K78K74
3979C76L76L6Q0j89pj43j40j44m82j04k79j47j06K89K56j54P1l90O09K45J40J23
4001C16K27n3K28l38k24p6L18j51n86J76l58j14L97Q8o8K54j04r4PK81N0K67j73
4024B70j02L7j44L15j48j5j78K2L8ln5l9J14j55j16J70J36l77K10L07k76k65j61
4047d15L07K21l42N62j16J40j45J62J4J20j39l14J97k72j58K70l14n07Q3J75j03
$$ plain form
3890 325 534 760 875 1113 1275 896 1197 694 335 -133 -718 -509 -627 -580 -973 -1165 -1028 -948 -853 -138 270
3911 270 226 227 702 687 1255 1202 999 1067 536 -76 -185 -88 -369 -701 -659 -1051 -1067 -1109 -716 -550 -330 11 -5 116
3935 116 363 895 1008 763 877 700 513 114 -120 -80 -381 -428 -810 -671 -848 -1038 -711 -222 -192 -269 196
3956 196 156 494 709 891 770 762 709 423 355 422 50 -253 -745 -1062 -829 -864 -753 -476 -343 -123 -176 102 376
3979 376 752 788 868 679 672 529 389 245 -237 -341 -620 -767 -873 -584 -328 -482 -411 -801 -192 53 193 316
4001 316 543 490 718 380 156 80 398 247 -339 -163 -521 -635 -238 -150 -218 36 -68 -162 -155 126 176 443 270
4024 270 168 205 61 376 228 213 35 57 95 92 37 -2 112 -43 -159 11 147 -230 -20 287 11 -254 -415
4047 -415 -108 113 -229 333 217 357 212 374 388 508 369 55 252 -20 -178 92 -222 -729 -646 -471 -574
4068e74J48L27M07j33K41J47j81K47j43J58m5j97l11k63M7k54j32j27J09j80o2
4089g71J84J46N03K25J48R1K1O0k0L4O8l42l79j9Nj86k44j52o0J00M9q4M06q1
4113b98K5K96K09N59k61K38j48j01J98j74k92P6o41L05m59k0l39R8Q6L1J96K40
4135a76J49J93R6L5M49J36l13J73k88o6l43P1k08k58k60j16j23o4N21j42j6N00
4157e0l3Q7Q5K72J18K93l1J16m19R8n15k3l20l32K7l89L38k2r1J49N29O7K00P5
4181B29K01J79K74j90r1o1j54j66j20k45j45k18n3K14l21O7O6L76n7J45O08p6
4203D62J2K54j66K7m6j42j17k88q8k5l31N27l31m75K35J62j59K05P2K44j32J22
4225B2l1K43L98q0k91J47k46o6K8p4q9k8j52k2j79j09K52j02J87J84j5R4J32M7
$$ plain form
4068 -574 -426 -99 308 175 416 563 382 629 486 644 599 402 91 -172 -125 -379 -511 -638 -529 -709 -771
4089 -771 -587 -441 62 287 435 526 547 607 587 621 689 347 -32 -51 -46 -232 -476 -628 -688 -588 -539 -623 -217 -298
4113 -298 -273 23 232 791 530 768 620 519 717 543 251 327 -314 -9 -468 -488 -827 -729 -643 -612 -416 -176
4135 -176 -27 166 262 297 746 882 569 742 454 388 45 116 -92 -350 -610 -726 -849 -913 -392 -534 -550 -50
4157 -50 -83 4 89 361 479 772 741 857 438 536 21 -2 -322 -654 -627 -1016 -678 -700 -791 -642 -113 -46 154 229
4181 229 430 609 883 693 602 541 387 221 101 -144 -289 -507 -560 -346 -667 -600 -534 -158 -215 -70 538 462
4203 462 474 728 562 589 543 401 284 -4 -92 -117 -448 79 -252 -727 -492 -330 -489 -284 -212 32 -100 22
4225 22 -9 234 632 552 261 408 162 96 124 50 -39 -67 -219 -241 -420 -529 -277 -379 -192 -8 -23 71 203 250
4249B50j44M21J98j96J53o46%J20l37J85m34k46J94j26L30k05J38k80K73N19m6
4270A21J51J82K76O4k86Mj75j97J31k92k78j73j59K29j77J87L3N3K58O7K01L00
4292E20k5q0J1Lk9r7J09l22J74m22j04p8K13l97K31N7M7j34K19M5K30K51j08r4
4316B20m3N8N7L3l33Rj40J61k86K74K35l52j15m5LJ07L08j89O1l41K49p7J15J62
4340A31k66M31J24k27j11K76k23J30K24l22l44J21J45k28k62M6p5j89oK46K48
4361a31R7R1J92K14l7r4L05j57P0n93O6l32N5K4r7k59k16M04o1j1N48m15M35J72
4385B70k06K75L54j92M07l82j69Q1m00j03j28k6j61k0q3l81L65L20o0J03p7J96
4407a7M55J34j49L82j18k96j16o2j41j7k37q2m34Q3k5j05L63J11o1k5K51M0N34
$$ plain form
4249 250 106 527 725 529 682 36 36 156 -181 4 -430 -676 -482 -608 -278 -483 -345 -625 -352 167 121
4270 121 272 454 730 794 508 512 337 140 271 -21 -299 -472 -631 -402 -579 -392 -359 -306 -48 19 220 520
4292 520 495 415 426 429 400 303 412 90 264 -158 -262 -340 -127 -524 -293 -236 -189 -323 -104 -59 171 422 314 220
4316 220 177 235 292 325 -8 1 -139 22 -264 10 245 -107 -222 -267 -264 -157 151 -38 23 -318 -69 -146 -31 131
4340 131 -135 296 420 193 82 358 135 265 489 167 -177 -56 89 -139 -401 -355 -430 -619 -625 -379 -131
4361 -131 -34 57 249 463 426 332 637 480 550 -43 23 -309 -254 -230 -327 -586 -802 -398 -459 -470 78 -337 98 270
4385 270 64 339 693 501 908 526 357 438 38 -65 -193 -219 -380 -400 -483 -864 -499 -179 -239 -136 -213 -17
4407 -17 438 572 423 805 687 391 275 213 72 55 -182 -264 -698 -615 -640 -745 -382 -271 -332 -357 -106 -66 468
4430D68l05O19k22L1j91J89j84j08n5q8n67k38K8j04J1J0J32N6K14J70L90l3N81
4453H04l00J7K63j16N8l91N6l47k93l87om8r9J32q1L37l43M77L80L12J25M69m07
4476F12L76k30Q8k10l40j73l75m9k82K9l26K63j8l0oN24K04L04L34J20l72J15
4498E58M38n91OK56l63n60k25m90N01k56J55Q7k71J15J48K43K53K88R1R9j53J62
4520D91K59Kj51j85k54l59k28mj23L04l94p6kK92N0M55j1L85l92K32L56J11m4
4543G14r9j79k7l81j03j62j96M20m27n16J49K02P2K47J06KL06j87N89Q6j23K45
4565G38p6k9n61k77K59l59L05k85k59k86L69mJ07J17K06N2L18n7j00L73K05l02
4587D54N9po54L89j58j84j56k26j16N3K90l8M57k82k63M04l69O04R3J33j46o7
$$ plain form
4430 468 163 782 560 591 400 589 405 297 242 154 -413 -651 -623 -727 -716 -706 -574 -518 -304 -134 256 223 804
4453 804 504 521 784 668 726 335 391 44 -249 -636 -642 -690 -789 -657 -738 -401 -744 -267 113 425 550 1019 612
4476 612 988 758 846 636 296 123 -252 -301 -583 -554 -880 -617 -635 -665 -671 -147 57 361 695 815 443 558
4498 558 996 405 411 667 304 -256 -481 -971 -470 -726 -571 -484 -755 -640 -492 -249 4 292 383 482 329 491
4520 491 750 752 601 416 162 -197 -425 -429 -552 -248 -642 -718 -720 -428 -378 77 66 451 59 291 647 758 714
4543 714 615 436 409 28 -75 -237 -433 -13 -440 -956 -807 -605 -533 -286 -180 -178 128 -59 530 616 493 738
4565 738 662 633 72 -205 54 -305 0 -285 -544 -830 -461 -465 -358 -241 -35 17 335 278 178 551 756 454
4587 454 513 506 -148 241 83 -101 -257 -483 -599 -546 -256 -294 163 -119 -382 22 -347 257 350 483 337 270
4609B70k92P3K25o3Jk94j84p5L2L98L5j04l21n4K33k92L33l9N81m21Rk22J49J62
4633A40O4K31Lk24o9q3m6m9K36m48o3K3k84L83K71k86L3k01MK88L46l2J88j30
4657B95j15J74lM1M6n8m06k90j64J3K5L9N6l26K63l19O06M12K2K01l4M4J5KJ53
4682F92l9m07r5l00l98Q0N7K2k01K90j94K31R9L10M37J26j15l50K11M8p0q7K20
4705E67l65k20m89rJ10J80j3l48k17K78J59O6M28p4N15j32q0K47Jo5n3r2k43o03
4729d52J49K9L8j4No27R3K33K03R7L64R4k45R1N50K76O0k65m9j93l51l8j56j64
4753b72R3l42k62j54K43K23J61L84O0P2J31j06M63kL79l53l41j20j39n4j64q7
4775a87k67m26k96J81J92O15j32K5O5P4O85J31J52K32p1l80o31M32l29L54n65
$$ plain form
4609 270 -22 51 276 213 214 -80 -264 -339 -307 91 126 22 -299 -353 -120 -412 -79 -118 463 42 51 -171 -22 140
4633 140 204 435 438 214 145 62 16 -33 203 -245 -308 -285 -569 -186 85 -201 -168 -369 -365 -77 269 237 425 295
4657 295 180 354 351 392 438 380 -26 -316 -480 -467 -442 -403 -347 -673 -410 -729 -123 289 311 512 478 522 537 539 692
4682 692 653 246 151 -149 -547 -467 -410 -388 -589 -299 -493 -262 -163 147 584 710 595 245 456 504 434 347 567
4705 567 202 -18 -507 -516 -406 -226 -239 -587 -804 -526 -367 -301 127 53 568 436 356 603 604 539 486 394 151 -452
4729 -452 -303 -274 -236 -250 -245 -872 -779 -546 -343 -246 118 212 -33 58 608 884 944 679 630 437 86 48 -108 -272
4753 -272 -179 -521 -783 -937 -694 -471 -310 74 134 206 337 231 694 692 1071 718 377 257 118 64 -100 -187
4775 -187 -454 -880 -1176 -995 -803 -188 -320 -295 -230 -156 529 660 812 1044 973 593 -38 394 65 419 -146
4796a46m25q8l35L98j98K63J71M45k17l5K69K79L94j59L72l49m59o9L51l36k14
4817h8k63k05J63n48N63j07R4O4k60L79J15L88J33L56j99k02K89m97K34m1nl29
4839C4l89m02P7M31j1J88k31j44J99J22P6K59K86j21mn1J07o2J51l2l19n86j26
4862e48m2M4K75r3R5k97OJ62L17J98K25lj56j5n4K62M18l96m00k0j91l19R4M08
4886c0jL3m12j93L30K56K38M1J90l60J59j85Q0L97N1l63j92j53m27M41J36Q1j3
4909A04l52j23P0o7N81R4j64k78r7LN44K6J30k88mq4m82Q59R6k7l66l15j61J05
4933a96L80l8j21k65k14r7K76M44J47J0l05j56J39L55L39K69l55o3n14m46J81
4954b30L27k25j47j22k94j67L55K61L31J39L0r4K07J89J4K07o7l57l80j57L2K92
$$ plain form
4796 -146 -571 -659 -994 -596 -794 -531 -360 85 -132 -167 102 381 775 616 988 639 180 111 462 126 -88
4817 -88 -351 -556 -393 -941 -378 -485 -391 -327 -587 -208 -93 295 428 784 585 383 672 175 409 368 363 34
4839 34 -355 -757 -680 -249 -260 -72 -303 -447 -248 -126 -50 209 495 374 370 319 426 364 515 483 164 -422 -548
4862 -548 -590 -546 -271 -364 -269 -566 -560 -398 -81 117 342 339 183 168 114 376 794 398 -2 -22 -213 -532 -438 -30
4886 -30 -31 2 -410 -603 -273 -17 221 262 452 92 251 66 146 543 594 231 39 -114 -541 -100 36 117 104
4909 104 -248 -371 -301 -368 213 307 143 -135 -232 -229 315 341 471 183 179 95 -387 472 568 541 175 -140 -301 -196
4933 -196 184 146 25 -240 -454 -551 -275 169 316 326 21 -135 4 359 698 967 612 549 35 -411 -230
4954 -230 97 -128 -275 -397 -691 -858 -503 -242 89 228 258 164 371 560 574 781 714 357 -23 -180 -148 144
4976A44r2j57l21l30o4NM76J67L8K45k19J99J0N62K87m17J74n16m37J91j00k0
4998a75j72No02K06J6N22j20N09k47mm9L84L53K59r5p1n23l49K64Lj20M0q0p79
5022h25j25p3Q18j8M2q7M6J18N5M16K30K47m61MJ07k86K31r0l06n4n46l13K34
5045f36J05p5N06m09J1r3N26K48L55L17l42j09k41K14l9M86j30n47n07l32j4M49
5067b57k56K39k56pj3K44M78J36L02m1Qk75K32P2M6k07k4m50k94j93m3k5K69n40
5091h55J30j19K65N48L09K93n4j91K73j09K01q5k26R1p11M9l16N1J43J48j21l80
5113f66r3Q2M66N52J00m4k73J9K33L24k3rj05n10l32J4K30J86k00k80k27n6L1
5136e81L39N61k28L05j96j78L21Q5Q9O8j80o3m46M53Mj51j22k29k89M4k19K85
$$ plain form
4976 144 52 -105 -426 -756 -820 -815 -339 -172 -134 111 -108 91 101 663 950 533 707 191 -246 -55 -155 -175
4998 -175 -347 -342 -944 -738 -722 -200 -320 189 -58 -62 -111 273 626 885 790 719 196 -153 111 114 -6 34 -46 -825
5022 -825 -950 -1023 -205 -223 -181 -268 -222 -104 -49 367 597 844 383 387 494 208 439 349 43 -11 -557 -870 -636
5045 -636 -531 -606 -100 -509 -498 -591 -65 183 538 855 513 404 163 377 338 824 694 147 -360 -692 -706 -257
5067 -257 -513 -274 -530 -537 -550 -306 172 308 610 569 577 302 534 606 652 445 421 -29 -323 -516 -559 -584 -315 -855
5091 -855 -725 -844 -579 -31 278 571 517 326 599 490 691 606 380 471 -240 -191 -507 -456 -313 -165 -286 -666
5113 -666 -759 -677 -211 341 441 397 124 143 376 700 677 668 563 53 -279 -265 -35 151 -49 -329 -556 -612 -581
5136 -581 -242 319 91 396 200 22 343 428 517 585 405 342 -104 349 353 202 80 -149 -438 -394 -613 -328
5158c28J83L7J22P7n1r3M57q2J65n3j51l77J95K23oL00j119K0j59J19K70K57n6
5181e0k21J05j92N23N8k8K59q0j17n60L80L4K39j58k15J26k91j71L93J13o8n2
5203B7j99Q3o3J81K30K6r6l84K29p2K68j8N8k97k46J74O7J84Q7j29L7k33j37J77
5227d6r7L59j49jj9k27k88M74K16L01m51n9j82M00J47J78J7m11l37j65j23M63
5249@J08k58k99k13J04K43L70J96J69j68p3pO6M16l72M00o58j89Jk58K23n4K1
5272b32n23K22k43M76M1M60j78K29j30J59M8K78N4n9%m84j04k77J46j3j83l68
5294f81j3K38k56M41K83M46ql22J7N11K34pk56k37j14n53K53L4j15j91l39j60
5316g95j16J7N10K48m8L52n0qM05J89M42l58m16Qk23N3j06K4m37l26k43j36K73
$$ plain form
5158 -328 -145 -108 14 91 40 -53 404 322 487 434 283 -94 101 324 318 618 -501 -481 -640 -521 -251 6 -50
5181 -50 -271 -166 -358 165 223 195 454 374 257 -303 77 111 350 192 -23 103 -188 -359 34 147 79 27
5203 27 -172 -89 -152 29 259 285 189 -195 34 -38 230 212 270 -27 -273 -99 -32 152 239 110 147 -86 -223 -46
5227 -46 -143 216 67 66 47 -180 -468 6 222 523 72 13 -169 231 378 556 573 162 -175 -340 -463 0
5249 0 108 -150 -449 -662 -558 -315 55 251 420 252 179 172 238 654 282 682 24 -165 -164 -422 -199 -253 -232
5272 -232 -755 -533 -776 -300 -259 201 23 252 122 281 329 607 661 602 602 118 14 -263 -117 -130 -313 -681
5294 -681 -694 -456 -712 -271 12 458 450 128 145 656 890 883 627 390 276 -277 -24 10 -105 -296 -635 -795
5316 -795 -911 -894 -384 -136 -184 168 118 110 515 704 1146 788 372 380 157 210 104 128 -309 -635 -878 -1014 -741
5339g41L37j1K97J81jJ58M8M88L91k27j00k11m23K8j17j41r6n77l85j53J01L97
5361g57K23N41j38l02M36M59K12M07r2k70k14N8n24Q4n9k55m09l90l68P2P37L50
5383a99j11K14J75k06N40J88M38o1j41k10j61m33K90m10o3l64l58k99L60M44l30
5404f97J07N94j70J43M84m7M12K48n85l64O5K28k92N4j82l54m66j69L40M09M3
5425a99L06q8k98L60L41J04K30q2j59o07K49k3QJ82j69k75l13k34M70K7j02L56
5447H4k56k55N48M0p7L44j80O2k59j63k7J98K82q2l60k41QM96k82K29k39K37k20
5470a13j87O6M64M76k18m32j07l64L78L81L77m03l92j72J14J04j74M01Q6k77j26
5491a18p4O3j11K69P1j10k08Q4J06K43J56Ln51J65j81M22L02j55j33j63l19k03
$$ plain form
5339 -741 -404 -415 -118 63 62 220 268 756 1147 920 820 609 186 214 97 -44 -140 -717 -1102 -1255 -1154 -757
5361 -757 -534 7 -131 -433 3 462 674 1081 989 719 505 563 39 123 64 -191 -600 -990 -1358 -1286 -549 -199
5383 -199 -310 -96 79 -127 413 601 1039 978 837 627 466 33 323 -87 -150 -514 -872 -1171 -811 -367 -697
5404 -697 -590 4 -166 -23 461 414 826 1074 489 125 190 418 126 180 -2 -356 -822 -991 -651 -242 -199
5425 -199 107 19 -279 81 422 526 756 674 515 -92 157 134 142 324 155 -120 -433 -667 -197 -170 -272 84
5447 84 -172 -427 121 161 84 428 248 310 51 -112 -139 59 341 259 -101 -342 -334 162 -120 109 -130 107 -113
5470 -113 -300 -234 230 706 488 56 -51 -415 -37 344 721 318 -74 -246 -132 -28 -202 199 285 8 -118
5491 -118 -192 -129 -240 29 100 -10 -218 -134 -28 215 371 374 -177 -12 -193 229 531 376 243 80 -239 -442
5513d42L57J52Q1k96J31k39k52J67J10M18j19k69k9J59K74P8L54P1n11l46R3K14
5535A56r7j53j23l34K5r9j10M46J43K74j85k02M35N52j03K38p7n02k11m8K81m0
5557B66j66k32k36l92J53r8K28K19K26k3J07m5K48k5O89p8k99n1k87l34K58o4
5579F4m02m10n40L94J47M20K62K74l76L4kN23L37K61j14m85L3q2l02J13P5m61
5601b37l56j75j42K14L01K42M1k81L72k03N34L82L06Q5p68j51p6L23k62j8k03
5622g2o48%J79j65K82m1K75j65K90J80j20O17L2j09Ql56k0o6K99k80r5m9n54l6
5646f14K16L84j67j07n2k50L20K10J12N17j6k37j03N3J58o0P3Pm88q1o44J93M16
5669a60J53k61j08j92Q2L39M84J52Ml73j13K93j26J57J86k98j31l91K6N1J91M6
$$ plain form
5513 -442 -85 67 148 -148 -17 -256 -508 -341 -231 187 68 -201 -230 -71 203 281 635 706 195 -151 -58 156
5535 156 59 -94 -217 -551 -526 -625 -735 -289 -146 128 -57 -259 176 728 625 863 786 284 73 25 306 266
5557 266 100 -132 -368 -760 -607 -705 -477 -258 -32 -55 52 7 255 230 919 841 542 491 204 -130 128 64
5579 64 -338 -748 -1288 -894 -747 -327 -65 209 -167 -133 -135 388 725 986 872 387 420 338 36 149 224 -237
5601 -237 -593 -768 -910 -696 -395 -153 -112 -393 -21 -224 310 692 998 1083 315 164 88 411 149 131 -72
5622 -72 -720 -720 -541 -706 -424 -465 -190 -355 -65 115 -5 612 644 535 543 187 167 101 400 120 25 -24 -578 -614
5646 -614 -398 -14 -181 -288 -340 -590 -270 -60 52 569 553 316 213 266 424 364 437 444 -44 -125 -769 -576 -160
5669 -160 -7 -268 -376 -568 -486 -147 337 489 493 120 7 300 174 331 517 219 88 -303 -277 -226 -35 11
5691A1m28L47k87j07K21M23J3J38l48m0j4L6L26J28l9n86J77j46k69M56j55J27
5713a6j66j6m62M63K97M0J28j29m92R4K92K31J05Nk55j37k11N87l7l2j20m43Q5
5736a89l04K18J99K22j77j83j23KK72K89r1J13k39m8J54J81J56r1M5l49l86k96
5758f25L64K40J42l80l8n3j10K49M59J81l94%l44L25N05m1k16J4m43o8J96J26
5780H9j47J12p8m72L37m03K75J23K98J17j44q7J42L88O9j56l2m66M4k10nM81l06
5803c1q2M7k62p9R6L25j65J53r6o6L28n4K68K8J82n40k67J32J04K14l6k47j03
5826a51j04l14M49j00N84o22q6j28J52L76K72k4N8K0o79P39k09P6L2m11J44m52
5848c78k44L60L11k04R9m92O7J48K74M16J73m3k03j28LJ76oK6j62l39p5j27j03
$$ plain form
5691 11 -417 -70 -357 -464 -243 180 193 331 -17 -57 -71 -35 291 419 380 -206 -29 -175 -444 12 -143 -16
5713 -16 -182 -198 -660 -197 100 140 268 139 -353 -259 33 264 369 374 119 -18 -229 358 321 289 169 -274 -189
5736 -189 -493 -275 -76 146 -31 -214 -337 -335 -63 226 135 248 9 -39 115 296 452 361 406 57 -329 -625
5758 -625 -261 -21 121 -259 -297 -350 -460 -211 248 429 35 35 -309 16 521 480 264 278 -165 -233 -37 89
5780 89 -58 54 -24 -496 -159 -562 -287 -164 134 251 107 20 162 550 619 463 431 -35 9 -201 -206 275 -31
5803 -31 -113 -66 -328 -407 -311 14 -151 2 -94 -160 168 114 382 410 592 52 -215 -83 21 235 199 -48 -151
5826 -151 -255 -569 -120 -220 364 -258 -344 -472 -320 56 328 304 362 382 -297 442 233 309 341 -70 74 -378
5848 -378 -622 -262 49 -155 -56 -548 -481 -333 -59 357 530 487 284 156 159 335 329 355 193 -146 -221 -348 -451
5871d51M47l48J64j12k86K10K20L30J31k89l1K1J17L07O5j87r3J29p78K84j69
5892c19K92j26j47j72j63nN37J2M4K97l07L01p0J19M88k42l09o1n02j15K35P1
5914a42O2k27K0n33L76J44J76J98m5j9j68J86N57N4j12n9j00j65l5p5J09k34j88
5937b20j87k94L8J92L22L22m0l22Q9L07K46P1M64l73j90k99r4NJ41k04j00n73
5959f99k6j7L63O7Q7K67q1O7J2K49N27j31j17l57k10L37j24Op9l21k70l75L66
5982d59R0r1K13K8L49j64j28M11J66K27k76K1j14k02J72p4J68o76O0k83K44M6
6004b72l7P8l1J92j82qO33p6J15J22m86o2J08O9J94m2l01k55j51j70K15N6L52
6027F1k74j38j21L70j40O96R8k79l57L22k05J49L16l38p4l91K10j87j5M38j82
$$ plain form
5871 -451 -4 -352 -188 -300 -586 -376 -156 174 305 16 -15 6 123 430 495 308 215 344 -434 -150 -319
5892 -319 -27 -153 -300 -472 -635 -640 -103 -91 -47 250 -57 244 174 293 781 539 230 169 -333 -448 -213 -142
5914 -142 -80 -307 -287 -820 -444 -300 -124 74 29 10 -158 28 585 639 527 468 368 203 168 93 202 -32 -220
5937 -220 -407 -701 -663 -471 -149 173 133 -189 -100 207 453 524 988 615 425 126 32 37 178 -26 -126 -699
5959 -699 -725 -742 -379 -312 -225 42 -39 28 40 289 816 685 568 211 1 338 214 220 141 -180 -450 -825 -459
5982 -459 -369 -460 -247 -219 130 -34 -162 249 415 642 366 387 273 71 243 169 337 -339 -279 -562 -318 -272
6004 -272 -309 -231 -262 -70 -252 -260 373 297 412 534 48 -14 94 163 357 315 14 -241 -392 -562 -347 -291 61
6027 61 -213 -351 -472 -102 -242 454 552 273 -84 238 33 182 498 160 86 -305 -95 -282 -297 141 -41
6048d1k8n9O3j25L28m6J99q0k56j22j0L68L26k85kk22j96J97j79K63PJ76k96r3
6072a13j33J61L31K0j17n4j26mK6J55Q3n1l54P6L14k66J87lj90J95l02r6L12J26
6096A77l75L96l23j24L1J36K07j07j33J37j01JJ67j4R5j04j77k0J40K5L55m3k08
6119A38m05K05k30K95r8R8j39q9p6M35R0k0m8j68J34j01j00L03RN5k26k18k60
6142d16j40K75J30N2j12J05k71M06N5L97K97l41j65JJ26j86J49l44j37l35JM08
6164d5l07J6K46mn96M53L6K42M93n7N4l61K40k15R3J31j18n28k31l89K38J87K46
6187a76J24k14j11K45Q5L73M47J25l90k82K8K84k32O9K2m07n9l50K22j75J2m8
6209d08K5l2R4J97M70m0K86j41j08j22J03L68J66p65Q6n28j03L52k24P4k2j59
$$ plain form
6048 -41 -69 -128 -65 -190 138 92 291 211 -45 -167 -177 191 517 232 230 8 -188 9 -170 93 100 276 -20 -113
6072 -113 -246 -85 246 266 149 95 -31 -35 -9 146 229 178 -176 -100 214 -52 135 132 -58 137 -165 -261 51 177
6096 177 -198 198 -125 -249 -218 -82 125 18 -115 22 -79 -78 89 75 170 66 -111 -131 9 34 389 346 138
6119 138 -267 -62 -292 3 -95 3 -136 -225 -301 134 224 204 156 -12 122 21 -79 224 233 288 62 -156 -416
6142 -416 -556 -281 -151 -99 -211 -106 -377 29 84 481 778 437 272 273 399 213 362 18 -119 -454 -453 -45
6164 -45 -352 -336 -90 -94 -690 -237 -201 41 534 477 531 170 410 195 288 419 301 -227 -458 -847 -609 -422 -176
6187 -176 -52 -266 -377 -132 -47 326 773 898 508 226 254 538 306 375 397 -10 -69 -419 -197 -372 -360 -408
6209 -408 -383 -415 -321 -124 346 306 592 451 343 221 324 692 858 93 179 -349 -452 -100 -324 -250 -272 -431
6231d31Q5J61n0K58P3J19Q5N1K19k89K48j12K80m66j21j97l93J3L12j71k24N6
6253d94J6O4L67j7M63k24j4M2K99M6p5K74n52k76j66kO5J51j28k38j15K42K9J14
6277a29J97K09k37M4J79K25k12M03k87k19j11k16J56j09o0j37J40k13j20P1O8
6298c58M82m2j49O22m20J5K12J06q3n5m72J08j40J90O9j22j20j99j19K69L6p3
6320b43K57K36k59n4M13j89K23k11pj57k41J36J74o9j02%n5k88J94L41j33J65
6342A31m34J44j33R5K53J70l16J66q6j55K38J44J0k99r1K12J47l57J55K92n12
6363b26p6l9L6J13L9J19J60M7l70L11j81j54M64K0j80k47j10J31M54N2l48j89
6385a74J28l09J75O1Pl8rJ45L9o2J9L88k2j98l18L0M46q6K13k91k13N4k19o8K35
$$ plain form
6231 -431 -346 -185 -235 23 96 215 300 351 570 281 529 417 697 231 110 -87 -480 -467 -155 -326 -550 -494
6253 -494 -478 -414 -47 -64 399 175 161 203 502 548 473 747 195 -81 -247 -249 -184 -33 -161 -399 -514 -272 -243 -129
6277 -129 68 277 40 84 263 488 276 679 392 173 62 -154 2 -107 -167 -304 -164 -377 -497 -426 -358
6298 -358 124 82 -67 555 135 150 362 468 385 330 -142 -34 -174 16 85 -37 -157 -356 -475 -206 -170 -243
6320 -243 14 250 -9 -63 350 161 384 173 166 9 -232 -96 78 9 -93 -93 -148 -436 -242 99 -34 131
6342 131 -303 -159 -292 -197 56 226 -90 76 -10 -165 73 217 227 -72 -163 49 196 -161 -6 286 -226
6363 -226 -302 -341 -305 -192 -153 -34 126 173 -197 114 -67 -221 243 263 83 -164 -274 -143 311 363 15 -174
6385 -174 -46 -355 -180 -119 -112 -150 -159 -14 25 -37 -18 370 348 150 -168 -138 308 222 435 144 -69 -15 -234 -302 -67
6410f7J33k19M8l67M62p5J62K10K4l73K32j08J32n6J96Pm13M9q7qmK13k57j49
6434c15J66K8j90L54R0K58j23l2j73M12k21J06k4m5k66k67p7M44j79k82J02k19
6456d53j07M45K62k2P4q7L3J41J88J24k91L17m27j83m0j09%%l34K54j94J8j4J34
6480b71L90k7J09j32L07J00M6N4o6j81J57m70k11J75m7q7k88j57P7QK32L00m8
6503c0K59j07M6J27L1M10k64j31k43n2j51P8L3j27k41j03r1m2L20K16k79M15j34
6526f0J21M11J47qq2o9m58L24k57K47l81j44p3J13m45L19jr1M98m46qN39K06K09
6550F11p5L4r5k08l8j40j46L78j76k10k44q5J92k24K30K85k53J7j36K76M70R6
6572E59K0n26K18j09j8n5L35l12l04q9J55j88J86M4j14J4j19j51M60k9J29K01
$$ plain form
6410 -67 66 -153 -105 -472 -10 -85 77 287 311 -62 170 62 194 138 334 341 -72 -23 -110 -118 -122 91 -166 -315
6434 -315 -149 -121 -311 43 133 391 268 236 63 475 254 360 336 291 25 -242 -319 125 -54 -336 -234 -453
6456 -453 -560 -115 147 125 199 112 145 286 474 598 307 624 197 14 -26 -135 -135 -135 -469 -215 -409 -391 -405 -271
6480 -271 119 92 201 69 376 476 522 576 510 329 486 16 -195 -20 -67 -154 -442 -599 -522 -514 -282 18 -30
6503 -30 229 122 168 295 326 736 472 341 98 46 -105 -27 6 -121 -362 -465 -556 -598 -278 -62 -341 74 -60
6526 -60 61 472 619 611 529 460 2 326 69 316 -65 -209 -282 -169 -614 -295 -296 -387 111 -335 -343 196 402 611
6550 611 536 570 475 267 229 89 -57 321 145 -65 -309 -394 -202 -426 -196 89 -164 -147 -283 -7 463 559
6572 559 579 53 271 162 144 89 424 112 -192 -281 -126 -314 -128 -84 -198 -184 -303 -454 6 -23 106 307
6594C07j53j39j08J42M3L29k33m22j49k8J06R7k00K42l6l69N23K20r4K21J8k76
6616D1j28J05L5L78j14j21k35j82N9K05K7j4l24K13q5N8J13k10L53l47Q6m4k0
6639a51M85p4k04mk46J40k47L12Q0K28j06l21J69j37J01n9rrl01J86k07K77L02
6662B05m1K5J03m48K11k10O62k01R0m40l29M97j88K89q7l10o7j57K37m4j24K62
6684f5L13j25j91N36n6J06l23M0Q8k53j78q1N0p1j19l9j49O9K87L05l45M64l54
6707i1P5O6M69J16m82K22J25j48j89m5Nj15l03j24n9J62Q2J77j75K75m7l02M82
6730A76k74M22L81m59n7l9j39J17K02k63j15n6j56j92j04L41QJ4l6k0J82L42L
6753B78k7P1Q1l37K26q3pl29R8J0l69l20J47K71J23j09M7p8K80M38j31J50r3j12
$$ plain form
6594 307 154 15 -93 49 92 421 188 -234 -383 -411 -305 -208 -408 -166 -202 -571 -48 172 78 299 317 41
6616 41 -87 18 53 431 317 196 -39 -221 -162 43 70 56 -268 -55 -140 -82 31 -179 174 -173 -87 -131 -151
6639 -151 334 260 56 52 -194 -54 -301 11 91 319 213 -108 61 -76 25 -34 -43 -52 -353 -167 -374 -97 205
6662 205 164 189 292 -156 55 -155 507 306 396 -44 -373 124 -64 225 138 -172 -239 -396 -159 -203 -327 -65
6684 -65 248 123 -68 468 412 518 195 235 323 70 -108 -189 -139 -210 -329 -368 -517 -448 -161 144 -201 263 -91
6707 -91 -16 50 519 635 153 375 500 352 163 118 123 8 -295 -419 -478 -316 -234 -57 -232 43 -4 -306 176
6730 176 -98 324 705 246 189 150 11 128 330 67 -48 -104 -260 -452 -556 -215 -207 -193 -229 -249 -67 275 278
6753 278 251 322 403 66 292 209 202 -127 -29 -19 -388 -708 -561 -290 -167 -276 -229 -307 -27 411 280 430 337 225
6777B25MJ66j54jN0m65j24j69L2R6o0J48j70k21M82RL12L33q2j06K30l52j51J82
6801B14j38k8R0j75k33k53o0L33J92o4J28m28M28J19l9R6M5J1R1k28K61J6l36
6824D2j9j46j11P0K26l96K6k7m6J16J98J26J79Rn7o0j2K10k06J25J15k25j50O1
6848D8l28J83k33J89j4L6k08J58l3K36j60o4J63L7Q4J24K04l39j64K25P8j35o4
6871B3oJ47M7l33n6k43O10k41J11n0k97L09K83l36M68l08K29l12o1n2O7k4K89
6894B64O8k45m86O00l79J07J47q6j01j2j14L02K16k8j71j48j46M23mJ56k83p3
6916Gl9j60J59R7L87n12R8J55k20k93Q7K80o3J70k96J28j54K27L02j72O7j00m14
6939b59K08j3J69Q5l25j94J81l06K26J0K03M3o7j51K13J74j18L16Jl80j40J94
$$ plain form
6777 225 229 395 241 240 290 -175 -299 -468 -436 -340 -400 -252 -422 -643 -161 -152 160 493 411 305 535 183 32 214
6801 214 76 48 138 -37 -270 -523 -583 -250 -58 -122 6 -422 6 125 86 182 227 238 329 101 362 378 42
6824 42 23 -123 -234 -164 62 -334 -308 -335 -381 -265 -67 59 238 247 190 130 118 328 122 247 362 137 -13 48
6848 48 -280 -97 -330 -141 -155 -119 -327 -169 -202 34 -126 -190 -27 10 94 218 422 83 -81 144 222 87 23
6871 23 17 164 211 -122 -178 -421 189 -52 59 9 -288 21 304 -32 436 128 357 45 -16 -68 -1 -25 264
6894 264 332 87 -399 201 -178 -71 76 -10 -111 -123 -237 65 281 253 82 -66 -212 211 207 363 80 7
6916 7 -32 -192 -33 64 451 -61 37 192 -28 -321 -234 46 -17 153 -143 -15 -169 58 360 188 255 155 -259
6939 -259 -51 -64 105 190 -135 -329 -148 -454 -228 -218 -15 28 -39 -190 23 197 79 395 396 16 -124 70
6961G0K79l45J1j47n4K13l31K13J14j69k18j4J82J27L18k66L48r1j70r9L52l2
6983B91j62PM9j92j79j20J14O6Mj16K10m54N01k19K05J19j21J01j13K27L5K53
7005E06k93k15l99K16J03l5R7N8p0l66j57L01L11n4J27O4j80p0J88L9J91K70l59
7028B73k96l3o1J89l41J01j13n3J10k07M83p8J21M6k22j3K17J10o0J53N8k54K83
7051D13l93J07j90Q3L5n00J4L32j26K71n5j50L05J72k88K82j70L15k89J40l94
7072h6L32k51J53j47k51N9mk02K73lk9j82K48J28r0M71j18L11l58n3j04K0J19
7095B36j08j72j54k60k1L59J1j3j13K08k59L71K8K30p7K51k27lj67J93j76J36
7117B73l06j98pj52J26J79k21O2J56K28m87L15j8R9M02n62K09K04o7j59J36j46
$$ plain form
6961 70 349 4 15 -132 -186 27 -304 -91 23 -146 -364 -378 -196 -69 249 -17 331 240 70 -29 323 291
6983 291 129 136 185 -7 -186 -306 -192 -126 -122 -238 -28 -482 19 -200 5 124 3 104 -9 218 253 506
7005 506 213 -2 -401 -185 -82 -117 -20 38 -32 -398 -555 -254 57 3 130 194 14 -56 132 171 362 632 273
7028 273 -23 -56 -117 72 -269 -168 -281 -334 -224 -431 52 -26 95 141 -81 -94 123 233 173 326 384 130 413
7051 413 20 127 -63 20 55 -445 -431 -99 -225 46 -9 -159 146 318 30 312 142 457 168 308 -86
7072 -86 246 -5 148 1 -250 -191 -195 -397 -124 -127 -156 -338 -90 38 -52 419 301 612 254 201 97 117 236
7095 236 128 -44 -198 -458 -479 -120 -109 -122 -235 -27 -286 85 113 343 266 517 290 287 120 313 137 273
7117 273 -33 -231 -238 -390 -264 -85 -306 -244 -88 140 -347 -32 -50 49 451 -111 98 302 235 76 212 66
7139F6l86J22J38j56J27J03k81k3J91J49k70J92P6L68m20J27K11j97J71J66k94
7160A80j55k72J71j87J31J66j6k18J00l68M06J25j07R5N5J7K7L0P1K2j00p1J54
7183B56j99j53n8L20l42K63k07l48O1L25K76m6k76kjL74J34k00K03k35q1j2K9
7206H1L3O4j60r8k73k1K19r2L51r4R3l93K34J72J2O3M0j00J65j81l9J22l3k07
7230d2J16l90K48j6k4N7J91l07J5Q6kK91N9k43K88j06k43J14r8J18k1O0k41r5
7254a85K36k02J42j80m9k65J95J32J42J66k49L48k46k5R4J97j73K35k91N9m6k61
7276b26o4J97J2M5k50J19J13J7j29K04k46M49o0j88M20ok47jj68j15J79j09J76
7299A22m20J22j54J13O8R2k5K3J39j96R6K40Q3K9l09J58j05K54k21Q4p0j59j34
$$ plain form
7139 66 -320 -198 -60 -216 -89 14 -267 -290 -99 50 -220 -28 48 416 -4 123 334 137 308 474 180
7160 180 25 -247 -76 -263 -132 34 18 -200 -100 -468 -62 63 -44 51 106 123 150 180 251 273 173 102 256
7183 256 57 -96 -154 166 -176 87 -120 -468 -407 -82 194 148 -128 -130 -131 243 377 177 380 145 64 52 81
7206 81 114 178 18 -80 -353 -374 -155 -247 104 10 103 -290 -56 116 128 191 231 131 296 115 76 198 165 -42
7230 -42 74 -316 -68 -84 -108 -51 140 -167 -152 -66 -68 223 282 39 327 221 -22 92 -6 112 91 151 -90 -185
7254 -185 51 -151 -9 -189 -238 -503 -308 -176 -34 132 -117 231 -15 -40 54 251 78 313 22 81 35 -226
7276 -226 -290 -93 -81 -36 -286 -167 -54 -37 -166 38 -208 241 181 -7 413 407 160 159 -9 -124 55 -54 122
7299 122 -298 -176 -330 -217 -149 -57 -82 -59 80 -116 -20 220 303 332 23 181 76 330 109 193 123 -36 -170
7322a70l28L59p7k3q5J18K27J17k38J30K80J2k5j14K36j95j50j00j13N36m24k52
7344b79L73k46R4r1l4R6k0O0m5J77K78k6J21l45K2K48k44r9J81k53J00p1j55p1
7368b29o5K96m34j58N67J62j47j8J46j23J36j03K48L7j71J14l77O7j07N2l35M96
7390E4j36l51K93j41L84J24N1k42J5K30R7o0j2j44J10l56J90j62j76J42k32L89
7412F7k81l53L22J96J07K7k51J34K96k4k32O3R4J75j62j15k86P1L3j13K37j45
7434a40m5N8q2O4J33m8J58m1j94J10J68j44K36n4kJ26n49L34j35J03r0m59M2M54
7458CQ9mk28K31l18M3K85k15Q5J70n9m6K93j61k97L10j90q4o6j8R9j92K16Q6p4
7483d2j55N22k70l1M21o03J75J59r5j32J86k07J78j8n9k18J69L4J42j38k42L06
$$ plain form
7322 -170 -498 -139 -216 -239 -324 -206 21 138 -100 30 310 322 297 183 419 224 74 -26 -139 397 -27 -279
7344 -279 94 -152 -58 -149 -183 -87 -107 -47 -92 85 363 337 458 113 135 383 139 40 221 -32 68 -3 -158 -229
7368 -229 -294 2 -432 -590 -23 139 -8 -26 120 -3 133 30 278 315 144 258 -119 -52 -159 -107 -442 54
7390 54 -82 -433 -140 -281 103 227 278 36 51 281 378 318 306 162 272 -84 106 -56 -232 -90 -322 67
7412 67 -214 -567 -245 -49 58 85 -166 -32 264 240 8 71 165 340 178 63 -223 -152 -119 -232 5 -140
7434 -140 -185 -127 -209 -145 -12 -60 98 57 -137 -27 141 -3 233 179 177 303 -246 88 -47 56 -34 -493 -451 3
7458 3 92 88 -140 91 -227 -184 101 -114 -29 141 82 36 329 168 -129 181 -9 -93 -159 -177 -78 -270 -54 32 -42
7483 -42 -197 325 55 24 445 -158 17 176 81 -51 135 -72 106 88 29 -189 -20 14 156 18 -224 82
7505H2j20l3J64k69m3K97r9J12j11k33M96N2m09J46Q9j58K10k91M8l01M49P3K53
7528D04o16K64j59q8j30M28r3j55N75l14j40J77K13j59k97J8J05k08P3q1j26J56
7550a53K06m15Pj46N67j40NJ27j02K26L8OM6R7p8j68k32J01k8K26k00J91o4l48
7574b31l64K51L27j08K32L20J3m28L81k53J02j35J73l54l1J74k54k07J78M8k30
7595c96J68PK38j97N59o30K74%K72K50m8k25j75P5j98qJ98k20P7l84J19m34M23
7618b55J78J98k12m31P43k25K20J95k87J18j67p7j1j81K41k19J66j67Mk15M0L69
7640B5k89J96j95L11J12N5J49m0Q4N4n95K57J43l35O4j19j99r6r4J62L4j15M55
7663B4l78J43K36J65Q8K8J36j01j60l2j17p4K36k06j62m3O8m2k70L09RMP1J80
$$ plain form
7505 82 -38 -71 93 -176 -219 78 -21 91 -20 -253 243 295 -114 32 121 -37 173 -118 -70 -371 78 151 404
7528 404 -212 52 -107 -195 -325 103 10 -145 430 116 -24 153 366 207 -90 -72 33 -175 -102 -183 -309 -153
7550 -153 53 -362 -355 -501 66 -74 -69 58 -44 182 220 226 272 369 291 123 -109 -8 -36 190 -10 181 117 -231
7574 -231 -595 -344 -17 -125 107 427 440 12 393 140 242 107 280 -74 -105 69 -185 -392 -214 -166 -396
7595 -396 -228 -221 17 -180 379 -251 23 23 295 545 497 272 97 172 -26 -34 164 -56 21 -363 -244 -678 -255
7618 -255 -77 121 -91 -522 221 -4 216 411 124 242 75 -2 -13 -194 47 -172 -6 -173 -169 -384 -344 25
7640 25 -264 -68 -263 48 160 215 364 324 408 462 -133 124 267 -68 -4 -123 -322 -418 -512 -350 -316 -431 24
7663 24 -354 -211 25 190 278 306 442 341 181 149 32 -42 194 -12 -174 -217 -149 -191 -461 -152 -143 -139 -68 112
7687A12n5L61l11K19j54K33k18J5J52r1j69m07M26r9r4k4J15k22J61j91K63J2
7709C4j13M83k19J06k05j12R1K02k20J24j20o9p1M2L0r1J6Pk86K44J77L65l11
7732A04L71n18K2J62q3J14K41l62r1l2j14J71P1j78j37j0j40M21k92L41l8m4J00
7755G9k98K79J1l0J37J42j83q3q6J62J02R3k68j52m2k81M38L4o7j08K08L9m13
7778b87L87j14K55j91M0q0o5J94n4N3k60r8Mm9PN1J86J54l10j56J94P4n4J19K27
7803B27Pk66j18L40J82m61o5J63J94k72r8J51n5K11l69P2j81L48P1N6j44M3m6
7826a0J01r6K33O6l50J45q2J73k15n3J52R9l70m8J8N6J64j11k2O8l1j15J28L21
7850B21Q6l9j38l4M7o1k14K37J2J3m04k21J30K01J0J2j52K38R9O7%k2K95O7j11
$$ plain form
7687 112 57 418 107 326 172 405 187 202 354 263 94 -313 113 14 -80 -104 11 -211 -50 -241 22 34
7709 34 -79 404 185 291 86 -26 65 267 47 171 51 -18 -89 -47 -17 -108 -92 -85 -371 -127 50 415 104
7732 104 475 -43 -21 141 58 172 413 51 -40 -72 -186 -15 56 -122 -259 -269 -409 12 -280 61 23 -21 79
7755 79 -219 60 71 41 178 320 137 54 -32 130 232 325 57 -95 -137 -418 20 54 -13 -121 87 126 -287
7778 -287 100 -14 241 50 90 10 -55 139 85 138 -122 -220 -216 -265 -258 -207 -21 133 -177 -333 -139 -65 -119 0 227
7803 227 234 -32 -150 190 372 -89 -154 9 203 -69 -167 -16 -71 140 -229 -157 -338 10 81 137 -7 36 -10
7826 -10 91 -5 228 294 -56 89 7 180 -35 -88 64 163 -207 -255 -237 -181 -17 -128 -150 -82 -113 -228 -100 221
7850 221 307 268 130 96 143 82 -132 105 117 130 -274 -495 -365 -164 -154 -142 -294 -56 43 110 110 88 383 450 339
7875C39k14j5p3M9j00n9l42j6K46r9J23j08P7L9j29M14K25%j56l7J76n2N0P5j95
7900B18k07R3l56N4R3N4j78l1k2k09L78M3K19J81j7j90K14J32l16k4K45l43l06
7923b75K9L91l15j78J58J4j16n7P4L46P8K92k84M1J60k49P3K92j53k76r9j68J6
7946b06J66Q1j69j83K5j85L87k33P19k43j70K63J43mK2Q2k49j66J06j44N8m97
7968c97M96l66o1J85k95K74P1J53J32J14j75N4L0K82j37j10k5km32j5K88M4l87
7991b79K35k04o7Q8J20J65J32k4o5p7j61J45J55P9j28j40r3RK08k00J62k79K4
8014a95P6n2L53k68K46k01l70L49K3m0K60J2Mj93l15M20k90K06J58k69n6J24k45
8037b63J81K16kmk25K87m18M37q3n1n2J63l99j3M86l3k09L5N0N6m25N78k56J3
$$ plain form
7875 339 125 110 37 86 -14 -73 -415 -431 -185 -284 -161 -269 -192 -153 -282 132 357 357 201 164 340 288 338 413 218
7900 218 11 104 -252 -198 -105 -51 -229 -260 -282 -491 -113 -70 149 330 313 123 337 469 153 129 374 31 -275
7923 -275 -246 145 -170 -348 -190 -176 -292 -349 -275 71 149 441 157 198 358 109 182 474 321 45 -54 -222 -206
7946 -206 -40 41 -128 -311 -286 -471 -84 -317 402 159 -11 252 395 391 413 495 246 80 186 42 100 -397
7968 -397 99 -267 -328 -143 -438 -164 -93 60 192 306 131 185 215 497 360 250 225 223 -209 -224 64 108 -279
7991 -279 -44 -248 -315 -227 -107 58 190 166 101 24 -137 8 163 242 114 -26 -119 -110 98 -102 60 -219 -195
8014 -195 -119 -171 182 -86 160 -41 -411 -62 -39 -79 181 193 197 4 -311 109 -181 25 183 -86 -142 -18 -263
8037 -263 -82 134 132 128 -97 190 -228 209 126 75 23 186 -213 -226 260 227 18 53 103 159 -266 312 56 69
8061F9j90o9J19j57J85J18R1q9k15L7K69j21K34k61j1j71J30J35n3L20l42N1k27
8084a48K2K53k89J11M3r5k40NK88j5N72n79J55L11p7k84J31O9o7M1j78k54J98
8107b7n7r9r7J65n12m1L21K48J07K33j52n5R0j68L73p3q4j6m1l64K47j8O0m3l28
8132c31J0Q4oJ80J10k1K34o3j02N64l36J94j36m66J8K14j85m31J92N9j13r0J18
8155c03j1K71kn7K58P6O8m7J00K79k34k51J65on66Q5L0P8k62J12k86L23R6j83
8179b67J08L55k00J7M51j60nM5P5j35m60J39
$$ plain form
8061 69 -121 -190 -71 -228 -43 75 166 77 -138 -101 168 47 281 20 9 -162 -32 103 50 370 28 79 -148
8084 -148 -126 127 -162 -51 -8 -103 -343 -338 -50 -65 507 -72 83 394 317 33 164 233 166 207 29 -225 -27
8107 -27 -84 -183 -280 -115 -627 -668 -347 -99 8 241 89 34 124 -44 329 256 172 156 115 -249 -2 -20 40 -3 -331
8132 -331 -321 -237 -243 -63 47 26 260 197 95 659 323 517 381 -85 -67 147 -38 -469 -277 -218 -331 -421 -303
8155 -303 -314 -43 -45 -102 156 232 300 253 353 632 398 147 312 306 -260 -175 -145 -67 -329 -217 -503 -180 -84 -267
8179 -267 -159 196 -4 13 464 304 299 344 419 284 -176 -37
8191c7
$$ Imaginary data points
##PAGE= N=2
##DATA TABLE= (X++(I..I)), XYDATA
0@%%%%%%%%%%%%Qj6J6j6J6k4L2l3M1n0N9p3Q8j00J15j36J55j75K01k31K63k98
34a58L37l80M25m79N36n97O66p40Q23r12J008j113J231j360J500j651J819k006
52a051K209k436K690k975L299l670M096m600N202n927O835q008R583j1824J5295
67H718k1460L5747j33462o9025J34892l4445K6961P7683K2160o4681O0243J15663
79A58994P443p2331J2590J092q9127n3811O6568R035j00618n8566K3988l1528
91a26271m2636P2159J03719j6906m0307N3069N2839j8602L1907R3697J293r8287
103F5674l4658K2377l8488n1027L2021J3330r2221p0710L8832L5493j4180M0989
115e2568Q0369p353n0539M1579Q1038L699j5020L1602j5543r5712m0593N0106
$$ plain form
0 0 0 0 0 0 0 0 0 0 0 0 0 0 8 -8 8 -8 8 -16 16 -17 24 -26 33 -40 48 -52 63 -73 82 -93 108 -123 140 -158
34 -158 179 -201 224 -255 281 -316 350 -390 433 -479 529 -584 647 -713 787 -864 955 -1051
52 -1051 1158 -1278 1412 -1563 1736 -1934 2162 -2438 2764 -3163 3672 -4336 5247 -6577 8718
67 8718 -12742 23005 -110457 -179482 -44590 -79035 -52074 25609 47769 -16912 43331 158994
79 158994 166437 94106 106696 107788 18661 -35150 31418 40453 -60165 -118731 -94743 -126271
91 -126271 -168907 -96748 6971 -9935 -50242 2827 55666 37064 68971 162668 163961 65674
103 65674 31016 53393 14905 -36122 -4101 9229 -82992 -153702 -114870 -79377 -93557 -52568
115 -52568 27801 20448 -30091 11488 92526 96225 81205 112807 97264 1552 -39041 11065
127A1065J3196m4717l534R864o0865n5722M7904O5563q540p061M2834P103l3874
140a6784L3866Q4898J0191m9752j1487l848n6600l1100M7292K1428n7706m0834
152g0436J3373q750k0606M8807O9497j1727m2317J6188K8875q947J7278O0347
164I1582K420o8778l3198J6464j1154k2861K5709J7011n5079m8493K6712L4496
176b5169k948J8262L9499j6773m8349J6932N9685J7522l550J9729j0702o7172
188c034l7060K9828J5681k6749p273Q031l1512k9564M0478N8229K324j3509J3899
201A9769m084k9469J6454N8146J2798l6853j7971n768l3553j8436L5505K2569
213A9107l8438l7057L823J184m129M0823N7552r83l4660O84J7973n044P363L5259
$$ plain form
127 11065 24261 -20456 -23990 -14126 -74991 -130713 -82809 -17246 -25786 -32847 9987 17090 -16784
140 -16784 17082 101980 112171 62419 50932 47084 -9516 -40616 6676 28104 -29602 -70436
152 -70436 -57063 -65813 -86419 -37612 31885 20158 -22159 -5971 22904 13957 31235 91582
164 91582 94002 25224 -7974 8490 -2664 -25525 184 17195 -37884 -86377 -59665 -25169
176 -25169 -28117 -9855 29644 12871 -35478 -18546 41139 58661 55111 74840 64138 -3034
188 -3034 -40094 -10266 5415 -21334 -28607 -20576 -52088 -81652 -41174 17055 19379 5870 19769
201 19769 15685 -13784 2670 60816 73614 36761 18790 13022 -20531 -38967 -3462 19107
213 19107 -19331 -56388 -52565 -51381 -55510 -14687 42865 41882 7222 7906 25879 20835 28198 63457
227F3457k014n5057l4055R496J80j0652J5910J0360l8951l6566K2582M1466J7181
240C337K2286L0793j2517m2368k513L4313J0423j0529K525j2230m7733k6415K5494
253b5134K2026j3419j0014J317k0753j8632L4711N3985J4557q190M842m494k2327
266H475O154L6513O036l7023k9771j3656k2486p614L4025K8166j8459k7714J080
279c6274N382L223L1590M2987P42k9832o587J2455R4L693J8102r086m8826l4499
293d6836O142J1866M908J8487J1899k6249l1157J1846L1997J7735J5468J8993
305D5099r371l1044l233K7449J1422r784p820j7265l9115k1674K2334K6506j107
318g603o247o78j4199j1655K4734M2350J1777j2686p157p572j3679Q741L3951
$$ plain form
227 63457 61443 6386 -27669 -18173 -17993 -28645 -12735 -2375 -41326 -77892 -55310 -13844 3337
240 3337 25623 56416 43899 1531 -982 33331 43754 33225 35750 23520 -24213 -50628 -25134
253 -25134 -3108 -16527 -26541 -25224 -45977 -64609 -29898 24087 38644 30454 35296 30802 8475
266 8475 14629 51142 57178 20155 -9616 -23272 -45758 -53372 -19347 8819 -9640 -37354 -36274
279 -36274 -30892 -27669 3921 46908 47650 17818 11231 23686 23780 27473 45575 36489 -12337 -46836
293 -46836 -40694 -28828 -23920 -5433 6466 -19783 -50940 -39094 -7097 10638 26106 45099
305 45099 35728 4684 1451 28900 40322 30538 22718 5453 -33662 -55336 -33002 -6496 -7603
318 -7603 -13850 -14528 -28727 -40382 -15648 26702 38479 25793 18636 11064 -2615 6126 40077
331D0077J1711k6464k9331j6356j7988n605K4574K2815j1626k2259p95R295Q476
344a3476K4535K9574l432k8793j1818J0255R620J1135J6929n286l9494l3754j362
357c5367Q890N444J2266P802j8774k2910R596K9445J9579J1232Q799j1454k6500
370a952m014K4110J7064k899p944j6516l0576j7970J5749K1549r88j0740p967
383b3094j1566n678K4800M0096J5991r686j1760j0586j2173O301K5390J1617j9217
396B0435k4558j2866r906q95J7608J4885j3305k3692n065J0273J5452K6208K6039
409D0613j379k6005j6139M033P829R886J2558m498k9608k5640L11J1858Q820P580
423B19P99j8370k1338N634K6616K1719J0953M958j0785k1503m293J8983J5423
$$ plain form
331 40077 51788 25324 -4007 -20363 -38351 -43956 -19382 3433 -8193 -30452 -31247 -21952 -13476
344 -13476 11059 40633 37201 8408 -3410 6845 16465 27600 44529 39243 -251 -34005 -35367
357 -35367 -26477 -21033 -8767 -965 -19739 -42649 -33053 -3608 15971 27203 36002 24548 -1952
370 -1952 -5966 18144 35208 32309 24365 7849 -22727 -40697 -24948 -3399 -4387 -15127 -23094
383 -23094 -34660 -40338 -15538 24558 40549 30863 19103 8517 -3656 2645 28035 39652 20435
396 20435 -4123 -16989 -26895 -27790 -10182 4703 -8602 -32294 -37359 -27086 -11634 14574 40613
409 40613 39234 13229 -2910 1123 8952 18838 31396 26898 -2710 -28350 -28039 -16181 -7361 219
423 219 1018 -17352 -38690 -33056 -6440 15279 26232 31190 20405 -1098 -5391 13592 29015
436B9015l257j1838j7217k3739j0394J7632K4416M553j0143j2395j3550o625J7580
449a5962L2066J4843o763j0903p990o263N933J9766O713j8441k4756j2361l619
462b7737O574K0008J4997j0138k2937j0644N159J3275K0966K1066r5k0302j3579
475c387M224J0106R714O698p538k7303k4297o50J4098J2374R073P27j4722j6807
489b7690M119K2451J8954P647j042j2130j7050j749J9085J7570l47j3433k0921
502d536k3475j1839J2509K1492P860o638q212p721n27J7022K6439J1446r449j3489
516A0882q476k602Q398J7323N159j7969k6821j6847m718O321J7728J4287m175
529a510j5357o246Q800J6099K0033J6023l022k0359j5412J116R863Q929M118r256
$$ plain form
436 29015 25758 13920 -3297 -27036 -37430 -19798 4618 9171 -972 -13367 -26917 -33542 -15962
449 -15962 16104 30947 24184 13281 5291 -972 4961 24727 31440 12999 -11757 -24118 -27737
462 -27737 -21163 -1155 13842 3704 -19233 -29877 -24718 -11443 9523 30589 30494 10192 -3387
475 -3387 837 10943 20657 27355 19817 -7486 -31783 -32433 -18335 -5961 3112 3839 -10883 -27690
489 -27690 -23571 -1120 17834 25481 24439 12309 -4741 -6490 12595 30165 29818 16385 -4536
502 -4536 -28011 -39850 -27341 -5849 2011 -4627 -12839 -20560 -21087 -4065 22374 33820 24371 10882
516 10882 2406 -196 8202 25525 30684 12715 -14106 -30953 -35671 -29350 -11622 2665 -1510
529 -1510 -16867 -23113 -14313 1786 21819 37842 34820 14461 -951 165 10028 18957 23075 13819
543A3819k4819k3109k716J1981J1960O814l37j0553r104Q719K6467K3170Q757
556D1049m397j5806k0019o684J1752J4013r63j2592j7999j9031q415J1431J8149
569i512O375n989p520l498N624K0193K6268J1548r009j6877j2418n308N617J2420
583A7914L073j6072k3610j5371k476Q700J6022J1556l533j4353n015J0446J8626
596E907K0833J4510k952j8384j5634j204P026N717n10j2110k2253j8384N16J5550
610b1372J4374O794k853j2016j0258P102K3210K1959J0729k244j2027j5717n766
623A915Q302R000l982j5489j8587j5264l787J3061J8525O816o117r964m743N115
637a5199J8907K2963J1602o371j4259j0965k533N827R654K72j6198k3703j5706
$$ plain form
543 13819 -11000 -34109 -36825 -24844 -12884 -6070 -6407 -16960 -26064 -17345 9122 32292 41049
556 41049 36652 20846 827 -5857 5895 19908 18945 6353 -11646 -30677 -39092 -27661 -9512
569 -9512 -3137 -9126 -16646 -20144 -14520 5673 31941 43489 34480 17603 5185 -123 5494 17914
583 17914 20987 4915 -18695 -34066 -36542 -27842 -11820 -264 -3797 -18150 -23165 -12719 5907
596 5907 26740 41250 38298 19914 4280 3076 10102 15819 15309 3199 -19054 -37438 -36922 -21372
610 -21372 -6998 -204 -3057 -15073 -25331 -18229 4981 26940 37669 35425 23398 7681 1915
623 1915 10217 19217 15235 -254 -18841 -34105 -37892 -24831 -6306 510 -5607 -15571 -20314 -15199
637 -15199 3708 26671 38273 31902 17643 6678 4145 9972 19626 19898 3700 -20003 -35709
650c5709j111J0247J6053J1147l240j2185n008Q698J7045J7492J1057l631j5791
663A5064j2077J570R586O552k005j3778k3714j8862q52J3858J5499Q590j216q840
677a0625p156O213J8513J8063P280m864j2152j1776j924R726R506l234j5561j9277
691a7268j5787l522J2214J6763Q092m821q394l104O442J7200J9212Q049q553j5731
705A0792j1092j442P440J0672J954j3636k0367j3799r96R315J3152Q233l429j0499
719a3702l556R308J7459J6713P162o864j6825j3734J61R565R054R39j0639j8204
733a3163j5241q50J1548J2954N710l027q550n224O671J7631J6666M733p378j3876
747H604j2190j931R658J0668K16j2210j5915j1629j396J1136J4389M778o782j0402
$$ plain form
650 -35709 -36820 -26573 -10520 627 -2613 -14798 -19806 -11108 5937 23429 34486 30855 15064
663 15064 2987 4557 14143 20695 18690 4912 -18802 -37664 -38516 -24658 -9159 -569 -1785 -10625
677 -10625 -17781 -11568 6945 25008 32288 27424 15272 3496 1572 11298 20804 17570 2009 -17268
691 -17268 -33055 -36577 -24363 -7600 492 -4329 -12723 -15827 -9385 7815 27027 35076 26523 10792
705 10792 -300 -1742 5698 16370 18324 4688 -15679 -29478 -30474 -21159 -8007 226 -3203 -13702
719 -13702 -17258 -7950 9509 26222 33384 26520 9695 -4039 -3878 5687 14741 15680 5041 -13163
733 -13163 -28404 -29254 -17706 -4752 958 -2069 -10619 -15843 -9172 8459 25125 29858 22480 8604
747 8604 -3586 -5517 4141 14809 15025 2815 -13100 -24729 -26125 -14989 -600 4178 -2604 -13006
761a3006m642N948J6460J8402Q096p389j5042j1041j464O946Q417J423j1843j6951
775a5686r645K656J0818J2636N212n998j2031o373P324J6187J5308P600n490j4280
789H238j1306m03Q613P649n92j0097j6198j1820J232J2658J2411M458m801j0146
803a0104n687N525J6871J5686M812o721j2591j0614r37Q042Q795j794j2615j5629
817a6961j0491J728J2623J5215O240n346j0171m987M615J3132J4463N695p600
830A8155j2576q453O63P124P437j271j2693j7146j0341K722J2481J4217P440l421
844D338r423m900O008J3699J2484L878p053j4097j0750K24P800O704j153j0519
858b760j5299j0047K693J3442J3892N809l707p834m502N521J4478J2520K471q856
$$ plain form
761 -13006 -17648 -11700 4760 23162 31258 23869 8827 -2214 -3678 3268 11685 13108 1265 -15686
775 -15686 -25331 -22675 -11857 779 5991 -7 -12038 -18411 -11087 5100 20408 28008 22518 8238
789 8238 -3068 -3471 5142 12791 12199 2102 -14096 -25916 -24684 -12026 385 4843 42 -10104
803 -10104 -15791 -10266 6605 22291 27103 20382 7791 -2823 -3760 4282 13077 11283 -1332 -16961
817 -16961 -27452 -25724 -13101 2114 8354 3008 -7163 -12150 -7535 5597 20060 25755 18155
830 18155 5579 -2874 -2211 4913 12350 11079 -1614 -18760 -29101 -26379 -13898 319 7759 4338
844 4338 -5085 -9985 -3977 9722 22206 26084 19031 4934 -5816 -5592 2208 8912 7759 -2760
858 -2760 -18059 -28106 -25413 -11971 1921 7730 4023 -3811 -8313 -2792 11686 24206 26677 17821
872A7821j3836j0625p95Q368Q348j151j1927j5065r238J644J1954J4464P005k720
886D247p106k016O307J3261J1742J826j0199j5501j0736o65P136P423q4j0327
900d692j4330q744L077J2264J2931O739k853p744k595O925J4202J1407K697r365
914A9919j5067j1418j158O546N673j629j0549j3692p828L548J3565J3787N606
927G303l027o235k525O795J4419J2382J538j0079j5078j2110k821N789N993j456
941H88j0115j2442o557M046J2539J3163N969l622o697j748P397J3402J2648K405
955C1276r769j5268j1637j956M426M524j989j0594j3015o581N386J3188J3781
968A772O844k285o626k510O803J3003J0722J230r172j4664j0990j301M954M716
$$ plain form
872 17821 3985 -6640 -7435 933 9281 8130 -3797 -18862 -28100 -26456 -14502 -38 6967 4247
886 4247 -2859 -4875 1432 14693 26435 28261 18062 2561 -8175 -8840 -1704 5719 5635 -4692
900 -4692 -19022 -27766 -24689 -12425 506 7245 4392 -3352 -5947 978 15180 26587 29284 19919
914 19919 4852 -6566 -7724 -1178 4495 2866 -7683 -21375 -29203 -25655 -12090 1697 7303
927 7303 4276 -1959 -4484 2311 16730 29112 30650 20571 5493 -6617 -9438 -3649 2344 888
941 888 -9227 -21669 -28226 -24180 -11641 1522 7491 3869 -2828 -4576 2821 16223 28871 31276
955 31276 21507 6239 -5398 -7354 -2928 1596 -393 -10987 -24002 -30583 -25197 -12009 1772
968 1772 8616 6331 -295 -2805 3998 17001 27723 28953 19781 5117 -5873 -7174 -2220 2496
982B496k717j0541j2745o227M949J4052J3536N543k742o308k676O148J2907J0895
996B6570J479r017j3143r974k261M823M529l169j0837j2628n387M709J3144J3648
1010B486O778l276o372j975N712J1417R999J522r215j3581r229p46N555N162k207
1025B030j0276j2760o450M588J2159J2243N830k957o141j699O681J1819R780N94
1039B5441q881j3208r571m92O111M446k046j0298j2096o112M163J2227J2744N750
1053H178k602n358k060N744J0692R028m40r214j2787q790k37O078N305j854r552
1068g869j1316n537M329J1458J2374N237k996n926j352O509J0729Q359K1j0455
1082A3565j4000r690n92N586M874q09q279j0087l643N959J2392J1796M990l623
$$ plain form
982 2496 -221 -10762 -23507 -29734 -24785 -10733 2803 8346 5604 -704 -3380 2768 15675 26570
996 26570 28049 19032 5889 -4085 -6346 -1523 3006 -163 -11000 -23628 -29015 -24306 -11162 2486
1010 2486 9264 5988 -384 -2359 3353 14770 24769 26291 17076 3495 -5734 -6480 -925 4237 2030
1025 2030 -8246 -21006 -27456 -22868 -10709 1534 7364 4407 -1734 -3433 3248 15067 24847 25441
1039 25441 16560 3352 -6219 -6711 -600 3846 1800 -8498 -20594 -26706 -22543 -10316 2428 8178
1053 8178 5576 218 -1842 3902 14594 23622 23182 13968 1181 -7609 -7846 -1768 3537 1683 -7869
1068 -7869 -19185 -24722 -20393 -8935 3439 8676 5680 -246 -1598 4911 15640 23999 24020 13565
1082 13565 -435 -10125 -10717 -5131 -257 -1066 -9345 -19432 -23075 -17116 -4724 7072 12062 8439
1096H439o394k255M963J0035O982j189j0316j3614r461m55O253N952l24p402q600
1111a7386l306N949J2329J1892M604l675o232k904M382R025O370k540j0924j3896
1125f312r229o82N993O592P17o227p113j574P259J3208J1397L748m827p814m174
1140I62K968P340N725k099j0398j3117q146Q63O503O544L47n766p313j393P616
1155i364J2849J1393L526m011p965m457K560O381M855k828j0504j2739p610L43
1169a7571P232O617J354m925o220p90O959J2495J0557L226m848q277m641K300
1183C468O723M690k536j0161j2152p548J108O911O261N84n817o630p22P063J2430
1198C672J1570L859m205p515m034K310O222L841l318j1067j2347p420J066O636
$$ plain form
1096 8439 2045 -210 4753 14788 21770 20581 10265 -3349 -12810 -13265 -7012 -1060 -1384 -8786 -17386
1111 -17386 -20692 -14743 -2414 9478 14082 10407 4175 1271 5653 14678 21048 18508 7584 -6312
1125 -6312 -15541 -16223 -10230 -3638 -2921 -9148 -16261 -17835 -10576 2632 14029 17777 12950 5136 962
1140 962 3930 11270 16995 14896 4498 -8619 -16765 -15902 -9399 -2855 -2508 -8274 -15587 -16980 -9364
1155 -9364 3485 14878 18404 14393 6428 1971 4531 10912 15767 12939 2435 -10304 -17914 -17571
1169 -17571 -10339 -3722 -2368 -7293 -13513 -14303 -7344 5151 15708 18934 14086 5809 1168 3468
1183 3468 10191 14881 12345 2184 -9968 -17516 -16408 -9497 -3236 -2652 -8469 -15099 -15821 -8758 3672
1198 3672 15242 19101 14896 7381 3347 5657 11879 15720 12402 1335 -11012 -18432 -17366 -10730
1212a0730O351Q29m694o390q89P071J2129J1355L747m088o562l924K489O430L713
1227A6837l943j0452j2303q445L33N912N874M67m950n536l61Q447J2770J1251
1241A5901M274l650o853l698K037N660L131m338j1457j2546p999O41O231O163
1255f503P32m672n040J21P943J2448J0905L690l464o550l348K337N154L053m481
1270A2325j1293j2948p852K41N754O449J478l847m645O81P735J2543J0357L131
1284B0109m249p103m573K042M959K585l788j0317j1610o630Q02O771O268R23m017
1299g828m993R4P366J1360R773K468m672o971l737J712N331L169l733r943j0711
1314a1315n892J312O563O477J145m146m722j60O532R883Q754J335m549p536l997
$$ plain form
1212 -10730 -4379 -3550 -8244 -14634 -15523 -8452 3677 15032 18779 14691 8129 4205 6694 13124 16837
1227 16837 12894 2442 -9861 -18306 -17973 -12061 -6187 -5720 -10670 -16206 -16567 -8120 4650 15901
1241 15901 20175 16525 9672 5974 8011 13671 16802 12464 1007 -11539 -19538 -18897 -12666 -6503
1255 -6503 -5771 -10443 -15483 -15362 -7419 5029 15934 19624 16160 9610 6262 8599 13753 16806 12325
1270 12325 1032 -11916 -19768 -19527 -13773 -7324 -5846 -9693 -14338 -13657 -5922 6621 16978 20109
1284 20109 15860 8757 4184 6226 11185 13770 9982 -335 -11945 -18575 -17773 -11002 -4734 -3811 -7828
1299 -7828 -12821 -12727 -5361 5999 15772 18240 13568 6597 2860 4572 9903 13072 9339 -604 -11315
1314 -11315 -17207 -15895 -9332 -2855 -1710 -5856 -10578 -10738 -4206 5677 14431 15766 11217 3681 -316
1329c16K206N490L692k400q413r833n478K000O528O217K87m142n468p26N642R979
1345E265P735J608n282p319l662K320N743L562k540p841r331m430K191P370O135
1360A524P01m827n268j328N429Q840P290Q27n397p155l546K377N594M001k075
1375F987p530r234l880K099O986O319Q69m466m763j042N500Q774O412O64n508
1390H187p712m015J662M869L692k117p271q158l515L140P603O189J256l614m535
1405d339j372N424Q225N817L46o265p894m288J478M727L212k670p036q068l199
1420a5902L848P996O776K387l158m280p47N067Q055N339j186o874q017n367R79
1435e084L810L643j999o248o750k538M288Q261P002J735k694m529p57M448P489
$$ plain form
1329 -316 1890 7380 11072 8672 259 -9574 -15052 -13052 -6524 -307 -20 -4162 -9630 -10356 -4714 5265
1345 5265 13000 14608 9326 2007 -1655 665 6408 9970 7430 -411 -9742 -14172 -11981 -4611 1524
1360 1524 2225 -2602 -7870 -9198 -3769 5071 12361 13188 7791 636 -2910 -533 5061 9062 6987
1375 6987 -543 -9777 -13657 -11558 -4572 1747 2616 -1850 -6613 -7655 -2155 6619 13031 13695 8187
1390 8187 475 -3540 -1878 2991 6683 4566 -2705 -10863 -14378 -11238 -3635 2554 3810 196 -4339
1405 -4339 -5711 -287 7938 13755 14101 7836 -58 -4346 -2868 1859 5071 2401 -4635 -12703 -15902
1420 -15902 -12054 -4058 2718 5105 1947 -2333 -3080 1987 10042 15381 14195 7321 -696 -6063 -5084
1435 -5084 -1274 2369 370 -5878 -12628 -15166 -10878 -2617 4385 6120 3426 -1103 -1860 2588 10077
1450A0077N210j319o709q850n113J045L823L229k163n975o318j598M704Q604P129
1465E776J855l277m528j072M325O584M447k131o546q405m719Q97M760L299j192
1480G3n480n935j270L926P585O796J751l241m853j158L515O428M628j087o540
1495E138p677m270Q84M460L138j300n540n857j542M390P947O318J590l989m910
1510a220j774L986O044M120r93o050o759l763K039M624L265j501o043o336j531
1525a1892L614P078N637J285l297m389r44L883O061M818j221n782p035l319J149
1540d354M366L259j713n529n784k166L849O717N506J209l121m231p99L637O388
1555G234M300j181n565o669l479J296M310L100j627n927o347j614L144P057N950
$$ plain form
1450 10077 15287 13968 7259 -1591 -6704 -5659 -1836 1393 -770 -6745 -13063 -14661 -9957 -1353 5776
1465 5776 7631 4354 -174 -1246 3079 9663 14110 11979 5433 -2972 -7691 -6794 -2034 1265 73
1480 73 -5407 -11342 -12612 -8686 -1101 5695 7446 4205 -648 -1806 1709 8137 12765 11678 5138
1495 5138 -2539 -6809 -5925 -1465 1673 373 -5167 -11024 -12566 -8176 -229 6089 7679 3690 -1220
1510 -1220 -2994 992 7036 11156 10163 4113 -2646 -6409 -4370 254 3519 2018 -4025 -10361 -11892
1525 -11892 -8278 -1200 4437 5722 2425 -1964 -2908 975 7036 11854 10633 4851 -2184 -5503 -4354
1540 -4354 12 3271 1558 -3971 -9755 -11921 -8072 -1355 4151 5360 2239 -1992 -2791 846 7234
1555 7234 11534 10353 4788 -1881 -5360 -4064 246 3346 1719 -4208 -10555 -12169 -9025 -1968 3982
1570C982J310k678l365q86L958N721L914j726o236p055l543J312M295L049j237
1585H15m802n243j760L752P034N135J277l291l854j414L858N511L569j325o039
1600C223o765l743J485M471K747o63m328m693j401L908O960N128Q28l298m729
1615h70j138K959M862L023j420o100o794k803J970M596L765o0l995m599l66L498
1631c472O391M264p3m087m537k214L222M874L421j558n178o124k657J906M808
1646a014L651m56l550l946q86M025N576M464m59l876n280k595K456M286L146q72
1662D670m796m934k173K476M450L639l23l948m122j036L566N821M179o86m194
1677B589m744j900K492M309L118j146m774n089j852J813M845L359l46m145m115
$$ plain form
1570 3982 5292 2614 -751 -1637 2321 8042 11956 10230 3994 -3061 -6604 -5292 -997 2052 815
1585 815 -3987 -9230 -10990 -7238 -204 4931 6208 2917 -937 -2351 1507 7018 10587 9262 3223
1600 3223 -3542 -7285 -5800 -1329 1418 755 -3573 -8266 -9667 -5759 1201 6329 7157 3859 -870
1615 -870 -2008 951 5813 8836 7416 1316 -5478 -8281 -6311 -1715 2050 1990 -2005 -6604 -6970 -3472
1631 -3472 2919 7183 7110 3023 -1514 -3728 -506 4368 7789 6231 1053 -5071 -7728 -5822 -1014
1646 -1014 2637 2181 -1369 -5315 -6201 -2176 3400 7864 7405 3529 -1751 -4346 -1890 2396 5542 4670
1662 4670 -126 -5060 -7233 -4757 -307 3332 3009 -939 -5061 -6097 -2531 3290 7469 6783 2589
1677 2589 -2155 -4055 -1563 2746 5864 4718 -56 -5145 -6997 -5184 -339 3020 2674 -1471 -5586
1692e586n87L659N685M002K66l968m600j775K087M099K660j041m765n366k041
1707g271J971M314L313q96l707m049q08L651N956M691Q53l209m268j287J751L497
1723D502K147k081n346n635k274K265M038L432m81l559l423p5L526N931M872P98
1739H637k795l990j381J694L288J559k489n658n609k755J686L929K851L57k793
1754c469k894K75L944O105M792P77k918l910k030J474K859J439k121o033n799
1769g509k831J897M130L627M09k489k670J27M051N455M247O0k934l680j224J794
1785B460L003J624k674n909n765k447J336L720L708O84k198k296k47L798N562
1800D359L805K5l211l848j900J689L262J621j514m593n111k373J524L697K882
$$ plain form
1692 -5586 -6173 -2514 3171 7173 7439 3471 -1129 -2904 -817 3282 5942 4901 136 -5230 -7271
1707 -7271 -5300 -986 2327 1431 -2276 -6325 -7133 -3482 2474 7165 8018 4809 541 -746 1005 4502
1723 4502 6649 4568 -778 -6413 -8687 -6422 -2384 1048 567 -2992 -6415 -6490 -2964 2967 7839 8637
1739 8637 5842 1852 471 2165 5453 7012 4523 -1135 -6744 -9499 -7813 -3884 -1033 -676 -3469
1754 -3469 -6363 -6088 -2144 3961 8753 9530 6612 2702 672 2146 5005 6444 4323 -1710 -7509
1769 -7509 -10340 -8443 -4313 -686 -277 -2766 -5436 -5309 -1258 4197 8444 8504 5570 1890 666 2460
1785 2460 5463 7087 4413 -1496 -7261 -9708 -8372 -4652 -944 -260 -2458 -4754 -5001 -1203 4359
1800 4359 8164 8189 4978 1130 -770 919 4181 5802 4288 -305 -5416 -7789 -6265 -2568 314
1815C14p55k263k882l11L749N295L952r1k893l711j489K204L125J992j335m220
1831F81m742k512J140L152K259j59k935k539k1L304M744L883l98k814l487j306
1847a750K420L534K768j163l887m554k688J188K583K074j177k987l203p40L275
1862d307N078M057J262k281k958j073J764L096J779r34m456m480k305J588L190
1877i80K153r04l376l355q51L042M897L669J052k298k763l91J455L496J922j244
1893E524l989m446j901J106K727J790o97l278l252l45K686N049L755N94k114k750
1909D59j411J625K868J906n61m301l799j458J384L046K580p18k787l471r45J894
1925c689L955K784L41k147k251q17K108L521J902r79l585m243j517J352L055K705
$$ plain form
1815 314 -441 -2704 -5586 -5897 -2148 3147 7099 7008 4115 404 -1085 1119 4244 6236 4901 681
1831 681 -4061 -6573 -5433 -2281 -22 -181 -3116 -5655 -5676 -2372 2372 6255 5857 3043 -444 -1750
1847 -1750 670 4204 6972 5809 1922 -2632 -5320 -4132 -1549 525 -652 -3639 -6842 -7582 -4307
1862 -4307 771 4828 6090 3809 851 -222 1542 4638 6417 5483 1027 -3453 -5758 -4170 -980
1877 -980 1173 269 -3107 -6462 -7313 -4271 626 4295 5347 3049 286 -105 1350 4846 6768 5524
1893 5524 1535 -2911 -4812 -3706 -979 811 114 -3164 -6416 -6761 -4075 974 4729 5323 3209 459
1909 459 -952 673 3541 5447 4886 585 -3214 -4672 -3288 -242 2338 1620 -1167 -4638 -5583 -3689
1925 -3689 266 3050 3391 1244 -1007 -1824 284 3805 5707 4728 1143 -3100 -4617 -3265 -210 2495
1941B495k42k784k749j340J851L330K565l87k427k895n29K031L492K164r06k498
1957A171l325q99J221L640K107o48k847l653j599J542L265J994j5k725k575m40
1973c786J833L991K541k02k987k615j598J627K975J994m63k816k858j213J376
1988b201K821K083r26k923k932j058J958L689L277L43k267k778j112J368K834
2003B176J709o67k748l119q63J794K655J890o31k684l090r93J841L131K825k86
2019B940k184k870p27J704K996K220m11k447l065q99J430K462K105o63k988k748
2035c145j586J773K646K200j17j980k150m97K172K579K272p26k261l084n87J646
2051h45L110K071o54k491l597j756J074K094J893k29j989j917l60J986L196K399
$$ plain form
1941 2495 2253 -531 -3280 -4620 -2769 561 3126 2739 312 -2583 -3112 -1081 2411 4575 3669 1171
1957 1171 -2154 -3053 -1832 1808 3915 3267 420 -3233 -4832 -3290 -25 1969 1954 -771 -3346 -3786
1973 -3786 -1953 2038 4579 4377 1390 -1225 -2823 -1196 1779 3773 3310 494 -2364 -3577 -2201
1988 -2201 620 2703 1777 -1146 -4078 -5136 -3178 511 3788 4131 1864 -914 -2026 -658 2176
2003 2176 3885 3218 470 -2649 -3512 -1718 937 2827 2196 -488 -3578 -4571 -2730 401 3226 2940
2019 2940 756 -2114 -2841 -1137 1859 4079 3668 1221 -1844 -2743 -1313 1149 3254 2591 -397 -3145
2035 -3145 -4731 -2958 -312 1888 1771 -209 -2359 -2856 -684 1895 4167 3441 1180 -1904 -2491 -845
2051 -845 2265 4336 3682 1191 -2406 -4162 -3088 -994 899 670 -1319 -3236 -3596 -1610 1586 3985
2067C985R4k527k673p77J508K745J521J44k855l441j496R38K644J715n36k401
2083a412k386q33K022L608K020L24j817k191r02J538K201K055k83k417k832j278
2099b583J192K037R26r55k614k710l97J658L251K812L53j791k089q49J643K501
2115B385K092r4k087k668j344Q26J889Q18r13k919k548j248J500K739K523M07
2131A358j286j333k69J861L017K028J48k408k603j595P63J582P00q91l046k844
2147d818j346J018K520K334P86r06q65M71K130K738K205o38k596k736j354O75
2163c82J837N47j325k997k967j498J244K355K726N58n76m39q2K411L098K141p74
2180E877k327k673j563M60O02N72j024k389l079q24J305L128K116N04o64q60L37
$$ plain form
2067 3985 4079 1552 -1121 -1898 -390 2355 3876 4020 1165 -2276 -3772 -2834 -190 1525 989 -1412
2083 -1412 -3798 -4631 -2609 999 3019 3343 1526 -665 -1567 -29 2172 4227 3944 1527 -1305 -2583
2099 -2583 -1391 646 1572 617 -1997 -4707 -5104 -3446 -195 2617 2970 1179 -910 -1759 -116 2385
2115 2385 4477 4383 2296 -372 -1716 -890 999 1817 904 -2015 -4563 -5811 -4311 -1572 951 1358
2131 1358 72 -1261 -1530 331 3348 5376 5524 3116 513 -1082 -319 1263 1963 1072 -1974 -4818
2147 -4818 -6164 -5146 -2626 -292 494 -412 -1277 -806 1324 4062 6267 5629 3033 297 -1057 -382
2163 -382 1455 2002 677 -2320 -5287 -6785 -5541 -3186 -460 98 -478 -917 -999 1412 4510 6651 5877
2180 5877 3550 877 -686 -226 376 948 -76 -2465 -5544 -6368 -5063 -1935 181 685 21 -839 -502
2197e02J785L098J834j74k296l281j736J74J132L95o07k142k441l32J360K576
2213a157J783M06p73j627O07K089K769J728k31k686k918j993k03J591Q95m89k105
2230b314j557n74J231K843J742O06j168j579J27J252K157J094J62k156k672r80
2246a786K17J198J150q70j700j955k93J415K555K493L14j532j370j141J344K196
2262B235J281j03k151k101j284L34J160J064m55j580j713j89J918K585J890L5
2278B926j460j518j277Q53J833J442k70j554k430r22O45J135J182l54j012k108
2294b889n44J386K801J785N93j343j322n84O19J291J067p80k496k385q21J013
2310b609J686J709j15j319j721k95J524K161K352N9p33k129n03K65J083R25j230
$$ plain form
2197 -502 1283 4381 6215 6041 3745 464 -1272 -1098 34 429 -178 -2320 -4761 -5093 -3733 -1157
2213 -1157 626 1032 259 -1368 -761 1328 4097 5825 5594 2908 -10 -2003 -2206 -615 280 -209 -2314
2230 -2314 -3871 -4445 -3214 -371 1371 1977 809 -770 -643 609 2766 3860 4022 1866 -806 -1786
2246 -1786 -1569 -371 779 -91 -1791 -3746 -4039 -2624 -69 2424 2738 1206 -164 -1305 39 2235
2262 2235 3516 3413 1262 -839 -2123 -1789 -629 435 -20 -1600 -3313 -3502 -1584 1001 2891 2926
2278 2926 1466 -52 -1329 -476 1357 2799 2529 975 -1455 -2377 -1732 -597 585 231 -781 -2889
2294 -2889 -3433 -2047 754 2539 3132 1789 467 -117 502 1793 2860 2080 -416 -2801 -3622 -2609
2310 -2609 -923 786 671 -648 -2369 -2664 -1140 1021 3373 3432 2699 570 67 332 1415 2340 1110
2327A110j963k049j060R31K026J440L69j430j510l47J520K553K400J32p91k098
2343A233j174O36N91N96j110k048k346r30O72J979J926L39o17o96j9J162K030
2360B224K216p49j395j768j023P07J101P06p61k696k047j374O60K025K020O77
2376E23m96o85q9J318J916J039L92j621j884r70K89J201K43p90j741k507o91Q93
2394c660K025J912N69o54r48j01J338J672J471j23j364j710j004j13J083Q73n07
2411G59j607j723r99M90J280J846M13q66o78M45J063K114J541m76j378k053j332
2428a161O1J181J057j21j300j777j103M56J506J412J3n73q52P5J048K002J696
2445C620n09q68k191q55o6J214J109o06j249k016p66Q65J386J299L46r51p63l52
$$ plain form
2327 1110 -853 -2902 -3962 -3031 -1005 435 804 -626 -2136 -2483 -963 1590 3990 4122 3331 1233
2343 1233 59 695 1286 1882 772 -1276 -3622 -4552 -3880 -1901 25 364 -253 -949 -968 194 2224
2360 2224 4440 3691 2296 528 -495 212 1313 2019 1258 -1438 -3485 -4859 -4199 -2174 -154 523
2376 523 27 -658 -747 571 2487 3526 3918 2297 413 -557 -268 933 1176 386 -1355 -3862 -4553 -3660
2394 -3660 -1635 277 846 192 -756 -857 481 2153 3624 3501 2137 427 -577 -690 393 1266 759
2411 759 -848 -2571 -3570 -3080 -1800 46 459 -407 -1085 -640 423 2537 4078 3602 2224 171 -1161
2428 -1161 -1100 81 1138 1017 -283 -2060 -3163 -2707 -1201 211 224 -349 -1201 -1126 -78 1924 3620
2445 3620 3111 2243 52 -803 -869 345 1454 848 -401 -2417 -3183 -2318 -932 367 713 -238 -1001 -1353
2463a353J263J757J376J57j134j797o93m46J044N81m72j577j262n18R04K077J312
2480A219J23r95j318j63R89J834R75K63r00j788j563J94P38M87k89q79j151n24
2498b748P30K410J480p0p70r97p04O60J594O22Jj553j758r37O0J321Q41k36p89
2517h43j291j81Q45K273J730N2o28j354n51M71N41N18o17j582j661n51O18J207
2535a004J320k3p81r02k79J205J910J804K42r56j361j163p1M69K16m23j392j410
2553b599q69Q81J269J305O01o31r44n5J607J466J248J99j138j402j120k8N75L20
2571F85o91j384j758q99O01J700J656R36l93m73P9N49J097J325qr60j527q65J30
2590b00Q98kn05j581j844p2N77J337J765N80o53p13m37Q68J564J034M16j007j145
$$ plain form
2463 -1353 -90 1667 3043 3200 2066 269 -424 -870 174 755 283 -1294 -2556 -3074 -2170 -93 1219
2480 1219 1342 347 -971 -1134 -145 1689 2664 2927 2027 239 -1324 -1130 -392 95 -194 -1073 -2224 -2748
2498 -2748 -2018 392 1872 1802 1032 35 -669 -9 1585 2207 2208 655 -1103 -2040 -1980 -659 182 -54 -843
2517 -843 -2134 -2315 -1470 803 2533 2585 1957 603 52 523 1064 1582 965 -617 -2278 -2829 -2211 -1004
2535 -1004 316 293 -488 -1390 -1669 -464 1446 3250 3492 2536 1175 12 -59 410 626 203 -1189 -2599
2553 -2599 -3468 -2587 -1318 -13 588 -43 -987 -1042 565 2031 3279 3478 2340 938 -182 -210 365 685
2571 685 -6 -1390 -3148 -4047 -3446 -1746 -90 846 453 -20 59 608 1705 3030 3022 2062 535 -330 -200
2590 -200 698 696 191 -1390 -3234 -3306 -2729 -1392 373 953 300 -413 -850 18 1582 2616 3032 2025 880
2609H80j123K97O83O46p06j431j573o11oJ437J319L92o84n92o3R88J142J418N3
2628B466n43j374o74K29J206O56o3j448j945j168n9P50R59L16j78q78l1J125J728
2647A074J166N17p78r54p38J97J194N04k12j448j606j731K24Q25O42K33l70j035
2665b296L92O84J695J622L04l37p69m61K46Q40L44j77j724j358j365k66J157M62
2683a007L77o00r46j99J099J979J467N51l32r16r19q5P00O15m83q10j377j045
2701a931M12O78N39r1o80q92m98J322J419J349M65m41j176o62J94Q04R53l31q63
2720E70j434m98J76R88O04r2l15j278l78M28J336Q40M08p74n89p01M09J052O75
2739A427j00o31j290m36K43J139P20J44p16j333r86J63R06Q26K65l51p91j66N90
$$ plain form
2609 880 -243 54 737 1383 677 -754 -2327 -2938 -2944 -1507 -188 204 -480 -1072 -1135 -147 995 2413 2466
2628 2466 1923 549 -125 104 1310 1966 1903 455 -1490 -2658 -2717 -1967 -1008 -692 -870 -1748 -1779 -654 1074
2647 1074 2240 2757 1979 1025 287 484 1678 2182 1970 522 -1084 -2815 -2591 -1766 -1124 -891 -1261 -2296
2665 -2296 -1904 -1220 475 2097 2401 2064 1295 834 1080 1920 2264 2087 363 -995 -2360 -2626 -1469 -1007
2683 -1007 -630 -1230 -2176 -2375 -1276 703 2170 2721 2389 1473 554 469 1169 1784 1301 491 -886 -1931
2701 -1931 -1519 -841 -302 -393 -1073 -1965 -2463 -1141 278 1627 2092 1651 475 -187 7 811 1764 1433 570
2720 570 -864 -1362 -1186 -198 406 314 -1 -1279 -1657 -1229 107 947 1355 581 -8 -709 -300 752 1427
2739 1427 1327 696 -594 -1030 -787 352 1072 1216 500 -833 -1819 -1656 -750 76 341 -10 -801 -967 -377
2758c77R32J171J10j200r09m19M00Q10O50M7r46j007j180K74J053Q25J56o55o39
2777i04o91P10J126J219J59p49o57o54P0Q38P03j19q19r00n72K36O96O09J85m87
2797aj176k71Q06J036J066O2k15j587o89L47N36Q95K25l74j114l20K86Q03N40
2816H55Nq27j275k60J98R31O55J65j78r48m25L08J061P47N02p68o04n49N66N34
2836F93N76R5j054j268n49j97Q90P23m2m09p15j1L65J287Q57L95l13q38r6M5J021
2857A455M06m22r96j664r47p0O53P43K54L4k16l92M80J166J198L20k79n42j059
2876A22N83K56N49m60q05j319j012L14L78J105l88J54o02k31L09J211J365P06
2894B235k73p35o95o14R39N97k40j069j055r24J19P86N41j20j87k80l97P93Q05
$$ plain form
2758 -377 555 1726 1836 636 -273 -692 -292 518 1168 1215 269 -738 -1918 -1644 -591 234 390 -265 -904
2777 -904 -1595 -885 241 1460 1619 870 213 -441 -371 467 1170 1051 232 -668 -1240 -1004 -308 301 486 -1
2797 -1 -1177 -1448 -642 394 1460 1522 1307 -280 -969 -622 -86 809 1034 660 -454 -774 -488 315 855
2816 855 860 33 -1242 -1502 -1304 -373 282 447 269 -679 -1104 -796 265 1012 1514 746 142 -407 159 693
2836 693 1269 1364 310 -958 -1507 -1704 -814 -91 -133 -542 -1257 -1268 -903 384 1241 1636 1323 485 389 434 1455
2857 1455 1861 1439 443 -1221 -2168 -2238 -1585 -842 -588 -554 -770 -1162 -682 484 1682 2002 1723 1181 122
2876 122 705 961 1510 1050 245 -1074 -2086 -1772 -1394 -289 -677 -523 -1125 -1356 -1047 164 1529 2235
2894 2235 1962 1227 532 -82 857 1454 1214 145 -910 -1834 -1715 -929 -388 -508 -695 -975 -1372 -579 226
2913B26J132N77o54r93q68L60N56R87N3n64q78n55m54N79M70k72l6r36k45K87
2933a228P42J258J98l64m37l91n0Q54R12M3m26j020o54L38L62M41j03m95j339
2952a359n94NR34Q46L21k07l30j37P07N08J177N2l53o74r64K71K12J82j43r30
2972d76j118o33n1Q06J125M98j49k59l26M75R19R26J28m44q80n97L36L96L58j90
2992H44o18j260q30R3L50N91M32o4k90j74P58J331Q46J22n42j096n85j47Q71M2
3012F74J21p97j013m83J34M08M62M05k57o36Q7J69O89R96L23j55p59k64K63N71
3032I38O02l73l43j037r38k94L83M39N09l83o93R6M7Q23J280M74n91n07p76M52
3052A08N45Q24J36r52n98n70M8J84P6K94q95p86m16L33R59J047N33P7k46k50J12
$$ plain form
2913 226 1358 1935 1281 288 -580 -220 336 1323 1376 812 -66 -621 -1075 -496 -26 -298 -334 -1270 -1515 -1228
2933 -1228 -486 772 970 606 169 -222 -272 582 1494 1537 1111 91 -563 -225 137 578 475 -20 -1359
2952 -1359 -1953 -1948 -1014 -168 153 -54 -384 -521 186 694 1871 1923 1570 896 -68 203 415 597 454 -476
2972 -476 -1594 -2227 -2278 -1472 -347 151 2 -257 -583 -108 811 1737 1865 1421 541 -56 280 676 1034 844
2992 844 226 -1034 -1864 -1771 -1421 -830 -398 -462 -752 -926 -168 1163 2009 2131 1589 493 -92 -239 632 674
3012 674 795 -2 -1015 -1498 -1364 -956 -494 -89 -346 -982 -895 -726 -37 959 1282 1127 368 104 367 938
3032 938 1540 1167 824 -213 -1151 -1445 -1062 -623 -114 -497 -1190 -1094 -1047 -224 1056 1530 939 432 -344 108
3052 108 653 1477 1613 661 63 -507 -459 -275 -199 95 -800 -1586 -2002 -1669 -710 337 870 947 701 451 563
3073E63Q37J77k68l25j055n55k30M78M89j17m01r69m57L53R61Q23L58L7k20m17
3093F2O4P30O21M1p55n85m95l01J23O85m8m63o14o41M83O09Q06N63l86m98k76
3114b75j6R45K84K6m79q73p37L80L95M59P34k42o63p10R3N13N40K15p06n94qJ0
3136g09N54Q71Q2l32o49o78N96M05P08M44n43p22n66J45O48K67Ln38p05k62m63
3157a444J030L42K72j55m90k13M12N70R98J56n20k60p31k30N12L32l78n60q06
3176a163m63J17Q77L02N38j18l82J9j20Q28O80J75k19p71N7l80M46L33J14o20
3196B50r38m90k48N58Q7O12k89j73k63L05O73R59M31j63m63o02o8O50J23j55m79
3217C17p90n94k50J52K75L86k75k55l05N28O84O39P37j44J89p70M51K84N82j73
$$ plain form
3073 563 1400 1577 1309 984 -71 -626 -856 -378 111 -6 -407 -1376 -1833 -1480 -519 304 662 699 479 62
3093 62 126 856 1477 1518 763 178 -317 -618 -495 190 142 -321 -935 -1576 -1093 -484 322 885 499 1 -275
3114 -275 -291 654 938 964 485 -388 -1125 -745 -350 109 843 601 -62 -772 -679 -166 374 589 -117 -711 -719 -709
3136 -709 -155 716 798 466 -183 -861 -265 140 848 1292 749 27 -539 -394 254 521 524 -14 -719 -981 -1444
3157 -1444 -414 -72 200 45 -445 -658 -246 324 1322 1478 958 698 -33 -263 249 581 203 -357 -1163
3176 -1163 -1626 -1509 -632 -330 208 90 -292 -273 -393 435 1115 1290 1071 300 357 -23 423 756 870 250
3196 250 -688 -1178 -1426 -868 -781 -169 -458 -631 -894 -589 84 1043 1474 1311 848 246 178 828 951 796 317
3217 317 -473 -1067 -1317 -1165 -890 -504 -779 -1034 -1339 -811 -127 512 1249 1105 1294 524 975 1259 1841 1668
3237A668p47j022j120j86L3J47K28m02k98J24M36R48Q44M08M63k60k14K20O13
3256A883J26o21m12o23j465j60p3l6K39l90l85l46Q41J026J070Q77L9n1r9r2N08
3277A856M9j97q57r73j223n04L14K75l82J69o33L7N97J022J244Q82O8k33j40k5
3297A346K86q1j28r32p33j049j91J33L90jj27o32J24L29J275P15O78K50k29p24
3317F99M81r4K95j28p73j050n83k17Q1O38k10P4j65o9R0J032O38N46k2m76k14
3338E73j64K36L46k65j63j030k35l66L83K89M14l17m60k44P7P28O98O6J41n67
3358A40J69k10K32M03P6k01q90k61j70L36M72l6J64l08l69q8M51N55J25n1n96
3379e7m00n6N55K61N35n07k68m83q6L77M56R4n1m36p60O51k72Q67J35m28k67l76
$$ plain form
3237 1668 921 -101 -1221 -1407 -1374 -1227 -999 -1401 -1699 -1575 -1139 -191 653 1061 1524 1264 1050 1270 1883
3256 1883 2009 1388 976 353 -1112 -1272 -1345 -1381 -1142 -1532 -1917 -2263 -1422 -396 674 1551 1590 1539 1440 1348 1856
3277 1856 1905 1708 851 -122 -1345 -1849 -1535 -1260 -1642 -1473 -2106 -2069 -1472 -450 794 1676 1744 1511 1371 1346
3297 1346 1632 1551 1423 491 -242 -1291 -1482 -1349 -959 -960 -1087 -1719 -1595 -1266 9 724 1402 1652 1423 699
3317 699 1180 1086 1381 1253 480 -570 -1153 -1370 -1289 -651 -861 -787 -952 -1021 -931 101 739 1285 1263 787 573
3338 573 409 645 991 726 563 -467 -702 -1068 -685 -396 18 -299 -759 -1003 -926 -198 500 566 707 140
3358 140 309 99 331 734 810 609 -281 -542 -712 -376 96 60 224 -84 -453 -541 -90 465 590 539 -57
3379 -57 -457 -513 42 303 838 331 63 -420 -506 -129 327 421 370 -66 -826 -175 -447 420 555 127 -140 -516
3401e16O1M07J58J31L20r77k86k5P12L82l02L65l39m08J87N59J81M21m12j148
3421e29J65m56M58J34L19m72j27n76L94L69O30K67l22j15n5J23M26N43o8m49o80
3442b1k33m13K59J3K38l26m98n08M00O71P82K10J63j37J08j32J70M10J76n16q01
3463A5m72m06K58l5M9m09j64j00L53N14N37N60J92j53j56J50L24M91j9j81j203
3484A45n58n68M4J09k42j3l37o0M09O03P31M27L37j39l0j23N96J30l27J0j022
3505A22o35k28j45nm1j27m65j65L70P08Q00K75K61K05j94J41L54L78j40m04o79
3526C86o86m58J74J35k83k93j54l24K9O89Q60L58O58o34K42K24L85L13j57n27
3546I37n84n36k30J68j76n5r05r9k66M32N07L02O09J69k06L17K35N23K39M3k23
$$ plain form
3401 -516 -455 -48 110 241 561 -416 -702 -727 -15 367 65 430 91 -317 -130 429 610 1031 619 -529
3421 -529 -364 -820 -362 -228 91 -381 -508 -1084 -690 -321 309 576 254 139 84 207 633 1176 1108 659 -21
3442 -21 -254 -667 -408 -395 -157 -483 -981 -1489 -1089 -418 364 574 737 600 708 576 746 1156 1332 816 15
3463 15 -457 -863 -605 -640 -591 -1000 -1164 -1264 -911 -397 140 700 892 739 583 733 1057 1548 1529 1348 145
3484 145 -413 -981 -937 -828 -1070 -1083 -1420 -1480 -1071 -468 263 690 1027 888 858 735 1331 1461 1134 1144 122
3505 122 -513 -741 -886 -891 -932 -1059 -1524 -1689 -1319 -611 189 464 725 930 736 877 1231 1609 1469 1065 386
3526 386 -300 -758 -584 -449 -732 -1025 -1179 -1503 -1474 -785 75 433 1091 457 699 923 1308 1621 1464 937
3546 937 353 -183 -413 -245 -421 -476 -1381 -1480 -1746 -1314 -807 -505 104 273 67 384 619 1142 1381 1424 1201
3567A201q13n66O9k6j8k42j70n60l05N13L62K32L08L31j71J68N5N05K68J24n6
3588A209o69o07j01J6jq0p2l68k21j18M69J60N57Q0k87J19l7M99J42J05j92j69
3610D34m66N9o6K28M9L31r64k88J63K36J38P2j69J51k31j49O20R1P6m9r7r7j24
3633e2L19J83N05m41m52k21k2r8M41j18k24j88l60j29K40K91N75j20o8p0K09K64
3655D64L95K58n80n02J24m82J81R4J58k33o87j63J3O50K24J41K20l20J95J61O4
3676C75Q04n9l18k36j96l38mL8m2m03m42j01m4J48N20R4R5M3k01L28K50L33k5
3699F19j9j53j72N3k13L6J76k74l85m38R8J66J83J28l46J22j21K84j46O22K44
3720D64q9K91o98L52K54J27R1l70m27l60K18j93O1k22l84K41k25p3O46K27L03
$$ plain form
3567 1201 388 -178 -109 -135 -153 -395 -565 -1125 -1430 -917 -555 -323 -15 316 145 313 368 873 1141 1265 1209
3588 1209 540 -67 -168 -152 -153 -233 -305 -673 -894 -1012 -543 -383 174 254 -33 86 49 548 690 795 603 434
3610 434 -32 27 -39 189 238 569 -395 -683 -520 -284 -146 -74 -243 -92 -323 -472 148 239 315 266 169 72 -52
3633 -52 267 450 955 514 62 -159 -181 -279 162 44 -180 -368 -728 -857 -617 -326 249 129 61 -9 200 464
3655 464 859 1117 537 35 159 -323 -142 -48 110 -123 -810 -973 -960 -310 -86 55 275 -45 150 311 375
3676 375 1179 1120 802 566 370 32 28 66 24 -379 -821 -922 -966 -818 -298 -204 -109 -66 -267 61 311 644 619
3699 619 600 447 275 328 115 151 327 53 -332 -770 -672 -506 -323 -195 -541 -419 -540 -256 -402 220 464
3720 464 375 666 -32 320 574 701 792 422 -5 -365 -147 -340 -279 -501 -885 -644 -869 -942 -296 -69 234
3741B34L41j41o3r0K18N84n5k56m01m92M6l26J44m87J36l28o0J83L20N55K58p3
3763B47kJ69J99L15K25o1j33q15k66k14K20k24p8l69l83P5k62P00L04K46O79k03
3785C69j47M07K01K87mk32o37J82k27m10j08j39k40J4m62M31K08K68K7J31j2J26
3807C3K67j3M15J18l95j5l5Mj09J0k9l3n95p4l18Q5M30K3j18j98J7L05N01l8L78
3832F16mj66M6J75K23j19J15k78m33n30k04M9Rk36q3l62K92j1K48P32M59M61j92
3855H07q8J15K55j2r3j77n28m43l38k10p6Kl20Q3k19M21K00N58M62K43J10L1K35
3878A018Q2K12k1n00m22o65k00l16L0j65j81j0j4K55J84O45K81M31o5L37n0L52
3900A218k49J32k42m88l38o31m5M4j72j08k41m8kJ57O79L23mL32M0L21M09l0J26
$$ plain form
3741 234 575 434 371 281 499 1083 1028 772 371 -121 -75 -401 -257 -744 -608 -936 -996 -813 -493 62 320 247
3763 247 245 414 613 928 1153 1092 959 144 -122 -336 -116 -340 -418 -787 -1170 -1095 -1357 -657 -353 -107 572 369
3785 369 222 629 830 1117 1113 881 244 426 199 -211 -319 -458 -698 -684 -1146 -715 -507 -239 -212 -81 -93 33
3807 33 300 287 702 820 425 410 375 379 270 280 251 218 -377 -451 -769 -684 -254 -231 -349 -547 -530 -225 276 238 616
3832 616 612 446 492 667 890 771 886 608 175 -355 -559 -510 -501 -737 -820 -1182 -890 -901 -653 79 538 999 807
3855 807 719 834 1089 1077 984 807 279 -164 -502 -712 -788 -786 -1106 -1023 -1242 -821 -621 -63 399 642 752 783 1018
3878 1018 1100 1312 1291 791 369 -296 -496 -812 -782 -947 -1128 -1138 -1152 -897 -713 -68 213 644 579 916 866 1218
3900 1218 969 1101 859 371 33 -598 -643 -599 -771 -879 -1120 -1168 -1170 -1013 -334 -11 -15 317 357 678 1087 1057 1183
3923A183k78n60K2j75m08m8k62j43k17l04J46J14O30m7P6R6L53j66N73J04M79
3944A168j43k27J1n46J99m18m42k9k50k56j09o6N46kR3M36K26J49N4K08N78j99
3966I81J1m18Q3j14k19l05k53k13n11j1J94l14P31J59j59p0O08L69M59j56j07
3987G45l1k64R0j94K9j70n25k1m17N4J23J70n0M06N8j69R9L28Q3K47j14L4j28
4010C83k09k17J71q3k86j77J28O3l92N67k88J32J67j27j10L51Oj09J31m7k08J85
4032C1k87J86J91M2O6m10K8M09j82j6MQJ18n66J13O6j5j0k08J02n5M10J92J2J66
4057C95j41j3P3J89j69J9m00Mk08j6Lk46J67k75kJ34L6K64L40M6o3L27j03J68
4081E29j57K81q0l49r9j1n03N1J04l40j32K43l39L28R1L25K30J57p5M05J6j51
$$ plain form
3923 1183 905 345 367 192 -216 -264 -526 -669 -886 -1190 -1044 -930 -300 -347 -271 -175 178 12 585 689 1168
3944 1168 1025 798 809 263 462 44 -398 -427 -677 -933 -1042 -1108 -562 -564 -471 -35 191 340 394 602 1180 981
3966 981 992 574 657 543 324 19 -234 -447 -958 -969 -775 -1089 -358 -199 -358 -428 180 549 1008 852 745
3987 745 714 450 540 346 375 205 -320 -341 -758 -704 -581 -411 -461 -55 3 -166 -67 261 344 591 477 511 383
4010 383 174 -43 128 45 -241 -418 -290 -227 -619 -52 -340 -208 -41 -168 -278 73 79 -30 101 54 -154 31
4032 31 -256 -70 121 163 229 -181 -153 256 74 58 62 70 188 -378 -265 -199 -214 -224 -432 -330 -385 25 217 229 395
4057 395 254 241 314 503 334 353 -47 -43 -251 -267 -264 -510 -343 -618 -620 -486 -450 -186 154 200 137 464 361 529
4081 529 372 653 573 224 125 114 -389 -338 -234 -574 -706 -463 -802 -474 -383 -58 172 329 254 659 675 524
4103E24J03R7j0m86l79j0R8l00j89l3n0k86J51M45J82J31J44L8L62j50K59k43
4125C98L35K10l92N8j21n65m1l12k58Q2J8n5k52K09K03M05RJ76K94j32M05p8K30
4148H26k2j36n07j07j9m15O1m02n2Lk48P2J37N49J04M05Q3M38J37j14n6J1j12
4171F36j70j66j79m87j07M6j20l93j16K35M22O3l0O94l9mL68j03L34k61m0r9l15
4194A69k66J77k29l95j33P5j85Q4L21J84K7RL97J13j72L73m2J24j32N0j57l06
4216H6J06k05k78j82n4j64L36R3M8j54J93J79j49M21k95L08J54j45j11R2n8J35
4238C56l59K57k13j18M9l41j03j35K27J76j00J91J00k8J01j33M93L96l38j51J85
4259E12q0j17n7k12k64j43p5P3l1q0j52K02pj0N28Q1J61K18J26j53k4J2j3M6k41
$$ plain form
4103 524 627 724 714 228 -151 -161 -63 -363 -552 -585 -635 -921 -770 -325 -143 -12 132 170 532 382 641 398
4125 398 733 943 551 609 488 -77 -118 -430 -688 -606 -588 -643 -895 -686 -483 -78 -69 107 401 269 674 596 826
4148 826 804 668 161 54 35 -380 -319 -721 -773 -770 -1018 -946 -809 -260 -156 249 332 770 907 793 737 748 636
4171 636 466 300 121 -366 -473 -427 -547 -940 -1056 -821 -399 -336 -366 328 289 285 653 550 884 623 583 484 169
4194 169 -97 80 -149 -544 -677 -602 -787 -703 -382 -198 -171 -162 235 348 176 549 507 631 499 549 392 86
4216 86 192 -13 -291 -473 -527 -691 -355 -262 -214 -368 -175 4 -145 276 -19 289 443 298 187 279 221 356
4238 356 -3 254 41 -77 -28 -369 -472 -607 -380 -204 -304 -113 -13 -41 60 -73 420 816 478 327 512
4259 512 432 315 258 46 -218 -361 -436 -363 -394 -474 -626 -424 -431 -441 87 168 329 547 673 520 496 508 495 541 300
4284C00k38m57l8k58J31m1L21l43O26j47K63K98l37n0J52q3K71m06K33K41l65
4305G3L4l71J09j60J16k55L77j91K57n3O4K10m0j6P4k53j10K53j34L00j30j79
4327b5j78K80jk7k5N7k18k06L16m7J02j49J02l92k02M84r3L20j32M23l23q7J72
4350A51K73J42l61K30n16k87J90m2p9Q4j61j25j88J72L46J47J21n8N10l0k71K49
4372D97N6j73N1n75j62Q8r1J30j49K00k34J72l04q7L85M03k71J37M56k40M15j23
4394E81J20l41J02l49r6L3p0J1k42l22J08J98o2n1M04l05K89j46N0L48L53K29
4416H42l57L26m04k1j16k85j47K02l65k2j82q0J1K05lN3J15O0L16L00J66R1m7
4439F58l60L43k35p2km88j56j97j74n3J9K64j37R1l2L02K43N18p1P23k82j35K85
$$ plain form
4284 300 62 -395 -433 -691 -560 -601 -280 -623 3 -144 119 417 80 30 182 99 370 -36 197 438 73
4305 73 107 -264 -155 -315 -199 -454 -77 -268 -11 -64 0 210 170 154 228 -25 -135 118 -16 284 154 -25
4327 -25 -203 77 76 49 24 81 -137 -343 -27 -74 28 -121 -19 -411 -613 -129 -222 98 -34 389 66 -21 151
4350 151 424 566 205 435 -81 -368 -178 -220 -299 -215 -376 -501 -689 -517 -171 -24 97 39 549 519 248 497
4372 497 553 380 431 -144 -306 -218 -309 -179 -328 -128 -362 -190 -494 -581 -196 207 -64 73 529 289 704 581
4394 581 701 360 462 113 17 50 -20 -9 -251 -573 -465 -267 -329 -380 24 -281 8 -138 -88 260 613 842
4416 842 485 811 407 386 270 -15 -162 40 -325 -347 -529 -609 -598 -393 -396 -343 -228 -168 148 448 614 705 658
4439 658 298 641 406 334 332 -156 -312 -509 -683 -736 -717 -453 -590 -499 -531 -229 14 532 461 1184 902 767 1052
4462A052n90J4L4n89J84o91J44l77j27R4K99l11K33K23J27O38K22J28R2j61J95
4483H33j01K80m74j09n02l46m93L11j16l79L50ln5R8O26k7N87N6K86j3l99M32
4505H42o3l91l6l49l38J24j87m8j44l52K57M8K23M28j58M12r4K09J28k45M67J00
4527H33n9k00k60k88l44j72J16J6J71n47J22l2K43J96P1L78l6L48p5l5K93J65
4549I04l66n5k62k27k84n5M7l76J57l66k39N84L86O8R4K03n0R9O12k61J28l45
4571C96J02l94K48l62J87k93j50j54r5Q1J03n4L62l2j26K00j68M64M11j38m9k21
4593C18j69J34j42J06l59J22k91j94K42k0K91R3l0l62K4Q7K15K55j3J64k72K0
4615B19k16K90j22K93j08m55l10J84J61J67q2K0j88J30k53J6K57L5J26k46J03
$$ plain form
4462 1052 462 476 510 -79 105 -586 -442 -819 -946 -852 -553 -864 -631 -408 -281 357 579 707 799 638 833
4483 833 732 1012 538 429 -73 -419 -912 -601 -717 -1096 -746 -749 -804 -706 -80 -107 480 536 822 809 410 842
4505 842 779 388 352 3 -335 -211 -398 -446 -590 -942 -685 -637 -414 14 -144 268 174 383 511 266 733 833
4527 833 774 574 314 26 -318 -490 -374 -358 -187 -734 -612 -644 -401 -205 -134 244 208 556 481 446 739 904
4549 904 538 483 221 -6 -290 -345 -298 -674 -517 -883 -1122 -538 -152 -84 10 213 163 262 874 613 741 396
4571 396 498 104 352 -10 177 -116 -266 -420 -515 -434 -331 -385 -23 -55 -181 19 -149 315 726 588 539 318
4593 318 149 283 141 247 -112 10 -281 -475 -233 -253 38 131 101 -261 -237 -150 65 320 307 471 199 219
4615 219 3 293 171 464 356 -99 -409 -225 -64 103 21 41 -147 -17 -270 -254 3 38 164 -82 21
4636B1nJ17M74k45P7l71L3j46L20K2j90j82J07m10l58K75J32Q0q5JK5j50N10M27
4660D79r2J81j66O9k06J43R2o4m94k80J20l52L0J01J84k00M5n0rM97J63M26Q2
4683F99j9m69P6K63q5j25l70r5k07k18k44N35k28o5O2%R4L18M03n6P1R2N7j47
4707C42J09M4J33j34m38k35r7J5N7l00l46j53M49J4K29L83L8L34j21K21P3j38
4729D79K21M1k54k78j64k68knj09j8l15k12j25L39N53r3K99J98j27K59L87M13
4751A219m06%k21k64k47j22n0j14m07k38J30k15L30K11L17o2K34P0K63L54J3N04
4773A299k78m58n48k5K95m41p7n6m85K3k19P7K93K60J48J14j53J81P36K48K38
4794A172k93k39m63m0l6o9k19r3k46j44j41K57J78K94k75Q9j31L11N49J66M1j62
$$ plain form
4636 21 16 133 607 362 439 68 101 -45 275 297 107 -75 32 -378 -736 -461 -329 -249 -334 -333 -308 -458 52 479
4660 479 387 568 402 471 265 408 500 436 -58 -338 -218 -570 -540 -439 -255 -455 -410 -460 -469 28 191 617 699
4683 699 680 211 287 550 465 340 -30 -125 -332 -550 -794 -259 -487 -552 -490 -490 -396 -78 325 269 340 432 489 342
4707 342 451 495 628 494 56 -179 -276 -261 -204 -504 -850 -1003 -554 -540 -311 72 110 444 323 544 617 479
4729 479 700 741 487 209 45 -223 -225 -230 -339 -357 -672 -884 -1009 -670 -117 -210 89 287 160 419 806 1219
4751 1219 813 813 592 328 81 -41 -91 -205 -612 -850 -720 -935 -605 -394 -77 -139 95 165 428 782 795 1299
4773 1299 1021 563 15 -10 285 -156 -233 -289 -774 -751 -970 -893 -600 -340 -192 -78 -231 -50 686 934 1172
4794 1172 879 640 177 137 101 32 -187 -280 -526 -670 -811 -554 -376 -82 -357 -268 -399 -88 461 627 668 506
4816E06K69n54N7j08J02j15p19J04k12k2L07Lj31K25j53k5J49N55J16P1Q3p4k33
4839B01L38m4k9M4n75Q8n14r6M39j23J28r4J4k96m8O11M22P1k07J24n46N93k56
4862B45K93R6o04R0o75L4K28Q8j38j01m9j61L43M30J34K05j44j47l1j2K98J55
4884E77j69R8k74l93j9J11P5N0k47p3J56m53M47M21O5pl89P7j2J35M19m45L0j17
$$ plain form
4816 506 775 221 278 170 272 157 -562 -458 -670 -692 -385 -382 -513 -288 -441 -466 -317 238 354 425 508 434 201
4839 201 539 495 466 510 -65 23 -491 -587 -148 -271 -143 -237 -223 -519 -567 44 466 537 330 454 -92 501 245
4862 245 538 634 30 120 -555 -521 -293 -205 -343 -444 -493 -654 -311 119 253 458 314 167 136 124 422 577
4884 577 408 506 232 -161 -180 -69 6 56 -191 -264 -108 -561 -114 307 372 365 -24 53 41 176 595 150 180 63
$$ [...]
8191B37
##END NTUPLES=NMR FID
##END=
