##TITLE=1H_5037-PEA
 200.13MHz,CDCl3.
 8 sc
 
 11.12.2025
##JCAMPDX= 6.0         $$ Bruker NMR JCAMP-DX V2.0
##DATA TYPE= NMR FID
##DATA CLASS= NTUPLES
##ORIGIN= UXNMR, Bruker Analytische Messtechnik GmbH
##OWNER= pz
$$ XWIN-NMR		Version 3.5
$$ Thu Dec 11 16:03:16 2025 Russian Standard Time (UT+4h)  she@DPX200
##.OBSERVE FREQUENCY= 200.1313
##.OBSERVE NUCLEUS= ^1H
##.DELAY= (6, 6)
##.ACQUISITION MODE= SIMULTANEOUS
##.ACQUISITION SCHEME= undefined
##.AVERAGES= 8
##.DIGITISER RES= 18
##SPECTROMETER/DATA SYSTEM= spect
##.PULSE SEQUENCE= zg30
##.SOLVENT NAME= CDCl3
##.SHIFT REFERENCE= (INTERNAL, CDCl3, 0, 14.3821)
##AUDIT TRAIL= $$ (NUMBER, WHEN, WHO, WHERE, WHAT)
$$ ##TITLE= Audit trail, XWIN-NMR		Version 3.5
$$ ##JCAMPDX= 5.01
$$ ##ORIGIN= Bruker BioSpin GmbH
$$ ##OWNER= she
$$ F:/spectra/data/she/nmr/H-C/1/audita.txt
$$ ##AUDIT TRAIL=  $$ (NUMBER, WHEN, WHO, WHERE, WHAT)
(   1,<2025-12-11 16:02:07.84 +0400>,<she>,<DPX200>,
      <created by zg, POWCHK disabled, PULCHK disabled
       configuration hash MD5:
       00 E9 B6 7A A2 85 ED C7 34 08 36 98 17 FE 4E 26
       data hash MD5: 16K
       A1 FF 35 38 54 FD FB 91 3D 5D 72 C6 FB 77 EB 26>)
$$ ##END=
$$ 
$$ hash MD5
$$ 2D DF BF 36 09 00 B0 55 E8 44 68 90 BB 4C 49 12
##$RELAX= 
##$RELAX= 
##$RELAX= 
##$RELAX= 
##$RELAX= 
##$RELAX= 
$$ Bruker specific parameters
$$ --------------------------
##$DU= <F:/spectra>
##$EXPNO= 1
##$NAME= <H-C>
##$PROCNO= 1
##$TYPE= <nmr>
##$USER= <she>
##$AMP= (0..31)
100 100 100 100 100 100 100 100 100 100 100 100 100 100 100 100 100 100 
100 100 100 100 100 100 100 100 100 100 100 100 100 100 
##$AQSEQ= 0
##$AQ_mod= 1
##$AUNM= <au_zg>
##$AUTOPOS= <>
##$BF1= 200.13
##$BF2= 200.13
##$BF3= 200.13
##$BF4= 200.13
##$BF5= 200.13
##$BF6= 200.13
##$BF7= 200.13
##$BF8= 200.13
##$BYTORDA= 1
##$CFDGTYP= 0
##$CFRGTYP= 5
##$CHEMSTR= <none>
##$CNST= (0..31)
1 1 145 1 1 1 1 1 1 1 1 1 1 1 1 1 1 1 1 1 1 1 1 1 1 1 1 1 1 1 1 1 
##$CPDPRG= <>
##$CPDPRG1= <>
##$CPDPRG2= <>
##$CPDPRG3= <>
##$CPDPRG4= <mlev>
##$CPDPRG5= <mlev>
##$CPDPRG6= <mlev>
##$CPDPRG7= <mlev>
##$CPDPRG8= <mlev>
##$CPDPRGB= <>
##$CPDPRGT= <>
##$D= (0..31)
0 0.7 0 0 0 0 0 0 0 0 0 0.03 0 0 0 0 0 0 0 0 0 0 0 0 0 0 0 0 0 0 0 0 
##$DATE= 1765454527
##$DBL= (0..7)
120 120 120 120 120 120 120 120 
##$DBP= (0..7)
150 150 150 150 150 150 150 150 
##$DBP07= 0
##$DBPNAM0= <>
##$DBPNAM1= <>
##$DBPNAM2= <>
##$DBPNAM3= <>
##$DBPNAM4= <>
##$DBPNAM5= <>
##$DBPNAM6= <>
##$DBPNAM7= <>
##$DBPOAL= (0..7)
0.5 0.5 0.5 0.5 0.5 0.5 0.5 0.5 
##$DBPOFFS= (0..7)
0 0 0 0 0 0 0 0 
##$DE= 6
##$DECBNUC= <off>
##$DECIM= 32
##$DECNUC= <off>
##$DECSTAT= 4
##$DIGMOD= 1
##$DIGTYP= 9
##$DL= (0..7)
0 120 120 120 120 120 120 120 
##$DP= (0..7)
150 150 150 150 150 150 150 150 
##$DP07= 0
##$DPNAME0= <>
##$DPNAME1= <>
##$DPNAME2= <>
##$DPNAME3= <>
##$DPNAME4= <>
##$DPNAME5= <>
##$DPNAME6= <>
##$DPNAME7= <>
##$DPOAL= (0..7)
0.5 0.5 0.5 0.5 0.5 0.5 0.5 0.5 
##$DPOFFS= (0..7)
0 0 0 0 0 0 0 0 
##$DQDMODE= 0
##$DR= 18
##$DS= 0
##$DSLIST= <SSSSSSSSSSSSSSS>
$$ [...]
##$SUBNAM0= <"">
##$SUBNAM1= <"">
##$SUBNAM2= <"">
##$SUBNAM3= <"">
##$SUBNAM4= <"">
##$SUBNAM5= <"">
##$SUBNAM6= <"">
##$SUBNAM7= <"">
##$SUBNAM8= <"">
##$SUBNAM9= <"">
##$SW= 18.0517328524113
##$SWIBOX= (0..15)
0 0 2 0 0 0 0 0 0 0 0 0 0 0 0 0 
##$SW_h= 3612.71676300578
##$TD= 16384
##$TD0= 1
##$TE= 0
##$TE2= 300
##$TE3= 300
##$TEG= 300
##$TL= (0..7)
0 120 120 120 120 120 120 120 
##$TP= (0..7)
150 150 150 150 150 150 150 150 
##$TP07= 0
##$TPNAME0= <>
##$TPNAME1= <>
##$TPNAME2= <>
##$TPNAME3= <>
##$TPNAME4= <>
##$TPNAME5= <>
##$TPNAME6= <>
##$TPNAME7= <>
##$TPOAL= (0..7)
0.5 0.5 0.5 0.5 0.5 0.5 0.5 0.5 
##$TPOFFS= (0..7)
0 0 0 0 0 0 0 0 
##$TUNHIN= 0
##$TUNHOUT= 0
##$TUNXOUT= 0
##$USERA1= <user>
##$USERA2= <user>
##$USERA3= <user>
##$USERA4= <user>
##$USERA5= <user>
##$V9= 5
##$VALIST= <valist>
##$VCLIST= <CCCCCCCCCCCCCCC>
##$VD= 0
##$VDLIST= <DDDDDDDDDDDDDDD>
##$VPLIST= <PPPPPPPPPPPPPPP>
##$VTLIST= <TTTTTTTTTTTTTTT>
##$WBST= 1024
##$WBSW= 4
##$XGAIN= (0..3)
0 0 0 0 
##$XL= 0
##$YL= 0
##$YMAX_a= 92111
##$YMIN_a= -109632
##$ZGOPTNS= <>
##$ZL1= 120
##$ZL2= 120
##$ZL3= 120
##$ZL4= 120
##$ABSF1= 10
##$ABSF2= 0
##$ABSG= 5
##$ABSL= 3
##$ALPHA= 0
##$AQORDER= 0
##$ASSFAC= 0
##$ASSFACI= 0
##$ASSFACX= 0
##$ASSWID= 0
##$AUNMP= <proc_1d>
##$AZFE= 0.1
##$AZFW= 0.1
##$BCFW= 1
##$BC_mod= 2
##$BYTORDP= 1
##$COROFFS= 0
##$CY= -3
##$DATMOD= 1
##$DC= 2
##$DFILT= <>
##$DTYPP= 0
##$F1P= 0
##$F2P= 0
##$FCOR= 0.5
##$FTSIZE= 0
##$FT_mod= 4
##$GAMMA= 1
##$GB= 0.15
##$INTBC= 1
##$INTSCL= 1
##$ISEN= 128
##$LB= 0.25
##$LEV0= 0
##$LPBIN= 0
##$MAXI= 10000
##$MC2= 0
##$MEAN= 0
##$ME_mod= 0
##$MI= 1.114404
##$NCOEF= 0
##$NC_proc= 0
##$NLEV= 6
##$NOISF1= 3.799351
##$NOISF2= 2.8
##$NSP= 1
##$NTH_PI= 0
##$NZP= 0
##$OFFSET= 14.38212
##$PC= 1
##$PHC0= -3706.667
##$PHC1= 12.79234
##$PH_mod= 1
##$PKNL= yes
##$PPARMOD= 0
##$PSCAL= 0
##$PSIGN= 0
##$REVERSE= no
##$SF= 200.129724274929
##$SI= 16384
##$SIGF1= 3
##$SIGF2= 2
##$SINO= 400
##$SIOLD= 16384
##$SREGLST= <1H.CDCl3>
##$SSB= 0
##$STSI= 0
##$STSR= 0
##$SW_p= 3205.1282051282
##$SYMM= 0
##$S_DEV= 0
##$TDeff= 0
##$TDoff= 0
##$TI= <>
##$TILT= no
##$TM1= 0
##$TM2= 0
##$TOPLEV= 0
##$USERP1= <user>
##$USERP2= <user>
##$USERP3= <user>
##$USERP4= <user>
##$USERP5= <user>
##$WDW= 1
##$XDIM= 8192
##$YMAX_p= 0
##$YMIN_p= 0
$$ End of Bruker specific parameters
$$ ---------------------------------
##NTUPLES= NMR FID
##VAR_NAME=  TIME,          FID/REAL,        FID/IMAG
##SYMBOL=    X,             R,               I
##VAR_TYPE=  INDEPENDENT,   DEPENDENT,       DEPENDENT
##VAR_FORM=  AFFN,          ASDF,            ASDF
##VAR_DIM=   8192,          8192,            8192
##UNITS=     SECONDS,       ARBITRARY UNITS, ARBITRARY UNITS
##FACTOR=    0.0002768,     1,               1
##FIRST=     0,             0,               0
##LAST=      2.2672688,     0,               0
##MIN=       0,             -109632,         0
##MAX=       2.2672688,     92111,           0
$$ Real data points
##PAGE= N=1
##DATA TABLE= (X++(R..R)), XYDATA
0@%%%%%%%%%%%%%%%%%%%%%%%jNj0J3j5J6j6J6j7K0k5K8k9L2l7M2m6N1n7O2o7P4
45C9q2R1r9J10j22J33j46J61j81K02k23K47k77L13l56M10m80N70o94Q75j156J643
67I78k639N398k5215q8154Q9374J12369l0418o4318K517J0973R933L9217j865
80E8150p5897l4027N5114L4088l7748l9159p153J1818L1364J9612l0771l1304
92d5913L2155M5788j484j5474j688m496J2281L7693o230n7886j0122M7896K515
105C5035m4428n648J2889k2338k986L8824o613n0558J1837N4801q674l6358K3934
118b83K8102k8669j0603M4114R273m5427j2417L2416Q618k1418j5269r667j417
131b2647J7352M167k6145j0932K2370J0265p281P043O743j0637N154K6145j164
$$ y = [0, 0, 0, 0, 0, 0, 0, 0, 0, 0, 0, 0, 0, 0, 0, 0, 0, 0, 0, 0, 0, 0, 0, 0, -1, 4, -6, 7, -8, 8, -8, 8, -9, 11, -14, 14, -15, 17, -20, 22, -24, 27, -30, 32, -35, 39, -43, 48, -51, 59, -63, 70, -76, 85, -96, 106, -117, 130, -147, 166, -190, 220, -260, 310, -384, 491, -665, 978, -1661, 3737, -21478, -109632, -20258, 92111, 61693, -2625, -108, 10865, 20798, 60015, 58150, -17747, -51774, 3340, 37428, -320, -39479, -46632, -34814, -3450, 16162, -14609, -45913, -13758, 32030, 30546, 15072, 13384, 8888, 21169, 58862, 52632, -5254, -15376, 32520, 35035, -9393, -15041, -2152, -24490, -27476, 11348, 4735, -45823, -33986, 20815, 12141, -24217, -283, 27819, -850, -11453, 32661, 41934, -3493, -15910, 16506, 25124, 3706, -11563, -21230, -22647, -5295, -1128, -27273, -38205, -15835, -5570, -12851, -5808, 935, -9702, -4548, 21597, 20433]
144B0433k0149Q310J4439j4986p133J9247o691l1449P046K8703j4055k8899J5829
157i355K0764j6713q455K0789K131j9212Q114K0708r747j4000J2476Q268j1678
170D090j128R298p799j1683N638N126p263m860l128n487R363J4689j2284k1211
184b6639J4291K7104o496j8561N242J0026k010M530N055j5569j0681J8193J1161
197A5646j9035j0760J2962L973p743O187N828j1912l781J8058O633j6297o651
210f892J0404N672k641k399n413l343R277P249j0302j0265O708O769l586l421
224b183j319m117K678J0012k395j2399K710J2588j668p983L916L339o884m76Q837
239D656k138j0953M34Q054j39m046P95j64m47N607N018m667m901N336O024k118
$$ y = [20433, 284, 8594, 23033, 8047, 914, 20161, 13470, -17979, -10933, 17770, 3715, -25184, -9355, 11409, -5304, -13759, 7030, 9161, -10051, -1937, 18771, 9024, -4976, 7500, 15768, 4090, 2962, 12260, 4461, -7222, -1584, 3542, -3721, -8581, -11709, -17196, -7833, 6856, -5428, -26639, -12348, 14756, 8260, -10301, -5059, 4967, 2957, 7487, 12542, -3027, -13708, 4485, 15646, -3389, -14149, -1187, 2786, -4957, 1230, 7058, -4854, -8635, 9423, 16056, -241, -6892, 3512, 9184, 6543, 4144, -1269, -4612, 4665, 11914, 1612, -8653, -1945, 4824, 1238, -2183, -3502, -7619, -4941, 5071, 2676, -9723, -7013, 5575, 3907, -4076, -160, 3179, -3705, -4181, 4656, 2518, -8435, -8001, 53, -86, -4132, -3337, -3501, -3948, 1659, 6677, 2010, -2891, 2445, 8469, 6351]
255F351n233j760J410J902L99l503l193K463L133j183j410J035m84j001K951K458
271D335l783l533L458L914k070l421Q26N77K80J268p12m003j921L963K149m673
287c346m263K672L902%k383J58K793J976P45J94R4l31O59P54j232k316j432M57
305h99j03j208o96L21N95P78J197J238k27n92J603K600q66k632p1K396R7k590
323I41j131N34k33o23K73p65j630j38J586m40j540j80J409Q73L18P18P36P11P39
342B158M80K89k80j128j131K16q2l057j999J399J202k081n25K433J178k36K403
359A239J565j231L72L221K83l650k79J916j054k640K34Pk067K15J810j421k054
376c534J370J626j299K70K192q59j796L580K480k580j175K813J40j500J313m53
$$ y = [6351, 1118, -642, 768, 2670, 3069, -434, -3627, -1164, 1969, 786, -624, 411, -73, -1074, 1877, 4335, 552, -2981, 477, 4391, 2321, -1100, -274, 303, 583, 1851, 1139, -2864, -4785, -822, 1327, -3346, -7609, -4937, -1035, -1035, -3418, -3260, -467, 1509, 2254, 2448, 2542, 2211, 2870, 3624, 2392, 76, -1356, -899, -1002, -2210, -2906, -2585, -1990, -1212, -15, 1223, 996, 404, 2007, 4607, 3741, 1109, 1038, 3434, 3531, 941, -190, 344, 111, -512, -239, -1004, -2634, -2772, -1186, -1626, -3166, -3346, -1937, -1064, -746, -28, 708, 1419, 2158, 2638, 2927, 2647, 1519, 388, 604, 522, -2535, -4534, -3135, -1933, -4014, -4539, -2106, -928, -1164, 1239, 2804, 1573, 1945, 5166, 5449, 1799, 1520, 3436, 2382, -258, -24, -17, -2084, -1869, -59, -1480, -3534, -2164, -538, -1837, -1567, 625, -234, -2030, 1550, 4030, 1450, 275, 3088, 3228, 1728, 3041, 2588]
392B588n138r65N004r69p441k33M745p22j054L420j07l693M941Q200l693o386
408a503L797M605k840j626J157n321l707P024L490r697n150P580L567l682P68
423a538J127m349K391R729k071r398K794Q119k823l488N023j763q079M767Q599
438I040q024j0070N947M624o792k12N975n706n985J1238Q099r623l941R335J490
453E395l605O647Q70j4106j155J6266o88j7074j246Q900k936j384P940n219j3550
468a4945R275J7524o851j3606N163O966j987N428L056j4699n547K0086P835k0259
482b561p773J3505J594p718M919n1j4962J490J9384k049j7869K401J2578k257
496F31R5Q200o834j2113J3206J5337j3705j3436R602M265r344M639P528j5399
$$ y = [2588, -2550, -3515, 1489, 520, -6921, -7154, -2409, -3131, -4185, -765, -872, -4565, 376, 8576, 4883, -1503, 2294, 6899, 4059, 2433, 3590, -1731, -5438, 1586, 5076, -4621, -9771, -2191, 1376, -2306, -1538, -411, -4760, -2369, 7360, 5289, -4109, -1315, 6804, 3981, 493, 5516, 3753, -4326, 441, 9040, 1016, -9054, -3107, 1517, -5275, -5487, 488, -5218, -11203, 35, 8134, -1489, -5430, 3905, 5395, 1790, 8437, 9307, -4799, -5954, 10312, 9624, -7450, -8696, 204, -2732, -4116, 3824, -1395, -14945, -5670, 11854, 5003, -8603, -3440, 3526, 1539, 6967, 10023, -4676, -10223, 9863, 17698, -2561, -10334, 3171, 4765, -2953, 1966, 1915, -13047, -11557, 7827, 5778, -12091, -9690, 2888, 631, 726, 8926, 2092, -10021, 3185, 18522, 4817, -8619, 983, 5248, -4096, 543, 8071, -7328]
510g328r884J8786J0391j6585o650J0602M28k278J0909j961j8724L594K2852k022
524A2130j8215K019Q197n058L898J1296j3857j8565J5509K0651j3718j8198O540
537g371P359k343N756R15j5960r49K3335M208k0781k473J4638j243n562P780l525
552C784j6315O766K0659q098k1382O478J4240m501k990N430q095p489J5291J0057
566A3835j7013r188J3994L443q851N916N274j4196k400J9758J634j8878N46J3410
580G284n171o530R449j056j5028M903J5986p311j2773Q513O741q375K862R819
594I313j0970j0640J6189J0325j7449q557J4659L511r337L589M708j0346r16J5513
608I592j503j6142K609J1044m674n009P086m080j0414R457J3645j1638j2417J1796
$$ y = [-7328, -17212, 1574, 11965, -4620, -11270, -668, -240, -2518, 8391, 6430, -12294, -8700, 14152, 12130, -6085, -4066, 4131, -927, 2971, 14267, 410, -18155, -2646, 18005, 4287, -13911, -7371, -12, -2355, 3401, 4316, -11644, -12593, 10742, 14950, -5831, -8304, 6334, 5091, -471, 7309, 3784, -12531, -5765, 14894, 6796, -14586, -8108, 6132, 1631, -1359, 4071, -4024, -11513, 3778, 13835, -3178, -12366, 1628, 5071, -3780, 2136, 7410, -6786, -9186, 10572, 12206, -6672, -6126, 7284, 2113, -4417, 5032, 3976, -11052, -6149, 9837, 2526, -10247, -1734, 5007, -3368, -506, 9313, -1657, -12297, 3892, 14217, -3232, -11789, 2870, 6381, -2956, 633, 5341, -5005, -5921, 9592, 8089, -8053, -5444, 5600, 926, -4083, 3003, -1077, -11491, -2034, 11611, -27, -12444, -648]
622f48R208q086o12O614p662n628J3749M479j6637m214J3433j86q913M968M026
637C891j0312k96J3922k343j3130M083R646o246l986Q834p45r638N290J0310o699
652B581p518O915L904o518P88L974p020l679R393J336j1505q53J0019p77n762
667d722N027K977o896J280J1136k353j0286K934O749m026k824M349l109p421N786
682a399Q055p018p731N805M583l828J76K639l888j951O687K704o312j018N969
697C473j27k451K519K81n247P14M772k447n683J545K152k900k6L391k241l407
713e682N220N078m363k828M841K961l107m63J751k605j850K919N28n462r75L774
729b63J42k516R97R52j721N41L296o71k485P95K509l13j12Q71j032o10K178P22
$$ y = [-648, 8560, 474, -138, 6476, -1186, -6814, 6935, 11414, -5223, -9437, 3996, 3810, -5103, -135, 3891, -6421, -6717, 7205, 4862, -8268, -4185, 5461, -785, -4771, 4063, 3318, -6320, -1030, 9280, 2581, -4937, 1978, 5882, -636, 152, 4126, -2894, -6573, 2820, 4156, -7349, -8202, 1817, 1040, -4722, 305, 3282, -3614, -2334, 8802, 6449, -3837, -903, 5846, 1820, -1004, 3345, 236, -7185, -1399, 6656, -362, -8093, -2288, 2295, -1533, -1357, 1282, -2606, -4557, 2130, 4834, -1478, -2496, 3473, 3346, 895, 3414, 3695, -1552, -838, 3934, 1487, -4196, -2651, -499, -3399, -3425, -34, -2275, -5682, -462, 4616, 253, -2575, 2266, 5227, 2120, 1657, 3408, 803, -1047, 1872, 2400, -3062, -4037, -263, -121, -2637, -1640, -688, -2409, -1868, 1428, 757, -1728, -933, 1576, 1263, 1151, 2022, 990, 380, 2558, 3280]
747C280l100j299J933k7k614k26M39j439j03K068n6j582J589K884l40n77J685
764B515R37j380n91J109q01j995m55N61p85j177k47O9M07O73K59k47L29R93N28
783G02L0N6J05j81P41N97r17o42O50J73j012m68j09m81r34K6K97o44n76O60J074
804h53L47J24P67R59O36N47J00m61m49J29m95j375j027k99m11j48o88K5N52J002
824a018M80J73N18P80K8L89J30j01k72m6M39o47p38q4N92q50o41O9j61p12K13
845a459M95n15q47J127J235k75jJ264N51K7Q27N6j015p40J016m51k296q4K57j472
865b300o73J375J33j446J168K227p9m87J434N00r48P05J632j760k440J768J220
882B029k698n95J346p10j633J906R40l097l54L330k69k370J100K124j534j5L321
$$ y = [3280, 180, -1119, 814, 787, -1827, -2053, -1614, -3053, -3156, -1088, -1144, -2726, -1137, 1747, 1407, 830, 2515, 3452, 2072, 1481, 2590, 1789, -206, -661, -100, -885, -2062, -2309, -2240, -1833, -1160, -901, -1148, -819, 174, 702, 732, 788, 893, 712, 1453, 2050, 1133, 491, 1141, 1314, 302, -166, -275, -756, -1690, -1664, -1367, -2011, -2587, -1927, -853, -506, -382, 385, 1344, 1980, 2527, 2627, 2166, 1717, 1846, 1351, -24, -1051, -1350, -1761, -1909, -2597, -2572, -2020, -1018, -538, -365, 153, 933, 961, 1350, 1480, 1379, 1107, 1061, 1500, 853, 115, 31, 623, -227, -868, -799, -960, -1672, -1459, -964, -1479, -2326, -1199, 36, -239, -240, 1024, 1575, 1602, 2429, 2485, 1470, 730, 1746, 1295, -1001, -1085, -828, -2300, -2973, -1598, -1465, -2911, -1743, 484, 405, -82, 1352, 1852, 904, 1609, 3241, 1481, -959, 809, 2029, -669, -1264, 82, -628, -2261, -355, 585, -2512, -2866, 464, 195, -2175, -1075, 1049, -485, -500, 2821]
899B821k91k871J328L076k299k370J898o0l298P06K189l272k522L881J630l076
915b530M02L600r94j647M221J321m534o00M336o50m056J170J356l798K23M144
931A964j696n333L059M408k655k442L316k24l023L338L633n021l138O279K528
946D993n376m79L662k184k207L978P7p043L95O497j825n369K676K810l300J420
962a275N691l132n136N491N671n829l630M765k52m931K796K515o360k539P412
977A257J291o822J198N038k881j490O332l79p883K352Q420l232o714M169K718
992C374n196J217N695m626o952N983N453o435l831N048o90l453N363L031q179
1007d198r72J0750J088q566J151N997l823k213N906k376r566L129R137n220p659
$$ y = [2821, 2530, -341, 987, 4063, 1764, -606, 1292, 1232, -2066, -1360, 829, -2443, -4965, -1084, 546, -2530, -2128, 1472, 478, -1169, 3052, 4373, -161, -761, 3575, 2925, -1131, 39, 1395, -2403, -2180, 1964, 268, -5065, -2006, 2402, -253, -2695, 621, 397, -2626, 712, 4345, -676, -3814, 2465, 4993, -383, -862, 2800, 616, -1591, 2387, 2464, -4579, -4184, 2313, 488, -4881, -2205, 605, -2695, -1275, 4416, 1284, -3852, 1639, 7310, 1481, -2149, 2616, 2364, -2567, 229, 2744, -3616, -6155, 1257, 2548, -4274, -3076, 1962, -919, -2409, 3923, 3544, -4339, -1987, 6433, 3201, -3513, 656, 3374, -1822, -605, 5090, 464, -6488, -505, 4948, -1487, -5318, -270, -960, -4413, 950, 3981, -4198, -5170, 5580, 6668, -1898, -747, 5250, 1427, -786, 5120, 2744, -6822, -3693, 5444, 224, -7435]
1022g435M522L612m497K691N646n929n223R595N909r247l008P394r43n427N150
1037B810K666r081j858R972m65r565J469N734l740j916O225j873q151N539Q787
1052F553n023o053O032K969m645K635N035p407n582Q265M285r579l612N930j256
1067a453l432M914J381q327Q03J1062l34q124K599N776l793p83N980k936q517
1082e184M615P959o312o731M570K421m949J979M247o080m142Q637L833p850j110
1097d097O569r69k788N127J508p308M56Q370j864p725J547L575m110j226M461
1112A526l110o235M622O475m371m045N007K723l130K743L603n565k849P082K173
1127F649p491j832M522j756k711L461J42o363Q61O819j356n486K619L369k731
$$ y = [-7435, -2913, 699, -3798, -1107, 4539, -1390, -6613, 2982, 8891, -356, -3364, 4030, 3087, -2340, 2810, 5476, -3605, -5463, 4509, 4044, -5521, -4052, 1682, -2058, -3974, 2251, 378, -7773, -2234, 6553, 1530, -4523, 1509, 4478, -167, 2468, 7503, 96, -5486, 2779, 7064, -2515, -6127, -197, -1453, -4885, 29, 1410, -6917, -6114, 4948, 4614, -3510, -911, 4865, 1072, 289, 6269, 3333, -5184, -569, 7390, 1078, -5653, -1083, 1338, -3611, -1632, 2615, -3465, -7607, 1030, 4863, -2987, -4097, 2472, 1503, -1285, 3842, 5350, -1958, -1502, 6868, 5004, -2721, -1174, 2401, -1709, -2935, 1526, -1584, -7819, -3197, 3278, -1093, -5138, -131, 2592, -538, 2205, 5808, 243, -2606, 4476, 6649, -842, -2674, 1848, 92, -2619, 842, 984, -5379, -4518, 2301, 945, -4541, -1922, 1447, -1284]
1142a284N89M113k223l987M391M124m310k974M272L66m164J416K031m761k164
1157d565M847M98n041L81L949j039j414L903Q61l620J562M823j718l973K026J383
1173B863k935l87K200k755k984K816K513l111j771L215J98j863K374J514k859
1188i72o48M032K43l361Q18K365j468j181K192n43k994O57K533k106k445J592
1204a286R64j765J33K024o45j098K405J610j630m40K056k43j367K00O98k106o28
1221a118J382p60j916N42J561o39o85J607N07j386J053J602r20p90P47N00r12
1238C75j98Q37r99r45J228L98j286l93Q98l83p34M31M13p35P3J097J83k97M85
1257D48P79j2k43M24j72p63j77J15r45p61K74n8n80M07K86J63M97Q42K35k26L39
$$ y = [-1284, -695, 3418, 1195, -2792, 1599, 5723, 1413, -1561, 2711, 3077, -1087, 329, 2360, -2401, -4565, 282, 780, -4261, -3880, 69, -970, -2384, 1519, 2380, -1240, 322, 5145, 3427, -546, 1480, 2863, -72, -459, 1741, -1014, -3998, -1182, 1331, -1780, -3551, -336, -138, -2001, 373, 1887, -972, -1620, 2412, 2655, -706, 112, 2477, 1009, -172, 2020, 1477, -1517, -860, 1673, -433, -2878, -1286, -322, -2087, -1954, 70, -575, -1673, 732, 2342, 712, 272, 2328, 2085, 718, 918, 1616, -490, -1118, 264, -496, -2412, -1870, -309, -948, -1633, -26, 481, -905, 148, 1750, 830, 40, 787, 1287, 375, 177, 1014, 15, -930, 298, 696, -590, -983, -85, -468, -1202, -771, -358, -1093, -1020, 77, 260, -37, 448, 1227, 1215, 972, 1396, 1224, 461, 284, 399, -546, -1307, -1033, -1091, -1671, -1264, -978, -815, -318, 524, 759, 533, 872]
1278H72L72j10j45j27j96l66p07L76k96m02j16L62o0p8J38J33j67L96nK61k31
1299i6O31O2k0L54k42L96k40r0j11n70j05k03m56n29J52o7j55K49L67K69n2P23
1321B67P62J6J47J66K69p53K9k04o09o23j55k58l14J19K42j52J63M77K79m2J21
1342e3N77j59O2L91K08n15MM53k45k97J06j44q11m02P32p45q04P20j20m11J66
1363a287J063K22l18Q60J217n77m60R51j2j128K59M78j326j115P56j15r71P7Q60
1382e66q33k05J482M50j008L96J661j62j326J062L98j190j9J410p42j895J189
1399A02J011j563o02Q55l1j726J010J357j823r42K506Q23j660Q36J388o03q20
1416A18K220P1k927K10K119j490j822R18K55j922O19K360j515j677K239K016j816
$$ y = [872, 1244, 1134, 989, 862, 666, 300, -407, -31, -327, -729, -845, -483, -543, -621, -483, -350, -517, -121, -126, 135, -96, 535, 597, 577, 931, 689, 1085, 845, 755, 644, 74, -31, -234, -690, -1219, -1067, -1134, -1289, -1040, -673, -404, -456, 267, 1029, 1045, 1192, 1358, 1627, 874, 903, 699, 90, -533, -688, -946, -1260, -1141, -899, -1051, -888, -411, -132, -174, -53, 524, 365, 427, 818, 1026, 511, 515, 968, 723, 426, 532, 388, -423, -825, -93, -838, -1642, -922, -1042, -1453, -1287, -224, -2, -320, 540, 1757, 1180, 720, 1671, 1659, 531, 790, 1268, -58, -1173, -417, -532, -1503, -1426, -566, -1399, -1604, -122, 328, -680, -284, 1377, 1215, -111, 951, 1349, 159, 140, 1550, 808, -1087, 102, 1113, -450, -1052, -197, -228, -1954, -944, 413, -1410, -2352, 154, 977, -683, 153, 1541, 938, 118, 2338, 2409, -518, -308, 1811, 321, -1501, -583, -328, -2250, -1631, 729, -786, -2463, -224, 1792, -24]
1433b4n58K184k68k061J853J505k817j358K726M84k857O01J341j837o67K970m18
1450G99l651Q39L176j186j938K144P18k306J546L016j783l088K890J771k669r46
1466f68J699j123k470K564J510m006j025M189N27k869J059K088k107R4L624n81
1482B505m494J134L681j684k839K028L24k989J642K773k641l097L608K366l362
1497a045n24K722j096k019L083J900m335p55M343J44l308J105J563l002j7L402
1513B161j239m558J611L815k218k186K742K68k344K396L240l110k820L609K286
1528C653l600j031K514k156j545L233Q19m771m02M809l72l097J406J378k288M06
1544a044M014j528m112K480L492k443k176K495k09k567K157K548l902k470L976
$$ y = [-24, -582, 1602, 1334, -727, 1126, 2631, -186, -1544, 1182, 1666, -1191, -590, 751, -1086, -1753, 1217, 799, -2852, -2013, 1163, -23, -1961, 183, 901, -1405, 141, 3157, 1374, -1714, 1176, 2947, 278, -668, 1031, -92, -2562, 2, 1512, -2494, -3519, 670, 1197, -1672, -613, 1475, -632, -538, 3086, 2505, -1989, -855, 2826, 1142, -1697, 331, 655, -2334, -692, 2081, -560, -3657, -49, 2317, -1045, -1569, 1153, 57, -1962, 1121, 3021, -1314, -2069, 2274, 2418, -890, 215, 1778, -1224, -1241, 2161, 922, -3636, -2025, 1790, -428, -2614, 128, 396, -1948, 448, 3688, 578, -2242, 1367, 3653, 53, -978, 1536, -620, -2165, 1068, 1887, -2884, -3286, 1523, 1151, -1946, -540, 838, -1450, -1044, 2970, 1442, -2670, -190, 3302, 859, -1317, 1178, 969, -1598, 559, 3107, -795, -3265, 711]
1559G11J186l522k06K508j872j198L973N53m140L32M722q55k986J862R70l058
1575a020L65L115j797m425K732K798k923j380K688j76k321K755K487l638j709
1590b449M037J417l593Q5K254k137j042L150J51m346O31L703j144k808J865J014
1606G88k536N77K903j898k791K887K693k522j241K534k00j784J691J536l369j263
1622a995K965L67l189O04J755j728p11K870J50l113J042L315j240j902J662O29
1638A481j996J19K359j756k401J884J683k056r08K180l99j589J806R82k197p31
1654a539K715J30k247O35J349j103l90J994k14k238M55K056j270j408O07P24j634
1671a378N60J336r72j569J904J622j550j17J428r8j294J041L98j511m27J256k90
$$ y = [711, 1897, -1625, -1831, 677, -1195, -2393, 1580, 2133, -2007, -1675, 3047, 2192, -794, 1068, 2038, -1020, -655, 2460, 663, -3762, -1030, 1768, -1155, -2535, 153, -23, -2344, 411, 2898, -740, -2449, 1588, 3005, -588, -503, 1751, -386, -1428, 1722, 1873, -2473, -1842, 1861, 717, -2091, -226, 788, -1748, -1171, 1732, -166, -2957, -70, 2623, 101, -1140, 1394, 1194, -590, 1101, 2637, -732, -1995, 970, 1337, -1852, -1248, 507, -1221, -1932, 938, 1088, -2025, -983, 2332, 1092, -810, 852, 1481, -515, -396, 1963, 207, -2194, -310, 1373, -683, -1591, 589, 190, -1399, 407, 1389, -808, -1539, 1176, 1306, -941, -306, 1043, -60, -450, 1544, 1330, -908, -453, 1603, 333, -1075, -468, 256, -1378, -818, 518, -454, -2023, -119, 1503, -47, -164, 1264, 1166, -128, 913, 1311, -200, -627, 629, 339]
1688C39j355L20N33p29o1J076K63j238K87J650p23o64J158m0j028L05J047q33
1706C07j013Q39L73r63n4Q00j96j036R82O4r91r6R24j2m29K68R55n87K10P26j1
1727A060q11K25L84p79n51p9J35n45R5M44m74k15P14O36l29J03P04j31j98K16
1747F04o7k29k47L88j05m91L4J76l03n34O08l14j80J83K26j04J46J72J88p8J50
1768B23K79N5O2J64P8n31p4J14m40l76l7j50k79m9K33j57K67L68L24R5L8O27K32
1791A066p5o4j33o3m99N6j92l70m51K99k47q9N18j34j87O2N42j17O9J94J00o2
1813B23L02j5J27n7P7J03l42k45j61j85k94j24J86n93Q5K47n7Q1J45O86K5K61
1835D75M57K4k46N6L72n76o14j8K47q39K0R7k57n8K92L28k85M8P12Pm06O28O7
$$ y = [339, -1016, -696, -163, -892, -953, 123, 386, -852, -565, 1085, 362, -302, 856, 816, -212, 93, 1140, 307, -706, 133, 506, -457, -511, 289, 93, -943, 39, 103, -888, -984, -60, -72, -501, -233, 722, 135, 345, 1071, 1060, 249, 474, 858, 79, -472, -551, -416, -961, -866, -422, -896, -1111, -397, 239, -90, 13, 717, 586, 388, 604, 537, 308, 61, 449, 344, -147, -113, 63, -240, -774, -166, -480, -660, -477, -251, -355, -209, -37, 151, 73, 223, 502, 557, 619, 783, 861, 330, 256, 370, -70, -446, -483, -633, -912, -961, -728, -885, -618, -250, 74, 169, 207, 834, 1066, 991, 927, 794, 731, 232, 288, 96, -274, -725, -426, -673, -762, -244, -378, -565, -503, 39, -78, -9, 185, 285, 223, 525, 510, 637, 580, 657, 760, 418, 173, 12, -173, -467, -591, -405, -998, -913, -666, -723, -642, -497, 189, 214, 475, 932, 956, 710, 766, 1138, 562, -52, -70, 177, -662, -642, -545, -802, -860, -568, -240, -525, -477, 235, 242, -164, 464, 531]
1858E31l43l5P38k62m32K55L17p14k80M48m49p96K58O16o10l56P40K64n15N22
1878a03R27m66j78Q14J61o96j02N79n89p20M90l76j062J65R82m50q07P31Q97l97
1898b00j92J030p4p85Q21Q53j128n90R92j29n82j11N42q25m20Q98p1j088L31O45
1918h3k23o96J103L25j107N89J397m94j087J032P10j025j63P15r93j158R48N81
1936C71j630l35J381Q3j104Q38Q60o46j82J645K9j430L63J122p38p98P53J21j579
1955h76M91J252j394r29J270O23j454K99J285r64r29J835O99j571m08J916r1r62
1973I2O37L87j313m40K002o78j882J20J584j278l82J035k69j440J431J882j196
1990B92j190J533J026j432K46J033j452j200J850M36k098m54J903m48j334J134
$$ y = [531, 188, 153, 891, 629, 197, 452, 769, 55, -225, 223, -226, -1022, -764, -148, -758, -1114, -374, -110, -625, -103, 824, 358, 180, 994, 1155, 459, 357, 936, 347, -373, 117, -259, -1321, -1156, -174, -624, -1431, -700, 197, -200, -392, 638, 564, -221, 600, 1453, 325, -265, 727, 598, 16, -95, 447, -378, -798, 100, 29, -1059, -728, -83, -306, -1002, 101, 426, -681, -92, 1305, 811, -276, 756, 1466, 441, 278, 993, 0, -1158, -210, 371, -1259, -1594, -213, -130, -1234, -396, 464, -182, -364, 1281, 1310, -120, 243, 1365, 627, -171, 582, 703, -876, -385, 867, -527, -1456, -186, 437, -1017, -718, 567, -397, -1326, 509, 1208, -363, -771, 1145, 1054, 92, 729, 1116, -197, -637, 1365, 687, -1195, -1075, 509, -769, -1151, -116, -385, -1825, -394, 1488, 292, -898, 635, 1661, 229, 475, 1508, 56, -1144, 706, 1142, -956, -1410, 493, 45, -1289, -155]
2006a55L11j532K64K363n68j992R85J476r74m44J412k36j765J228J438j552j718
2023a459J834L42j571J30J242j351r36J905P22k138K25K182m51r82J108O46j706
2040b58K28J481m90k394Q55J358j371o16J375o55j223J505J615j635j017J927
2056F85L07j375N00J070r06j044J743L67k071j01J679o10j124J000J92j530K57
2073i61J976j039j709J153J443j070l43J679n30j289J375J044j633q30J384J4
2089F64j454K50Q18j472j50J396L36j757O09J500l36o34Q97L06j278M49J338q74
2107F08j279Q01P82j388j64R52m21j073J012O64j261m64J681j18p17L23P76o94
2125B0m91J686J39j721M56J072p47n98M11N1j055J06Q40p44q05Q69N65m73N3R38
$$ y = [-155, 156, -1376, -1112, 1251, 683, -1309, -324, 1152, 178, -266, 1146, 910, -855, 373, 1811, 259, -1459, 375, 717, -854, -724, 518, -833, -1769, 136, 858, -1280, -1055, 1127, 676, -306, 802, 1448, -258, -30, 1451, 961, -1433, -578, 780, -591, -1207, 168, -487, -1710, -205, 1410, -225, -1242, 685, 992, -383, 117, 1187, 281, -763, 980, 1347, -724, -825, 854, 244, -880, 120, 312, -1218, -961, 1015, -24, -1733, -580, 863, -207, -550, 1129, 599, -690, 685, 1729, 96, -734, 650, 664, -790, -540, 278, -1194, -1344, 52, 388, -1369, -760, 740, 404, -230, 667, 973, -305, 144, 1482, 608, -671, 130, 912, -476, -640, 312, -109, -1182, -170, 494, -767, -1231, 450, 332, -385, -62, 714, 20, -471, 1215, 1354, -367, 89, 1161, 414, -184, 227, 278, -777, -671, 169, -575, -1380, -511, 54, -419, -366, 572]
2145E72j61n47R72N86j097k86J067l90j019J47L80m95p47J034j44q69N12N25l33
2164b93l13P21J17n33L38O95n56l53P19L64p95J63L56m84m30K96Nq48l5O72M5
2185a49p33L71O00m87K05O87M8k69L46J58k87m28M72k34l19j86J59m24k77L50
2205c97J46j23j78O65j18n00N94L66l42RL74r8l93O3K74j76j49J53j07m62K03
2226a96K23l51j55J41J86m58J93O13k00q5N63Ol00K63J19n2l97K11o8j66m06P3
2248b43ol51MK63j02J00M35j63J06J88Q0L8n3J48N6o6n01J90k24p9L2J94k33r7
2272b84Q7Ok92M03l1O1k7K98O4k35P8K66Jj29L32l13j7j94J14n78J00k18K63n02
2296g47K13j19M13p8J87M34k41M65J15k18J4k76Pk82M6Lj4j11k7J12j88L1J60
$$ y = [572, 411, -136, 836, 1422, 325, 39, 1106, 716, -303, -156, 224, -271, -1018, 16, -128, -997, -485, 40, -293, -606, 115, 232, -301, 37, 732, 176, -177, 542, 906, 111, 274, 630, 146, -284, 12, 17, -831, -866, -194, -149, -882, -511, 89, -398, -193, 494, 542, 273, 619, 777, 490, 62, 534, 300, -19, -205, -46, -470, -747, -397, -251, -374, -552, 113, -5, -505, 89, 455, 113, 122, 496, 398, 5, 68, 342, 166, 17, 170, 63, -399, -196, 27, -324, -479, -338, -152, -610, -417, 196, -4, -89, 474, 480, 180, 443, 562, 510, 113, 324, 256, 90, -316, -243, -249, -600, -596, -333, -435, -335, 100, -63, 43, 231, 311, 349, 296, 444, 500, 434, -67, 123, -101, -180, -148, 46, -187, -284, -197, -191, -483, -80, -111, -50, -77, 221, 285, 50, 128, 394, 395, 266, 598, 285, 268, 74, 188, -390, -290, -508, -245, -747, -534, -653, -240, -318, -131, 303, 62, 527, 642, 424, 438, 162, 169, -113, -67, -64, -78, -189, -216, -104, -292, -261, -101]
2319a01o5J2l2M78k61MK16q8J11mJ83m59J66K59k69k40M1L37n13j82J62R2k59
2342d12J84L47m93M53J79O1n8J14m7l5J0o8m9j67l17M16j49l87J43K05k66P2M45
2365A81j14l08K34L15j81j53M75j16k75N9O2j20j2J56M0j98k82J13k34m0L37j
2387f2n03K22N22R1m56N44K83m15J05K20j5m74J17J92m05n92O21k97k97L96K50
2408D7m72j96P67M10p08L54M96l48j87L67m6p84N2Q28j69j051O51J01m30L6O13
2429C31n06k81N16M40q68kO55j25l06M50N35q18k35Q41n1p18L1M47n66l18N70
2450B2j79p62L37P26l9o18P68K11n19J35O31n51j26M47J44r43K45M36m17o30M44
2471b38L50n01r3N70l9n76J92P44p06l5P88k71n20M16P35n84k43L51M2o59K41
$$ y = [-101, -166, -154, -186, 292, 31, 35, 251, 163, 274, 270, 453, -6, 160, 419, 150, -90, -49, 288, -225, -407, -245, -153, -412, -228, 119, -374, 79, 258, 319, 261, 375, 328, 293, 303, 235, 186, 19, -298, 118, -31, -418, -275, -70, -336, -264, 181, 67, -241, -7, 308, 127, -26, 449, 333, 58, 117, 179, 59, 47, 203, 243, 45, -237, -124, -358, -398, -61, -62, -565, -343, 179, 270, -186, 358, 641, 226, 331, 551, 536, 62, 179, 371, -34, -626, -5, -302, -599, -203, 47, -425, -621, 146, 556, -152, 202, 698, 350, 163, 530, 484, -300, -248, 580, 411, -640, 11, 112, -318, -282, 331, -175, -456, 60, 500, -368, -370, 285, 160, -146, 304, 839, 21, -214, 627, 576, -142, -111, 336, -230, -548, 22, -157, -919, -582, 144, 105, -513, 255, 466, -53, 82, 713, 162, 36, 483, 627, -316, -71, 365, -52, -682, -238, 112, -389, -482, 88, 49, -527, -335, 409, -297, -332, 456, 185, -335, 81, 816, 232, -11, 340, 382, -277, -36]
2492c6L42m74n68N31L91q38K2P63j0o88O85M83n85j37J046l52q49J79K93l41k62
2513d05O22n20l51K58R71q41l21O15K74m82J75L85l21n35Q30M82j069J38N72k99
2533A78l63L03K35q44J95N41l30n73J80O20m89j77P14%p04Q33M62n42l67O09j19
2554C62m83J21M11n61n47P54K0o69J46M84N5l39N72J64o19K22M96j87o11M32N61
2575G84r11j86P95l35o30M41M45m28n69N69J64p23M16M34n08j51P01L0m16K45
2595A67L02j98l13K22J53l64k35M25j5o93K32L91n65K21K66Kk08L05L0k7m3L60
2617D15J53o81K09K29l53NK45n3m99J55L32k32j81Q1K32k90K88K10k24l73N31
2638A99K54k99j56L84j81j00K58L0n37j58J72jj94J59J23j58k18L60K49m01K00
$$ y = [-36, 306, -168, -736, -205, 186, -652, -630, 133, 123, -565, 120, 603, 18, -119, 927, 575, -274, -95, 198, -143, -405, 217, -303, -654, -396, 575, -266, -587, 28, 302, -180, -5, 380, 59, -476, 354, 836, -233, -95, 477, 178, -185, 118, 353, -491, -296, 245, -85, -658, -478, 142, -347, -524, 190, 190, -514, 319, 781, 239, -128, 481, 362, -121, 0, 411, -150, -697, 57, 77, -592, -446, 38, 93, -246, 326, 490, -129, 93, 589, 402, -209, 223, 784, -127, -313, 482, 147, -483, -42, 403, -25, -594, -25, 139, -584, -168, 266, -242, -393, 308, 338, -78, 167, 469, 271, -42, 180, 333, -31, -266, 159, 144, -549, -317, 74, -491, -270, -4, -2, -210, 95, 125, 98, 55, 415, 568, -113, 96, 325, -28, -23, 222, 169, -330, -175, 157, -75, -256, -175, 57, -233, 55, 265, 41, -332, 199, 453, 154, -2, 382, 201, 101, 359, 389, -148, -306, -134, -135, -329, -170, -47, -205, -423, -63, 186, -215, -15]
2659a5N01k10r2J48m9k62L1K17k17k44o0K17l66M04p2M8p9J49K27k35k46R4J28
2682A7k02K64J83l49L28n7J0l02L32j17%m41J30L8l86M67J38j29j32K25J06r8
2704B5O8R9J6j56K18j6k72J84j39k29J41j88J70k39L92j26r1oK66K44l68K63q8
2727A68q7j45K0L08j57N5k01O7K20j31j13k04J77j38J79l22J58J76j3q5j01K81
2749A12R3p5r2J17J65k1l0j34j55J34j48j42R9j38kQ9r9K20k2J29K07o3p9M4O1
2774B70k11rm5M3K3j80j93R1M9N6n4J14J03j59L1M1J51j43LM4k9L29k5j22j83
2799eM31k0m12L8j10M0m2j02j89N04k91l3J65J95k5k03P2K02k80J49K25l94K48
2822A63k1j46j27J32K31k92k10J72mrJ59j36K46j23K01k35k36L74j64K75n6j3
$$ y = [-15, 486, 276, 184, 332, 283, 21, 52, 269, 52, -192, -252, -35, -401, 3, -69, -21, -100, 49, 276, 41, -205, -111, 17, -185, 79, 262, -87, 241, 184, 194, -108, 224, 107, 107, -334, -204, -166, -552, -85, 53, -76, -208, 17, 123, 25, 93, 192, 208, 52, 270, 254, -18, 166, 27, -202, -61, -249, -79, -318, 74, -52, -143, -149, 117, 361, -7, 256, 168, 81, -64, -44, 264, 107, 162, -39, 28, 248, 117, 4, -200, -23, -161, 18, -304, -146, 30, 17, -68, -169, 112, 205, 130, 38, 155, 320, 299, 269, 135, -20, 114, -34, -176, -77, -215, -217, -128, -227, -7, -29, 100, 307, 244, 165, 209, 270, 59, 50, 5, 48, 71, -109, -302, -211, -162, -106, -160, -46, 57, -102, -71, -30, 121, -22, -19, 25, -4, 325, 300, 178, -5, 426, 406, -6, 32, -78, -38, -80, -182, -371, 133, -158, -191, -26, 169, 144, -59, 13, 215, -65, 84, 309, -85, 163, 142, -4, -131, 1, 232, -60, -270, -98, -102, -111, 48, -88, 158, 35, 236, 1, -235, 139, -25, 250, 194, 181]
2844A81j0j30n8J33l0j10j28O4n4K64j38l04J58J8L25k36J7L36N1j31j66J74k65
2867c9J6M9kj9j36N4lq6N8Q6j07K21l2j55M9J48k1j80J09n6K13k91m1K91N6k58
2893g6j8k5m6L4L41k79j14K21k44Q9J42K05n3j24L8J05k30J02jj69j68L76k52
2916a46m0K68k89n8P3L6K74k05L1K13j54J02k6J35m2Nm1k04o2J38K3q3q5O8J59
2941I0m37K25N61o48K31J21J14m09K30L0r9j49K08J63k71l2K24j73k31K74L4k40
2963a84j75M09j6r3J59o4K48k72J20qk85L79J6j64j14L1m2n7O7k1R1l07L41K4
2987H3j76n4K53k56J66K05J08m17M4L61l72j93K62J97l29L91j82n7l25K22R5l22
3009b96QL55M8n6k9O4j98K75J30J4k30Nk0O3o8J61k78j42P2J25K7k92%L62k18
$$ y = [181, 171, 41, -17, 116, 86, -24, -152, -88, -142, 122, -16, -320, -162, -144, 181, -55, -38, 298, 349, 218, 52, 226, -39, -23, 26, 24, 5, -131, -77, -80, -166, -108, -22, -129, 92, 60, -95, -46, 102, 81, -99, 10, -46, 167, -124, -165, 126, 182, -76, -94, -119, -165, -131, 210, -69, -183, 38, -206, -117, 25, 230, 177, 53, 91, 196, -34, 68, 67, -102, -270, 106, -146, -186, 82, -207, -265, -192, -156, 118, -87, -56, 157, 3, 105, 79, 214, 172, 177, 136, -68, -130, 8, 31, -52, -137, -69, 90, -347, -122, 439, -209, 22, 143, 257, -152, 78, 108, 9, -140, 68, 231, -40, -72, 152, -21, -252, 22, 56, -184, -359, 50, 34, -59, 100, 36, 284, 12, 132, 124, -161, 218, 234, 70, -44, -13, -55, -112, -45, -66, 25, -282, 59, 83, -93, -147, 106, -150, 16, 221, 329, -88, -44, 317, -55, -248, 14, 211, -118, 273, 91, 34, -291, -69, 26, -296, -288, 67, 115, 59, 30, 94, -104, 171, 301, 315, 85, 90, 70, 133, 65, 226, -52, -194, -122, 3, 30, -262, -262, 100, -118]
3034a18L5J84n5r8J7K29m5j04j35K17j37J23J82l33R0j19J02j05k7k6j4J18J05
3057H6J4j77j48M98l54J9L50q2j98K28o4j91j99qK06j50o4K49j86J9K01J24o0
3080A13j13K5J59j58P9K26l24L03j84j66k02K35J64j81j35K09p0Kn8K53j91R2
3102G8NO5k31RJ54R5k28r8K51k21J22M0m5r9n3K17j37J22j43M2nn2L33k19RJ06
3128A17j4j57K11r7J47l25L0L00m06K09k15K47Q6J4k19J55m15K79J06k94K51o6
3150e6K59j39Lk22L44j8j9N6k52J80l45J53J47k9j11q5K48j66k8N7Q7l3l1j04
3174a04O4K77ol39P8L0j31K86k4j28j04P9j90K10L6j06j13J75j68K36M4j83Q0
3197ak18N65j96k55K96l98L22j57L8k06J41J18K0j8p1n8J01K2j12N3L10j19J55
$$ y = [-118, -83, 101, 46, -52, -35, 194, 149, 45, -90, 127, -10, 113, 295, -38, 52, -67, 35, -70, -97, -123, -137, -19, 86, 100, -77, -225, 273, -81, -62, 288, 206, 8, 236, 172, -19, -218, -226, -20, -170, -234, 15, -171, -152, 49, 173, 113, 0, 25, 184, 26, 105, 331, 7, 310, 126, -40, -242, -7, 157, -24, -159, 50, -20, -18, -76, 177, -14, 78, 83, 148, -83, -74, 80, 175, -53, -151, 100, -121, 1, 41, -4, -103, -156, 61, -76, 46, -97, -55, -60, -112, 221, 2, 11, 117, 103, -54, 157, 60, 207, -118, -88, 212, -194, 15, -200, 47, 133, 147, -72, 83, -332, -53, 53, -241, 10, -56, 203, 64, 67, -155, 189, 171, 152, 208, -44, 136, -209, -56, 91, 62, -49, -134, 114, -52, -80, -23, 64, 31, 0, -104, -40, 237, 231, -108, -30, 0, -131, 155, 131, 3, -101, -22, -212, -2, 34, -72, -185, -10, -178, 58, 102, -81, -1, -219, 346, 150, -105, 191, -207, 115, -42, -4, -210, -69, 49, 69, 51, -20, -78, 23, 45, -67, -14, 296, 177, 332]
3220C32l62O0k2j51K96l95K42J86j84j09N2J35k67K46j80K20N5j75J23K7k83J69
3242A5K70k68j1K2p8K5M9m6l3N6J92k32K9J50n1r4N2NJ14j93n8M5J39j22L0k13
3268b06N4R6J16j10j93M55k6l83K23l2j76L30j61O0R0k30L7o0L45k82Q1k37K68
3291E9k51J70j06K42j88j13J63j42J65rM8o6Q0m3j07Q6J0O4J86k06N6k03J49j55
3315a11P3l1K23N2k00o2M2lJ46m6r6J16q4q0J09j7j56K8L5J3J85o6k15L28m6n5
3341H2L1j78J20m4l26M55l37R2J86j47M7j31L30l50L06k53J43j02L3K14j44j5
3363A2q9L02l30Q5r8J79j7J49k87J12j49J91k34J47r7J61rp4L3L26k14j87n3K56
3387A15l6j07L23l24L5O4r9K0r3J34j02R1l3M9k44M6K01J55j82j22J85j19j1L8
$$ y = [332, -30, 30, 8, -143, 153, -242, 0, 186, 2, -107, -55, 80, -187, 59, -121, 99, 154, -21, 102, 129, -154, 15, 285, 17, 6, 28, -50, -25, 24, -22, -55, 1, 193, -39, -10, 140, 89, -5, 47, 52, 166, -27, -85, -40, 99, -23, 7, -206, -152, -56, 60, -50, -243, 212, 186, -197, 26, -6, -182, 148, -13, 47, 137, -93, -56, -116, 229, -53, 28, -209, 59, -192, -22, -128, 114, -74, -187, -24, -166, -1, -10, 38, -28, 52, 9, -98, -12, -2, 62, 248, 42, 98, -105, 44, -111, -38, -69, 154, 206, 6, -56, -14, -17, 129, 83, -13, 103, 19, -61, 48, 31, -125, -97, -62, -49, 136, 70, -145, 183, 137, 82, 113, -65, 55, 11, -315, 140, -197, -105, 81, -66, -19, -150, 180, -170, 136, -117, 26, -76, -43, 171, 27, 12, -77, 225, -105, -20, -118, 61, 44, 193, -94, 18, -131, 60, -174, -27, -124, 37, 28, -46, -13, 313, 99, -88, -141, 115, 79, -28, 295, -29, 6, 70, -29, -9, -102, 32, -70, 21, -12, 37, -207, -161, 40, 195, 13, -109, 76, -43, -54, -16]
3411a6N1J1P9M9j00J8l55M09j90N7J22k90P4j34O7L16k12R5n2L4q9k8K95j00j86
3436g5L10l79J05R8j01j1R2k77K96O8k19L4o8P6M25m04K74m75J11J40J23k56J96
3459H3j37mJ3J21j21J4j7P0J8l3R2k67K39lJ52J7j58k46K62J22k28lJ18J3q5j
3485C1R6q3k49K93k96N1P3M3mJ08J22j03kp0p3lP7p2j00K53q2J80l60L50j28k55
3511b03K34q3Q3N5j92Q4J14j23L91k70j23R6O4j19lR0j8l65J23L73q9j41j87J00
3535a09J12J03q0Jj14L78k69J48j46P1L4j47QJ81k44J1r0J23K1j85K35p2P4K4
3559F8k34Mj8L88j4k72J27k46L94j98P5j01q4j9L54L2j44k27K0R7O0j64P9J2n2
3584f3o3J90MM4L2l7m8j63J47mL4N7p9K4j11J95r7K6p5j31K84j63O3l09M68j56
$$ y = [-16, 35, 46, 125, 174, 74, 92, -263, 146, -44, 13, 135, -155, -81, -215, -148, 168, -44, 51, -1, 33, -56, -84, 211, 111, -75, 235, -144, -39, 59, -42, -53, 39, -238, 58, 126, -93, -59, -127, -51, 374, -30, 244, -231, -120, 20, 143, -113, 83, -54, -58, -45, 76, -45, -31, -48, 22, 40, 7, 99, -168, 71, 68, 220, 237, 79, -167, 95, 217, -11, -14, 104, 117, 32, 31, 127, 44, -205, 88, -208, -157, -84, -41, -45, 63, 185, 82, 80, 10, -63, -66, 11, -61, -161, 92, 10, 190, -170, 180, 52, -203, 31, -52, 31, 86, -106, -22, 92, -31, 360, 90, -33, 63, 127, 8, 5, 95, 77, -288, -165, 208, 119, -22, -209, -109, 3, 106, 26, 27, -87, 291, 22, 170, 24, 95, 129, -18, -10, 171, -73, -62, -152, -29, -8, -193, 42, -30, 44, 68, -166, -162, -180, 208, 194, -78, 49, -197, 197, -1, 74, -27, -111, -130, 224, 256, 112, -115, -95, 2, 62, -102, -23, -11, -63, -126, 64, 68, 112, 144, 107, 59, -104, 43, 39, 73, 130, 51, 75, -36, 159, 62, 88, 13, -118, 166, 3, 66, -243, 225, 69]
3610F9m2j30J56O7rj40o3L8K11k16k4r9J92J6r9R3J6R5j33J40j20k60K99O3o7
3635E3J9J65O0l04k27Q4N6K16p6j31n6K24j06j10J27L8p8P5Q9j92l8J64J54k51
3659d5J62L8j92R7l7J8K25l24J4J20J24J9j11k40L48j59o0L90j89j39L5O8k24
3682f2oN4P7k73L63l63O7P5N5j62K03J54k66N9m5J10j28O6M2m9Q9j05L00k74M6
3707B7j03J21q7K42k38Q2j19k9J21Or0l6J83l7k4K89l79K79k14lmo3m1K39l26
3732b04J64q8pJ80j13QK47l06M4Q6J01j65M8L3%l7Q4j42J86j67n4J9J06j36L11
3757A98n52L58J31k13N0j42K74m0R0l3j21J77j29q7k8K40j33r9j25N6K01k21K50
3780A02j1oj36J59J35k75J07R%r5J6J5j64L0J25Nm5Q7j3nj21j2R9k00J23R0J56
$$ y = [69, 27, -103, 53, 120, 111, -29, -92, -54, 157, -59, -83, -182, 10, 26, -73, 20, 36, 131, -2, 138, 18, -242, 57, 120, 53, 72, 237, 297, -7, -234, -150, -94, 122, 46, -85, -141, 83, -23, -133, -6, 32, -46, 29, 118, -74, -112, 52, 206, -45, 117, 155, -37, 60, 23, 41, 266, -58, -44, 76, 200, 219, 108, -132, 216, 57, -3, 387, 198, 59, 94, 162, -62, -68, -14, 63, -210, 153, -210, -143, -68, -13, -175, 28, 182, -84, -25, -70, 40, -88, -22, 20, -29, 60, -45, 255, -19, 27, -76, 45, -42, 200, -38, 44, -75, -104, 17, 23, -67, -103, 80, 43, 19, 308, -71, 208, -6, -9, -13, -76, -117, 122, -204, -40, -128, -135, 45, -68, -60, 187, -119, -75, 11, 112, -53, -5, 28, 28, -9, 75, -67, 119, -48, -102, -83, 23, -113, 198, -354, 4, 135, -78, -28, -170, 104, 64, 154, 121, 0, 177, 48, -39, -67, 173, 40, -59, -184, -128, 73, -148, 102, 91, 85, -51, 108, 243, -32, 75, 84, 84, -11, 5, 20, -144, -114, 11, 16, -29, 58, 45, 40, -81, -93, 6, -194, -71, 19, 175]
3807A75j2j27j55J77K6m7m5o5N3L1M0m1J03o9q7K20r4Rj02k75J7K87J3n8J15L0
3833A19R8l18K47J75j22k82J05k81O7J33n8J69j70Q7J03j18J25j28k25L24jpJ06
3856A48j84P8n4J07j00o5j62L64j22l9j15J10J33j59j36J89k6kK43%j59j54M75
3879C70j28jj62j78o7L04q1o8j21J32k47L59k27J28lo6j96M51j86Mk4K54k42j20
3903a15K19l01M01p9k7j86K75j61k01K39k1o2j3j47R5L46l72l0L49j93K04p3j67
3926b0J11r4j74J76k00L33k78n2J74P9n6L0L42l49j84J97K02j63QN3o5k81J27
3949h4K51j61n0o2J56M2j68N5M9q8j05N04l95J26m4R9j11k5K16l38K7K31j56k03
3973b34R6J93j80q6J38J36k10J10lk7R6NL3j74L81j10j22M2K79q1l00j80K04R0
$$ y = [175, 163, 36, -119, 58, 84, 37, -8, -73, -20, 11, 51, 10, 113, 44, -43, 177, 83, 92, -10, -285, -268, 19, 32, -26, 89, 119, 217, -101, 146, 321, 199, -83, 22, -259, -192, -59, -117, 52, -118, -31, 72, -46, 79, -49, -274, 50, 49, 42, 148, -36, 42, -12, 95, -5, -70, -232, 132, 10, -29, -144, -34, 99, -60, -196, -7, -33, -35, 208, 208, 49, -105, 370, 242, 241, 79, -99, -166, 138, 57, -11, -132, 0, -247, 112, -115, 13, 10, -56, -252, 199, 13, 17, -7, 247, 5, -115, 104, -197, 204, 125, 98, -88, 187, 26, -175, 64, 43, -19, -32, -179, -84, 262, -110, -140, 209, 16, 220, 147, -20, 91, -3, -177, -1, -201, 132, -146, -198, -24, 55, -1, 29, 371, 22, -162, 35, 237, 74, 82, 135, 70, -211, -84, 167, 6, -44, -106, 50, 92, -76, -21, 28, -60, -165, 339, -56, 70, 26, 125, 14, -11, 205, -133, -106, 125, -31, -234, -138, 55, -125, -211, -73, 63, -147, -37, -40, -67, 29, 34, 67, -107, 274, 164, 42, 84, 363, 282, -18, -198, 6, 96]
3997I6l04pJ62p4K9K55L5j84J34J55j82j01o7m0MJ29j27J11p2jP6m7l7J44j24
4022c7j19L12l17l9rJ94j2j35J17L18l08J10K55m36J03O3J08k15j12J24Q9l06
4044b52J78J19j00P5q0J76K0j29J97j62j30J39mM7N2j66J68l42K00K16l91J18
4066e1J9r1J1R8K7n2j50K09LJ04J2N7j41j4P4k02N5J20j30j43J7j00M1k4q8L24
4092a5k19n8M14Q8l03J23N7j8o3O1P9j88N9k19K20J16j0j64j00j88M00j97J3J63
4116E1m2lO2J02k89K3M6L9J7k3K29O5l55j1k0K19k00j19J24O5R4j17M5J7p6K17
4142A60j03j24L72j92Rj10j04M5k4J08P8k11j06K3M4J26J34j7j73o5M13o5l25
4165a07J88L0j12J58M2k26oL41k85q8k6q9K43l06L67k35o5J13K52m44L34K7o4
$$ y = [96, -208, -215, -53, -127, -98, 157, 192, 8, 142, 297, 115, 14, -53, -93, -89, 40, -87, 24, -48, -49, 27, -20, -57, 87, -37, -156, 156, -161, -200, -209, -15, -27, -162, -45, 273, -35, 75, 330, -106, -3, 60, 168, -47, -159, -35, 54, -252, -74, 45, -55, 20, -60, 116, 136, 7, 204, 42, -88, 51, 47, 94, 146, -20, 148, -194, 6, 222, -169, -51, -32, -123, -112, -14, 13, -39, -189, 20, 23, 127, 139, 196, 55, 41, 115, -87, -32, 88, -42, -185, -168, -268, -227, -251, -339, -15, -234, -292, 122, 210, -93, 30, 87, 69, 6, 67, 146, -42, 17, -202, 18, 134, 124, -40, -140, -328, 72, -125, -112, 51, 9, 6, 68, 170, -119, -96, -50, -11, 6, -17, 212, 277, -78, -89, -109, 110, -90, -209, -85, -20, 74, -43, 2, 19, -57, 160, 57, -67, 305, 113, 122, 12, -92, -47, -71, 37, 115, -96, -202, -179, -135, -9, 125, 108, -65, -130, 283, 218, -107, 81, 111, -1, 157, 199, -27, -33, 308, 23, -65, -91, -180, 63, -243, 124, -111, -176, -63, 189, -255, 79, 106, 42]
4188D2K2m3J05j27J69N1k31o4L8oM1k05N7Q7L0R5k17J31j15K44j21j41K61j04
4212aK37j08n5q4l8Om1Q5J1o9j2J1J39j17M8K4o3k06K81O1j64P7M2jr4J78k19
4239g2n5K49k46J76k6j53l1j4J07J0J00j03J31k30N6L41k15J91j00Q2k2n4l09
4262a87K83k45J42k14J15M5K34l6k76J77j99N8p0L21j84j38K13r3P5J85j52k41
4284a87J79QQ2j66Q2R4j95J28m1N6J5k5k1J15k79N8L07j62J16n5j04j19QJ44q8
4309e0n7m0o9K12j42J63j73J52j55M43j83j70j34K29o8K51q5o8j08J64l8l3q6
4332d5qJ72k45K27k94j69J83l0L42j15K0R6j75o4K89J65j87j50k87J68M0P7r1
4355h1j11J45k22J09k30J63J63p2J48k79L02q9K68o2j49MJ35K02m23n5J0J82j45
$$ y = [42, 64, 21, 126, -1, 168, 219, -12, -76, -38, -44, -3, -208, -151, -64, -34, 61, -156, -25, -140, 104, -17, -158, 103, -1, 236, 128, 73, -11, -49, -43, -84, 1, 12, -57, -69, -58, 81, -36, 12, 36, -27, -233, 48, 109, -55, 22, 64, 63, -31, 147, -72, -127, 122, -124, 52, 26, -127, -158, -172, -65, -55, 45, -58, 73, -157, -101, 240, 25, 216, 116, 198, 176, 122, -187, 96, -149, -7, -221, -106, -61, 173, 137, -139, 38, -161, -103, -173, 148, -36, -174, 39, -54, 21, 206, 54, -187, -8, 0, 82, -84, -2, 92, -103, 25, -16, 40, 55, 30, 9, 124, -155, -97, 210, 48, 164, 109, 5, -114, -106, 38, -50, -107, -147, -216, -4, -146, 17, -156, -4, -159, 284, 101, -69, -203, 26, -42, 209, 124, 56, -52, 112, 74, 41, -45, -53, 119, -126, 101, -193, -362, -179, -209, 133, 18, 38, 134, -41, -105, 184, 349, 162, 12, -275, -107, -67, 10, -81, -192, -47, -269, -160, -390, -227, -64, -136, 12, -267, 35, -54, 214, 152, 3, 7, 142, 344, -79, -134, -124, 58, -87]
4378h7J0n0P0RJ43Qk53K66j14j17R8J29k0m9m9K09k13j59K19j51J45l18L42k94
4402b26K7O2J1p6J74K30n0j50J76m3L9j19k0L1j12K21k79K2r8N4kP9J32M9l44
4427b12K08r3J39K92l08Qr1J8L6M8k9N6k6j59L7R7K9p8K3q5J88k78n5L31k6k7
4453D3J86l94J97J73P9l36J45J36j34qR8o5j39r0J25k04o7L46K3k23J47J61N4
4476B53l07o5J76N0j52R5n7Qj57K45j03q1K23n9j76J15p8O3J7j6n8j59K19K15
4500B11j2j28L8L5j57pJ45k43N4K06j50m9O3j13L10l69J67R9or4R3K33k88P2q9
4525B1k9K8J87k04J75k82J69k4j71K3J89rn4R7o8j59J61n2J02j26J67Oo7j6J18
4550A82r5j03j37K62j46n9j31J45o0J07J17o1q6L12j30M3N3O0p2j50J14J8k34
$$ y = [-87, -77, -127, -57, -48, 95, 103, -150, 116, 2, -115, -17, 112, 92, 43, -6, 203, -10, -169, 50, -101, 44, -274, 68, -226, -199, -137, -126, -202, -28, 202, 152, 2, 178, 135, 174, 55, 35, 66, -46, 175, -104, -82, -180, -126, -128, -49, 83, 132, -212, -4, -97, 42, 334, 26, 34, -57, -39, -3, 45, 16, 72, 46, -113, -76, 21, 50, -28, -5, -90, 98, -180, -235, 96, 70, 43, 229, -165, 32, 205, 284, -52, 93, 229, 95, 87, 185, 120, -19, -109, 16, -188, -255, 91, 114, -109, 38, 199, 253, -54, -119, 57, 107, -45, 50, -7, 1, -156, 89, -14, -95, 128, 69, -107, 8, -70, -7, 10, -6, -64, -223, -4, 211, 199, 71, 109, 144, -13, -20, 125, -118, -64, 142, -8, -57, 6, -107, 203, -166, 1, 100, 94, 0, 93, 326, 38, 110, 21, -8, 20, 207, 3, 178, -104, 65, 41, -130, -107, 82, 73, 19, 116, 48, -111, 50, -2, 100, -26, 141, 147, 80, 64, 182, 87, -16, -153, 109, -37, -96, -227, -82, -142, -35, 82, 21, -65, 247, 117, 160, 213, 273, 201, 51, 165, 183, -51]
4573e1R3J06j74k59K27J6r6r5K00j19M9LP5l2O2no3J1K09j56l9L63j25r6l19K52
4599C7N7j98K7l05J00M3J94J01j10n2K95k9J1j34J56k04J60nj40p0l2J05M2o7
4623a8k9k6O2no2J12j3j95M78k25j92R8J32J68k20j49L02j98p9j11j45L98n2j77
4647a46K20k32Q8P5K6M5l8o1J4r1k8J65q3M9k4R9J99k92p3Q4k1l53K03K07Lk14
4673a79M34l42M0j59J85K46j50N1J23l05J31k04J61N7m0J02k53O2qj60K36j35
4695a07q5O8R7O2Kn8r9J63j63M9J80o8R8j62N3j10J34M6k27n1J5m6K31q9J94p
4721A20j81J3K16k17l3J77j27K06k97Q8%j79J85n3Q1K15j81k2k91L87k12L33r1
4744A37j30R3l29K09K16l15L5K40m8R5j77M1j29j80K5K18j33P2J44l79M89q4j00
$$ y = [-51, 42, 148, -26, -285, -58, -42, -138, -233, -33, -152, -103, -100, -25, -57, 5, 0, -63, -52, 157, 1, -38, 325, 200, 104, -215, 37, 94, -104, -77, -382, -282, -239, -45, 56, -54, -106, 189, 160, 171, 37, 193, -11, 149, 144, 4, -66, -98, 7, 49, -18, -47, -73, -11, -16, -78, 34, 21, -174, 304, 79, -113, -15, 117, 285, 65, -84, 218, 20, -59, -170, -315, 83, 31, -146, 74, -158, -70, 5, 31, 76, 38, -23, -9, -100, -128, 37, -46, 3, -21, 78, 277, -15, -88, -4, -25, -378, -175, 32, 35, -179, 255, -87, -47, -206, -21, 225, 75, 126, 249, -56, 75, -129, 32, 89, 49, 151, -102, -40, -48, -208, 28, -107, -192, -124, -27, 35, 37, -21, -120, 43, -120, -71, 109, 41, 139, -23, 30, -80, 54, 100, -127, -178, -163, -209, 22, -67, 127, 120, -61, -48, 168, -49, -82, 95, -32, 174, -123, -35, -35, -214, -29, -82, -1, 214, 33, 11, -280, 107, -105, 228, 137, 7, 100, -229, -20, 196, -119, -84, 156, 108, 203, 26, 67, -62, -242, -217, 1, -132, -60, 84, -295, 194, 110, 10]
4767A0L3ok1J8K2pN5j52M5m0L0j30k7K25q2q8J41k3j70K25k60M01k38J83m1k55
4793a52K60Lk77p0J97qL19l50n0K67k28j43J26j68M40n0j2j26J81j21L39l19j21
4816f3K55l07Q9J14j95K24P6l46m9J23j64K83n2O6L4k5j07J94j21j36K12L8j03
4839D0J32K3j49r2P8J6j9N3m08K72j34k0j5J71J88j82O1n6J97p1k1J53j29l1O
4864F3m6K10k88m9J87L2m49L86k29Q4l2M22k23K6J02j34j16J28J13j19m9j8j21
4887a20J37Nj2M6k52Q0K24j08Kk1j19J43O3M7J01l6L9l79M16j55O2j84p3L6R8
4912D0k02j66K5L90k80K07m7K06j51m6K35N5j59p9q9j4k8J18J27j57j52O5J5J1
4936g6N8J3o6j21K88l12P6K21n0Mj60J89P9j97L35k00j17K15qk12J57q7j34K06
$$ y = [10, 43, 37, 16, 34, 56, 49, 104, -48, -3, -43, -13, -143, -170, 55, -27, -115, 26, 3, -167, 58, -202, 199, -39, 144, 103, -152, 108, 111, -166, -236, -39, -47, 272, -78, -128, 139, -89, -232, -106, -274, 166, 116, 104, -22, 159, 38, 377, 58, -63, 192, -115, -26, 88, -107, 117, 193, -153, -202, -79, -243, 40, -12, 54, 88, 63, -44, 150, 29, -107, 105, 143, 40, 172, 195, 46, -46, 32, 48, 29, 82, -326, -54, -188, -208, -223, -52, 136, -46, 15, -41, 156, 85, 64, 217, 88, 57, 63, 17, 227, -61, -110, 77, 109, -340, 46, -183, -99, -131, 291, 68, 94, 196, 62, -54, 74, 187, 68, 19, 1, -120, 17, 22, 10, 56, -196, -116, 108, 0, 2, -19, -138, 5, 68, 115, 216, 180, 219, -160, 256, 101, 163, -21, -94, -58, 40, -162, -328, -303, 87, -193, 14, -33, 173, 22, -24, 211, 266, 107, 28, -61, -75, -103, 15, 142, -15, -167, -102, -87, -76, -18, -5, -71, -192, 96, -216, -140, 81, 31, 35, -125, 64, 143, -54, 281, 81, -36, 179, 171, -41, 116, 29, -105, 101]
4960A01r9L9k05J94q6r4K48k63K98l2j59J92L0N7j76Qn0n6j6N5j55N4L03j51n3
4985a6n1J51j50N6j6L2J1n8L04k12q4J42J3j76R9J12j96J05J04l06J89k46J93
5008@J95j72K73p8k00J88N0k25o9J24n6n9r1L94l39j81J40p0J45L9l8O2Q1lj17
5033gj0K4j14J37Q4q1J1j01J04r5Q7m9l0L08j24k92J94p5j10K1J9J12j90L37l6
5058A24j82O9J50K53m70K29j83k02J0N4l8L2J83j92J56Lq0Q0o4J02r6j6K0J17
5082E9m4j72J27K06k85O8l5l5Q7L1j11J93j2j40L3rK0L7Ok1q5J64R9q6k07J47
5108C5n8m3J13M5k13k5J14J09j83q4L0J14K4j69L05k77J27j36L42n0j62J23n8
5131B3K6q9j40Q8K4j4j49K47N7J7P5j19j56R3j1j30J97N8j42m6K55j62J35j62
$$ y = [101, 2, 41, -164, 30, -56, -150, 98, -165, 133, 101, -58, 134, 164, 221, 45, 53, 3, -53, -69, -14, -169, -115, 188, 37, -16, -67, 84, -66, -10, -26, 6, 17, -41, 263, 51, -33, 109, 122, -54, 45, 157, -39, 66, 170, -136, 53, -193, 0, 195, 23, 296, 218, 18, 206, 256, 31, -38, 86, 30, -29, -120, 274, -65, -246, -106, -176, -31, 8, -30, 32, 113, 110, -7, -17, 7, -107, 30, 114, 33, 44, -57, 47, -48, 39, -10, -40, 268, 144, -148, 46, -29, -139, -118, -99, 13, -177, 160, 124, -58, 11, 161, 414, -56, 173, -10, -212, -202, -148, -186, -154, 29, -163, -7, -4, -84, -4, -68, 34, -62, -78, -58, 59, 15, -157, -30, 176, -109, -41, -76, -111, -24, 7, -104, 89, 77, -63, -30, -39, -19, 18, 24, 3, -82, 82, 181, 95, -112, 35, -23, -66, 47, 92, -121, -146, -32, 77, -106, -190, -160, -46, -22, -191, 114, -163, -36, -172, 170, 120, -42, 81, 23, 49, -40, -180, -92, -68, -82, -231, 16, 73, 90, 165, 46, -110, -17, -28, -158, 39, 97, -45, -91, 164, 2, 137, -25]
5155b5l2J38K0j90N7j0kK4r2l3n3J82j27J94n4J64K9o6j19Q7m6J93m24K21j05
5180f9k4K0J0P6j14L20l07J95j50J04Q3m03J80n3J39K26k29j36K62k40J86P7j56
5203cK3J6J11j49J42l03R9M3J63q8Q2m2K24j00k0l3P0j77j54K2j68J46o2J07J06
5228E5j00Q8j17l6L79j81M3k01R5Q3K3l50K03p6K67j70m6l8O1J40j90LK21K3j54
5253B5mj95K58j26O1J29k97K48q3J34q8p0j17R7J11n5k23J66j33N6o9K57q0j07
5277a05k4N6MRJ93M1j98o0J67k94J11P4J58k54J13pj64O2m0K57k03K10J76l40
5301e8PK75r5j45N3q1L10L0j24k28J52J7j58j04K51j63R8Q2j59oO6O7j2n6J98
5326B17k06J2O3j62K13l28J11j05j8L4J05j6JJ9M4O1n1l2K35k42K39o9N8L2j67
$$ y = [-25, -57, 81, 101, -89, -32, -42, -44, -20, -112, -145, -198, -16, -143, 51, -3, 161, 190, 124, 5, 92, 46, 239, -185, 36, -69, -93, -73, -63, 13, -101, 219, -88, 107, -43, 61, 144, -259, -79, -132, 7, 233, 4, -132, 130, -110, 76, 153, -3, 20, 36, 147, -2, 140, -163, -64, -21, 142, 54, 136, 94, 318, 218, 198, 165, 235, 58, -96, -74, -242, -96, -158, -51, 55, -45, 43, -74, -110, 269, 88, 131, -70, 25, 108, 131, -219, -16, -92, 175, 5, -41, -79, -18, 122, -68, -65, 156, 179, 25, 21, -174, 84, -42, 19, 148, -149, 99, 16, 150, 62, -8, -125, -28, 83, 28, -195, -29, -162, -106, -175, 82, 2, -105, -129, -73, -69, -60, 133, 174, -24, -84, 83, -211, -100, -26, 132, -122, -9, -16, -180, -118, -158, 99, -104, 106, 282, -58, -51, 224, 129, -16, 37, -44, 266, 296, 172, -56, 96, 113, -45, -149, 102, -61, 37, 119, -40, -46, 20, 87, 75, 19, 217, 11, 23, 86, -76, 137, -191, -80, -185, -203, -169, -64, -80, -79, -60, -16, 45, -6, -38, 197, -45, 194, 125, 183, 215, 48]
5351D8R8j22n1m3pm1k2J00n0k7K39m1j65k22K22k8J87r6J20R2j98J79j69m4J7
5376b4r8K45J1j57Q3K7j86j7Q9n1K07l91K37R4j76K08p2PLL2N1k15J99k88N1K42
5402A11j26q6MM9K7j14J18k63L74j66J38R4l42M58l26J10p7P2j30pR8j64J3m1
5426a76j13N12k82j20J53j6J1J42N1l22K39k61J83k8L04l18K01q7k99K93k11J07
5448c7J73k41M1J1l5L69j88j23J47l48L09k9j1K47j59K07j71j04O5k46k9J59N5
5471F2l8j13j41J39K56k83J4P2L73l43M8J42j34Nj00m5n1J42k17K15P7l85L40
5494C5k53J53j24J80k39J49J12p7N4K71k61l7L8J65l8k05J66q4l7Q2J19j38J94
5517B25l29K07q7p9R2K53k20k5j22J74P5k4N5o2j24J8N4k10N6o6M8P3k8l5R8j82
$$ y = [48, 146, 24, -27, -70, -77, -118, -140, -40, -90, -117, 122, 81, -84, -306, -84, -112, 75, -21, 99, 191, -7, 172, 3, -41, -24, -122, 123, 134, -23, 60, 87, -99, -116, -27, -78, 129, -262, -25, 69, -107, 101, 29, 36, 39, 71, 122, -93, 106, -182, -131, 111, -15, -101, -97, -48, -21, -135, -17, -280, 94, -72, 66, 160, -182, 276, -50, 60, -17, 55, -75, -82, 16, -148, -135, -176, -289, 223, -59, -179, -26, -42, -31, 111, 162, -160, 79, -182, 1, -27, 277, -41, 160, 73, -226, 67, -144, -37, 136, -105, -64, -53, -88, 281, 93, -30, 117, -231, 78, 49, 38, 285, 126, 333, 162, 58, 123, -123, -152, 7, 62, 24, -89, -230, -91, 165, -118, -104, -32, 341, -2, 46, 188, 54, 59, -41, -86, -137, 5, -212, 3, 80, -305, 35, -218, -65, -189, -9, -248, -99, 13, -64, -10, 261, 0, -37, 1, 166, 128, -77, 89, 5, -32, 50, 169, 31, 225, -104, 103, 16, -63, 29, 282, 62, 37, -85, 89, 164, 140, 195, 133, 9, 27, 81, -129, -73, -139, -91, -18, -46, -81, 17, -165]
5543a65J16o1J62P0n4j59M4J17nj42O8J83k91J44k08J73j94J87Mr2K38p1k92J42
5567h6K8q2J53Jr7L3K59N3j59k8r9r7P0N5P5r1j17K27j58J70j65R6k09J63R3J93
5593B81k94N1j32K13J3p6o5o1J17j22j6j22K47m9Rj02M4K0pJ66o6j24J93j04K9
5618D3j00O4J02L1k43J41j44J08k05K92l76K64m1L4L5j90K85Ok61R0J77j47M0
5641Eo6J67j59k28K78O3m3rN7j36J1k0N3R0k3J00j57J44o5K5n0J8n0J05k45J55
5667B0L4J0q9k2r8Q6j44L37j42j42o0N3j3K41j10m9N5j6o8K74j95k9J80j98K50
5692A65l8j37j46J45m9O0k8j30J15k0j9J94P2k24J16O5k10Q2m5p6J9J84j04k1
5716c0n1K49j40j11O8m8K87r0j44P5K8j1p5J63j56k7J14j24LQ8j40k79J30J88
$$ y = [-165, -49, -110, 52, 122, 68, -91, -47, 70, 65, -77, -9, 174, -117, 27, -181, -8, -202, -15, -11, -103, 135, 64, -228, -86, -58, -140, 13, 14, -83, -50, 209, 262, 103, 75, -24, -121, -51, 4, 79, -12, -129, 98, -60, 110, -55, 41, -168, -5, 88, 281, -13, 38, -94, 119, 132, 56, -9, -70, 47, -75, -91, -213, 34, -15, -6, -108, -64, -44, -51, 115, 49, -75, 118, 14, 43, -57, 7, 109, 140, -103, 38, -106, 2, -203, 89, -287, -23, -64, -30, 5, -185, 100, 106, -155, -65, 112, -35, 5, -61, 106, -53, -281, -3, 60, 17, 8, 65, -71, -60, -80, -27, 63, 40, 140, -17, 127, 62, 87, 37, 55, 5, 110, -135, 20, 54, 64, -25, -47, -145, -59, -203, 134, -8, -150, -210, -157, -170, 71, -39, -88, -33, -49, -117, 157, -38, -67, 113, -85, 165, 127, -10, -156, -11, -60, 0, -28, -158, -43, -63, -82, 112, 184, -40, 76, 141, -69, 13, -32, -108, -89, 95, -9, -30, -81, 168, 28, -83, -15, -63, 224, 134, -10, 65, 93, 82, 7, 170, 14, -13, 101, -23, -20, 68, -72, -351, -221, -33]
5740c3j80J23J61P2k80J82L4j50R1l21K28K13j63J33J7j52K5k57L91j73R8K8j01
5763a4kj16J74O4j53J74j89J0K10q3j11J65j60O1k0J48l04K24R3o2M0r2l82J76
5787a49J83nr2Q2j8Om9O1J88j76l38L07j30R3J56p4k8kpL9j5O4J6j68N0p5K30
5814A49j07K21j70J34k24P6J24j91J05o8J22j61j97J51lK2K4n2Q9k1K1LM9j2n0
5839C4k17M35j80J88l75L3L8J01n6N8l11K67j37J7J63k26K10p7r7J27M1o2J54
5862A28N0k79K33j99K6L9p2j22Q4J36j5j57K78k39K02j91o2j1K56r6J03o8K93
5885C17m86K45j12J04Q4Pj44j12jl3q0J64k32K20J5J0N6J94k04k48K12J31k36
5908a29N2Q5K27l95J41Qj01L87k67L0j28J18J46k33J3J6%k7Q4j73nJ81K45j36
$$ y = [-33, -213, -90, 71, 143, -137, 45, 79, -71, 20, -301, -73, 140, -23, 110, 127, -25, 0, -257, 134, -39, 59, 87, -14, -16, -132, 42, 106, -47, 127, -62, -52, 158, 75, -36, 129, -31, 30, 10, 158, -146, 78, 171, 109, 149, 57, -325, -149, 34, 29, -63, 19, 1, 7, -42, 19, 207, 31, -307, 0, -130, -37, 119, 45, 17, 15, 8, 47, 32, 96, 112, -56, -6, -81, 149, 42, 263, 93, 227, 3, 79, 203, 12, 117, 49, 171, 10, -187, -36, -39, -17, 7, -45, 44, 23, 44, 47, 96, 84, 34, -183, 252, 72, 260, -115, -82, -44, 57, 1, 59, -252, 15, -122, -105, 58, -168, 42, -35, -132, -5, 36, -26, 128, 178, -101, 132, -67, -41, -2, -74, -196, -112, 24, 9, -148, 130, -109, 93, -98, -160, -171, 85, -11, 92, 24, 317, -169, 76, -36, 68, 152, 159, 15, -97, -98, -131, -211, -47, -279, -59, -44, -34, 22, 216, 12, -236, -24, 107, -129, -77, 8, 235, -160, -19, -11, -112, 275, 8, 38, -90, 28, 174, -59, -46, -30, -30, -57, 27, -146, -151, 30, 275, 139]
5932A39q1j01Q9j6j70J72j94j8J97J9l64K57K08J3j77j38J43J66P7k04j50L17
5954A84l45J04J25n5k66K21Q9J01j49j73p3L03K01m15q7M71j65k13L25j13J27
5975A97o7J0k66n4J64J50r4n0k6pJ52j43pj50J36n1n7J66J09j1OL0j37O8J69k00
6001C7k71Q5KL30j64N9j16K5q2j91L44j23P8K3qJ08p0k13P8K20l6j87K12o0o0
6026B0j74J76j09l0j54P6J72m9J2Q7K1j65jKJ28Q0L7j74J39k24M5J48j33l0O8
6051c2J38j95P4P1k07J84L6J75k81j28K52L4j5O3k87J06k58L76j13j1n1Q1J13
6074A25l42K76Nj13R1j79K02k53J25Lr1LQ8R0q5J39k06r8L04k75J29P1J53j89
6098b7j59K11Ok9J50j28k9J6J75l54J97j85M8L16k59P1M7k16K86k10k26L88q0
$$ y = [139, 58, -43, 46, 30, -140, 32, -162, -180, 17, 36, -328, -71, 137, 150, -27, -165, -22, 144, 221, 17, -133, 184, -161, -57, 68, 13, -253, -32, 57, 158, 9, -164, -237, 66, 267, -148, -235, 236, 71, -142, 183, 70, 197, 130, 140, -126, -180, -16, 134, 40, -10, -36, -43, 109, -34, -41, -191, -55, -106, -163, 3, 112, 101, 107, 137, 0, 68, 237, 37, -234, -149, -147, 183, 19, 78, -38, -13, -95, -286, 58, -65, 13, 36, 28, 136, 66, -147, -69, 151, 115, -72, 140, 80, 20, -154, 22, -87, -117, -271, -195, -23, -72, -60, 27, 48, -117, -118, -116, 12, 92, 129, -45, 94, -130, -85, 63, -70, -100, -32, 106, -89, -15, 56, -151, 33, 69, 244, -37, -165, 87, 121, 106, 169, -118, -12, -270, 106, -7, -18, -69, 12, 125, -217, 59, 64, -49, 42, -137, 65, -188, -63, -60, -151, -148, -60, 30, -55, 84, -122, -220, 84, -191, -62, 9, 162, -27, -186, 25, 31, 2, 152, 24, -5, 11, 186, -168, 29, -156, -108, 208, -51, 20, 67, -149, 137, -73, -299, 89, 9]
6121Ik82L09k01M0J94oj70J23l1J81J17l53RJ88j08m1L2R4q1M3O9k80K32k98J45
6146f6n1L82j77j88K04M2K7mk35J31p6k29P8J49n7jQ4M8k1o5M9Q5N9k88r0K14
6172DN0p9k6K60j53q3K8o0J38J9O7Jk61k1kP7p0J6L0K26j6n5j38J7J39J4j75J48
6200I5j30R6j71m9K01N2k64K75j40o9K35k60J26k86K50m5J52j99O6m8K4J25L4
6223G0j26J57j36p4M6o6K38R3k51j94K97j52K48o0j04J79l9j90L6m3K11k16P8
6246BK8N7j08j08J10l5L01m78K72j11l0K8J02j02J05k9k58K37m4K40j52R1k02
6269h4L8r3L1K54j7k60J37j18K8J3lk5O0O8j97K27J61j48J43l01O1J40j24J06
6293I7k48J66j50n5L21j62J93k05K0K3%o1p9K67j45q9J68j91K24J16l07P9ql27
$$ y = [9, -273, 36, -165, -125, 69, 63, -107, 16, -15, 166, 283, -70, -61, 127, 19, -22, 10, 104, 23, 66, 135, -145, 87, -211, -66, -117, 265, 88, -100, 104, 146, 173, 169, -66, 65, -11, -240, -162, -13, -70, -71, 13, 61, 40, -25, 24, 109, 168, -120, -210, 4, 54, -25, -51, 209, 56, -27, 1, -59, 79, 98, 165, 166, -95, -116, -118, -41, -111, -95, -65, 161, 145, 90, -48, -31, 108, 122, -53, 95, -35, 61, -110, -159, 42, 94, -170, 105, -35, -104, 131, -129, -3, -289, -39, -84, 68, -131, -65, -113, -89, 36, 70, -56, 101, -35, -109, -63, -129, 109, 202, -49, -243, 54, -98, 150, 90, -14, 165, 126, -64, -28, -71, 140, -76, 2, 30, 87, -21, -129, -19, -54, 247, -231, 41, -70, -100, -72, 30, -72, 33, 4, -254, -17, -61, 179, 27, 118, -84, -46, -139, -108, 146, 129, -131, 6, -112, -84, -71, -74, -99, -39, 29, -168, 59, 220, 72, 215, -86, -25, 115, -9, 97, -151, 15, -135, -190, 131, -31, 162, -43, -23, 0, 0, -61, -140, 127, -18, -107, 61, -130, 94, 210, -97, -18, -26, -353]
6317c53K83J42o5q3P9J47k37K44l80M49k29J88j25J39k92K11l9o9Q9j03p2L05
6339B29k29J78j7R5k41k9l0j39K14J9L0j14Q0q5o4K20j21J0O0J2o2O3j37J76q0
6364C8J53k72mL9J81n3j21K32o9l9j28j43j57M62No4j65L3NQ1k42J13J42r6j76
6389b45k4L04J01p5K3j58j4P9l1K76o7j73J44j87O0KL3QK5k33Q5K70j56n0J38
6414A35j77J35J09l29N9J8J29l15L17J31l21j51L43j2r8r8J41m4K19k99O3kl4
6437h1j0rN9QkJ7M8K0oK7k46J36k6P4k77J61J3J00k3j40L8J88q1J47k14K54L6
6464B11k76N6n4m0Q1j4k6l23J15L66q1j1Rj9r6J62k28J90j87K53k21N3K30J4n2
6489A12j73L2p1j0J06rj11K95k33P4j17j74K96Q5J1j38P2j96J85R6j12or0L5N1
$$ y = [-353, -70, 72, 7, -76, 3, 150, -87, 157, -223, 226, -3, 185, 60, 199, -93, 118, 79, 10, 99, -4, -76, 229, 0, 178, 161, 256, 15, -14, -44, -183, 31, 50, 80, -34, 46, -39, -103, 117, -4, 6, 66, 78, 16, 79, -58, 118, 38, 191, -81, -85, -46, 135, 82, -39, 193, 124, 85, -43, -186, -343, 119, 124, 60, -105, -72, -67, 14, -228, -115, 27, -69, -245, -269, 35, 136, 61, 84, -74, -88, -9, -40, 236, 169, -4, 140, -47, 13, 15, 48, 56, 81, -152, -67, 203, 47, -3, 135, -42, 93, 202, -127, -68, -50, 79, -236, 81, 212, -109, -260, 83, 71, -27, -125, 16, -28, 191, -108, -45, -47, -81, -91, -100, -41, -33, -35, -18, 30, 50, 44, 71, -175, -39, -65, 9, -268, -107, -94, 6, -17, -157, -119, 69, -12, 135, -79, 175, 211, -65, -9, -63, -103, -22, -36, -62, -385, -270, 96, 15, 4, 13, -6, -102, 60, -168, 22, -165, 88, -133, -80, 150, 164, 112, -61, -29, -100, -110, -4, -13, -124, 171, -62, 12, -105, -279, 17, 102, 113, -25, 47, -149, 36, 132, 20, 14, -76, -41, 10]
6514A0Pp0kK37j31q7K08j67Ok16mJ16J71k26L67l4j15k38J84J23n0J16l75K40
6538G0j89J55j08R5p3mJ32jn6M3%j45J65n6J75j98J27j11J42k44j7P5J34o3p0
6563b2r5k0K44l6j7k9R5k31N4J9R0k6l4k1k2K8J37qr4J75k31K2J41j55J18j26
6589d4K19k12j24K05p9O7p1J47j04J53J7k39M9j12K32j7k82J90j10K61m77J08
6611b23L19j35j07j57J37L58q4j57K95k38p7R1j9j45J54Q6r0k50K14J4M6M1l2
6634D1j45p1L05j35j08K2K22j70j35J08J90j07L8o8J9k7K46k47K2O2j6jk19J14
6658f0j90K69o6o9L87L0k43n3J78k00jQ6K5l06Q5K01J9J9k05J95j09o1K6M1m7
6683d9j53K69k5J11k01r7J59L7J72l67J05K62l14M3K81j43j67N3j5o6J3J65mj86
$$ y = [10, 17, -53, -55, 182, 51, -36, 172, 5, 11, -205, -209, -93, 78, -148, 219, 185, 70, -168, 16, 139, 89, 205, -170, 70, -119, 36, -72, 23, -50, -54, 78, 77, 21, 64, 64, -81, 84, 28, 203, 5, 132, 21, 163, -81, -98, -23, 111, 48, -22, -117, -137, 107, 71, 54, 25, 120, -111, -57, -38, 52, 26, -8, -29, -51, -23, 114, 106, 12, 187, -44, -22, 119, -36, 82, -44, 175, -37, -161, 44, -35, 32, -39, 108, 4, 157, 174, -65, -16, -128, 104, 87, -195, -5, -115, 146, -331, -223, 96, -39, -146, -303, -166, 192, 108, -49, 246, 8, -69, 22, 3, -142, 12, 98, 8, -242, -28, -14, 32, 73, 41, -104, -175, 130, -5, -113, -91, 131, -39, -174, -66, 124, 17, 55, -13, 6, -21, 225, -22, 0, 62, 46, 45, -174, -60, -250, 19, -47, -116, 271, 301, 58, 5, 183, -17, -18, 68, 93, -213, -128, 73, 92, 111, -94, 101, -8, -69, -43, -2, -49, -202, 67, 42, 153, -48, -145, 14, 51, 223, -144, -39, 223, -91, -48, 233, 90, -77, -24, -39, -105, -92, 73, 69, -117]
6707a17J32o3RJ49l81K57J7J32j77j0J14K24l73K45j33j01K38q6j89LJ36K5J00
6730A51j69j6J16k0Q5J34m11qR4K5j09K11l1k7l3j27J24j2n2M4j31J58l8R2J38
6755A88J88k67M1OO2l34O5J27k28L44l08q0K24KR1j3nl6P3r0K31k15j90J77k50
6780a97K27Q3k1Lo2j79K96n9k18J8J80N8r8m8j08J94l02J51qL53k67j99J87j14
6804a30J01J25j11R3p9j4%j3o6J64j53J19K4N9q2r9J71q7Q5m3M3j68N7k53K74
6829A7J86k57j8K81j66P1nj40Q5j24MK7%J46k48L98j82J07p2j87J43j22J46mM6
6854A32j98m7J83k44J60N9N8j62j4j39K42J4J07j38L3n6p9K76k13J09p3j00L7
6877e3j8Q9l9J49m2k79J26N2J73k17K28k61N9Pm0P8j5K00j61q6q8PL22l12L28
$$ y = [-117, 15, -48, -39, 110, -271, -14, 3, 135, -42, -52, 62, 286, -87, 158, 25, -76, 162, 76, -113, -110, 26, 51, 151, -18, -34, 82, 62, 147, 281, -130, -138, -44, -19, -128, 83, 52, 25, -8, -135, -11, -23, -75, -31, -162, -4, -42, 50, 188, 376, 109, 150, 156, 218, -116, -51, 76, -152, 192, -116, -196, 28, 30, 121, 108, 103, 67, 140, 50, 281, 66, -124, 53, -197, 30, 113, 92, 95, 33, -146, 150, 91, -127, -109, 71, 129, 31, -17, -125, 69, -233, -82, -90, 263, -4, -203, -16, -130, -29, 96, -15, 78, -1, -15, -15, -28, -94, 70, -83, 36, 60, 119, 37, -62, 109, 22, 107, 64, 107, -61, -4, -257, 17, 203, -54, -72, 209, 43, 114, 109, -31, 54, -70, -66, -39, -39, 107, -141, 257, 75, 182, 110, -77, 66, -56, 90, 86, 132, -66, -113, 70, -174, -14, 45, 103, -59, -73, -212, 30, 44, 151, 13, 46, -10, -89, 187, -26, 83, 10, -90, -53, -71, 18, -21, 128, 86, -193, -67, -15, 158, -59, 169, -92, -33, -26, -66, 12, -3, 197, 36, -50, -138, -131, 191, -121, 207]
6902B07k98J32O9k3q1j51J56j7n4Q0Q9r9O7j32o4M3J73o3k4r1J37k9o2j00J79
6927D4m2j59m9N6N6J2R1J89m10j5M53l21P7k01K92l6k6qk15L22j82J65j65J61
6951H9j04MJ59k26L1N3J24n0j08l5j29L33j64l08J17mJ54P3k2P1j74M5P8J03o9
6976D1j08j00K50Q3k38K08J8K4j93J63m06J65o9J85L5r3j02J59j60J58k9J13k12
6999a08J69K34k03l7p0j34J19K6J10k55M06m87J87j7p3P4j40M47k97K3Q1lK24
7022B76l98K55J6n8q2k8j97J45j20J52q2Q0K0p4J35k94L23o2r9J74L6O8n7J51
7046B80n0k23n1J23l4j14j8j0K4J28n6l2j00l4M2qJ50n5n4MMJ86N3j70j4m9M2
7073c6J3J30q4j81J13k04K50l6J01Pj89J48j79J61j37K37o7j17j3K55k05R7j31
$$ y = [207, -91, 41, 110, 87, 6, -145, 11, -6, -60, 20, 109, 10, 77, -55, -119, -76, 97, 34, 10, -81, 56, 27, -35, -135, 44, 2, -157, -206, -150, -94, -82, 9, 198, -212, -227, 226, -95, -18, -219, 73, 37, 11, 3, -212, 110, -72, 93, -72, 89, -15, -11, 148, -78, -47, 6, 130, 80, -28, -63, -192, 141, -23, -331, -214, -218, -64, 9, -13, 58, -116, -71, 7, 110, 41, -67, -167, 83, 166, -72, 136, 154, 178, -15, 148, -258, -93, -162, 23, 58, -35, -137, 22, -138, 20, -9, 104, -108, 61, 295, 92, 55, -15, -149, -30, -4, 106, -149, 257, -230, -43, -60, -133, -59, -199, 248, -49, -26, 55, 52, 276, -122, 133, 149, 91, 9, -19, -216, -71, -191, -39, -121, -41, -21, -95, 40, -254, 69, 7, -92, 82, 118, 186, 129, 280, 230, 7, -44, 79, 45, -69, -87, -97, -73, 55, -1, -33, -133, -167, -125, -133, 17, -38, -92, -88, -84, 102, 155, -15, -29, -78, -36, -23, 107, 23, -158, -45, -249, 1, -35, 66, 73, -116, 32, -147, 14, -123, 114, 47, -70, -83, 172, -33, 64, -67]
7096f7k2J66j50J36k79K49j20j97J60J18o4J91l4o8J4oK75k30P9l71L01j66J66
7119H1ol5P1k56P7O6L3K7l1j20q7o6J08J92r2j09J35n0J13p9J06j49j11J36M4
7144bk03M21k3k05MJ57N1k89L7n5O1O6j37K28j74J32m2K6j13M3j23K92j66k36
7168b50M2M29k43N1J47k82K57k02j2l3J67p7k8K98m54M17k69J67J6k09K18k97
7190a47R1L1j35K31j30J23m0K13j85M2k13J15j24M9J81k76K72k84J86m12K68K5
7212a19J59m0K4q2J12p2Q6k58K06j30P1J35J09l21P2RJ29n1q6O3j06K03j45o6
7236i8r0K18j69O4J94k55r7J0J85K97j71j37J61j70L9LJ50j34r0K10l22L00k62
7259a64J44N0n1l3J5P7j06J76j28J6k9J42p8r9J65n4j78J00LJ9n7m0J72j34n2
$$ y = [-67, -89, 77, -73, 63, -216, 33, -87, -284, -124, -6, -70, 121, 87, 19, 33, 27, 302, 72, 151, -220, 81, -85, 81, 75, 40, 111, -145, -68, -2, 31, 58, 27, -93, -180, -246, -138, 54, -38, -147, -12, -62, 51, -28, 78, -71, -182, -46, -2, -205, 216, 193, -12, -8, 149, 200, -89, -52, -107, -46, 20, -117, 111, -63, 69, 27, 53, -60, -17, -140, 152, -14, -250, -208, 221, -22, 29, 176, -106, 151, -51, -63, -96, 71, -6, -34, 264, -190, 227, -42, 125, 141, -68, 150, -147, -56, -25, -160, 71, -59, 64, 24, 237, 52, 94, -119, -4, -128, -79, 102, -174, 98, -186, 0, -412, -144, -119, 40, 0, 24, -58, 54, -18, 68, -190, 16, -114, -43, 92, 201, -120, -48, -39, 90, 39, -47, 16, -90, 113, -32, -98, -188, 30, -139, -75, 119, -136, -233, -223, -38, 259, 88, -49, 112, -58, -19, -16, 134, 0, -90, 120, -202, 98, -164, -20, 30, -21, -54, -39, 38, -68, 108, -20, -4, -33, 109, 31, -68, 97, 43, -135, -35, -32, -13, -70, -110, 62, -72, -124]
7284a24J03J39k56J82O2J48l55mO2r6J19j65K42M8R9j59l7q5j0r3J11j09K54j33
7308e7L5K79j73m6j54K8K91lj54k02L06o0l02J47L6R8q6j69N9R9J49j65M3m5p
7333e3N8k64J46L7L40m24J49J7J22Mj22r2R9J0k36J29K2m5K10l10K84J17k20Q1
7357E9Ol9Op3O1q3O0n5J40lj46k1M4q3P7K0k7j1L1k03L12r4l17N33k20j27k3K26
7385E0j2p3J9J83k63%O4P6j20J58j09J04j08k1J01L6q4m9l5J64L2l8o0L6J2k93
7411b30K50%P2k71K03j93j13L17j65P5M6K01j09n4K42k97O4k9P2J80k66P9K3k78
7435a81J10K57j50Ql16K12J01o6j93J33J17k01L38r4n3k22K60N3k7mj8K37l34
7458c3j55J6NK89K9k63j3K57J9j71KK50k73J13P6j73P9k31J81M6k02J9J3J18R7
$$ y = [-124, -21, 118, -138, 44, 106, 254, -101, -105, -43, -139, -20, -185, 57, 105, 204, 45, 8, -77, -87, -180, -69, -178, 76, -57, -22, 257, 84, 38, -116, -88, 203, 200, 46, -156, 150, 90, -212, -65, -29, 69, -17, -186, -127, -28, 121, -44, -1, -46, -53, 5, -259, -113, -76, 264, -160, -11, 6, 128, 132, 10, -82, 17, 27, -209, -80, -58, -103, 107, -203, 81, 198, -22, 59, 65, 26, 32, -41, 20, -63, -3, -58, 82, 79, -67, -88, -44, -127, -50, -30, -57, -68, -37, -240, 72, -22, -339, 194, -26, -153, -176, 50, 38, -35, -16, 167, -96, -96, -32, 44, -76, 82, -27, 77, -31, -52, 49, 85, 1, -48, -83, 81, 113, 75, 15, 51, 63, -230, 20, 20, 92, -179, 24, -169, -282, 35, -130, -55, -9, 192, 83, 29, 271, -26, 38, 9, 81, 261, -5, 74, 97, -181, -71, 186, 36, 44, -272, -60, 41, -25, -218, -85, 32, -169, 169, 75, 22, -200, 60, 113, 86, 82, 64, 301, -33, -188, -172, -167, 122, 151, -112, -125, 132, 151, -20, -18, 232, -41, 72, 148, -25, 54, -177, 4, 50, -152, -133, -120, -2, 95]
7483I5M8j02j00L9O1lj76L27k27K87l49P2j92K33pj36K3L32j87l51J65K10Q2j13
7507C1j37rK53n6%O4L2j05k31J14K70j47k5j22m0K9J28P2P3k44K17O9k19j79R5
7532f7k6Q6O7k0j09M9K2K51l97r0J81j29J68J86k5k96j15O5L75j07K8n6J32k91
7556a18K53Q4l26J15L66k77J9k88K50J84l16oO5j2j1p6j3Mj52L48j33K38j50M6
7580I4O2j49L3%J86j96k00K5R7j4n5R6J02j78m5J47k7j24K74j00kl8k7j12J68
7605A7J50j13n9m6N4J92l02o5K40j50k2K9L7Q0oj06O9J05o9k11K5q9M06j73M7
7630D0J72l30J99O5j27j12L7R5Q3k45J02R5k90J5j5K11J54k33J91j50L2lM1r2
7654f5m3J56q1l2j06K48j65n0L3K4M8R8o2j64K12K57k88mj9J18Q8k84N4j5J94
$$ y = [95, 143, 41, -59, -20, 41, 38, -138, 189, -38, 249, -100, -28, -220, 13, 6, -130, -107, 225, 38, -313, -148, 62, 144, 31, -106, -115, 138, 82, 82, 146, 178, 73, -158, -44, 226, 79, 54, -68, -108, -79, 49, 121, 194, -50, 167, 236, 17, -162, -67, -93, -7, 60, 40, -69, -20, 2, 253, -144, -234, -53, -182, -14, 172, 147, -149, -264, -199, 176, 69, 97, 41, 173, -118, 135, 219, -107, 8, 374, 97, 116, -172, 78, 262, -54, -60, 5, -7, -18, -94, -107, -103, -255, 93, -40, 198, 48, 94, 156, 7, 40, 40, 226, 30, -170, -145, -48, -62, -117, -21, 81, -97, -142, 5, -22, -146, 128, 28, 26, -12, -39, -151, 17, 167, 54, -5, -51, 3, 195, -107, -172, 68, -82, -104, -75, -38, 42, 36, -70, -1, 104, 35, -176, -151, -240, 166, -7, 40, 212, -118, 81, 146, 19, -93, -56, 39, 122, -123, -21, 74, -216, -201, -216, -5, 149, -84, 107, -43, -11, -14, 27, -65, -108, 48, -33, -65, -171, 77, -88, -138, -105, -81, -33, 65, 3, -161, 51, 308, 20, 16, -3, 115, 203, -81, -27, -42, 152]
7679A52j43K6j29q8rK82m0J95j87R3k87L7K31o2j02N0p8mj1J29q6J82m03J92L3
7704b7J89j12k99K06K90k99q4J65j0J01k1j88J86k92K41n3J90l57J75k55K53L3
7726C2K1j95ol7K21J23r9N8n7R5k03Q8l54K52J11J9r7k00L09N5j78J54l5j46K01
7751A32k46K27K6l17K74kk7J79j45l64N51j87j23O4l6O6M4n5k14Q2m4K21k25N2
7775f7J50oj99J64O6n5J25k08N9k54J83J16k79M91k58J9n8J18q7J52k11L25l11
7798b5J63l2k07K44p6j4j32J40j77P6QM7Qj50j8j85L35P5j28j6J54r9Q5k7m9K5
7824B5Lk8P1q5k54M17k26LR6R3L6j40J47m22L47k33O2J26K08k87K07k31J2J16
7848F3q9m5K45j14k9M3n8J05k57K89p8j11O4j17j16J28Q9R3L0k91J96N3j20jO5
$$ y = [152, 9, 35, -94, -182, -191, 91, 51, 246, 59, 152, -135, -98, 133, 71, -31, 19, -59, -63, -74, 55, -31, 151, -252, -60, -27, 162, 50, -249, -43, 247, -52, -136, 29, 19, 120, 99, -89, 97, -195, 46, -7, 183, -174, 1, -254, -1, 32, 53, -142, -148, -185, 36, 159, 60, 118, 61, 156, -47, 41, -313, -61, 50, 69, -28, -228, 81, 136, -42, 112, 77, -69, 132, -114, 113, 139, -178, 96, 94, 67, 246, 101, -263, 288, 101, -22, 42, 6, 72, 116, 61, -153, -71, -115, 106, -119, -67, 83, 77, -122, 42, 108, 53, 178, -30, 29, -225, -42, 74, -205, 286, 28, 47, -11, 107, 20, 172, -39, 286, -25, 138, 106, -101, 143, 67, 53, -79, 61, -116, -40, -32, 15, 23, -127, -145, -330, 5, 80, -48, -64, 90, -9, 76, 49, 0, 25, 28, 0, 71, -14, -268, 149, -77, -74, 22, 115, 151, 11, 158, -264, 83, -150, -88, 38, 246, -41, 166, -65, -53, 63, -26, -71, 174, 60, 31, 74, 16, 121, -136, 153, 75, -36, 28, -89, -205, -77, 12, 105, 135, -156, 40, 93, -27, -28, 37]
7873C7m4J30K1r7n5nJJ06j83p6P6J30k6K3j10N6j41J83J9J47j25k1o0O7%j40K16
7900A29r0j09J03J5r1j27J70J33j77M1o2J1J34j88K57j78J13n7K7L8j26K5O4k46
7924a91J60j26J79J06o7j7K1M8j20J41J6l18J36O2J3j39k1P9J73j68O6j53K25
7947A05k84J96K41l86L0J04j70Q6J65J68j15j79j11K46j16qK23k30R8j93J69Q6
7969A25Qm3k97J49Q3m61M22q4J71l29K06J59j16j41K48N1jk34Q8J0Q0j85J81J15
7993B05j13K7j97L8n6k1J77p4N2j61O5P5O5j35P8n1m3N5J47j42pJ55j67N7R6k08
8019h3K7qM3j7p1J85j04k26M19k04k4N1Q7j16j03K13j11k7k30K02L0l06L23N8
8043Hj05J08J76n1j20j9j32K39j03KN4j23p8J36J80q9j06j18Q9J94j49p9l4J9
$$ y = [37, -7, 123, 144, 47, -8, -13, -12, 94, -89, -165, -89, 41, 15, 38, -72, -16, -157, 26, 45, 192, 67, 46, -14, 53, 53, -87, 129, 39, -70, 33, 48, -43, -170, 0, 133, -44, -3, -65, -54, 80, -108, 149, -29, 84, 27, 54, 92, -34, -9, 55, -191, -31, -157, 22, 128, 61, 44, 65, 113, -7, 134, 150, -168, -32, 30, 43, -96, -117, -38, 135, -33, 33, -120, 105, -179, 17, 258, -128, -98, 6, -164, -78, 87, 255, 140, -39, -150, 96, -20, -28, 195, -35, 63, -130, 39, 125, 133, 90, -207, -58, 25, -436, -14, -98, 73, -256, -50, 109, -7, -148, 100, 151, 150, -84, 4, 14, 94, -91, 90, 205, 92, 119, -78, -40, -96, -117, 60, -14, 38, -123, -58, 17, 82, -53, 25, -26, -69, -14, 133, -9, -16, 139, -28, 29, 125, -83, -56, -64, -21, -38, -109, 76, -28, -254, 165, -39, -63, -12, 75, -41, -144, 69, -42, -69, -299, -97, -67, -373, -50, 8, -97, 11, 187, 136, 16, -3, -135, 104, 1, 3, 57, -66, -144, -8, 172, 83, -23, -141, -52, 142, -7, -86, -120, -101]
8067a01J13P3K03l94m0K06j2k9n7K02l12J61j98K17l8l1J55k20J48J0K8j6RO9
8091A46k02m7K91o3k8m83K46R9N3J1K1n2k45L43k3k24j03m3M10qq1r0J37j28K09
8116A46j05NJ50K9k83J37o4m4J59l21P2j24J72l5m0L2J81m1k36L69q7K1j43J48
8140I8l0pqj5j2R3o2n3Q2j00M4l4J09j73J38j39l5K78k95k5L46k46J7k11K64N1
8166G5N1j09q5J7j52J96k4J54j61M2k5j36R9L6m4L40k07k52J06N0m2O5p6j84J94
$$ y = [-101, 12, 85, 288, -106, -146, 60, 48, 19, -38, 164, -148, 13, -185, 32, -6, -37, 118, -102, 46, 56, 84, 68, 77, 146, -56, -103, 188, 125, 97, -386, -140, -41, 12, 23, 44, -8, -253, 90, 67, -157, -260, -303, 107, 99, 18, -72, 65, -63, 146, 41, 46, 196, 225, -58, 79, 15, -29, 130, -191, -119, -243, -71, -106, -146, -114, 67, 26, -210, 159, 72, 93, -50, 98, 68, 61, 53, 38, 26, 119, 57, 4, 86, -14, 30, -4, 105, -68, 70, -69, -104, 174, -121, -146, 200, -46, -29, -240, 24, 75, 126, 17, -68, -51, -203, -7, -31, 123, -38, 4, -21, -157, -58, -22, -66, 274, 67, -185, -79, -29, -71, -6, -82, -266, -72]
8191g2
$$ Imaginary data points
##PAGE= N=2
##DATA TABLE= (X++(I..I)), XYDATA
0@%%%%%%%%%%%%%qJ6j6J6j6J8k6L2m0M8n6O4p2Q8j04J20j36J53j75J99k26K58
35A37k90L24l64M08m55N07n63O24o92P68q49R35j032J138j253J379j518J674j849
54i71K041k257K504k784L108l489L943m494N181o066P252q937J1539j6116K6548
69A7002r5429o059J42121o9140p0895J4859N6458J2037L2544l265n0397j4884
81c5048P4326L3166m7275m4856J1910J9238J5147m690l9116l3803L0950L8525
93A8474j6130l1622L201J0845J5751K9044k120m3793L742N9229J0921m6255n854
106E433K5689j2215j3479K3199j0618n3704K405M8108j4909m9997J4337L3904
118a847k3313j3645M2688J4625l9855m909M5830J5332k4775j1316N408N923J2125
$$ y = [0, 0, 0, 0, 0, 0, 0, 0, 0, 0, 0, 0, 0, 0, -8, 8, -8, 8, -8, 10, -16, 16, -24, 24, -32, 32, -40, 48, -56, 64, -72, 81, -94, 105, -121, 137, -153, 171, -193, 215, -240, 267, -296, 328, -364, 404, -445, 490, -542, 596, -657, 722, -796, 878, -971, 1070, -1187, 1317, -1467, 1641, -1848, 2095, -2399, 2782, -3284, 3968, -4969, 6570, -9546, 17002, -78427, -84486, 57635, -11505, -82400, -67541, -11083, 954, 33498, 30233, -20164, -35048, 39278, 72444, 25169, -19687, -7777, 11461, 26608, 21918, -17198, -51001, -20051, 18474, 2344, -29278, -26077, -15232, 519, 29563, 27443, -16350, -12608, 46621, 57542, 11287, 5433, 31122, 18907, 5428, 28627, 18009, -35695, -33290, 14818, -91, -50088, -35751, -1847, -25160, -38805, 3883, 18508, -21347, -26256, 19574, 34906, 10131, -1185, 4223, 10146, 22271]
131B2271k19k6718j2516K0176P555j8462m826N869r304O62K1064q67k0781Q486
145g610K2364p186p752J9394J513k4483P171L0112j2930l2135J1340K1143j9924
158A017j8486J5605K572k2131K250K0069p721j5504J3902J4573r612k244J2020
171F310j522r117P449P941p689o826R90j038M895Q730j2593j9854J3224K5336
185A6236j0152k3177O962J6077k465r81M906q845p232J8638J1723j9288j1539
198i137J5792P383j1077m57N131j0822n690J4625M413j8488p109J3820P065n634
212a85l482n03K18Q225N725j0678r319Q251Q513n879o365k06j054K562P431k823
228D31j1157K948J3461j119r334L326O131m876j398Q073q05j0267J089R617o44
$$ y = [22271, 22052, -4666, -17182, 2994, 10549, -7913, -12739, -6870, -16174, -15512, 5552, 4685, -16096, -7610, 14754, 7568, -184, 19210, 20723, -3760, 3411, 33523, 20593, -11542, -202, 20941, 1017, -17469, -1864, 708, -21423, -19173, 896, -6825, -22329, -8427, 6146, -3466, -5710, 6310, 4788, -4329, 3120, 11061, 3372, -3454, -2464, -3502, 1393, 10123, -2470, -22324, -9100, 16236, 6084, -17093, -10131, 5946, 3481, 2500, 7406, -1439, -8671, 9967, 21690, 2402, -9137, 6655, 14038, 2961, 2504, 7635, -3187, -8877, 5748, 10161, -8327, -15436, -1616, 5449, -185, -3667, -4170, -3952, 4273, 9998, -680, -9999, -1748, 6765, 886, -5479, -5685, -6739, -4177, 3254, 431, -10726, -7778, 5683, 4564, -4770, -1444, 4687, -189, -1587, 6486, 5681, -4586, -3497, 6120, 5476]
243E476o615K2J801n60L009K557n822n122N407O124l481n588O35L497K180l8k579
260I03k082K864K816k573l171R2j09j921R09J102l992k653M297M484k057k902
276c993K238K919P62J021l61k871q66L806J456n023m048K938L940j641l736O3
292c396L236J310k61m89j15L00P42J672m71j546L4J598P62j085r23M53P8p34n49
311F16o65j583j796P75J369j087k287R00L762Q09j473J96K600P12j96j84m69j506
329D93o61O43j120k568o89J023L76m46q1J009Q75J227P29O15L19j52O6J327M73
348C458j648j431J540J131k155j591J323K62j835k72N19k062o05K919L28k945
364c064N06L948P35j620J606J710j184l3J676j634l141p3O72k410j712R58j197
$$ y = [5476, -1139, -1117, 684, 124, 3133, 5690, -132, -5254, 153, 6277, 2796, -2792, -2157, 1340, 3520, 3482, 903, -1179, 1685, 4501, 1928, -1243, -1151, -1260, -3181, -2272, -1170, -5162, -7815, -3518, 966, -1091, -3993, -1755, 1164, 1926, 2947, 2586, -285, -1151, 2655, 4111, -912, -4960, -2022, 1918, 277, -3459, -3396, -160, 1150, 889, 400, 285, 585, 1327, 2999, 2528, 982, 1016, 2614, 3376, 2291, 1368, 1821, 1899, 1165, 616, -49, -1632, -3428, -2653, -1284, -2371, -4658, -3758, 4, 813, -660, -464, 2136, 2848, 2652, 2468, 1999, 493, -168, 475, -645, -3213, -3902, -2879, -2503, -2949, -3030, -2021, -1146, 81, 810, 1425, 1744, 1592, 1658, 2985, 3458, 1810, 379, 1919, 3050, 895, -696, 627, 889, -946, -1218, -699, -2761, -3366, -447, -119, -3064, -2558, 1390, 2125, 505, 2111, 3821, 2637, 2604, 4280, 2646, -495, -568, 104, -2306, -4018, -3060, -4257]
381d257j664K599K846k180r35M435J992j255J096J205k957j93N155j047o906o69
397b735N547j195l569J058j96l886K351N961m089p100M775P034k605k506K883
412A728q27j653P101L576q697n032P913L285o829k936O98l881L17O358k335r649
428a0863L116J0286j472m462M985K262n425M217Q630o302j0143O548O764p357
442G84l942N185m223o663Q192O694j0983o320R977L731n437L271K988r377L75
457e748J6856Q77j6819l60J3789q88n924M169l520j2257O831J4756r790j7162
471a5190N474J0773l002k58L345r159k902J9574Q106j9584p427J7370N274j0640
485A754N05K400j1089K28J6610l149k0380J416J5165j730o154N092l364r259J0933
$$ y = [-4257, -5921, -3322, -476, -2656, -3591, 844, 2836, 1581, 2677, 3882, 925, 732, 5887, 4840, -2066, -2735, 2812, 1617, -1952, -894, -1090, -4976, -2625, 3336, -753, -7853, -3078, 3956, 1351, -1155, 1728, 901, -752, 6349, 9925, 1228, -3804, 4109, 7394, 565, -2371, -1673, -5554, -5237, 1121, -1214, -10863, -7747, 2539, 1067, -3395, 1590, 3852, -1573, 2644, 11274, 4972, -5171, 1377, 8141, 784, -3158, 2027, -2196, -8859, -667, 6027, -4956, -11276, -1299, 2432, -3005, 266, 3254, -6123, -5748, 11108, 11985, -4834, -5194, 8595, 7707, 1783, 5952, 2432, -9825, -2994, 11762, 1972, -15190, -9716, 1057, -1945, -2203, 1142, -8017, -10919, 8655, 16761, -2823, -10250, 7120, 12394, 1754, 2259, 4659, -6430, -6202, 10408, 7259, -13121, -11705, 3460, 1730, -4424, 668, -2696, -11955, -1022]
500a022J5228j2929j4324J2714R994q529L91Q301j0402r085J7185R524j9299j0212
514a2465J3166L109p218M433n27j4848L253K2138j934k0682K971J4466k193r94
528B675Q061r348j5304J4905K0001j5630k0995R340J2760m544j255R50j1449q61
542a0694K0604K730k2831l554J8631J391r901M634R72j1923O231J9959q163k1507
556a3421P280J8234n285r343M316l534o706J2093Q743j7247j0236J5816P008j1128
570c410J152P235j0052l320J7829K539k0068q96J6565k550j0396P260K666j2653
584h099L301J6270o289j4853P865R906q725k140Q588p640j0410J3975J0287j7257
598e221r730J6808O622j1521M47P120o696k226J3576p20j6254J840J4201l755
$$ y = [-1022, 14206, 1277, -13047, -333, 9661, 1132, 1523, 9824, -578, -9663, 7522, 17046, -2253, -12465, 701, 3810, -3408, 1025, 498, -14350, -11097, 11041, 9107, -11575, -8604, 5862, 3669, 2675, 10736, 1388, -13916, 989, 20990, 5360, -15635, -6295, 6465, 1921, 666, 1616, -9833, -10694, 9910, 12640, -10191, -13745, 4886, 6277, -3624, 1010, 1982, -9941, -3710, 16249, 8086, -13421, -6141, 12093, 6808, -2535, 1781, -1753, -8459, 3634, 12377, -4870, -15106, 710, 7718, -3410, -2258, 4977, -5075, -8395, 9434, 11973, -8095, -8991, 7574, 5024, -5372, 1888, 4554, -8099, -4798, 11472, 5183, -9670, -1805, 8101, -624, -2764, 5824, -1816, -12226, 1749, 12036, -5221, -14951, 1857, 8479, -3042, -2595, 4525, -2171, -4397, 9179, 8459, -7795, -5955, 8246, 4491]
612D491q789N448L15r226O883J2245j1292j3612J1780J1565j0384m972P219l394
626a723n564J1548N420j5363m190J5955K813j1149K566N993p953k421J1674j842
640E764j4567K376J1072n281o929P350J979q934L649J1021n542q664P508O345
654G147o364j298N194m171m056P772K334j1245j685J0505m82q533K941M018o361
669d284k49R246j977j0656L072R358k405m502M867ln318N061P743o885q572N547
685D3N833n720l002K138k461k859N606K938o924j300O966J288l283J939K006l408
701b00K44N421j896n664J513L686k908j660K622j556m108L726L929m681m320M752
717a100L294l656j111K831o41p30L626J307l911m03M551K62l579k28Q47k259q71
$$ y = [4491, -4298, 1150, 1465, -7761, -878, 11367, 75, -13537, -1757, 9808, -576, -5548, 1671, -1723, -7287, 4261, 9681, -5682, -9872, 6083, 8896, -2253, 313, 6306, -1647, -4068, 7606, 5764, -8803, -6427, 4645, -636, -7565, -215, 1764, -7170, -3521, 7500, 1958, -6706, 802, 7147, 783, -515, 4679, 508, -3548, 4224, 6558, -4687, -6372, 4133, 3651, -4882, -1941, 2077, -4284, -4533, 4713, 2736, -7920, -4848, 4510, 2105, -2397, 2470, 2467, -2851, 2210, 9953, 3068, -5504, 43, 5876, 156, -2846, -708, -3169, -6028, -422, 2516, -4408, -5708, 1258, 2546, -737, 1202, 3208, -200, 44, 5465, 3569, -2095, -582, 3104, 196, -1464, 1158, -398, -4506, -780, 3149, -1532, -5852, -1100, 2194, -1462, -2573, 258, -383, -1113, 2513, 3820, -91, -494, 4057, 4319, 740, 512, 1359, -900, -1771]
734a771J685j142l301O82K934k35p15J264L33J00K469J230k379r00K551N48k783
751E70k56N34j095j018J166k51k306P68K163j052j530J136J413j158k41J777K49
768H69j158P94J729n4j180M28K50k67j10r84j336o02M25q16l96j81J93P25P14
787i57Q90K59M05J072P75k88k50K95l17j036m09m25o56j006L63L45k27q17M08
806a576P24K79M82m7P5K79Q27R5m84K25M06M26k98l36j66q1k83p78r28l98nn27
828b089j63K15L02L05O17J243O29QO38J066j65n50j59j31r78q77L08j460j269
847b510M08Q64n44m66J203N10o0R32P01o34j61J465K36j358J54R60m73r72Q84
866A139j6k140K6J438q32j960N24M08r78P28J733r53j144K583K382j702o61K387
$$ y = [-1771, -86, -1228, -4529, -3847, -913, -1148, -1863, -599, -266, -166, 2303, 3533, 1154, 254, 2805, 3353, 570, 314, 848, -247, -1265, -99, -350, -2656, -1888, 275, -777, -2307, -1171, 242, -916, -1157, 620, 869, -289, 505, 2234, 2180, 1000, 1428, 1678, 1411, 1301, 317, -1019, -1621, -1196, -2012, -2408, -2589, -2396, -1671, -957, -67, 192, 597, 1669, 2444, 2156, 1906, 2201, 1884, 848, 439, 14, -642, -1648, -1285, -940, -1167, -1984, -1576, -852, -573, -91, -138, -63, 216, 1043, 1138, 654, 879, 1285, 1711, 1413, 1077, 911, 830, 547, -231, -1159, -1557, -1562, -2089, -2252, -2037, -1735, -1430, -813, 430, 1059, 1067, 1705, 2771, 2606, 2056, 1897, 1766, 788, -89, 219, -1241, -2510, -2102, -1238, -1782, -2248, -1045, -535, -595, 337, 1038, 404, 243, 1708, 1944, 586, 740, 1700, 1227, 255, 1139, 1123, -1017, -991, 447, -385, -2345, -1821, -1413, -2391, -1663, 70, -883, -2027, 556, 2938, 1236, 575, 2962]
884B962p3j839R73O60l162j568K676o80l129J45K264j248o94L014L37k714J727
901c49L636j453k269K109R58k674K53K723k549l065L398J648l999r36L342j174
917d01k583K530J679m144o60N185N44m038J723K974j900n95M108j196n274J945
933a03M251l621m022K514O99l535J927L226l803k890O251L417n118j144N041j06
949B984l310K996R53n726j37O193j457o356J619L798l324p10M470k179n265M669
965g82N646n372l988O003J869m852J752M271m612l278P593J255p816m69N286k590
981h4l916M330N20p394J955Q448k490o704M262N389m056l04N702k821o720N054
997A171O267p033n619N366J085n001K784K868o747j553R543J490r154L62P849
$$ y = [2962, 2889, 1050, 2023, 2683, -479, -2047, 629, -51, -3180, -3035, -771, -2019, -2713, 301, 638, -2076, -349, 3287, 1834, -435, 1674, 2632, -42, 211, 2934, 385, -2680, 718, 2366, -1633, -2569, 773, -401, -2984, -454, 1225, -2919, -3579, 1606, 2150, -1888, -165, 2809, 909, 314, 4422, 3226, -2048, -103, 4148, 527, -3495, -981, -282, -3817, -1890, 1336, -2467, -5357, 894, 4311, -807, -1951, 3090, 2984, -326, 2670, 3623, -2103, -2240, 3953, 2496, -3860, -2241, 1557, -1767, -2477, 1993, -186, -5451, -782, 4864, -508, -4496, 1507, 3376, -1476, 276, 4547, -65, -3343, 4250, 5505, -2311, -2780, 2506, -84, -4000, 330, 850, -6544, -4589, 3859, 1369, -5335, -1073, 4316, 260, -44, 5658, 2837, -3883, 1171, 7438, 405, -5214, 152, 1237, -3764, -980, 1888, -4859, -6412, 3131, 4621, -4533, -4171, 3678]
1012C678j661l675N143l1p594L016R527m658r065M242N442n026j003M549m878
1027a994o059P892N588r390m247R145J679n271L834M082o509j746J0365L98j0462
1042b695J32P511l601m507M436j105p799L474Q670n000p780O340N346m653M80
1057g51N569m603n146Q504N233r146m184P446J102n454K677J828p503q93R467
1072D146r12j0140J390P368k642k972N600m84o731M965Q949n075p561N863M431
1087F195m827r54L659n179m790O881L159q779k911P093O86m227L682K359n635
1102c588O20R083o21q332K096O126l313k750M036j391o358L388O201n314n899
1117f016M328K990m262Q60L075l707k607P264L028o745j311O199J000l320K323
$$ y = [3678, 2017, -1658, 3485, 3454, -4140, -1124, 8403, 3745, -5320, -1078, 4364, -662, -1665, 2884, -1994, -8053, -161, 5427, -3963, -8210, 935, 2614, -2657, 1177, 5259, -1250, -2996, 7369, 7767, -2695, -2563, 4948, 1347, -3160, 1276, 171, -7628, -4154, 4516, -484, -8264, -1924, 3422, -1231, -751, 4818, 215, -4931, 3573, 8806, -340, -4524, 2922, 4024, -1430, 1247, 3075, -4428, -5321, 4146, 3234, -6906, -5516, 1852, -790, -3762, 1838, 1354, -5377, -412, 8537, 3462, -4099, 1764, 6195, 1368, 414, 4073, -1106, -5896, 985, 4144, -4635, -7546, -453, 233, -3994, -312, 2047, -3588, -2968, 6115, 5494, -2838, -742, 5384, 2071, -679, 3357, 1966, -4392, -1004, 5197, -117, -6016, -1688, 1302, -2960, -2100, 975, -2732, -5339, 1925, 4953, -1792, -3103, 3096, 4096, 776, 3099]
1132C099R42n484O5O165k163p052J018M046k687j822L522j029l813M015N194m140
1148a24k630N049J819l809P02K978l510k475M391J064n855m30M119j112l133K227
1164g29J100l761M28M682j320l691K581K959j942m75L006j012k738K876K445l258
1180A151k777K362N16k847M22J187k924r22L535R42l257P89L141k85j169K317
1196B181O41k682K75K971j831l254J548J576k430j032J948o45j916J912J496j888
1212a130o89K336L10j440N46J202j032M4J510j80j909O51J563j077j358O66Q1
1229I4j406k24J551r76j582J370J268r75N72J515j07p51J051Q57j184p81P96k92
1247G96j356j14J46r11k41J146k8n15J32J082J85l25N78N21o04K5N40k66o13K72
$$ y = [3099, 4041, -1443, -1378, 4787, 2624, -4428, -3410, 636, -2051, -3873, -351, -1380, -5193, -1178, 4016, -124, -2754, 2295, 4114, 305, 1007, 3985, 475, -2000, 2391, 3455, -2400, -2830, 1289, 177, -2956, -729, 371, -3390, -2962, 1720, 400, -3291, -710, 2249, 307, -168, 2838, 1826, -912, 1964, 4409, 1151, -1626, 736, 1252, -1595, -1173, 14, -2910, -3832, -297, 645, -2612, -1823, 1318, 1033, -136, 2181, 2822, 140, 415, 3386, 1555, -1699, -151, 1425, -1005, -2037, -89, -734, -2650, -738, 758, -1130, -1819, 517, 827, -613, -67, 1135, 103, 147, 1657, 1477, -432, 219, 1782, 705, -653, 13, 94, -1312, -1536, 15, -961, -2543, -1173, 95, -880, -308, 1207, 1100, 349, 1400, 2257, 1073, 292, 1088, 796, -560, -674, -528, -1439, -1680, -534, -562, -1077, -945, 137, 322, -3, 575, 1096, 492, 517, 1057, 791, 178, 450]
1267D50K86n30m21M12m92k48J60P5o06k97P75k52m1L45O12LK49P14j01J71l35
1288I29M11j52p84j02m32n24o15J55L1n01K50M69K83K00O55L80J97M98j37j13
1308A098q7J31n96l87o5j12m92k28L45l24k40N9L24k07K56M04k3j00K27N24K15
1329G22k14N73K62l89N2J86l61r02j42j06o79o35K99j61j37O20N69j81L70J001
1349G47J64n6M86L23o07l40N08n00r60N5qj027j97R66l41q50L90J252n62l67J265
1370C41q0p16P08J040n91p15J222M24j294M2O34n50j306P98N3j542m85J347l21
1389i91j216J134J249p15K27J789j75j119J005J550j672r04Q71r6j759L33R72
1406D83j751j300J974J015k251L73J891n27q68J584J113k345m7K561m79k031J038
$$ y = [450, 736, 206, -215, 197, -295, -543, -383, -308, -914, -1211, -436, -688, -729, -384, 228, 231, 480, 1194, 1093, 1264, 929, 1340, 1188, 404, 302, -130, -654, -1269, -1114, -1083, -1584, -1334, -865, -582, -382, 273, 653, 850, 1348, 1211, 1098, 1011, 1142, 546, 159, 94, -18, -510, -738, -393, -717, -957, -898, -574, -781, -525, -121, -144, -244, -17, 507, 722, 508, 1081, 1343, 954, 1006, 1192, 831, -71, -213, -319, -998, -1633, -1334, -1495, -1632, -1012, -443, -624, -254, 747, 911, 855, 1341, 1664, 1057, 717, 1225, 725, -235, -180, -188, -1215, -1412, -446, -787, -1637, -1247, 5, -557, -924, 341, 261, -455, 253, 1293, 702, -13, 1209, 1633, 339, 381, 1015, 465, -841, -43, 10, -1532, -2017, -670, -991, -2207, -1073, 176, -539, -312, 1477, 1302, 183, 1188, 2738, 1066, 162, 1033, 937, -822, -489, 483, -1268, -2568, -594, 421, -1830, -1457, 434, -93, -961, 623, 1736, -609, -656, 1905, 1426, -605, 433]
1423D33J221j929k0K231j207l087J836J948k230j689K013K44j757J285K112k290
1439h86r00L381J054k423q1K231j446j400K312k41l862L13L281j373k918J686
1455a272J540k049O60L070j465k687K655K586k661j508K391m8k122J558J688l499
1471a163j288L897O54l863K13K436j603j106K945k54l815J097M430j379k865K143
1487D79J381k275Q96K953k459l778L290K420l746j762K686n03k265K404J966l517
1503a830j107M914R17m023Q01K643k023r73L087q36m421J720L865k174l302K329
1519d13J262k578R26L038k727k748L569K630l573j416L266n72j692K706J099m022
1535a245p55M978k80m493M91K401k504p56L363r83m153K131M598k322k678K708
$$ y = [433, 1654, -275, -295, 1936, 729, -2358, -522, 1426, -804, -2493, -480, -236, -1993, -708, 1404, -886, -1786, 1595, 2649, 226, 145, 2376, 930, -470, 1842, 1601, -2261, -1948, 1333, -40, -2958, -1272, 268, -1781, -1121, 1949, 484, -2203, 452, 3038, 377, -1131, 1260, 1212, -910, 648, 2336, -1163, -2451, 1446, 2100, -1763, -1550, 886, -717, -1823, 1122, 868, -2947, -1850, 2580, 1201, -1664, 479, 1860, -415, 481, 3434, 975, -2803, 487, 2907, -839, -2601, 85, -418, -2683, -279, 1687, -1830, -2937, 1977, 2894, -1129, -328, 2315, 292, -681, 2406, 1570, -2851, -1131, 2734, 560, -2742, -413, 849, -1729, -803, 2235, -492, -3240, 329, 2959, -614, -2030, 1236, 664, -1028, 1678, 2777, -1245, -2000, 2978, 2698, -1795, -1304, 1097, -1407, -2163, 1200, 217, -3936, -1805, 2793, 471, -2207, 501]
1551E01J442k280J111K782l456k406L634J572l994j054K858j139j964K888Q69
1566A364l677l69M724j75l693J246K306k221k02L261j556l564K339L622k774k471
1582a840K573M90k624J114K219l361k331M235J438l773j90K909o26j571L097M33
1598B192l435K09L977p39l525J031J676k348m88K591j533k809K280K963k362j758
1614b078K754P24k184J297J832k602j311K988P88l227J66J953j090j300K291M6
1630A047k802K78L101j261k522J523J431j705J35K554j191k072J836K112j952
1645E12j305J808J62k121R48J423k496j071K275O45k361L50J771n44o98J719K47
1662A264j961N96K172p85k107P91J030j632j13J509j009j483J437J239j338j004
$$ y = [501, 1943, -337, 774, 3556, 100, -2306, 1328, 2900, -1094, -2148, 710, -429, -2393, 495, 1364, -2313, -2682, 2042, 1867, -1826, -580, 1726, -495, -697, 2564, 1008, -2556, -217, 3405, 631, -1840, 733, 1223, -1401, -287, 1932, -1429, -3760, 475, 1913, -1860, -2050, 859, 233, -1338, 1759, 2192, -1243, -1034, 2943, 2204, -1321, -290, 1386, -962, -1450, 1141, -392, -3201, -921, 2042, -320, -2078, 676, 1400, -784, 513, 2345, -257, -1568, 1420, 2208, -1019, -853, 1100, 10, -1290, 1001, 1047, -1755, -1477, 1624, 363, -2159, -636, 795, -910, -775, 1779, 588, -1484, 352, 2464, 512, -793, 1015, 1177, -944, 4, 1427, -1069, -2140, 135, 780, -1581, -1231, 540, -4, -702, 1017, 1264, -697, -101, 2071, 1286, -821, -30, 1000, -632, -745, 764, -245, -1728, -291, 948, -390, -1394]
1678a394J718J57j048N03J011j273m84J746L78j616K29J339p97n62R01k04j603
1695i99L49J122q77j142J039N75r23P2J404k33p69J286M40q58m14Q97k56p78K26
1714A61K48j076l33N83Oo63L28O45k15j14P75J51n93L84O69m17p35M75L60m30
1734B09j1N11m40o07P7J61r3n48L63k14k58N03K30l03R5P80K71n96L59N25j56
1755H58l85J55k42m39m9Rm62m62J06K90k28K63M03L9J90K05N42k11k53O13p1l57
1777E14j17K5l91j12J67l49qp5J73k78k13M2J07r0K93K58L4M7L19M27j44K08K81
1800A118m32q0K9l54l39l34l8j62l40k03K90Q2J28K89L63K40J50M71p7r8p6J1
1822F38l37J04k5o94l3J75k85l75J87K63p7J74K7J07k52M15M15k02j30M71L71
$$ y = [-1394, 324, 481, -567, -64, 947, -326, -810, 936, 1314, -302, -73, 1266, 469, -93, 808, 604, -999, -650, 472, -405, -1547, -508, 67, -856, -784, 620, 387, -382, 904, 1344, 486, 72, 969, 713, -65, 161, 409, -667, -1000, -417, -411, -1074, -746, -101, -316, -430, 345, 496, -97, 287, 956, 539, -196, 279, 639, 209, 198, 709, 269, -338, -261, -100, -193, -741, -378, -592, -850, -347, -117, -420, -325, 455, 726, 130, 489, 1014, 858, 473, 628, 386, -53, -102, -93, -555, -1017, -911, -621, -849, -586, -183, -144, 46, 251, 793, 582, 329, 942, 871, 514, 397, 422, 31, -81, 86, -263, -271, -346, -173, -451, -664, -622, -515, -605, -312, -54, -20, 27, 346, 773, 629, 837, 1118, 686, 606, 635, 281, -58, -392, -430, -592, -932, -1135, -845, -763, -635, -346, 17, 257, 407, 878, 801, 703, 627, 638, 301, 405, 380, -314, -347, -172, -457, -832, -645, -382, -459, -285, -258, -151, -403, 12, 427, 225, 95, 566, 937]
1843I37m63J18J76r6m71J94j44o44l93L75k72l91O7K42L3J61O65K66k52L84O57
1864A149l18j84M05o7q07k03M61q51o43O01J23n21J07O49k12o10R87K37p28L08
1884a17Q59k26n82M96N59p30k66R19k55j089K38N14q11m77O05j69p89O57J057
1903C93q13n65J272N48o45L11J085r39m95R09J11j700j95J197p66q12L34N0m57
1922a177R0J399j87j052R92R82p65j98P60q9j216J057Q93j384p68J186R0j533
1940i20L88P86p86q21J400J43j627M26J551l66p56Q68N95r59N70J325j002j353
1958e38J010Q67j430p47J067q97j176J374P39j602m22K260K28j289P81R15j117
1975B3l76J966pk497O96J430q44j130R24m8j390N43J716j380j382J466R42j330
$$ y = [937, 474, 592, 768, 672, 201, 395, 251, -393, -786, -411, -683, -1074, -1007, -765, -732, -571, 94, 360, 108, 492, 1149, 831, 647, 1052, 985, 178, -25, 436, -415, -1058, -457, -334, -855, -748, -99, -311, -921, 66, 303, -425, -117, 742, 516, -66, 430, 989, 259, -7, 912, 657, -432, -194, 320, -491, -968, -363, -532, -1321, -664, 393, -420, -985, 287, 835, 190, 501, 1586, 647, 152, 1061, 1172, -528, -723, 474, -292, -1104, -770, -720, -1177, -1087, 312, 125, -927, 65, 1047, 282, 84, 844, 755, -461, 596, 1489, 105, -663, 523, 613, -920, -532, 254, -532, -1353, 47, 190, -1437, -1011, 540, 174, -582, 286, 881, -78, 492, 1817, 815, -538, 472, 1339, -91, -838, 229, -668, -1844, -470, 269, -1333, -1755, 505, 733, -556, 225, 1140, 23, -353, 1613, 1606, -891, -195, 1235, 391, -739, 185, 137, -1253, -710, 1006, -374, -1756, -290, 652, -678]
1993f78k00J665q12q79J635J081j964m33J966r0j512M55O73j616n56K107p12k185
2011b055R29J524o29r57J490M86j306P75J670j479j323J600J070j958k87J312
2027H62j132j148J673O31k069j87K023j13j615R20R58j211k00J780m35k007J139
2044a31J633j017r50J246p1j793J107J343j695j543J887O25j413j93J343q72o38
2061a132J879N67j810j99K135l59j426P01O90j483k40J600p40j803Q18J588r35
2078a49j001J509j01r89Q87J080j277q97J662M14j427J17R26o01q75J287K30j882
2096a087jJ658n43j253P81M03j173L40J593n18j004Q40J230p84m35Q33j73q30
2114a23O45O65j516p13J052J29j157R9J003q19j00J431k0j114L96J365m40r92
$$ y = [-678, -878, 787, -25, -904, 731, 1812, -152, -585, 1381, 1291, -221, 234, 907, -709, -1265, 842, 130, -2055, -1126, 398, -231, -1188, 302, 788, -518, 257, 1927, 448, -875, 725, 1795, -163, -450, 862, -270, -1418, 255, 886, -1183, -1370, 653, 540, -1075, -155, 803, -408, -608, 1172, 737, -1270, -131, 1502, 485, -465, 781, 710, -1083, 24, 1367, -328, -1871, 16, 641, -772, -965, 378, -494, -1132, 747, 1314, -496, -695, 1440, 1081, -345, 356, 1046, -437, -677, 923, 183, -1620, -802, 786, -149, -1150, 359, 258, -731, 156, 1236, -41, -938, 724, 1138, -289, -172, 754, 153, -722, 565, 795, -1087, -1088, 570, 27, -1226, -445, -42, -1215, -875, 718, 200, -804, 36, 1266, 482, 47, 880, 707, -123, 522, 1187, -329, -1042, 10, 139, -1018, -919, 84, -735, -835, 596, 576, -538, -142, 1223, 783, -209]
2132b09P46M51j242L45P55m71j199N44Q16r98k88Q14m4j009P33L68n58m65J350
2151D39J79p90J65O62k88k78R78k56q73k60Q47m67q33L47K57o43j30R63k79n11
2171g71R29L95n07K2N03K18o59O05J7r82J6O11k92p77K60M04k62l91N87j1m01
2192d86K15N07j29k18K91J35Q2j81M38k43n1J12j77k53j82J16k21l60K2J09jl23
2214g98K75K84n7L99N29N8l61N62j92n43O7L19m16l61M22m01k94L82j94N5k52
2235e17J77K85l6j83N85Mk26J46J56j5p5J88n0k92K2n7j32k06L1%m73L91L2k45
2259d90j24M33L0K31p4K71R4N2J24o4l70K45j89j56n6l01k03J4p2L22n7L6Q8P8
2283a38L60j98L13k92j4J45K61j16j71q5L22k67j28j02j5M3J5j59j63l2J20R4
$$ y = [-209, 537, 988, -254, 91, 846, 375, -824, -280, 536, -462, -750, 64, 20, -989, -256, 112, -446, -911, 439, 618, -172, -7, 655, 367, 89, 1067, 811, -62, -322, 525, 58, -775, -428, -171, -814, -944, 19, -260, -771, 158, 553, 46, 68, 571, 789, 130, 735, 752, -230, -214, 397, 105, -672, -412, -8, -270, -661, -74, -85, -486, -271, 236, 107, -111, 180, 315, 397, 216, 654, 411, 360, 472, 295, 42, -140, -24, -245, -605, -583, -474, -475, -798, -523, -239, -296, 103, 632, 690, 329, 891, 699, 156, 223, 542, 126, -235, 187, -214, -508, -126, -320, -265, -517, -340, -55, -91, -274, 311, 315, 89, 235, 391, 376, 301, 489, 439, 147, 169, 112, -20, -226, -195, -195, -668, -277, -245, -490, -614, -181, -151, 80, 6, 277, 371, 423, 547, 483, 113, 358, 169, 13, -43, -344, -547, -533, -605, -283, -340, -304, -216, -138, 222, 24, 337, 45, 31, 176, 437, 321, 150, 65, 387, 120, -8, -110, -125, -82, -67, -226, -389, -421, -301, -207]
2305b07J8J74O9K0J76J61Nk27L52L1k25k14o8j40k00m3K4j35j03K24K05j70k3
2328b96L29L6p3M64r4P2l49K63k37j70O5O3j64k28L31k40j63K08J64k3j64J07
2350i9q0j93M40K4j96L19K56nl07J52J37m32m28L91mn10R8L09n11J89P7J44O3
2373a66L31L70k04j05M73k4n46j39N47n39k46J48k2k28p6L49k3l98J65N08k76
2394a01P8K73r4m02M92K90k72m50P81k55l16J7L34o12k47M41O0n44j45O53k04
2415b23l18O86j6l05K72M71Q6p02M33M49o42j47L66l48o79M45L52p04k14Q72L6
2436A70o10N71L26l30k92P51K61q92k54J034o19k91M63J46q24J35P36m51m78L52
2456i6L33o45M1N00k92n72P00P22p86n6N95J64p76L63N73p50m27P76j50q37J45
$$ y = [-207, -189, -15, 54, 74, 250, 411, 416, 189, 541, 572, 347, 133, 65, -75, -275, -318, -294, -429, -532, -308, -103, -273, -296, 33, 69, -4, 460, 366, 438, 89, 352, 115, -55, 10, 73, -91, -319, 12, -228, -391, -183, -19, -42, -206, -99, -179, -372, 68, 92, -104, 215, 471, 466, 159, 311, 448, 16, -412, -21, -25, -535, -437, -128, -639, -450, -373, -229, -166, 165, 535, 331, 226, 699, 675, 129, -10, 537, -2, -248, -100, -122, -350, -426, -77, -100, -498, -333, 175, -101, -23, 250, 156, -246, 246, 536, 264, -186, 595, 340, 24, 41, 375, -237, -484, -43, 17, -527, -672, -19, -223, -541, 145, 129, -176, 96, 567, 653, -49, 384, 833, 191, 44, 410, 62, -617, -172, 180, -524, -738, 134, 170, -440, 131, 457, 127, -165, 586, 847, -45, -299, 735, 116, -175, 288, 434, -390, -255, 481, 30, -448, -96, 237, -408, -367, 133, -159, -731, -31, 691, -95, -151, 444, 608, -168, 195, 768, 18, -409, 367, 217, -620, -475]
2477d75M36l14l05O52K02q76M41J008n09l53M43L52m78l59Q25n06o85N62P00j197
2497d36l4P22m31n25N29M60n96j13P73R8r10M10O80n41p8M45k05n46L09P45o05
2518A51p40O22K05n94j12N42l60l61O04L43o78L3P66j5n15O29K9o08k68J079l49
2539D03r52M37L31m75l96P35j64o44N85L22l24l21P67Q3o74L54K76k72o34J051
2559D88m0o18k8O26m53n40O77K25r56J21P47j15q29N73L29k42j70O45J39o31K77
2580B25N33n78m71P43r7q26K02L77k47l86O62J2o34L04N58k55j51L26L76p79m1
2601a47N58j22p24L69L65l60k17M64j13n09M03J69m45l20O54Kl50L41K80l02j29
2622a33M54K00m30P8L37k41m03K26P6n10k54N25k9j68L09J15l08K72M6j42j05
$$ y = [-475, -39, -353, -658, -6, 196, -680, -239, 769, 260, -93, 350, 702, 224, -135, 690, 184, -501, 61, 761, -436, -470, 252, -179, -704, -175, 285, -311, -424, 349, 447, -463, -53, 627, 86, 8, 453, 248, -298, 11, 756, 151, -589, 33, 238, -356, -468, 74, -286, -647, -43, 300, -378, -345, 421, 406, -109, 520, 549, -59, -327, 752, 403, -549, -112, 219, -256, -652, 83, -81, -725, -140, 182, -142, -463, 304, 387, -287, 67, 343, 71, -563, 488, 448, -170, -198, 428, -25, -565, 112, 337, -619, -498, 249, 134, -695, -122, 207, -35, -205, 440, 579, -52, 225, 758, 180, -291, 452, 355, -471, -269, 108, -139, -525, 137, 149, -485, -181, 377, 122, -29, 297, 673, -106, -147, 411, 289, -435, -66, 299, -61, -278, 186, 73, -436, -33, 136, -309, -629, 25, 27, -323, 18, 298, -4, -133, 321, 521, 91, 169, 506, 265, -138, 88, 164, -346, -600, -75, -104, -272, 37, 152, -156, 116, 162, 20, -85]
2643h5L48J73j41m04N40k95k16j56M72l61k27N15p6m38m6M55q6k26L78r7j86K06
2665D7L17k57j13L73J66n47o1K65l7k91J58p2k12kK03j23k9p2K42j14r0M75k2
2688B04j96K87J74l18j03N0K43n73K55k71J95j60J3K82k84j0K00L1k71K62L6J8
2710F4l2K87j64j2j24k8K26l71L89K9k56j27J1Q3k58R4Q5P9LJ7J63O3J94j28p4
2735B13R1K4j86P2Mj07r2k66N9L2l1l6J43L8j56J40J77M3q2Q7K6m83L07Pq0L1
2761b5m4N5j21J14J06j23L5k88K20l09K76j03J3MK37Q8P7l0J65k01j2L9r5j50
2785g2J36k88J56j93K6J39O3J0K7j30J47K42j91J81l70L70j8j2R9k08j25L6rq9
2809g3k68J74K69j6r7J32p7J6l1o7O0J03j76J37k26K75K0k34J48m1K11k49o7r5
$$ y = [-85, 263, 436, 295, -109, 431, 136, -80, -236, 236, -125, -352, 163, 87, -351, -397, 58, -28, -254, 124, 27, -159, 47, 364, 107, -6, 367, 533, -14, -75, 190, 153, -138, 20, -52, -264, -266, -63, -186, -215, -287, -45, -159, -249, 226, 204, 8, 295, 469, 151, 48, 98, 341, -232, 23, -248, -53, -213, -200, 82, -202, -212, -12, 19, -252, 10, 46, 64, 32, 319, 155, 143, 19, -9, 217, -154, 235, 264, 8, -119, -108, -25, -283, -189, -104, -25, -22, -5, 158, 221, 415, 287, 213, 304, 328, 142, 214, 218, 111, 19, -247, -188, -156, -187, -223, -80, -42, -198, -58, 119, 162, 80, 167, 193, -290, 17, 24, -56, -25, -69, -14, -135, -21, 85, -38, -3, -291, -71, -380, -104, -207, -194, -190, 47, 135, 212, 182, 347, 146, 134, 173, 78, -72, 64, -224, -68, -261, -235, -96, -33, -23, 4, -126, 21, 263, 72, 253, -117, 253, 235, 223, 322, 114, -11, 25, 16, -73, -341, -167, 102, 86, -11, 121, 44, 60, 29, -38, 22, 125, -51, 86, -140, 135, 155, -79, 69, 28, 239, -10, -77, -172]
2833a72o8k08K69m3j8j13N58m01L98q3N4q9J53j4j18k3k29K27j97k04J03J60p1
2856a29J4J84l44J81M2L5K9n4Q3k19o5K72J34q8j94K74o3Pk6K82m62J0j49K39
2880gr7J08J00k02j33L26J04j90K1M68l94k37L26n4l22K90l5k51LP4p8o0J62L20
2904B42l1l22M9O6m9j6K55j02k71K76m7M8k82K15J83m15K63J1k91L2K86p9j20
2927i9J43R1k39N6J53m3j97J33K95n8j07k46L59l37o2K98j85k13J13K67l77mL98
2950A39m17Q8L42J10j40k09K39j1j50k01O7l1K3L07l18j43J84K32j36K3K88j64
2972A22m49O03Rl06j36J66K23k11K0J98j16j85L26P4o13kM33l01R6j63M8j20J01
2995a83J85M7j96J91O0k71J76J31l6k99K67O7j34k97K72K0j40R8J02j09j61L64
$$ y = [-172, -240, -448, -179, -222, -240, -353, 205, -196, 202, 119, 173, 84, 237, 223, 105, 82, -147, 80, -117, -321, -218, -58, -129, -115, 69, -275, -94, -52, -17, 12, -42, 41, -178, -243, 29, 163, 75, -119, 155, 92, 99, 73, 355, -107, -97, -246, -7, -104, 4, 104, -98, -231, 95, 199, 9, 30, 498, 104, -133, 193, 139, -183, 107, 72, -179, -176, -102, -180, -240, -78, 242, 211, -111, -62, 4, -45, -61, 194, 92, -179, 97, 50, 98, -184, 31, 214, -201, 62, 73, -218, -186, 100, 21, -99, 44, 135, -104, -48, 105, 62, -135, -2, 293, 235, 128, -118, 241, -96, -158, 140, -45, -258, -145, 122, -255, -259, 139, -278, -190, 152, 262, 122, -87, 152, 141, -9, -210, -143, -174, -151, 156, -162, -305, -121, 111, -25, -2, 286, 122, -327, 276, 285, -21, -157, 9, 232, 21, 41, 239, 123, -62, 264, 338, -275, -277, 156, -145, -49, -212, -164, -284, -183, 2, 49, -147, 44, 104, -167, 9, 140, 104, -195, 72, 139, 5, -292, -20, 0, -140, -42, 60, -49, -210, 154]
3017A54j5l83J85O5n5J43j19m7J38O9n2j67j29K20J36m7m40L47k51QK38J50l37
3040a89J32J49M3J4k34QK9J25j1K12m34K85ok00LJ66l29J11J17J77k17k78K07
3063a20J97j76J63K25j47j05R6Q2l02p3J69J56j18n3J02k72m0K17j10o6M8L63
3085B36k83m0L16k33j69j0M03l80J35J04r4K38m42J52J0k07K73j82J67n5J10Q
3107E7j75J30n3K06k63L15j26k03J58j12J68j77N7m8k85L13N5j12M4K8M2l2P7
3130F4k09J96j93O8R6q7R1N8K3pj21n2J56k10J97J11k50j92J49M4J27R0j98l5
3154h4K6J48j01J54k81P7K86k48m2j03L04k21k5J31mLK0k1k00J55r6N2P7k4rJ7
3180iJ50j57Q6qp0l4K06p7j16R3p5Q9k5Jm8k3J25j72J20J03k26k1J31%j8k6j13
$$ y = [154, 139, -244, -59, 6, -49, 94, -25, -72, 66, 135, 83, -84, -213, 7, 143, 96, -344, 3, -248, -240, -2, 148, -189, -57, 92, 135, 149, -85, -77, -48, 77, 66, 278, -156, 129, 123, -77, -74, 92, -237, -126, -9, 168, -49, -327, -120, 77, -99, 64, 289, 142, 37, 133, 215, -87, -160, 9, 165, 47, -6, 96, -176, -216, 1, -109, -175, -127, 236, -47, -87, 229, -4, -173, -183, 220, -160, -25, 79, -15, 223, -219, -67, -57, -264, 9, -173, -6, -61, 49, 57, -118, 12, -41, 165, -98, 217, 91, -112, 46, -66, 102, -75, -18, -66, -351, -38, 17, -95, -51, -23, 19, -13, 64, -145, 51, -142, -74, 22, -65, 26, 84, 107, 100, -21, -73, 83, -127, 70, 181, -69, -261, -112, -68, 59, 149, -49, -84, -58, 90, -11, 143, -138, -61, 225, -23, -65, -168, 136, -85, -110, 21, 17, 20, 40, 19, -181, -26, -122, -70, 7, -17, -26, -9, 141, -16, 70, 62, -8, -42, 164, 87, -29, 64, -11, 78, 53, 54, 6, -17, 108, -64, 56, 159, -67, -88, 43, 43, 25, -1, -114]
3207a14J51j05J21J05j01J18l79jJ50p7J07R5M8n4k27K42K8L4j61o8K14j99L21
3230B48k05Q8k2m7j09l1K62k98j2J85j10j2J11J70k65K13j75o0R5N3p4J7N7Q1
3254A60j97J21j20J15k03J17j00J78k65M27l28J23p4L5M4r0L5K1q9N6o1K44j75
3277b6O4m8j38J89O9J5k8J25m70K47L6K1J86o5j96J52j76kk6J31J27l54j9K44
3301E8K7j22N6J4j88P3J9J27j5N0j14r5J42J3P7q8jr0Q1J38j89NK7K8k54L50j96
3328f7K0K28q9l11L27j02J3j07o3J24n3L0k7J8N9J59j53r9l0l4J3M15j86k31M7
3353i9p3K19J18k41K45k72L56j53j79K07j74K12j00q0K22k86M0k0J64P2k41P5
3375A2l1P2j50R3J0J71j50k30N3J59o7k00L29n3j93K3J44K26o5n6l91L85J70j38
$$ y = [-114, 37, -68, 53, 158, 57, 175, -204, -205, -55, -132, -25, 70, 118, 64, -163, 79, 107, 141, -20, -88, 126, -73, 248, 43, 131, 109, 62, -47, -78, 184, -114, -126, 59, -51, -63, 48, 218, -47, 166, -9, -69, 26, 79, 5, 22, 79, 160, -37, 84, -36, 79, -124, -7, -107, 71, -194, 233, -95, 28, -46, -11, 33, -57, -22, -1, -90, -34, -95, 149, -26, 38, -10, -148, 41, 110, 125, 97, 222, -248, -1, 35, 56, 242, 177, -19, 133, -43, -45, -71, 60, 187, -167, -186, 58, 85, -37, 19, 33, -155, -82, -63, 64, 49, 99, -15, -110, 32, 45, 122, 34, 33, -57, 24, 162, -27, -22, 5, 33, -221, 129, -67, -47, 181, 92, -219, 108, 6, 19, -88, -151, -27, -80, -50, -77, -59, 0, 159, 6, -93, -123, -157, -144, 271, 85, -146, -99, -172, 47, 165, -76, 169, -103, 253, 100, -79, 128, -46, 166, 66, -14, 208, -78, -38, -58, 106, 178, -63, 12, -19, 53, -97, -4, 6, 177, 27, -203, -150, 9, -58, -258, 71, 18, -175, -152, -8, 218, 153, 97, -294, 91, 261, 123]
3399A23J12j16j74K14j38K7j41K43k18J56j04QJ39O8o0r0m3Lk28K4K10K0j66M6
$$ y = [123, 235, 119, -55, 159, 21, 48, -93, 150, -68, 88, -16, -8, 131, 199, 139, 49, 6, 9, -219, -195, 15, 35, -131, -85]
$$ [...]
8191b4
##END NTUPLES=NMR FID
##END=
