##TITLE=1H_LY-MTBE
 200.13MHz,CDCl3.
 8 sc
 
 11.12.2025
##JCAMPDX= 6.0         $$ Bruker NMR JCAMP-DX V2.0
##DATA TYPE= NMR FID
##DATA CLASS= NTUPLES
##ORIGIN= UXNMR, Bruker Analytische Messtechnik GmbH
##OWNER= pz
$$ XWIN-NMR		Version 3.5
$$ Thu Dec 11 13:35:16 2025 Russian Standard Time (UT+4h)  she@DPX200
##.OBSERVE FREQUENCY= 200.1313
##.OBSERVE NUCLEUS= ^1H
##.DELAY= (6, 6)
##.ACQUISITION MODE= SIMULTANEOUS
##.ACQUISITION SCHEME= undefined
##.AVERAGES= 8
##.DIGITISER RES= 18
##SPECTROMETER/DATA SYSTEM= spect
##.PULSE SEQUENCE= zg30
##.SOLVENT NAME= CDCl3
##.SHIFT REFERENCE= (INTERNAL, CDCl3, 0, 14.3821)
##AUDIT TRAIL= $$ (NUMBER, WHEN, WHO, WHERE, WHAT)
$$ ##TITLE= Audit trail, XWIN-NMR		Version 3.5
$$ ##JCAMPDX= 5.01
$$ ##ORIGIN= Bruker BioSpin GmbH
$$ ##OWNER= she
$$ F:/spectra/data/she/nmr/H-C/1/audita.txt
$$ ##AUDIT TRAIL=  $$ (NUMBER, WHEN, WHO, WHERE, WHAT)
(   1,<2025-12-11 13:33:11.78 +0400>,<she>,<DPX200>,
      <created by zg, POWCHK disabled, PULCHK disabled
       configuration hash MD5:
       00 E9 B6 7A A2 85 ED C7 34 08 36 98 17 FE 4E 26
       data hash MD5: 16K
       AE 78 87 0D 28 19 62 F1 E3 F7 4F 67 A9 42 5E E4>)
$$ ##END=
$$ 
$$ hash MD5
$$ 7A 35 6E 04 AF E3 7F 2C AB 70 8F 34 A7 E4 92 6B
##$RELAX= 
##$RELAX= 
##$RELAX= 
##$RELAX= 
##$RELAX= 
##$RELAX= 
$$ Bruker specific parameters
$$ --------------------------
##$DU= <F:/spectra>
##$EXPNO= 1
##$NAME= <H-C>
##$PROCNO= 1
##$TYPE= <nmr>
##$USER= <she>
##$AMP= (0..31)
100 100 100 100 100 100 100 100 100 100 100 100 100 100 100 100 100 100 
100 100 100 100 100 100 100 100 100 100 100 100 100 100 
##$AQSEQ= 0
##$AQ_mod= 1
##$AUNM= <au_zg>
##$AUTOPOS= <>
##$BF1= 200.13
##$BF2= 200.13
##$BF3= 200.13
##$BF4= 200.13
##$BF5= 200.13
##$BF6= 200.13
##$BF7= 200.13
##$BF8= 200.13
##$BYTORDA= 1
##$CFDGTYP= 0
##$CFRGTYP= 5
##$CHEMSTR= <none>
##$CNST= (0..31)
1 1 145 1 1 1 1 1 1 1 1 1 1 1 1 1 1 1 1 1 1 1 1 1 1 1 1 1 1 1 1 1 
##$CPDPRG= <>
##$CPDPRG1= <>
##$CPDPRG2= <>
##$CPDPRG3= <>
##$CPDPRG4= <mlev>
##$CPDPRG5= <mlev>
##$CPDPRG6= <mlev>
##$CPDPRG7= <mlev>
##$CPDPRG8= <mlev>
##$CPDPRGB= <>
##$CPDPRGT= <>
##$D= (0..31)
0 0.7 0 0 0 0 0 0 0 0 0 0.03 0 0 0 0 0 0 0 0 0 0 0 0 0 0 0 0 0 0 0 0 
##$DATE= 1765445591
##$DBL= (0..7)
120 120 120 120 120 120 120 120 
##$DBP= (0..7)
150 150 150 150 150 150 150 150 
##$DBP07= 0
##$DBPNAM0= <>
##$DBPNAM1= <>
##$DBPNAM2= <>
##$DBPNAM3= <>
##$DBPNAM4= <>
##$DBPNAM5= <>
##$DBPNAM6= <>
##$DBPNAM7= <>
##$DBPOAL= (0..7)
0.5 0.5 0.5 0.5 0.5 0.5 0.5 0.5 
##$DBPOFFS= (0..7)
0 0 0 0 0 0 0 0 
##$DE= 6
##$DECBNUC= <off>
##$DECIM= 32
##$DECNUC= <off>
##$DECSTAT= 4
##$DIGMOD= 1
##$DIGTYP= 9
##$DL= (0..7)
0 120 120 120 120 120 120 120 
##$DP= (0..7)
150 150 150 150 150 150 150 150 
##$DP07= 0
##$DPNAME0= <>
##$DPNAME1= <>
##$DPNAME2= <>
##$DPNAME3= <>
##$DPNAME4= <>
##$DPNAME5= <>
##$DPNAME6= <>
##$DPNAME7= <>
##$DPOAL= (0..7)
0.5 0.5 0.5 0.5 0.5 0.5 0.5 0.5 
##$DPOFFS= (0..7)
0 0 0 0 0 0 0 0 
##$DQDMODE= 0
##$DR= 18
##$DS= 0
##$DSLIST= <SSSSSSSSSSSSSSS>
$$ [...]
##$SUBNAM0= <"">
##$SUBNAM1= <"">
##$SUBNAM2= <"">
##$SUBNAM3= <"">
##$SUBNAM4= <"">
##$SUBNAM5= <"">
##$SUBNAM6= <"">
##$SUBNAM7= <"">
##$SUBNAM8= <"">
##$SUBNAM9= <"">
##$SW= 18.0517328524113
##$SWIBOX= (0..15)
0 0 2 0 0 0 0 0 0 0 0 0 0 0 0 0 
##$SW_h= 3612.71676300578
##$TD= 16384
##$TD0= 1
##$TE= 0
##$TE2= 300
##$TE3= 300
##$TEG= 300
##$TL= (0..7)
0 120 120 120 120 120 120 120 
##$TP= (0..7)
150 150 150 150 150 150 150 150 
##$TP07= 0
##$TPNAME0= <>
##$TPNAME1= <>
##$TPNAME2= <>
##$TPNAME3= <>
##$TPNAME4= <>
##$TPNAME5= <>
##$TPNAME6= <>
##$TPNAME7= <>
##$TPOAL= (0..7)
0.5 0.5 0.5 0.5 0.5 0.5 0.5 0.5 
##$TPOFFS= (0..7)
0 0 0 0 0 0 0 0 
##$TUNHIN= 0
##$TUNHOUT= 0
##$TUNXOUT= 0
##$USERA1= <user>
##$USERA2= <user>
##$USERA3= <user>
##$USERA4= <user>
##$USERA5= <user>
##$V9= 5
##$VALIST= <valist>
##$VCLIST= <CCCCCCCCCCCCCCC>
##$VD= 0
##$VDLIST= <DDDDDDDDDDDDDDD>
##$VPLIST= <PPPPPPPPPPPPPPP>
##$VTLIST= <TTTTTTTTTTTTTTT>
##$WBST= 1024
##$WBSW= 4
##$XGAIN= (0..3)
0 0 0 0 
##$XL= 0
##$YL= 0
##$YMAX_a= 515960
##$YMIN_a= -517991
##$ZGOPTNS= <>
##$ZL1= 120
##$ZL2= 120
##$ZL3= 120
##$ZL4= 120
##$ABSF1= 10
##$ABSF2= 0
##$ABSG= 5
##$ABSL= 3
##$ALPHA= 0
##$AQORDER= 0
##$ASSFAC= 0
##$ASSFACI= 0
##$ASSFACX= 0
##$ASSWID= 0
##$AUNMP= <proc_1d>
##$AZFE= 0.1
##$AZFW= 0.1
##$BCFW= 1
##$BC_mod= 2
##$BYTORDP= 1
##$COROFFS= 0
##$CY= -3
##$DATMOD= 1
##$DC= 2
##$DFILT= <>
##$DTYPP= 0
##$F1P= 0
##$F2P= 0
##$FCOR= 0.5
##$FTSIZE= 0
##$FT_mod= 4
##$GAMMA= 1
##$GB= 0.15
##$INTBC= 1
##$INTSCL= 1
##$ISEN= 128
##$LB= 0.25
##$LEV0= 0
##$LPBIN= 0
##$MAXI= 10000
##$MC2= 0
##$MEAN= 0
##$ME_mod= 0
##$MI= 1.114404
##$NCOEF= 0
##$NC_proc= 0
##$NLEV= 6
##$NOISF1= 3.799351
##$NOISF2= 2.8
##$NSP= 1
##$NTH_PI= 0
##$NZP= 0
##$OFFSET= 14.38212
##$PC= 1
##$PHC0= -3502.312
##$PHC1= 8.39234
##$PH_mod= 1
##$PKNL= yes
##$PPARMOD= 0
##$PSCAL= 0
##$PSIGN= 0
##$REVERSE= no
##$SF= 200.129724274929
##$SI= 16384
##$SIGF1= 3
##$SIGF2= 2
##$SINO= 400
##$SIOLD= 16384
##$SREGLST= <1H.CDCl3>
##$SSB= 0
##$STSI= 0
##$STSR= 0
##$SW_p= 3205.1282051282
##$SYMM= 0
##$S_DEV= 0
##$TDeff= 0
##$TDoff= 0
##$TI= <>
##$TILT= no
##$TM1= 0
##$TM2= 0
##$TOPLEV= 0
##$USERP1= <user>
##$USERP2= <user>
##$USERP3= <user>
##$USERP4= <user>
##$USERP5= <user>
##$WDW= 1
##$XDIM= 8192
##$YMAX_p= 0
##$YMIN_p= 0
$$ End of Bruker specific parameters
$$ ---------------------------------
##NTUPLES= NMR FID
##VAR_NAME=  TIME,          FID/REAL,        FID/IMAG
##SYMBOL=    X,             R,               I
##VAR_TYPE=  INDEPENDENT,   DEPENDENT,       DEPENDENT
##VAR_FORM=  AFFN,          ASDF,            ASDF
##VAR_DIM=   8192,          8192,            8192
##UNITS=     SECONDS,       ARBITRARY UNITS, ARBITRARY UNITS
##FACTOR=    0.0002768,     1,               1
##FIRST=     0,             0,               0
##LAST=      2.2672688,     0,               0
##MIN=       0,             -517991,         0
##MAX=       2.2672688,     515960,          0
$$ Real data points
##PAGE= N=1
##DATA TABLE= (X++(R..R)), XYDATA
0 0 0 0 0 0 0 0 0 0 0 0 0 0 0 -8 8 -8 8 -8 11 -16 16 -17 24 -31 33 -40 46 -54 63 -75 84 -95 111 -128 143
35 143 -162 182 -205 232 -259 287 -322 360 -399 440 -488 539 -596 657 -725 796 -877 968
53 968 -1066 1172 -1292 1425 -1579 1753 -1947 2171 -2437 2749 -3118 3564 -4092 4673 -5054 3444
69 3444 23311 515960 68323 -382808 189134 129138 -322132 129801 384630 -326275 -318929
80 -318929 330208 97652 -250420 175651 111229 -358440 46486 411962 -160682 -279449
90 -279449 212244 20315 -216807 256080 169709 -425227 -78147 422962 -56154 -265215
100 -265215 184491 13692 -278198 224265 295495 -343262 -193582 330844 3587 -207169
110 -207169 205071 28920 -357701 123911 374196 -205722 -228979 219514 -17271 -176480
120 -176480 261129 93943 -404770 611 379507 -97331 -196375 187483 -53598 -237327
130 -237327 264578 214854 -358434 -112590 306501 -51493 -144529 230981 -36459 -337045
140 -337045 173594 315319 -232809 -169485 202603 -62036 -126806 275658 37665 -373242
150 -373242 51978 319928 -122662 -131660 172891 -104600 -188647 285885 150239 -341171
160 -341171 -51107 257361 -93138 -86688 230128 -94308 -298905 215664 256530 -241664
170 -241664 -100980 185626 -111842 -87012 289400 -18205 -353279 103949 273521 -154534
180 -154534 -75571 175319 -149157 -158809 303437 94519 -331868 6830 225786 -128042
190 -128042 -41397 228243 -137849 -258369 244946 191263 -250782 -39576 170476 -142932
200 -142932 -46676 284028 -67909 -314878 144305 216859 -173205 -28760 156460 -175004
210 -175004 -108851 304551 36429 -307097 51909 185627 -140171 3407 201650 -177392
220 -177392 -204772 268742 133239 -248333 4859 141181 -161492 538 271710 -120848
230 -120848 -281611 182347 172985 -182708 13282 134681 -202908 -63073 311829 -15480
240 -15480 -290686 92090 152047 -152004 45719 182530 -214239 -162490 286196 82349
250 82349 -241674 42828 109329 -174869 45321 256293 -161630 -243669 203629 127754 -173889
261 -173889 51447 99857 -220166 -14294 303966 -58699 -260065 113188 108291 -144560
271 -144560 87466 149140 -241148 -117043 287658 39080 -217944 69733 68121 -177336
281 -177336 90564 234700 -195067 -203428 216076 82574 -160693 88878 67177 -236238
291 -236238 28247 293238 -98869 -228120 136041 63903 -144638 126250 123419 -261564
301 -261564 -72614 284860 -6979 -192085 101383 29952 -180964 128925 208931 -220510
311 -220510 -158071 220422 36088 -142112 117746 30372 -238498 69380 267977 -130377
321 -130377 -186988 145617 22761 -127683 153259 85605 -266118 -27446 267025 -42692
331 -42692 -157840 116082 -7092 -167105 158989 171925 -235334 -111660 214848 -5531
341 -5531 -120404 137801 -4018 -231901 106977 238307 -160053 -145609 157857 -14231
351 -14231 -114540 175795 51058 -267133 18698 249832 -81752 -129250 130751 -40745
361 -40745 -153179 186137 133572 -249390 -66528 209918 -38221 -94896 146631 -42695
371 -42695 -215410 145242 205160 -181829 -108169 153959 -41933 -83821 187234 6124 -260084
382 -260084 58878 225811 -102857 -96802 124136 -73078 -123631 207281 92418 -252216
392 -252216 -29067 192004 -59732 -60305 148139 -80699 -195097 175908 171418 -194099 -71430
403 -71430 143018 -72135 -55056 199831 -32096 -252116 93213 198789 -122439 -59876
413 -59876 122000 -107981 -100454 229106 57758 -251849 6370 171210 -81569 -25563 148420
424 148420 -117010 -174238 199880 136774 -197203 -36202 124001 -95055 -22158 200346
434 200346 -68048 -231159 118230 163322 -127707 -21944 107571 -132413 -68743 233747
444 233747 20511 -235033 37138 140022 -95871 7731 139308 -143302 -145349 211252
454 211252 96691 -192811 -503 104847 -113589 7033 195559 -98802 -204083 142781
464 142781 125782 -135423 14048 94500 -155550 -37636 237940 -18726 -221466 68793
474 68793 112751 -108270 38703 125985 -169630 -112519 223895 57871 -186579 29798 82241
485 82241 -122410 40023 181581 -129319 -172464 160157 89413 -132669 41901 71531 -166174
496 -166174 -3538 227650 -52811 -196897 88484 82167 -105971 65230 102520 -183252
506 -183252 -74798 222697 20680 -170186 53957 55839 -124895 70194 162833 -154979
516 -154979 -140751 172232 55345 -127175 66072 47429 -175316 30690 219859 -84759
526 -84759 -175409 105715 54396 -100444 92347 76874 -200136 -37617 224305 -13251 -154365
537 -154365 72612 26756 -123408 101422 141898 -178141 -110210 177288 25895 -112707
547 -112707 83549 19345 -174418 61877 201776 -105994 -145607 110281 24563 -85004
557 -85004 113117 47588 -204584 -4584 210905 -39879 -129377 82736 -3169 -115467 125645
568 125645 118456 -189303 -79703 172239 -467 -91761 97906 -10214 -170828 91642
578 91642 182305 -125649 -115642 113533 -6456 -70992 134665 19697 -210938 26713 198956
589 198956 -65345 -104753 92842 -31063 -106154 146839 93521 -195299 -47004 162418
599 162418 -27235 -69201 108626 -37059 -159924 114674 153656 -138449 -81500 110823
609 110823 -33619 -54621 143386 -6674 -200148 54008 174699 -82736 -76574 93211
619 93211 -52927 -86643 157626 61598 -192391 -14100 147639 -47928 -45664 108827 -65260
630 -65260 -141832 138757 123519 -151652 -51407 106996 -54239 -33555 149326 -37800 -190590
641 -190590 84034 153988 -98806 -50080 89712 -75980 -63637 170953 27940 -191710
651 -191710 16875 131788 -66546 -21314 107467 -91054 -122888 156526 94788 -155181
661 -155181 -24174 95452 -68838 -10231 147299 -62992 -172105 102581 127112 -102595
671 -102595 -24324 75869 -93440 -37663 174046 -2174 -181450 39243 110845 -73396
681 -73396 3827 96716 -112983 -98586 168864 66523 -152538 -318 79179 -79761 15974
692 15974 142925 -90371 -154414 120949 100697 -106566 1559 63127 -111307 -13132 177706
703 177706 -30362 -170136 60913 88705 -80517 29287 87418 -131340 -74475 175295
713 175295 37865 -144051 22518 58910 -88420 39946 133060 -110969 -131051 130195
723 130195 72348 -101636 23870 44892 -120273 12133 171577 -53034 -151028 73835
733 73835 65461 -77114 50225 69093 -143189 -47747 173880 10940 -130995 39521 37234
744 37234 -90576 63095 118925 -129287 -105912 137538 44545 -95585 45379 27727 -127223
755 -127223 36548 162956 -75957 -129954 87795 39938 -76725 70703 53019 -152647
765 -152647 -21607 169578 -16309 -116300 55952 16704 -90074 82477 101817 -141055
775 -141055 -78629 139283 19985 -84309 58827 7360 -124754 59848 146836 -94139
785 -94139 -108027 92622 19449 -66224 82778 29614 -154382 5103 160656 -36614 -99487
796 -99487 62917 -2480 -80326 99987 80495 -150339 -52807 137249 -1561 -70946 68927
807 68927 -14131 -120720 82237 129942 -110516 -84911 95722 -3325 -55151 97000 7370
818 7370 -155703 31635 150130 -56148 -79483 69219 -24317 -70480 116733 58609 -156770
829 -156770 -27898 130523 -20142 -53703 73638 -36976 -111891 101358 110761 -119172 -62870
840 -62870 90971 -19427 -37638 103443 -15222 -149463 51619 133852 -66558 -58875 66528
851 66528 -42584 -55785 126253 36393 -155148 -6170 117600 -35438 -34907 76387 -55973
862 -55973 -100509 115403 89539 -123325 -38373 84874 -37907 -22017 109446 -35702 -140900
873 -140900 71156 114556 -78379 -36675 64514 -61240 -41295 134287 12856 -151671
883 -151671 16803 104635 -47742 -15798 74240 -74113 -84068 127644 66335 -125027 -17339
894 -17339 75054 -48609 -3747 106377 -56708 -126844 85797 93839 -82170 -17559 55201
905 55201 -72568 -21517 135089 -9573 -141165 34929 87215 -54707 3452 67812 -88789
916 -88789 -65633 134026 42442 -121491 3338 62053 -59793 13936 102980 -75136 -111291
927 -111291 99011 72364 -84962 2513 46223 -83819 -2374 135327 -31568 -130477 51923
938 51923 70518 -58852 20915 56751 -102431 -44729 138487 18763 -116210 19805 47954
949 47954 -63139 32555 93333 -91354 -92588 107103 52305 -81241 17425 32381 -88059
960 -88059 17468 128812 -49612 -115883 61513 51937 -57394 36234 43618 -110780 -25040
971 -25040 136985 -775 -105653 32438 31722 -64217 49970 82976 -103745 -73545 111476
982 111476 32206 -74513 32227 16160 -93392 37565 122097 -68179 -101017 70664 33469
993 33469 -54167 52041 29212 -118587 -4426 134722 -19363 -93669 42695 15223 -61681
1004 -61681 65790 69295 -112684 -53686 110114 12952 -64306 42850 -184 -92496 53767
1015 53767 109532 -79448 -82050 73551 15395 -47363 63115 15319 -118175 13420 125142
1026 125142 -33890 -77964 48859 -915 -56515 77239 53100 -117666 -33151 106505 -5113
1037 -5113 -53475 51455 -16151 -88732 70824 96076 -91562 -63791 76614 -181 -38656
1048 -38656 71360 -2219 -116879 33342 114808 -48948 -62675 52362 -16887 -47850 88299
1059 88299 34872 -121187 -13087 100907 -19840 -40945 55860 -30499 -80990 82972 80702
1070 80702 -96156 -46168 72450 -12989 -26892 74772 -18247 -110272 47664 100543 -57128
1081 -57128 -46524 50576 -30516 -36753 95431 18571 -119907 3474 93040 -29575 -27812
1092 -27812 55995 -44570 -71291 93629 64781 -99966 -29971 66915 -24269 -13683 76950
1103 76950 -35802 -103727 62823 86521 -64980 -30055 48319 -43649 -24460 101743 1740
1114 1740 -116351 19409 81933 -38109 -13257 53885 -57533 -59547 99736 46673 -98346
1125 -98346 -13295 57261 -34095 242 76203 -49631 -92850 72866 71044 -67151 -15265
1136 -15265 42192 -52059 -11377 101734 -13738 -108804 31168 69293 -41774 89 46960
1147 46960 -68497 -44840 104766 28830 -95860 1389 47826 -40713 14603 73417 -63620
1158 -63620 -81342 82422 55739 -68029 -876 34344 -60400 2338 100652 -29395 -99515
1169 -99515 42274 54192 -45123 14804 40424 -77828 -30461 106175 12156 -88927 14988
1180 14988 36190 -45123 27421 67401 -73401 -67454 86008 39410 -64782 10689 24163
1191 24163 -63574 16346 94507 -42921 -87274 50250 40642 -43912 25706 30213 -82884 -13916
1203 -13916 105228 -3859 -81704 25033 25209 -45309 39216 57786 -82895 -52301 89043
1214 89043 23455 -60430 21253 12524 -65970 31182 88180 -55867 -74274 57328 26334 -41551
1226 -41551 37255 20118 -87407 637 101610 -17535 -71962 32020 12300 -43530 50216
1237 50216 47238 -89022 -37408 87993 10022 -52390 28496 382 -64273 44231 79456
1248 79456 -64663 -61499 59195 14656 -35326 44236 7621 -87841 14755 95109 -28779
1259 -28779 -61577 35780 395 -39053 59443 35852 -92456 -22720 85084 -2425 -43143
1270 -43143 35139 -11489 -61895 55618 69060 -71863 -46924 59435 705 -28934 51719
1281 51719 -4426 -87149 27976 86455 -38922 -48656 38884 -11646 -33101 67222 23337
1292 23337 -93424 -7952 79790 -13105 -33321 37570 -22751 -55783 64686 56618 -76272
1303 -76272 -33955 56765 -8442 -20109 53718 -16898 -81801 39867 76223 -45424 -36589 38107
1315 38107 -21161 -24517 72032 10480 -91705 4942 72275 -21799 -22827 38453 -33710 -48929
1327 -48929 71825 43888 -77929 -20029 52234 -18314 -10471 56356 -28300 -75868 50110
1338 50110 65026 -50234 -23773 35805 -30668 -15334 74923 -3187 -88236 17132 63369
1349 63369 -28305 -12020 36202 -43258 -38786 77393 30234 -77569 -8046 46465 -23810 -279
1361 -279 54233 -38993 -66977 57815 52912 -52216 -13130 30618 -36928 -5354 74454 -14957
1373 -14957 -81895 26328 53271 -31734 -1465 32601 -50597 -28877 79990 17911 -73968
1384 -73968 2991 38353 -29173 9965 51680 -48718 -58047 63544 40480 -52558 -2524 24496
1396 24496 -42409 5331 73265 -26697 -74824 34989 43385 -33110 8217 26629 -56741 -17296
1408 -17296 81084 5526 -69724 11328 29926 -30790 19473 45864 -56749 -47711 66549 28914
1420 28914 -49741 6147 16745 -45086 15786 69619 -35588 -65466 40042 32424 -32219 17361
1432 17361 19932 -60934 -7096 78741 -5504 -62540 18593 19795 -31852 28899 39714 -62909
1444 -62909 -36219 68131 16935 -45709 14592 8759 -46363 26021 63996 -44780 -55465 44664
1456 44664 21785 -30374 24589 11400 -63318 4750 75372 -16583 -55328 24249 11074 -29970
1468 -29970 36779 31542 -66850 -24569 67545 6832 -40143 19867 290 -45007 34535 56626
1480 56626 -50791 -45268 45346 11743 -26119 30406 2908 -63313 14680 70119 -24134 -46339
1492 -46339 27327 1939 -26768 43505 23367 -69153 -14059 65026 -2052 -33802 23511 -8417
1504 -8417 -42447 42499 48296 -55975 -34910 45518 3053 -20716 34906 -6002 -61879 24608
1516 24608 64068 -31127 -37644 29097 -6077 -22401 48357 14563 -69454 -4439 60285 -9504
1528 -9504 -26450 25392 -16496 -38398 48413 39756 -57682 -24601 43271 -4700 -14606 37784
1540 37784 -13644 -58829 31666 56659 -35177 -29071 28137 -13070 -16802 50980 5227 -67808
1552 -67808 4804 54706 -15326 -18786 25511 -23898 -32413 54117 30414 -59451 -14979 40723
1564 40723 -10769 -8071 38619 -22010 -54596 38603 48740 -38499 -20752 26007 -19281 -10153
1576 -10153 53002 -3577 -64730 12917 48091 -19430 -10527 24750 -30579 -26597 57397 21868
1588 21868 -58247 -6826 35651 -15759 -1515 37942 -28780 -49111 42723 40133 -38970 -12561
1600 -12561 22266 -24019 -2871 53055 -12115 -60281 20157 41328 -22371 -3342 22265 -35872
1612 -35872 -19535 59233 12632 -56614 426 30388 -18798 5404 35329 -35308 -41847 46946
1624 46946 31152 -38717 -4442 18088 -28109 4556 52464 -19805 -55065 25697 33593 -23944
1636 -23944 3553 18979 -40048 -13029 58822 4791 -52456 6412 23902 -20527 12291 32140
1648 32140 -40135 -34546 48881 22990 -36881 1821 13158 -30090 11338 49643 -26510 -49371
1660 -49371 29439 26824 -23654 8780 14033 -42357 -5295 57721 -2771 -48019 11320 17884
1672 17884 -20488 18653 27801 -44440 -27036 49895 15024 -34327 7257 7420 -31806 17585
1684 17585 46431 -31673 -42787 31523 19151 -21948 14784 9166 -44218 1711 55309 -9160
1696 -9160 -41958 15287 10914 -20232 24227 23068 -47457 -19963 49250 7902 -30934 11035
1708 11035 2100 -31029 23174 41440 -35885 -35605 32907 12851 -19192 18525 3340 -43992
1720 -43992 9198 51865 -15531 -36575 17876 4955 -18444 28690 17169 -49367 -12512 47608
1732 47608 1411 -26521 14332 -3880 -29721 28931 36445 -38997 -28154 32789 5965 -15677
1744 -15677 22481 -2564 -43901 15342 47490 -20225 -30165 19025 -1362 -15762 32520 11188
1756 11188 -49788 -5273 45084 -3950 -21445 16136 -9190 -26671 33514 30199 -41280 -21041
1768 -21041 31962 573 -11936 24108 -8474 -41829 21047 42331 -24031 -24209 19192 -6256
1780 -6256 -12041 35024 5233 -48672 1329 41282 -8411 -15928 16956 -14713 -23580 37034 23901
1793 23901 -42164 -14262 29539 -4645 -7355 25497 -14067 -39027 25908 36856 -26293 -17793
1805 -17793 18377 -10722 -7552 36609 -1153 -47006 7359 37140 -11848 -11018 16182 -19033
1817 -19033 -19209 39464 17315 -42232 -8387 26882 -7740 -2759 25053 -19045 -35105 29826
1829 29826 31264 -27400 -12218 16447 -14332 -3150 37036 -6575 -44369 11737 32042 -14032
1841 -14032 -5673 14963 -23228 -15111 40879 11689 -40376 -2827 22969 -10685 2283 24501
1853 24501 -23330 -30963 32437 25256 -27496 -6832 13651 -17305 1513 36339 -12204 -40877
1865 -40877 15985 27105 -15398 -1058 12827 -25898 -9945 41393 5753 -38316 1881 19421
1877 19421 -12057 6491 22277 -27012 -26003 34099 19335 -26836 -2364 10480 -19212 5921
1889 5921 34831 -16480 -36623 18895 21858 -15466 3703 10221 -28229 -5116 40900 416
1901 416 -35252 5759 14829 -13096 10880 19500 -30189 -20983 35044 13551 -25401 1732 6932
1914 6932 -19897 10889 32365 -20990 -31759 21646 16928 -14948 7298 6576 -29509 317 39547
1927 39547 -4932 -32232 8553 10634 -12738 14550 16002 -32492 -15690 35100 8550 -22971
1939 -22971 5020 3126 -20153 15028 29855 -23925 -27257 22408 11922 -13502 10742 3069
1951 3069 -30478 4493 37405 -8767 -28214 10478 6185 -11901 18200 12611 -33820 -10585
1963 -10585 34397 3949 -20147 7587 -586 -19478 18744 26170 -26751 -22392 23079 7420
1975 7420 -11830 12943 -839 -30089 9178 34857 -12393 -24171 11847 2348 -10170 20844
1987 20844 8739 -34421 -5770 32811 -40 -17147 9168 -4440 -18579 21751 22824 -28115
1999 -28115 -17960 22134 3475 -9081 15005 -4317 -29312 12797 31837 -14610 -19791 12266
2011 12266 -1609 -8321 23053 4918 -34466 -1438 30770 -3583 -14061 10127 -7654 -16609
2023 -16609 24043 18623 -29001 -13162 21324 23 -6444 16184 -7913 -27515 16436 28161
2035 28161 -16925 -15687 12267 -4758 -6027 24176 1000 -33619 2440 28045 -6176 -10607
2047 -10607 10433 -10746 -14264 25969 14710 -28810 -8774 19624 -2851 -3399 16637 -11356
2059 -11356 -25614 19122 24429 -18376 -12016 11343 -7334 -3271 24721 -3097 -32198 6364
2071 6364 25379 -8199 -7435 9782 -13280 -10985 27519 10096 -28711 -4586 17778 -5136 -480
2084 -480 16126 -14967 -23063 21771 20581 -19137 -8428 10002 -9540 -79 24925 -6658 -30066
2097 -30066 9302 21974 -9097 -3688 8598 -16025 -8038 28375 6343 -27687 -1392 14985
2109 14985 -6913 2709 15517 -17563 -20388 23110 17042 -18720 -5115 8174 -10915 3079
2121 3079 24248 -9895 -27429 11797 18547 -9885 -693 7095 -17845 -4946 28256 2456 -26218
2134 -26218 1553 12513 -7871 5461 14215 -19602 -17142 23991 13298 -17893 -1982 5937
2146 5937 -12255 5969 23274 -12684 -24679 13315 14787 -10001 2408 5409 -19453 -2075
2158 -2075 27854 -714 -23960 3902 9696 -8164 8158 12612 -21144 -13745 24250 9543 -16764
2171 -16764 526 3646 -12719 8638 21309 -15452 -21556 14994 11533 -9821 4585 3463 -19819
2184 -19819 1279 26926 -3897 -21732 5810 7138 -7889 10491 10137 -22546 -10212 24001
2196 24001 5912 -15284 2705 1047 -12982 11366 19637 -17492 -18502 15654 8404 -8731 6890
2209 6890 1213 -20302 4265 25510 -6454 -19183 7071 4280 -7331 12522 7635 -23479 -6799
2222 -6799 23509 2744 -13797 4171 -1163 -12209 13789 17184 -19147 -15168 16220 5710 -7638
2235 -7638 8135 -1351 -19899 7327 23660 -9018 -16729 7728 1663 -6227 14320 4888 -23970
2248 -23970 -3503 22675 253 -11525 5310 -3747 -11537 16183 14996 -20160 -12171 15593 3023
2261 3023 -5622 9566 -4134 -19623 9823 21610 -10646 -13765 7975 -978 -4789 15853 2475
2274 2475 -23821 -548 21349 -1983 -9320 6037 -5839 -10311 17557 12226 -20609 -9044 14868
2287 14868 520 -4121 10219 -6360 -18559 11950 19284 -11989 -10978 8042 -3054 -3310 16717
2300 16717 26 -23098 2050 19358 -3778 -6839 6335 -8072 -9006 18682 9555 -20584 -6213
2313 -6213 13612 -1476 -2108 10670 -8522 -17116 13829 16640 -12779 -8233 7626 -4784 -1526
2326 -1526 16948 -2757 -22049 4710 17415 -5472 -5037 5974 -9638 -6896 19394 6487 -20481
2339 -20481 -3375 12525 -2970 -172 10422 -10493 -15116 15514 14048 -13401 -5852 6762 -6288
2352 -6288 503 16918 -5277 -20815 6701 15164 -6244 -2616 5305 -11310 -4909 20138 3979
2365 3979 -19680 -1089 10898 -3872 1994 9785 -12509 -13203 16662 11381 -13410 -3706 5498
2378 5498 -7306 2561 16436 -7655 -19155 8572 13081 -6727 -735 4338 -12337 -2545 20211
2391 20211 1409 -18669 848 9126 -4594 3889 8791 -14165 -11197 17231 8908 -12925 -1751
2404 -1751 3917 -8241 4643 16041 -9344 -17352 9554 10717 -6452 1501 3110 -13617 -674
2417 -674 20024 -743 -17333 2344 7002 -5029 5759 7760 -15410 -9019 17556 6400 -12107
2430 -12107 171 2507 -8536 6533 14890 -11121 -15044 10652 8332 -6404 3210 1653 -14147
2443 -14147 1563 19080 -3157 -15752 3811 5037 -5002 7472 6312 -16266 -6502 17459
2455 17459 3952 -10967 1918 794 -8739 8352 13608 -12483 -12861 11001 5876 -5833 4770
2468 4770 83 -14514 3653 18123 -5146 -13845 4990 3270 -4617 8833 4680 -16673 -3906
2481 -3906 17131 1567 -9988 3053 -710 -8351 9893 11606 -13949 -10467 11529 3785 -5269
2494 -5269 5666 -1555 -14088 5907 16933 -6888 -12103 5687 1609 -3808 10003 2650 -17145
2507 -17145 -1635 16477 -312 -8641 3672 -2624 -7848 11572 10123 -14797 -8540 11298 2260
2520 2260 -3905 6666 -3404 -13873 7792 15727 -8008 -10276 5701 -196 -2854 11040 773
2533 773 -17246 380 15463 -1943 -7079 4185 -4197 -7060 12804 8437 -15107 -6299 10883
2546 10883 573 -2611 7234 -5105 -13159 9238 14096 -8904 -8334 5538 -1948 -1792 11856 -969
2560 -969 -16886 2211 14236 -3135 -5209 4516 -5770 -6168 13740 6791 -15042 -4404 9894
2573 9894 -883 -1130 7481 -6797 -12364 10505 12064 -9573 -6302 5301 -3357 -555 12189 -2752
2587 -2752 -16084 4034 12851 -4195 -3702 4440 -6815 -4683 14140 4546 -14771 -2384 8906
2600 8906 -2118 130 7423 -8223 -11024 11667 10187 -9927 -4409 4811 -4359 750 12258 -4304
2614 -4304 -15014 5459 11238 -4773 -2064 3919 -8087 -3356 14449 2520 -14312 -674 7692
2627 7692 -2982 1648 6967 -9551 -9480 12590 8274 -9983 -2729 4184 -5026 2171 11793 -6100
2641 -6100 -13744 6840 9569 -5298 -722 3077 -8829 -1654 14440 452 -13586 958 6588
2654 6588 -3343 3124 6201 -10785 -7821 13235 6526 -9794 -1295 2877 -5580 3847 11265 -7638
2668 -7638 -12603 7576 7811 -5038 858 2047 -9719 43 14509 -1051 -12670 2061 5157
2681 5157 -3471 4511 5461 -11710 -6376 13364 4696 -9246 -197 1702 -5958 5176 10504 -8828
2695 -8828 -10992 8188 6190 -4819 2198 1022 -10237 1638 14141 -2543 -11483 2986 3588
2708 3588 -3598 5808 4527 -12411 -4846 13087 3029 -8200 1032 334 -6151 6580 9842 -9616
2722 -9616 -9471 8441 4451 -4319 3501 38 -10563 2916 13360 -3852 -10113 3694 2143 -3539
2736 -3539 6659 3425 -12566 -3118 12662 1275 -7352 2077 -645 -5966 7553 8496 -10423 -7578
2750 -7578 8763 2849 -4033 4207 -1160 -10321 4336 12288 -5173 -8802 4180 933 -2977 7528
2764 7528 2061 -12755 -1324 12212 -16 -6285 2625 -1957 -5526 8772 7275 -11135 -6091
2777 -6091 8561 1528 -3104 4700 -2438 -10058 5797 11316 -6204 -7466 4449 -207 -2223 8262
2791 8262 589 -12716 416 11533 -1330 -5260 2942 -3106 -4877 9581 5782 -11568 -4519
2804 -4519 8236 342 -2217 5081 -3838 -9551 7161 10173 -6881 -6003 4339 -1408 -1188 8877
2818 8877 -863 -12587 1784 10695 -2244 -3983 2922 -4487 -4157 10379 4527 -11555 -3150 7655
2832 7655 -569 -946 5378 -5125 -8815 8092 8867 -7304 -4604 3980 -2474 -354 9070 -2177
2846 -2177 -12064 2913 9557 -2944 -2714 2954 -5361 -3295 10870 3253 -11268 -1683 6835 -1472
2860 -1472 145 5474 -6114 -8133 8795 7521 -7340 -3241 3414 -3379 645 9169 -3250 -11319
2874 -11319 3800 8287 -3340 -1375 2726 -6283 -2370 11117 1871 -10775 -448 5881 -2187
2887 -2187 1114 5162 -7030 -7025 9235 5970 -7406 -1934 3067 -4017 1532 8881 -4424 -10211 4963
2902 4963 7048 -3814 -350 2322 -6794 -1080 11005 311 -10304 787 4983 -2640 2078 4546
2916 4546 -8004 -5742 9801 4524 -7291 -781 2258 -4341 2847 8563 -5667 -9294 5744 5868
2930 5868 -3807 666 1459 -7359 262 10957 -1131 -9739 1585 3994 -2668 3185 3832 -8763
2944 -8763 -4372 10094 3124 -6951 233 1347 -4523 4012 7842 -6772 -8169 6322 4604 -3719
2958 -3719 1637 490 -7770 1588 10642 -2345 -8817 2319 2844 -2526 4390 3037 -9445 -3162
2972 -3162 10144 2001 -6254 975 190 -4695 5122 7340 -7549 -7169 6399 3264 -3114 2655 -454
2987 -454 -8115 2642 10230 -3294 -7707 2919 1686 -2414 5192 2228 -9678 -1870 9751 734
3001 734 -5494 1683 -758 -4638 5950 6328 -8080 -5721 6490 2047 -2682 3362 -1279 -7918 3811
3016 3811 9517 -4155 -6657 3318 651 -2090 5880 1247 -9808 -713 9223 -412 -4608 2143
3030 2143 -1866 -4275 6876 5445 -8526 -4422 6394 968 -2045 3928 -2240 -7710 4842 8557
3044 8557 -4971 -5494 3485 -320 -1667 6279 145 -9634 693 8522 -1456 -3770 2485 -2557 -3674
3059 -3674 7489 4304 -8758 -2988 6251 -38 -1444 4027 -3229 -7153 5802 7469 -5607 -4424
3073 -4424 3401 -1154 -784 6662 -1105 -9385 1915 7999 -2068 -2871 2397 -3507 -2997 8152 3084
3088 3084 -8930 -2041 5822 -662 -577 4025 -4372 -6599 6600 6549 -5946 -3465 3115 -1848 33
3103 33 6800 -2204 -8972 2880 7184 -2601 -1901 2284 -4328 -2322 8477 2036 -8793 -1081 5115
3118 5115 -1187 386 3954 -5185 -5961 7202 5575 -5832 -2309 2574 -2545 997 7030 -3129
3132 -3129 -8534 3527 6180 -2890 -871 1945 -5058 -1467 8710 1049 -8322 -149 4334 -1694
3146 -1694 1383 3832 -5919 -4978 7595 4359 -5829 -1176 2111 -3210 1717 6770 -4050 -7750
3160 -7750 4201 5025 -3182 48 1641 -5492 -545 8476 -23 -7725 869 3512 -2012 2230 3426
3175 3426 -6559 -4105 7809 3145 -5673 -347 1424 -3480 2592 6385 -4800 -6923 4724 4074
3189 4074 -3068 948 1071 -5808 481 8423 -1162 -7195 1641 2761 -2145 2906 2789 -7050 -2993
3204 -2993 7897 1902 -5366 443 787 -3511 3416 5806 -5580 -5790 5208 3133 -2887 1565 344
3219 344 -6020 1510 8071 -2215 -6514 2114 1956 -2039 3627 2034 -7564 -2024 7933 1115 -4920
3234 -4920 920 10 -3469 4363 5283 -6237 -4996 5356 2280 -2524 2181 -556 -6163 2470 7652
3249 7652 -2990 -5778 2432 974 -1758 4323 1339 -7759 -959 7734 261 -4188 1416 -764 -3351
3264 -3351 5078 4587 -6660 -3988 5373 1286 -2145 2706 -1424 -6142 3355 7116 -3576 -4950 2634
3279 2634 190 -1368 4976 566 -7932 -55 7369 -554 -3503 1714 -1741 -3073 5698 3774 -6953
3294 -6953 -3098 5042 430 -1449 3099 -2235 -5950 4136 6400 -4146 -3911 2783 -624 -979 5290
3309 5290 -262 -7627 878 6623 -1356 -2713 1981 -2413 -2683 6096 2922 -7088 -1955 4868 -343
3324 -343 -892 3341 -2770 -5451 4803 5570 -4511 -3023 2739 -1297 -420 5521 -1170 -7428 1808
3339 1808 6021 -1944 -2034 1884 -3022 -2072 6617 1943 -7061 -1054 4564 -829 -215 3251 -3600 -4870
3355 -4870 5447 4698 -4890 -2226 2531 -1796 193 5490 -2091 -7030 2626 5449 -2296 -1289 1757
3370 1757 -3575 -1370 6848 1099 -6940 -251 4081 -1209 481 3092 -4415 -4417 5925 3960 -4875
3385 -4875 -1510 1948 -2283 1060 5580 -2881 -6667 3193 4741 -2401 -513 1366 -4156 -729 7028
3400 7028 231 -6675 378 3372 -1555 1257 2839 -4990 -3702 6215 2997 -4768 -666 1589 -2673
3415 -2673 1676 5396 -3483 -5982 3624 3904 -2485 330 1039 -4547 -21 6932 -588 -6267 998
3430 998 2669 -1700 1961 2545 -5539 -2971 6360 2218 -4439 -1 961 -2874 2445 5168 -4190 -5313
3446 -5313 3992 3055 -2458 916 523 -4959 783 6763 -1350 -5730 1483 2047 -1756 2546 2121 -5803
3462 -5803 -2082 6377 1197 -4133 659 425 -2997 3038 4599 -4814 -4531 4245 2158 -2320 1511
3477 1511 49 -5011 1523 6502 -2087 -5045 2027 1329 -1701 3215 1481 -6171 -1240 6318 453
3492 453 -3765 1101 -289 -2874 3825 4121 -5345 -3796 4429 1451 -2000 1969 -710 -5012 2422
3507 2422 6070 -2841 -4432 2333 627 -1440 3664 779 -6340 -310 6177 -350 -3282 1445 -930
3522 -930 -2726 4369 3454 -5698 -2923 4518 781 -1534 2355 -1405 -4915 3279 5592 -3377 -3787 2380
3538 2380 -117 -1027 4175 60 -6488 369 5881 -849 -2680 1600 -1646 -2437 4982 2836 -5874
3553 -5874 -2122 4274 122 -1001 2644 -2101 -4828 3830 5045 -3717 -3037 2354 -803 -771 4472 -544
3569 -544 -6298 1173 5349 -1408 -1964 1794 -2238 -2092 5367 2116 -5900 -1295 4015 -492 -463 2802
3585 2802 -2821 -4513 4376 4323 -4092 -2173 2214 -1335 -104 4614 -1288 -6087 1912 4813 -1803
3600 -1803 -1361 1647 -2883 -1534 5664 1303 -5958 -521 3655 -1026 74 2741 -3338 -3940 4857
3615 4857 3620 -4193 -1442 2101 -1772 444 4658 -2075 -5641 2545 4119 -2236 -675 1526 -3413
3630 -3413 -947 5878 468 -5784 173 3158 -1300 755 2582 -3969 -3349 5262 2858 -4210 -768
3645 -768 1656 -2113 1146 4652 -2843 -5236 3042 3508 -2317 -29 1145 -3841 -236 6065 -258
3660 -258 -5541 832 2648 -1509 1384 2324 -4519 -2603 5523 1950 -4189 -157 1192 -2438 1777
3675 1777 4376 -3591 -4690 3541 2716 -2290 671 705 -4149 526 5943 -1064 -5156 1331 2021 -1526
3691 -1526 2103 1862 -5054 -1921 5740 1243 -3852 365 480 -2558 2579 4108 -4161 -4089 3830 2096
3707 2096 -2101 1273 187 -4343 1244 5732 -1832 -4607 1665 1280 -1562 2563 1411 -5394 -1161
3722 -1161 5608 485 -3496 960 -30 -2562 3168 3671 -4495 -3312 3961 1329 -1935 1775 -357
3737 -357 -4472 1899 5321 -2412 -4035 1984 599 -1389 3120 828 -5530 -477 5489 -235 -3050
3752 -3050 1299 -642 -2425 3824 3099 -4966 -2675 3983 673 -1629 2076 -965 -4424 2658 4939
3767 4939 -3014 -3427 2188 -22 -1116 3566 190 -5567 410 5218 -878 -2504 1572 -1199 -2135
3782 -2135 4204 2409 -5308 -1785 3923 34 -1172 2317 -1749 -4125 3379 4440 -3403 -2650 2248
3797 2248 -623 -650 3915 -559 -5673 1178 4882 -1454 -1965 1562 -1942 -1793 4743 1722 -5383 -1046
3813 -1046 3721 -510 -589 2421 -2374 -3783 3953 3795 -3732 -1950 2177 -1092 -159 4084 -1193 -5348
3829 -5348 1861 4383 -1780 -1275 1524 -2431 -1326 5030 1050 -5373 -376 3401 -889 -2 2489
3844 2489 -3001 -3401 4426 3104 -3910 -1338 1881 -1568 411 4151 -1986 -5171 2368 3801 -2093
3859 -2093 -689 1270 -2914 -714 5284 329 -5233 296 2897 -1290 538 2280 -3584 -2900 4775
3874 4775 2395 -3904 -689 1532 -1933 990 4105 -2656 -4617 2925 3087 -2171 -49 1163 -3360
3889 -3360 -109 5254 -478 -4945 921 2387 -1481 1202 2046 -4095 -2304 5001 1578 -3774 -45
3904 -45 1093 -2171 1678 3886 -3231 -4141 3330 2499 -2182 512 656 -3661 593 5196 -1206 -4609
3920 -4609 1379 1855 -1572 1704 1663 -4444 -1605 5133 907 -3544 529 679 -2276 2208 3567 -3803
3936 -3803 -3538 3605 1780 -2201 1046 110 -3814 1270 5078 -1891 -4133 1770 1226 -1374 2344 1101
3952 1101 -4819 -734 5145 262 -3265 857 -3 -2251 2961 3120 -4368 -2896 3735 1142 -1854
3967 -1854 1458 -441 -3959 2031 4784 -2385 -3530 2095 640 -1295 2807 588 -4973 -61 4955
3982 4955 -434 -2810 1266 -628 -2185 3489 2601 -4677 -2135 3831 458 -1531 1904 -1050 -3838
3997 -3838 2719 4338 -2975 -2906 2181 27 -951 3167 -120 -5024 630 4708 -1039 -2327 1386 -1226
4013 -1226 -1865 4008 1999 -4921 -1412 3699 -78 -1089 2131 -1618 -3644 3215 3807 -3324 -2234
4028 -2234 2179 -536 -647 3448 -623 -4980 1347 4345 -1541 -1705 1558 -1687 -1545 4310 1380 -4911
4044 -4911 -689 3458 -526 -617 2144 -2186 -3316 3738 3223 -3625 -1668 2026 -1011 -139 3600 -1300
4060 -1300 -4819 1997 3907 -1833 -1204 1441 -2242 -994 4676 686 -4938 -40 3150 -983 -66
4075 -66 2145 -2828 -2870 4162 2605 -3710 -964 1851 -1451 446 3704 -2025 -4409 2581 3341 -2112
4091 -2112 -531 1227 -2655 -449 4745 -100 -4848 569 2697 -1227 521 1925 -3435 -2364 4580
4106 4580 1843 -3720 -357 1422 -1690 1142 3607 -2694 -4056 3012 2755 -2224 -20 903 -3047
4121 -3047 155 4815 -794 -4548 1106 2179 -1458 1069 1728 -3782 -1747 4698 1192 -3601 178
4136 178 1062 -2022 1573 3428 -3216 -3602 3313 2055 -2205 584 489 -3307 732 4773 -1384 -4080
4152 -4080 1548 1654 -1467 1704 1354 -4164 -1130 4775 551 -3338 591 577 -2045 2203 3060 -3673
4168 -3673 -2976 3499 1429 -2033 1015 53 -3372 1470 4570 -2038 -3593 1917 1119 -1369 2063 898
4184 898 -4405 -479 4702 -74 -2968 978 50 -2081 2685 2677 -4075 -2308 3673 894 -1739 1407
4200 1407 -454 -3405 2075 4214 -2482 -3116 2057 594 -1171 2529 300 -4602 193 4551 -677
4215 -677 -2612 1204 -538 -1851 3327 2124 -4366 -1690 3646 286 -1393 1719 -1081 -3347 2641
4230 2641 3790 -2929 -2526 2118 -90 -921 2890 -254 -4516 934 4244 -1236 -2104 1474 -1072 -1599
4246 -1599 3688 1551 -4581 -876 3470 -251 -1065 1893 -1643 -3182 3190 3280 -3348 -1937 2157 -568
4262 -568 -471 3140 -897 -4491 1561 3978 -1637 -1586 1447 -1661 -1151 4073 843 -4677 -288 3240
4278 3240 -667 -520 1930 -2243 -2811 3694 2716 -3516 -1247 2030 -1022 6 3320 -1479 -4252 2194
4294 2194 3414 -1962 -942 1409 -2071 -729 4253 199 -4579 313 2890 -1049 -41 1895 -2774
4309 -2774 -2315 4078 2073 -3603 -686 1736 -1371 474 3245 -2171 -3874 2698 2909 -2121 -482
4324 -482 1171 -2483 -211 4421 -382 -4399 897 2480 -1287 553 1723 -3212 -1827 4362 1376
4339 1376 -3545 -139 1366 -1665 1053 3150 -2809 -3458 3038 2280 -2244 108 830 -2760 472 4382
4355 4382 -1101 -4088 1376 2020 -1426 1110 1358 -3631 -1260 4520 676 -3396 334 946 -1806 1680
4371 1680 2869 -3315 -3006 3434 1721 -2159 579 371 -2986 1104 4241 -1747 -3633 1818 1414 -1417
4387 -1417 1603 965 -3921 -632 4491 43 -3134 843 477 -1789 2322 2524 -3661 -2317 3516 1031
4403 1031 -1968 1084 -100 -3078 1649 4000 -2368 -3137 2034 823 -1308 2038 461 -4156 122
4418 122 4432 -567 -2764 1098 -78 -1699 2767 2023 -4072 -1659 3649 447 -1685 1385 -610
4433 -610 -3004 2330 3582 -2809 -2587 2221 257 -1028 2413 -30 -4097 724 4155 -1086 -2287
4448 -2287 1375 -592 -1518 3121 1473 -4258 -961 3485 -101 -1308 1574 -1260 -2883 2905 3086
4463 3086 -3179 -2046 2191 -161 -638 2679 -649 -4138 1472 3851 -1540 -1803 1392 -1119 -1175 3522
4479 3522 889 -4403 -388 3280 -472 -924 1792 -1748 -2543 3350 2572 -3372 -1402 2120 -697 -289
4495 -289 2817 -1260 -3910 2024 3393 -1941 -1287 1301 -1584 -791 3796 254 -4333 254 2958 -931
4511 -931 -345 1714 -2308 -2137 3793 2041 -3585 -833 1897 -1026 197 2837 -1887 -3688 2538 2892
4527 2892 -2120 -754 1175 -2033 -278 4032 -450 -4199 828 2558 -1223 217 1605 -2767 -1749
4542 -1749 4046 1338 -3553 -294 1617 -1414 701 2827 -2410 -3293 2909 2351 -2256 -192 1026
4557 1026 -2327 274 3985 -1045 -3918 1328 2121 -1388 612 1379 -3161 -1210 4240 754 -3480
4572 -3480 207 1229 -1549 1258 2642 -2954 -2771 3247 1825 -2226 318 662 -2542 867 3909
4587 3909 -1634 -3578 1760 1692 -1451 1129 1034 -3444 -590 4288 44 -3233 712 826 -1545 1743
4603 1743 2333 -3381 -2187 3480 1128 -2140 725 168 -2682 1447 3699 -2195 -3170 2043 1145 -1329
4619 -1329 1521 580 -3678 102 4299 -444 -2889 1032 356 -1551 2332 1886 -3771 -1649 3495 618
4635 618 -1899 1100 -358 -2677 2047 3374 -2597 -2620 2259 593 -1176 1950 97 -3763 678 4028
4651 4028 -1042 -2520 1225 -220 -1425 2712 1445 -4012 -1070 3456 6 -1571 1317 -809 -2535
4666 -2535 2528 2952 -2945 -2070 2331 122 -816 2230 -452 -3771 1332 3744 -1553 -2058 1349 -672
4682 -672 -1125 3086 806 -4122 -404 3364 -490 -1206 1449 -1312 -2303 3054 2423 -3318 -1463 2246
4698 2246 -358 -515 2359 -1089 -3653 1854 3318 -1877 -1473 1387 -1163 -793 3401 228 -4089 267
4714 267 3155 -805 -710 1513 -1869 -1946 3451 1885 -3406 -913 2077 -733 -27 2493 -1745 -3416
4730 -3416 2432 2854 -2102 -970 1250 -1585 -332 3523 -435 -4064 830 2795 -1165 -215 1465
4745 1465 -2280 -1571 3742 1234 -3496 -320 1867 -1172 401 2483 -2191 -3053 2889 2304 -2362 -345
4761 -345 1101 -1876 204 3607 -1112 -3775 1383 2326 -1376 211 1213 -2791 -1030 4020 570
4776 570 -3459 262 1530 -1235 982 2332 -2738 -2571 3226 1749 -2388 66 763 -2082 799 3494
4792 3494 -1684 -3442 1780 1879 -1478 811 950 -3098 -470 4067 -28 -3195 762 1155 -1434 1424
4808 1424 2096 -3116 -2051 3446 1190 -2300 517 432 -2329 1278 3376 -2232 -3076 2104 1337 -1510
4824 -1510 1233 623 -3266 152 4045 -556 -2951 998 623 -1406 1850 1657 -3514 -1567 3501 630
4840 630 -2125 880 -42 -2351 1855 3125 -2672 -2531 2344 757 -1293 1543 203 -3370 686 3871
4856 3871 -1116 -2575 1299 137 -1315 2309 1251 -3783 -873 3504 76 -1840 1082 -470 -2255
4871 -2255 2354 2634 -3012 -2097 2465 325 -1071 1814 -351 -3389 1307 3652 -1622 -2133 1415 -324
4887 -324 -1111 2729 697 -3888 -270 3391 -362 -1436 1291 -942 -2033 2834 2249 -3291 -1489 2379
4903 2379 -155 -743 2045 -949 -3311 1852 3181 -1970 -1704 1462 -748 -755 2964 215 -3872 333
4919 333 3134 -781 -1004 1359 -1505 -1751 3201 1704 -3509 -933 2230 -516 -283 2112 -1454 -3053
4935 -3053 2434 2794 -2206 -1154 1427 -1177 -327 3216 -406 -3846 854 2879 -1158 -609 1292 -1964
4951 -1964 -1370 3478 1097 -3494 -343 2065 -863 149 2153 -1888 -2770 2768 2288 -2327 -669 1209
4967 1209 -1551 40 3224 -981 -3613 1331 2367 -1344 -114 1178 -2343 -974 3652 571 -3471
4982 -3471 175 1766 -1043 580 2034 -2383 -2384 3036 1763 -2428 -213 963 -1780 528 3209 -1530
4998 -1530 -3341 1769 1942 -1448 369 903 -2621 -447 3700 5 -3224 641 1382 -1267 998 1844
5014 1844 -2832 -1917 3303 1167 -2382 277 654 -2017 1030 3014 -2004 -2959 2107 1550 -1485 694
5030 694 662 -2850 120 3746 -564 -3063 938 970 -1326 1475 1504 -3254 -1424 3430 696 -2294 544
5047 544 311 -2011 1533 2850 -2462 -2570 2301 1008 -1373 1190 202 -3037 635 3621 -1091 -2653
5063 -2653 1264 510 -1256 1874 1155 -3431 -829 3454 204 -1965 959 -103 -1960 2042 2522 -2809
5079 -2809 -2054 2462 482 -1247 1398 -200 -3084 1152 3488 -1538 -2319 1381 90 -1085 2289
5094 2289 770 -3569 -267 3399 -299 -1702 1144 -584 -1846 2415 2146 -3092 -1578 2497 82
5109 82 -964 1698 -629 -2994 1685 3141 -1851 -1897 1503 -360 -893 2553 272 -3666 187 3186
5125 3186 -730 -1334 1241 -1023 -1652 2807 1709 -3280 -1069 2349 -304 -602 1841 -1100 -2895 2147
5141 2147 2794 -2161 -1452 1544 -669 -538 2729 -191 -3616 713 2854 -1071 -976 1193 -1477 -1379 3073
5158 3073 1209 -3393 -487 2231 -648 -272 1896 -1556 -2640 2515 2322 -2385 -908 1422 -1102
5173 -1102 -175 2759 -794 -3425 1171 2511 -1269 -542 1162 -1754 -1010 3327 646 -3348 -36 2037
5189 2037 -892 162 1769 -2022 -2268 2862 1875 -2488 -547 1238 -1394 273 2861 -1322 -3234
5204 -3234 1623 2167 -1412 -10 1007 -2111 -567 3466 130 -3301 382 1680 -1056 548 1676
5219 1676 -2377 -1940 3077 1364 -2433 -54 883 -1565 758 2862 -1719 -2956 1997 1760 -1475 343
5235 343 805 -2461 -98 3526 -431 -3119 701 1324 -1155 1011 1471 -2812 -1501 3302 916 -2352
5251 -2352 344 609 -1683 1144 2647 -2140 -2549 2186 1291 -1486 764 520 -2607 343 3387 -878
5267 -878 -2788 1100 848 -1162 1391 1188 -3072 -900 3340 340 -2241 648 272 -1789 1644 2425
5283 2425 -2528 -2199 2371 836 -1389 989 78 -2734 910 3305 -1338 -2464 1370 530 -1129 1762
5299 1762 813 -3252 -505 3304 -71 -2003 878 -60 -1657 1959 2043 -2843 -1689 2454 384 -1216
5315 -1216 1312 -261 -2675 1332 3059 -1655 -2045 1493 78 -965 2119 444 -3408 29 3173
5330 3173 -536 -1653 1047 -545 -1578 2356 1689 -3088 -1222 2451 -20 -935 1486 -754 -2609
5345 -2609 1842 2808 -2069 -1748 1526 -275 -724 2283 -21 -3346 522 2974 -836 -1330 1077 -920
5361 -920 -1348 2657 1265 -3196 -749 2405 -294 -566 1630 -1204 -2473 2169 2410 -2222 -1231 1447
5377 1447 -634 -378 2421 -466 -3302 1008 2659 -1085 -921 1169 -1312 -1036 2922 784 -3230 -295
5393 -295 2165 -646 -262 1611 -1571 -2228 2500 2002 -2358 -790 1371 -997 -14 2575 -925 -3092
5409 -3092 1434 2371 -1301 -458 1086 -1629 -780 3139 350 -3184 221 1858 -885 33 1582 -1987
5425 -1987 -1959 2767 1541 -2416 -370 1267 -1140 295 2598 -1375 -2879 1757 1999 -1448 -106 893
5441 893 -1941 -361 3139 -193 -3092 559 1648 -1027 458 1468 -2304 -1504 3000 1064 -2433
5456 -2433 16 901 -1377 687 2410 -1819 -2627 2023 1603 -1544 196 637 -2170 135 3294 -604
5472 -604 -2930 960 1336 -1112 931 1240 -2643 -1174 3067 650 -2285 303 718 -1536 1115 2322
5488 2322 -2204 -2293 2266 1244 -1517 544 439 -2257 506 3147 -1059 -2670 1174 915 -1147 1232
5504 1232 966 -2811 -748 3177 196 -2185 661 268 -1584 1511 2146 -2422 -1906 2393 787 -1331
5520 -1331 902 127 -2406 963 3020 -1424 -2373 1383 573 -1091 1511 698 -3004 -310 3136 -209
5536 -209 -1941 871 -85 -1496 1860 1890 -2713 -1493 2424 409 -1229 1079 -203 -2359 1396 2819
5552 2819 -1740 -1947 1486 186 -902 1805 362 -3103 149 3059 -554 -1662 1040 -372 -1412
5567 -1412 2183 1512 -2912 -1021 2436 55 -1029 1331 -620 -2326 1733 2487 -1966 -1555 1604 -214
5583 -214 -799 2002 -35 -3056 593 2803 -951 -1331 1138 -744 -1226 2427 1066 -3038 -653 2320
5599 2320 -268 -780 1353 -932 -2151 2092 2195 -2227 -1221 1580 -435 -444 2194 -472 -3004 1000
5615 1000 2623 -1153 -1048 1179 -1060 -979 2651 710 -3070 -216 2196 -557 -375 1533 -1330 -2026
5631 -2026 2375 1875 -2374 -819 1449 -823 -162 2306 -907 -2942 1386 2295 -1339 -671 1034 -1429
5647 -1429 -678 2865 307 -3061 188 1953 -773 -79 1438 -1691 -1787 2603 1458 -2446 -392 1245
5663 1245 -1024 180 2315 -1271 -2728 1652 1929 -1390 -232 874 -1636 -348 2994 -74 -2919
5678 -2919 554 1656 -910 334 1381 -2087 -1462 2787 1021 -2388 -56 1049 -1294 485 2254
5693 2254 -1604 -2459 1911 1556 -1490 122 745 -1895 -1 2955 -552 -2781 834 1333 -1095 606
5709 606 1135 -2340 -1041 2930 659 -2342 238 761 -1388 836 2067 -2031 -2158 2121 1167 -1468
5725 -1468 403 486 -2062 394 2940 -990 -2555 1089 1007 -1120 987 961 -2560 -701 3026 199
5741 199 -2157 598 487 -1325 1274 1943 -2323 -1737 2283 827 -1475 700 174 -2184 903 2790
5757 2790 -1366 -2270 1310 683 -1034 1322 627 -2710 -170 2999 -213 -1972 775 108 -1364 1620
5773 1620 1633 -2540 -1442 2377 446 -1303 989 -126 -2221 1198 2640 -1639 -1948 1426 272 -878
5789 -878 1684 320 -2820 212 2949 -478 -1732 937 -178 -1294 1945 1327 -2806 -1032 2323
5804 2323 53 -1080 1225 -423 -2204 1611 2430 -1912 -1569 1554 -49 -704 1802 -25 -2889 575
5820 575 2717 -833 -1429 1075 -517 -1145 2196 1101 -2804 -614 2294 -273 -756 1311 -789 -2053
5836 -2053 1922 2093 -2037 -1222 1457 -386 -482 1925 -387 -2841 937 2501 -1211 -1089 1053 -867
5852 -867 -884 2439 680 -2896 -145 2208 -530 -563 1309 -1130 -1806 2214 1766 -2305 -846 1491 -608
5869 -608 -286 2029 -857 -2683 1379 2278 -1362 -707 1051 -1162 -662 2616 193 -2871 185 1907
5885 1907 -720 -210 1305 -1524 -1607 2535 1374 -2348 -484 1317 -896 69 2134 -1217 -2478 1653
5901 1653 2007 -1476 -322 928 -1426 -313 2721 -198 -2836 629 1753 -920 117 1222 -1811
5916 -1811 -1282 2732 986 -2384 -119 1119 -1059 457 2040 -1587 -2276 1934 1574 -1506 -61 729
5932 729 -1716 -49 2753 -569 -2666 827 1449 -997 496 1060 -2125 -970 2781 581 -2325 183
5948 183 807 -1167 731 1956 -1921 -1982 2120 1209 -1509 254 519 -1857 405 2705 -985 -2473
5964 -2473 1179 1070 -1053 847 818 -2252 -611 2822 152 -2113 568 544 -1318 1091 1742 -2204
5980 -2204 -1669 2285 822 -1475 592 284 -1983 697 2604 -1262 -2148 1379 724 -996 1129 604
5996 604 -2527 -199 2859 -255 -1970 674 254 -1235 1453 1526 -2364 -1245 2326 448 -1363 805
6012 805 6 -1957 1089 2425 -1656 -1892 1434 436 -943 1360 397 -2627 172 2767 -611 -1776
6028 -1776 963 -6 -1135 1727 1292 -2620 -847 2375 86 -1144 1005 -312 -1944 1530 2228 -1889
6044 -1889 -1521 1613 12 -817 1558 -14 -2706 565 2684 -908 -1449 990 -427 -1056 2001 918
6060 918 -2710 -514 2271 -191 -878 1146 -647 -1804 1831 1922 -2085 -1174 1538 -243 -550 1823
6076 1823 -354 -2626 971 2390 -1117 -1113 1043 -752 -839 2271 599 -2785 -136 2174 -531 -690
6092 -690 1202 -1001 -1735 2046 1642 -2240 -802 1393 -558 -382 1928 -699 -2484 1205 2196 -1245
6108 -1245 -828 1017 -1071 -637 2403 215 -2795 170 1965 -711 -383 1181 -1322 -1452 2264 1231
6124 1231 -2258 -450 1348 -738 -26 1879 -1066 -2331 1547 1841 -1435 -416 956 -1268 -324 2514
6140 2514 -218 -2676 603 1742 -884 -30 1144 -1614 -1233 2494 812 -2287 -62 1206 -974
6155 -974 237 1870 -1404 -2143 1849 1438 -1587 -130 805 -1499 27 2565 -644 -2501 927 1474
6171 1474 -979 281 950 -1902 -828 2646 465 -2254 232 936 -1051 579 1691 -1741 -1832 2020
6187 2020 1076 -1589 208 628 -1629 378 2493 -989 -2306 1125 1143 -1047 581 789 -2093 -515
6203 -515 2712 58 -2072 518 669 -1209 932 1613 -2036 -1535 2192 801 -1494 439 383 -1762
6219 -1762 711 2430 -1307 -2071 1300 734 -974 925 555 -2266 -122 2755 -305 -1941 765 368
6235 368 -1182 1315 1368 -2237 -1212 2270 448 -1324 745 -13 -1777 1077 2212 -1560 -1763 1482
6251 1482 436 -910 1180 282 -2411 232 2594 -612 -1675 888 61 -1177 1605 1117 -2484 -787
6267 -787 2207 9 -1118 931 -328 -1769 1391 1959 -1948 -1426 1528 138 -837 1427 -36 -2373
6283 -2373 580 2416 -925 -1435 1056 -217 -991 1815 797 -2517 -459 2215 -288 -935 1056 -607
6299 -607 -1679 1740 1735 -2073 -1076 1621 -197 -583 1542 -439 -2387 1014 2298 -1150 -1095 1108 -570
6316 -570 -786 2002 454 -2635 72 2065 -508 -693 1074 -947 -1466 2045 1342 -2202 -746 1549
6332 1549 -402 -338 1640 -774 -2256 1352 1967 -1380 -739 985 -898 -464 2252 61 -2652 325
6348 325 1861 -728 -418 1106 -1275 -1263 2243 1089 -2218 -346 1338 -683 -77 1622 -1108 -2121
6364 -2121 1594 1700 -1538 -470 872 -1048 -262 2278 -281 -2541 643 1627 -874 -107 1076 -1438
6380 -1438 -1009 2350 681 -2226 -14 1100 -895 217 1656 -1371 -1910 1875 1341 -1550 -116 808
6396 808 -1290 54 2251 -702 -2315 893 1385 -1055 281 911 -1725 -712 2462 301 -2132 240
6412 240 991 -983 602 1495 -1715 -1616 2023 1003 -1578 198 583 -1414 389 2134 -1035 -2122
6428 -2122 1177 1036 -1066 539 671 -1938 -338 2509 -62 -2023 577 695 -1063 889 1292 -1963
6444 -1963 -1228 2183 569 -1490 417 262 -1489 740 2086 -1359 -1860 1432 760 -1000 838 477
6460 477 -2037 53 2522 -439 -1846 760 366 -985 1160 1090 -2121 -922 2183 255 -1406 672
6476 672 -11 -1529 1146 2018 -1618 -1597 1495 418 -879 987 150 -2154 406 2372 -772 -1558 868
6493 868 21 -972 1509 846 -2372 -552 2192 -4 -1167 839 -304 -1486 1461 1792 -1780 -1236
6509 -1236 1575 105 -692 1276 -156 -2121 696 2304 -1026 -1296 950 -267 -822 1715 552 -2341
6525 -2341 -229 2105 -334 -909 906 -533 -1371 1672 1413 -2016 -832 1549 -220 -566 1354 -531
6541 -531 -2111 1053 1979 -1266 -976 1024 -504 -623 1874 199 -2453 187 1921 -576 -660 959
6557 959 -884 -1253 1911 1130 -2140 -551 1376 -478 -274 1449 -854 -1975 1386 1747 -1379 -662
6573 -662 968 -720 -377 1968 -170 -2438 472 1702 -720 -384 968 -1118 -1005 2048 795 -2103
6589 -2103 -193 1296 -614 26 1438 -1067 -1791 1633 1454 -1469 -400 816 -1005 -88 1979 -471
6605 -471 -2266 752 1474 -894 -108 863 -1431 -733 2195 424 -2027 93 1091 -764 265 1351
6621 1351 -1378 -1538 1855 1103 -1498 -142 673 -1061 209 1975 -858 -2064 1066 1210 -1007 213
6637 213 664 -1552 -412 2265 132 -1977 377 932 -864 494 1214 -1659 -1326 1971 760 -1435
6653 -1435 173 461 -1263 534 1934 -1121 -1794 1220 960 -897 498 550 -1723 -99 2310 -241
6669 -241 -1842 556 615 -945 849 1072 -1892 -902 2038 403 -1373 437 268 -1279 845 1846
6685 1846 -1312 -1577 1369 621 -980 718 360 -1811 192 2159 -598 -1600 778 324 -848 1074
6701 1074 824 -1999 -584 2057 160 -1197 573 -12 -1233 1108 1568 -1603 -1303 1460 327 -848
6717 -848 886 -18 -1885 575 2057 -872 -1393 833 52 -696 1357 557 -2144 -250 2020 -199
6733 -199 -978 746 -321 -1241 1435 1353 -1800 -963 1404 46 -667 950 -266 -1826 908 1868 -1098
6750 -1098 -1106 973 -188 -597 1504 314 -2117 32 1840 -426 -839 786 -533 -1084 1587 1058 -1906
6767 -1906 -608 1409 -217 -470 1194 -535 -1725 1140 1684 -1209 -885 934 -425 -445 1601 -69
6783 -69 -2144 361 1692 -602 -565 846 -854 -861 1802 801 -1968 -314 1340 -413 -188 1194 -867
6800 -867 -1608 1380 1357 -1373 -538 823 -666 -239 1655 -316 -2016 636 1480 -746 -318 728 -1028
6817 -1028 -689 1904 511 -1957 -71 1191 -523 22 1162 -1093 -1405 1569 1126 -1382 -280 788
6833 788 -830 13 1696 -614 -1877 945 1312 -866 -72 735 -1263 -379 1966 136 -1838 227
6849 227 995 -687 256 1066 -1295 -1183 1723 818 -1377 -51 523 -967 266 1659 -907 -1729 1029
6866 1029 1072 -878 174 559 -1412 -181 2002 -115 -1782 385 727 -722 486 945 -1518 -952
6882 -952 1823 520 -1345 177 378 -972 582 1492 -1116 -1474 1218 812 -857 361 312 -1511 156
6899 156 1945 -392 -1567 613 544 -710 805 804 -1723 -632 1883 254 -1197 354 154 -1019 827
6916 827 1394 -1384 -1276 1276 531 -777 573 148 -1544 430 1814 -699 -1282 755 231 -630 963
6933 963 515 -1757 -316 1837 -30 -1083 487 -27 -994 1088 1257 -1460 -930 1287 253 -656 739
6950 739 -135 -1500 709 1692 -984 -1157 832 45 -570 1153 286 -1854 -5 1683 -306 -818 612
6967 612 -322 -918 1312 996 -1603 -717 1346 -42 -494 890 -353 -1476 938 1536 -1084 -884 805
6984 805 -205 -481 1273 33 -1851 215 1591 -424 -671 640 -516 -803 1462 671 -1726 -351
7000 -351 1339 -235 -300 927 -579 -1363 1129 1267 -1209 -663 822 -430 -237 1398 -220 -1744 527
7017 527 1382 -615 -414 633 -750 -575 1638 430 -1683 -149 1163 -373 -49 914 -882 -1247 1360
7034 1360 1011 -1306 -382 791 -574 -9 1425 -496 -1682 709 1285 -736 -205 616 -892 -383 1632
7051 1632 164 -1663 75 1027 -531 78 927 -1005 -1088 1482 775 -1283 -223 593 -633 207 1386
7068 1386 -708 -1533 921 1039 -783 41 499 -1070 -235 1679 -87 -1647 290 769 -561 313 740
7085 740 -1246 -794 1595 588 -1223 -5 500 -764 377 1338 -897 -1303 988 754 -724 206 344
7102 344 -1071 80 1623 -267 -1415 520 609 -578 481 676 -1363 -610 1637 335 -1166 195
7118 195 342 -804 567 1182 -1086 -1067 1124 550 -711 351 149 -1252 349 1539 -506 -1272 617
7135 617 439 -606 687 500 -1404 -330 1630 46 -1071 326 139 -744 795 1014 -1293 -897 1210
7152 1210 368 -659 491 -16 -1199 512 1488 -797 -1165 706 225 -509 777 303 -1486 -88 1509
7169 1509 -196 -893 399 -121 -761 999 871 -1417 -625 1151 102 -473 577 -179 -1211 722 1346
7186 1346 -938 -944 695 38 -411 931 89 -1555 236 1436 -367 -730 511 -281 -609 1177 637
7203 637 -1447 -408 1174 -113 -390 672 -407 -1064 918 1158 -1024 -715 696 -148 -271 1072 -164
7220 -164 -1529 412 1354 -468 -452 549 -452 -518 1229 427 -1502 -206 1052 -227 -243 688 -560
7237 -560 -1001 1024 982 -1052 -470 681 -301 -112 1048 -387 -1400 599 1092 -593 -380 527 -622
7254 -622 -339 1291 186 -1524 52 920 -366 -81 664 -756 -882 1262 758 -1095 -217 632 -380
7271 -380 100 1073 -581 -1264 738 973 -617 -229 413 -790 -211 1363 -39 -1335 159 766 -389
7288 -389 40 620 -961 -635 1295 439 -1103 -42 520 -525 235 950 -747 -1141 885 742 -728
7305 -728 -27 372 -872 -13 1318 -239 -1311 366 638 -463 256 545 -1091 -525 1383 321 -1070
7322 -1070 48 313 -615 427 947 -919 -1010 974 618 -643 96 227 -891 230 1312 -432 -1155
7339 -1155 489 509 -470 468 400 -1153 -314 1384 127 -990 207 181 -556 568 861 -1034 -742 1048
7357 1048 410 -568 298 129 -930 324 1271 -579 -955 622 263 -403 566 321 -1170 -143 1276
7374 1276 -59 -812 365 53 -556 733 739 -1118 -582 957 226 -573 411 -92 -937 515 1063 -725
7392 -725 -849 587 165 -401 722 77 -1272 124 1263 -247 -723 339 -74 -480 808 546 -1140
7409 -1140 -367 1028 41 -422 494 -235 -878 697 918 -836 -668 661 -46 -227 760 -46 -1180 323
7427 323 1107 -343 -561 382 -281 -425 953 388 -1237 -215 1015 -75 -277 489 -420 -839 905 863
7445 863 -896 -420 591 -155 -114 822 -247 -1133 436 1006 -483 -429 411 -434 -300 991 211 -1175
7463 -1175 -60 872 -253 -190 489 -588 -728 952 656 -933 -309 582 -251 -38 811 -367 -1101 627
7481 627 877 -532 -263 282 -531 -169 1081 21 -1167 156 808 -283 15 471 -629 -592 1018 485
7499 485 -939 -127 442 -342 44 787 -560 -963 659 728 -586 -43 328 -661 -21 1077 -176 -1091
7517 -1091 282 599 -359 108 425 -830 -383 1092 342 -892 13 408 -401 248 712 -705 -822 725
7535 725 556 -534 64 219 -687 60 1054 -315 -1020 314 512 -392 252 366 -858 -262 1116 83
7553 83 -815 148 235 -419 397 697 -816 -683 829 394 -577 127 134 -708 273 965 -466 -833 450 356
7573 356 -283 377 223 -920 -161 1108 -17 -765 222 128 -481 544 631 -839 -494 870 287 -461 233
7592 233 -83 -727 446 879 -579 -725 497 195 -321 406 109 -851 30 992 -160 -713 229 35 -374
7611 -374 600 433 -980 -404 850 137 -403 280 -149 -677 506 810 -644 -612 501 115 -255 509 -25
7630 -25 -905 196 890 -277 -514 312 -103 -301 695 370 -985 -195 797 -12 -293 374 -262 -560 608
7649 608 672 -757 -425 523 -4 -171 533 -180 -904 332 858 -369 -430 387 -226 -291 674 190 -893 -60
7669 -60 708 -136 -207 372 -356 -534 719 541 -750 -259 515 -134 -95 589 -258 -817 402 731 -484 -262
7689 -262 361 -300 -87 805 19 -903 48 692 -248 -110 360 -452 -493 830 417 -804 -175 453 -226 59
7709 59 596 -384 -714 601 574 -501 -165 266 -406 -40 782 -115 -909 186 534 -262 55 254 -581 -312
7729 -312 870 256 -664 -80 378 -201 119 518 -480 -645 569 473 -440 -41 209 -499 120 827 -197
7748 -197 -797 268 488 -275 91 183 -630 -247 831 176 -689 34 277 -219 260 522 -571 -482 644
7767 644 297 -459 52 103 -464 157 753 -317 -761 372 288 -275 236 216 -708 -120 834 37 -616 161
7787 161 192 -309 333 417 -644 -408 672 195 -456 121 30 -503 315 690 -391 -601 415 243 -232 304
7807 304 125 -651 43 776 -99 -571 140 54 -261 407 309 -747 -308 666 114 -398 183 -25 -432 441
7827 441 663 -564 -544 448 106 -177 291 17 -683 201 777 -204 -493 249 -35 -213 463 232 -734 -153
7847 -153 634 51 -276 203 -103 -443 418 506 -511 -410 372 73 -143 413 -84 -613 243 735 -299 -451
7867 -451 221 -116 -135 589 117 -746 -29 652 -7 -198 195 -206 -369 503 351 -578 -273 348 -69 -64 348
7888 348 -267 -643 358 580 -356 -306 223 -104 -27 472 4 -742 71 561 -106 -145 269 -289 -324 571 305
7909 305 -542 -128 357 -125 5 385 -273 -558 410 509 -339 -214 179 -232 -1 589 -132 -692 116 457
7929 457 -178 -31 202 -375 -170 625 231 -526 -56 340 -121 99 367 -415 -500 471 345 -371 -116 188
7949 188 -251 41 611 -190 -587 187 390 -173 59 123 -376 -119 612 98 -520 -27 266 -151 99 340
7969 340 -404 -369 482 313 -405 -31 53 -347 145 521 -241 -505 225 293 -210 99 70 -472 -57 560 10
7990 10 -500 89 147 -121 224 262 -519 -355 523 193 -313 -9 48 -322 236 518 -349 -487 312 206 -169
8011 -169 139 25 -457 15 594 -129 -414 81 110 -165 219 198 -492 -185 529 119 -326 78 -13 -242 283
8032 283 429 -329 -389 320 120 -152 149 -38 -479 109 516 -116 -310 155 47 -132 329 144 -519 -145
8052 -145 459 76 -240 36 -103 -250 365 319 -414 -294 251 75 -125 250 -91 -466 160 491 -198 -281 158
8073 158 12 -43 361 43 -502 11 423 1 -172 85 -99 -217 335 293 -397 -213 238 59 -85 239 -136
8094 -136 -458 249 384 -267 -206 132 -42 -54 387 -28 -475 -4 373 -36 -99 105 -219 -150 450 221 -387
8115 -387 -145 265 -9 20 238 -156 -318 316 347 -199 -167 95 -79 -5 354 -55 -512 42 364 -9 -51 144
8137 144 -194 -121 371 156 -451 -57 229 -101 56 188 -244 -286 334 265 -181 -132 65 -117 46 333 -172
8158 -172 -414 178 293 -83 -10 115 -308 -82 456 81 -407 -30 139 -59 122 212 -261 -226 396 226 -280
8179 -280 -90 84 -195 141 347 -169 -363 154 198 -86 6 63
8191F3
$$ Imaginary data points
##PAGE= N=2
##DATA TABLE= (X++(I..I)), XYDATA
0 0 0 0 0 0 0 0 0 6 0 8 -8 8 -16 16 -21 24 -32 40 -48 58 -72 88 -104 121 -139 163 -193 222 -258 292 -332
31 -332 382 -435 491 -551 623 -700 785 -875 974 -1086 1208 -1338 1480 -1636 1809 -1998
47 -1998 2202 -2425 2671 -2943 3244 -3576 3943 -4358 4828 -5362 5974 -6689 7531 -8548
61 -8548 9795 -11375 13439 -16267 20398 -27001 39227 -69268 293718 201567 -517991 80819
73 80819 238986 -243160 -5493 371095 -271543 -372284 343240 242154 -298226 42655
83 42655 171442 -279494 -26038 419991 -113838 -373393 182560 164648 -212091 133720
93 133720 194066 -368123 -136357 453326 22333 -356864 114467 136565 -239737 123962
103 123962 307125 -302749 -270028 345751 108347 -269907 108210 115435 -302986 52705
113 52705 394359 -163617 -317684 213020 104139 -203628 154622 145259 -354169 -56910
123 -56910 408516 -45275 -294878 147955 66415 -229013 167813 243449 -320968 -172385
133 -172385 343274 30650 -231022 153787 57359 -301502 104616 339153 -209625 -248726
143 -248726 228504 51963 -175836 177825 90210 -336378 6142 357137 -95697 -235138
153 -235138 159276 16886 -191057 199941 175485 -324623 -99556 315737 -24685 -184684
163 -184684 167890 319 -271217 162373 284336 -245773 -187267 228696 -1917 -145179
173 -145179 203230 32405 -331918 71934 331142 -140012 -189454 171731 -32042 -168041
183 -168041 236181 125045 -337878 -42552 300491 -66298 -145079 176717 -54057 -248256
193 -248256 208283 234536 -268336 -128051 222907 -44314 -107096 219196 -20818 -316644
203 -316644 118311 287918 -164481 -136313 164187 -75319 -129096 257715 71791 -330655
213 -330655 2625 262897 -91303 -93335 170657 -103611 -212228 242667 184407 -272826
223 -272826 -76269 198862 -81443 -63572 229945 -70110 -298120 157987 245764 -183677
233 -183677 -85656 156818 -119275 -99990 277807 28146 -321051 47785 229978 -120909
243 -120909 -48335 174560 -143152 -185532 264746 135887 -271675 -23762 177037 -115919
253 -115919 -28536 231414 -108262 -267159 185708 194435 -192700 -36618 140724 -147618
263 -147618 -62061 277131 -18466 -293267 87178 189076 -134769 -6906 157293 -171983
273 -171983 -142446 274048 82473 -261200 18134 148174 -132774 9556 216535 -146876
283 -146876 -228143 213099 146429 -198397 5157 122371 -168760 -21959 274375 -66946
293 -66946 -269926 126542 153738 -149288 29693 140151 -199780 -99564 284933 29763
303 29763 -253186 57570 120023 -145510 49325 199027 -184554 -188241 235931 102647 -193633
314 -193633 38593 91068 -180520 25048 263091 -110642 -241106 147728 115553 -141529
324 -141529 63020 104956 -219993 -53403 284001 -9843 -229181 78741 82316 -140710
334 -140710 90017 172694 -213048 -148936 242241 62313 -176017 67996 55795 -190519
344 -190519 65584 249301 -144741 -208807 164017 74210 -136037 98752 79293 -237442
354 -237442 -14563 278017 -48447 -202029 104182 44600 -142412 125977 150426 -234264
364 -234264 -110041 242112 21528 -155737 92751 19650 -192247 102952 225991 -171011
374 -171011 -169867 170247 35940 -117790 124153 44375 -239893 25670 258513 -78622
384 -78622 -167483 114252 7710 -129013 151625 116454 -242359 -68806 229507 -13815
394 -13815 -127902 109615 -14331 -183814 133874 195285 -190282 -127443 173352 -2028
404 -2028 -101626 146016 13841 -237907 62948 235181 -111082 -133299 127723 -27542 -118519
415 -118519 176142 83992 -250562 -27361 219565 -47381 -102493 122033 -46576 -168627
425 -168627 164883 161953 -206966 -88465 169437 -31063 -77909 153269 -23829 -224066
435 -224066 98537 205095 -131262 -98408 123986 -55533 -91541 189349 43738 -245522
445 -245522 11566 199227 -69610 -72029 121121 -77189 -144752 187654 124573 -215233 -51966
456 -51966 158627 -55605 -51405 157364 -59407 -208352 130690 175151 -148105 -63407 118661
467 118661 -84914 -63916 206602 5586 -244282 47182 180437 -88915 -40838 117101
477 117101 -111342 -121048 211149 89699 -219756 -19924 140566 -74676 -18271 156674
487 156674 -94729 -187920 155360 143060 -151539 -29154 101976 -107915 -33257 210356
497 210356 -27639 -227571 71244 149174 -96437 -7791 104366 -135389 -92877 217075
507 217075 53551 -207370 11966 115434 -90579 12773 152286 -121281 -163073 171692
517 171692 107560 -152586 4521 86884 -128629 -6336 210758 -59545 -210236 95599
527 95599 119612 -104754 22662 91702 -156826 -62077 223794 16217 -196629 42963 91989
538 91989 -102399 42128 141551 -146533 -134191 184471 72308 -149327 30799 67132 -137299
549 -137299 21687 197730 -86872 -181965 111798 87654 -101970 47734 70496 -166278
559 -166278 -27991 217080 -17857 -176856 64939 66049 -104049 66949 122193 -164341
569 -164341 -103148 189010 40453 -139373 50691 43012 -139641 53367 183472 -115100
579 -115100 -155494 127209 58783 -96920 72243 46949 -179308 5911 215087 -49809
589 -49809 -161079 82455 40531 -102258 92204 101198 -181119 -72209 189973 11160 -123477
600 -123477 67895 16474 -137160 82698 163453 -135819 -124785 132626 29190 -84936
610 -84936 89948 21405 -180122 35112 199074 -72639 -135848 88778 13741 -90022 111741
621 111741 74415 -187387 -39990 181904 -13790 -101594 78046 -12769 -128829 111616
631 111616 140815 -154915 -95780 134850 2274 -70118 105369 -6964 -181073 65349
641 65349 184343 -94088 -109712 94337 -14303 -76286 133278 47505 -193704 -8221 171427
652 171427 -39060 -78023 88489 -40364 -120997 132757 116850 -163845 -66081 128246 -22367
663 -22367 -52020 114251 -30090 -170333 86177 159162 -104475 -79224 90738 -37817 -57761
674 -57761 143169 19948 -187523 19311 152650 -56830 -54263 88211 -63573 -103780 147995
685 147995 87969 -167667 -36327 119469 -41870 -31784 117790 -55675 -156376 110092
695 110092 134186 -117627 -51010 88568 -59726 -40030 151623 -8832 -182268 47180
705 47180 134859 -74311 -31392 87585 -84080 -84457 160398 58246 -167370 -7612 107065
716 107065 -57285 -9881 115229 -79144 -137033 127584 106574 -122469 -26490 76626 -74154
727 -74154 -16347 151543 -36349 -169762 67456 114922 -78879 -9916 74592 -100610 -58443
738 -58443 167748 29838 -161656 14301 90156 -65127 13857 107120 -103141 -117333 142191
749 142191 80259 -123654 -2917 63000 -88368 7453 151986 -61744 -155900 86352 92315
760 92315 -83729 14913 64832 -117788 -36284 171974 3075 -152502 35082 70146 -73125
771 -73125 36351 98392 -120786 -95803 148872 54499 -116984 17025 45019 -95123 31144
782 31144 144335 -82092 -136371 97023 69467 -79711 33511 47139 -126613 -12044 167812
793 167812 -20303 -138054 48611 49559 -72927 56069 83883 -133793 -71918 151409 29808
804 29808 -107235 35668 27401 -99527 52759 133650 -100870 -114637 106178 43502 -76720
815 -76720 53418 31174 -134607 12083 161252 -44589 -120557 63681 27520 -72380 75525
826 75525 68278 -143812 -46191 150446 5483 -95011 49035 7743 -97474 73062 117128
837 117128 -115478 -91607 109081 22588 -66920 64194 10944 -132963 34994 148601 -61503
848 -61503 -100871 69500 8967 -63106 88747 48060 -147470 -21895 143341 -15045 -80381
859 -80381 57675 -11154 -91959 89920 98679 -126289 -67552 109545 1252 -55904 75931
870 75931 -8062 -130246 57746 134620 -79017 -80554 74698 -11226 -53580 102197 26491
881 26491 -150933 2860 135920 -33247 -64783 61374 -31193 -81151 107304 78088 -134428
892 -134428 -45150 105957 -13640 -39936 79679 -29899 -121948 77123 117674 -88365 -60866
903 -60866 70126 -27583 -37629 109215 3852 -147362 22949 121725 -44885 -44624 61314
914 61314 -49765 -68181 119542 57600 -135539 -22770 96344 -30208 -22921 84501 -49215
925 -49215 -113487 92606 98543 -95939 -38929 65985 -45318 -23222 116253 -16430 -141534
936 -141534 42691 106700 -55480 -25349 58763 -66251 -52438 128493 34920 -133882 -1545
947 -1545 84951 -42053 -6261 81704 -66993 -99142 103960 77371 -97675 -19329 57572
958 57572 -55561 -6338 115110 -35055 -129155 57385 88526 -60618 -7371 52199 -77954
969 -77954 -36031 130627 13451 -127422 16150 71103 -50307 10203 76903 -81340 -82570
980 -82570 112912 56075 -97040 -348 47125 -65242 12159 113297 -55453 -117022 72919
991 72919 71078 -64933 9203 42671 -89717 -17241 132812 -8348 -120507 31915 57334
1002 57334 -53654 26726 67637 -94161 -63789 117941 35705 -91724 14674 33570 -69447
1013 -69447 29426 105374 -71121 -101173 80580 52179 -63021 23525 31103 -94985 383
1024 383 128330 -25408 -107849 42558 41497 -53097 41540 56071 -103329 -44588 119413
1035 119413 16077 -84590 27459 18712 -72031 47148 96491 -87033 -85558 88203 35196
1046 35196 -59193 36241 16964 -99000 20525 123429 -42802 -94502 51697 24741 -50101
1057 -50101 56313 42013 -111825 -25632 117817 -1792 -74618 37298 3702 -70869 61171
1068 61171 85115 -95148 -68343 87959 19134 -50117 45763 2889 -97661 35770 112400
1079 112400 -54009 -78222 54620 8287 -44236 66934 28075 -114733 -9041 112165
1089 112165 -15839 -63072 43287 -10069 -66240 73927 72236 -101729 -50641 87118 4093
1100 4093 -40759 53236 -12675 -95520 51946 100663 -66453 -61954 57957 -7423 -37300 76664
1112 76664 13197 -115179 8732 104289 -29123 -49587 47465 -23683 -58648 83443 56012
1123 56012 -103913 -31838 81426 -10223 -29305 57281 -27100 -88957 64425 86121 -73523
1134 -73523 -46135 56503 -18879 -27183 80623 -1814 -110599 23974 94336 -37462 -36560
1145 -36560 45654 -35850 -47015 91531 38210 -106244 -15118 75572 -21166 -17355 58505 -42182
1157 -42182 -81012 77549 72536 -79125 -30900 53091 -29949 -15097 84616 -17663 -105561
1168 -105561 38098 81903 -44818 -21477 43182 -48913 -36013 97369 21842 -103725 255
1179 255 65831 -30042 -4035 57781 -54207 -70479 84951 57338 -78939 -16404 45751 -37735
1191 -37735 -2226 83194 -32405 -96651 48675 68231 -48316 -8629 36947 -57748 -22185
1202 -22185 99875 5461 -99150 13770 56304 -35075 8476 53381 -65270 -57901 91275
1213 91275 41231 -78037 -2446 36973 -45245 11068 81162 -46629 -86629 58761 53572
1224 53572 -50700 5335 30793 -66049 -9355 100320 -8940 -91603 25068 44357 -38190
1235 -38190 20890 47191 -73942 -44761 93262 25705 -73520 8468 26505 -48478 23772
1246 23772 75432 -57801 -74757 64760 40735 -48540 15450 21689 -69377 4551 96802 -22477
1258 -22477 -82556 33074 32633 -38239 31230 38491 -80543 -30984 93366 11116 -67369 18658
1270 18658 15952 -50280 36023 68772 -67325 -61253 69075 26040 -45494 26403 12045 -72695
1282 -72695 17819 91520 -35250 -71674 39922 19550 -36870 41291 28500 -85112 -16350
1293 -16350 91508 -2024 -59587 25628 5330 -47821 47002 58931 -74585 -47984 70110
1304 70110 14479 -39672 31740 443 -71133 30559 83412 -45103 -60376 42861 8557
1315 8557 -31572 49111 17305 -86608 -2607 87052 -12951 -50020 30503 -6139 -44709 56545
1327 56545 48618 -79549 -34467 68220 1978 -32315 38230 -10758 -69648 41917 74607
1338 74607 -52714 -47524 44300 -2962 -25387 55840 5760 -86232 10847 80528 -22753 -39718
1350 -39718 32542 -17044 -38680 64102 36136 -82312 -21168 64832 -7267 -23775 40237
1361 40237 -21394 -63712 51589 63817 -57383 -35299 42740 -11864 -17520 58869 -5655 -82807
1373 -82807 21480 71480 -29744 -29037 32485 -26425 -31821 69113 24566 -81388 -8633 58889
1385 58889 -15763 -14203 41981 -31438 -57439 59718 52537 -60696 -23254 39780 -20535 -9177
1397 -9177 60679 -17609 -78412 32099 62436 -35147 -18877 30219 -34357 -22340 73039 12005
1409 12005 -79590 2615 52629 -20987 -4841 39683 -40676 -48964 65331 40763 -61167 -12896
1421 -12896 34095 -26452 138 60079 -27797 -71608 39648 52119 -37209 -8228 26558 -41078
1433 -41078 -13239 74169 944 -74607 12100 43500 -25447 5057 36705 -48982 -39850 69197
1445 69197 28247 -59999 -2307 27888 -31359 9942 57872 -37827 -63128 47164 41578 -38592
1457 -38592 1099 21037 -46102 -2576 73366 -11307 -69404 20617 35056 -27511 13615 31237
1469 31237 -55248 -29498 71085 17096 -56620 5971 20734 -33139 19135 53433 -45313 -53849
1481 -53849 50645 30814 -36780 9272 14212 -49343 6784 70490 -20573 -62039 26147 25449
1493 25449 -27466 21998 25510 -59695 -19439 71170 7057 -51757 12627 12932 -33805 27702
1505 27702 47745 -52252 -44263 53197 20588 -34183 16132 6618 -51041 16574 66576 -29315
1517 -29315 -54044 30887 16942 -25931 28936 18836 -62210 -9737 68767 -1950 -45541 17431
1529 17431 4806 -32834 34656 40844 -56398 -34498 52747 11048 -29915 21661 -330 -50710
1541 -50710 24368 61177 -34870 -45396 32821 8843 -22540 33867 10950 -62839 -162 64821
1553 64821 -10127 -38877 20363 -3169 -29976 41384 32733 -60207 -24404 52538 3085 -25034
1565 -25034 25409 -7958 -48605 32569 54795 -40389 -37031 33338 1235 -18075 37952 2690
1577 2690 -62378 8527 59614 -16622 -31176 22235 -10908 -26333 46720 25404 -61098 -15455
1589 -15455 49498 -3628 -18880 27697 -14934 -45508 38150 47373 -43005 -28469 31553 -5713
1601 -5713 -12608 40368 -5622 -60081 16938 53836 -21750 -23696 22621 -17153 -21090 50591 16884
1614 16884 -61172 -6717 45899 -9274 -12681 27805 -22190 -40522 43624 38677 -45179 -19581
1626 -19581 29184 -11951 -6341 42292 -13380 -56854 23989 47311 -25319 -15913 21838 -22985
1638 -22985 -15937 52546 9309 -58960 325 40031 -13488 -5914 26879 -28268 -35061 47192
1650 47192 30590 -45107 -11794 25869 -16171 -95 42018 -20302 -52278 29526 40615 -27241
1662 -27241 -9723 19005 -27078 -9651 52940 1067 -56179 6792 34618 -16035 631 24718
1674 24718 -33812 -28699 50150 22647 -44092 -4620 21572 -19844 6145 41121 -26310 -47272
1686 -47272 33123 32980 -27652 -2724 15432 -31179 -3484 52545 -5862 -51540 12393 27916
1698 27916 -17847 7361 22332 -37976 -22437 51275 15145 -42040 1107 17028 -21640 11605
1710 11605 37900 -31582 -40915 35995 25831 -27080 2523 11077 -32844 3597 50720 -12971
1722 -12971 -46780 17272 22215 -18207 12775 18289 -41349 -15423 51438 7719 -39090 5919
1734 5919 11492 -22663 17582 34473 -36303 -34400 37777 18557 -25023 8230 6301 -34636 10087
1747 10087 48503 -18618 -41208 20207 15475 -17446 17921 13424 -43829 -8702 50080 1046
1759 1046 -35223 9640 6048 -21952 22999 29710 -39735 -27286 38677 12263 -22434 12022
1771 12022 1234 -34463 16112 44623 -23667 -35529 22044 9636 -15770 21639 8392 -44561
1783 -44561 -2162 47592 -4716 -30176 12629 404 -20656 27852 25052 -41957 -20365 37761
1795 37761 5668 -18938 15364 -4154 -34037 21314 40114 -27515 -29278 22872 3883 -12990
1807 -12990 24893 2883 -44231 4514 44643 -9510 -25285 14213 -4325 -18016 31241 19209
1819 19209 -43229 -13867 36237 720 -15339 16666 -9152 -31614 25964 35032 -30114 -23289
1831 -23289 22647 -759 -9586 27084 -2122 -42899 9837 40558 -13075 -19921 14628 -9255
1843 -9255 -15297 33894 13850 -43164 -8027 33283 -3680 -10762 17947 -13895 -28958 29768
1855 29768 29819 -31445 -17204 21426 -5014 -5750 28130 -7605 -40707 14970 36027 -16287 -15161
1868 -15161 14104 -13197 -11475 35535 7913 -42379 -2352 30538 -6678 -6488 17473 -17892
1880 -17892 -25038 32606 24236 -32037 -11859 19372 -8307 -1765 28254 -12389 -37971 18558
1892 18558 31120 -17726 -9976 12687 -16896 -7497 36724 2801 -40423 2428 26602 -9032
1904 -9032 -1742 16721 -22013 -21180 34817 18535 -31829 -6863 16478 -11067 2547 27348 -17277
1917 -17277 -34226 22376 25991 -18771 -5274 10709 -19355 -2713 36767 -2655 -37989 6764
1929 6764 22722 -10565 2373 14617 -25257 -16743 35776 13073 -30587 -2485 13163 -12979
1941 -12979 6769 26283 -20773 -30251 24310 21077 -18277 -629 8290 -21627 1221 35964
1953 35964 -6921 -34713 9716 17981 -11360 6366 12489 -27770 -12276 35994 7833 -28689
1965 -28689 1590 10103 -13863 10631 24037 -24068 -25567 26278 15986 -17924 2695 5364
1977 5364 -22542 5493 34122 -11487 -31336 12409 14062 -11203 9644 9500 -29242 -7516 35598
1990 35598 3299 -26305 4475 6672 -14014 14084 21597 -26402 -21555 26517 11594 -16353
2002 -16353 5615 2017 -23266 9289 32249 -14657 -27541 13821 9954 -10225 12898 6519
2014 6519 -30434 -2966 34734 -824 -23669 6651 3302 -13507 17056 18276 -28438 -16987
2026 -16987 26547 7305 -14447 7846 -1310 -22851 13268 29634 -17598 -23459 15085 6134
2038 6134 -8860 15363 3194 -30732 1017 32792 -4225 -20502 8001 -402 -12581 19728
2050 19728 15027 -29354 -12745 25489 3744 -11712 9877 -4679 -22159 16528 26840 -19555
2062 -19555 -19475 15314 2659 -7098 16989 -255 -30275 4813 30415 -7267 -17291 8795 -3386
2075 -3386 -10584 21805 11203 -29718 -8072 24429 245 -9080 11013 -7935 -20590 19538
2087 19538 23268 -21367 -15560 14925 -628 -4979 18053 -3786 -29208 8247 27437 -9395
2099 -9395 -13435 8920 -6646 -8501 23638 7638 -29439 -4156 22414 -2581 -6210 11540 -10896
2112 -10896 -18873 21448 19655 -22101 -11932 13899 -2952 -2523 18300 -7035 -27185 11527 24409
2125 24409 -11184 -10170 8723 -8826 -5939 24393 3709 -28872 -637 20513 -4633 -3772 11080
2138 11080 -13453 -16309 23122 15966 -22227 -8350 12422 -4948 327 18489 -10067 -25229
2150 -25229 13913 21127 -12017 -6750 7731 -11363 -3461 24968 430 -27651 2169 17880
2162 17880 -5906 -899 10304 -15723 -13559 24275 12428 -21715 -5074 10642 -6358 3128
2174 3128 17782 -13097 -22795 16098 17798 -12807 -4052 6358 -12915 -707 24838 -2852 -26021
2187 -26021 4761 15347 -6596 1977 9037 -17690 -10557 24993 8933 -20716 -2178 8295
2199 8295 -7878 5901 17137 -15498 -20442 17281 14462 -12430 -1075 4592 -14391 1897 24421
2212 24421 -5502 -23662 6751 12356 -6958 4643 7629 -19217 -7633 24924 5386 -19582
2224 -19582 346 6234 -8597 8064 15473 -17489 -17303 18388 11188 -12185 1296 2984 -14836
2237 -14836 4747 23107 -8342 -21205 8591 9701 -6989 6757 5672 -20287 -4460 24532
2249 24532 2008 -18009 2434 3888 -8791 10485 13846 -19086 -14321 18780 8175 -10996
2261 -10996 3445 689 -15201 7503 21697 -10790 -18693 9699 6858 -6570 8652 3444 -20920
2274 -20920 -1459 23796 -806 -16220 4042 1936 -8214 12482 11620 -20157 -11120 18946 5312
2287 5312 -9889 4761 -1411 -14887 9918 19789 -12853 -16147 10361 4393 -5684 10154 1289
2300 1289 -21020 1382 22725 -2953 -13956 4931 -479 -7517 14325 9582 -21023 -8428 18200
2313 18200 2907 -8203 5897 -3853 -14518 12100 17886 -14209 -13552 10512 2164 -4256 11367
2326 11367 -1078 -20697 4136 21195 -5034 -11907 5508 -2577 -6328 15651 6998 -21407 -5588
2339 -5588 17295 684 -6491 6568 -5922 -13434 14054 15714 -15125 -10808 10256 41 -2717
2352 -2717 12362 -3254 -20136 6214 19132 -6399 -9377 5510 -4841 -5228 16765 4725 -21142
2365 -21142 -3066 15917 -1155 -4392 7184 -7843 -12171 15479 13191 -15593 -8030 9663 -1856
2378 -1856 -1301 12637 -5495 -18882 8340 16956 -7867 -7171 5664 -6339 -3596 17211 2205
2391 2205 -20405 -430 14581 -2624 -2625 7043 -9458 -10439 16581 10581 -15841 -5647 8758 -3358
2405 -3358 371 12567 -7507 -17558 9950 14745 -8453 -4932 4894 -7808 -1750 17651 -185
2418 -185 -19573 1791 13001 -3616 -724 6400 -11135 -8630 17372 7967 -15840 -3471 7742
2431 7742 -4307 2188 12021 -9619 -15682 11764 12558 -8996 -2974 4100 -8801 372 17557 -2735
2445 -2735 -18586 3664 11217 -4267 1097 5431 -12729 -6556 18045 5620 -15208 -1556 6119
2458 6119 -5101 4383 11597 -11303 -14056 12620 10362 -8560 -930 2689 -10033 2270 17368
2471 17368 -4780 -17324 4991 9067 -4579 2986 4427 -13741 -4514 18215 3238 -14261 335
2484 335 4667 -5631 6020 10623 -12789 -11922 13317 7838 -8423 766 1494 -10545 4158 16560
2498 16560 -6663 -15536 6189 7226 -4546 4681 3233 -14531 -2342 17896 1154 -12996 1834
2511 1834 2864 -5997 7689 9619 -13979 -10089 13420 5700 -7776 2305 -12 -10921 5922
2524 5922 15718 -8068 -13673 7040 5275 -4298 6009 1955 -14850 -255 17179 -1087 -11770
2537 -11770 3151 1411 -5888 8873 7973 -14699 -7736 13566 3608 -7103 3455 -1240 -10555
2550 -10555 7630 14326 -9568 -11707 7720 3537 -3799 7092 322 -14984 1740 16323 -2866
2563 -2866 -10390 3809 -215 -5415 10135 6527 -15249 -5691 13342 2044 -5827 4153 -2984 -10070
2577 -10070 9438 12805 -10794 -9837 7873 1891 -2958 7813 -1490 -14927 3762 15435 -4364
2590 -4364 -9015 4253 -1484 -4343 11196 4703 -15436 -3639 12716 567 -4550 4594 -4664
2603 -4664 -9503 10826 11209 -11574 -8074 7570 322 -1783 8645 -3088 -14615 5272 14323
2616 14323 -5116 -7199 4175 -3212 -3411 12219 3105 -15456 -1967 11644 -759 -3030 4899
2629 4899 -6308 -8729 11820 9603 -11926 -6161 7099 -1040 -591 9011 -4477 -13693 6739 12584
2643 12584 -5896 -5372 4083 -4515 -2338 12554 1148 -14910 -41 10421 -2102 -1533 4968
2656 4968 -7536 -7597 12604 7766 -11860 -4295 6429 -2212 690 9119 -5966 -12632 7819 10730
2670 10730 -6467 -3655 3567 -5763 -1076 12813 -597 -14302 1512 9245 -2897 -246 4765
2683 4765 -8425 -6218 13130 5749 -11745 -2456 5686 -2930 1796 8574 -7337 -11248 8947 8927
2697 8927 -6980 -2206 3059 -6421 362 12699 -2316 -13412 3035 8090 -3391 1071 4153
2710 4153 -9467 -4610 13518 4015 -11387 -1158 4569 -3570 3245 8081 -8795 -10061 9701
2723 9701 7444 -6759 -817 2117 -7120 1880 12578 -3776 -12521 4017 6801 -3516 2211 3228
2737 3228 -10250 -3264 13545 2290 -10863 -17 3444 -3891 4541 7364 -9845 -8547 10282
2750 10282 5878 -6506 426 1235 -7546 3287 12179 -5106 -11463 4670 5339 -3377 3489 2227
2764 2227 -10984 -1720 13419 949 -9805 956 2047 -4010 6053 6839 -10627 -7409 10407
2777 10407 4424 -5772 1616 -80 -7920 4545 11505 -6244 -10128 5191 3716 -3219 4555 1291
2791 1291 -11292 -289 12863 -595 -8750 2056 972 -4071 6929 5785 -11112 -5584 10282
2804 10282 2651 -5287 2527 -1049 -7842 5679 10401 -7226 -8529 5694 2313 -2807 5466 264
2818 264 -11229 1284 12212 -1924 -7563 2698 -279 -3710 7808 4537 -11568 -4032 9977
2831 9977 1327 -4524 3083 -2197 -7445 6974 9255 -8080 -7046 5918 1179 -2243 5910 -949
2845 -949 -10960 2786 11359 -3147 -6557 3053 -1266 -3131 8385 3138 -11801 -2485 9687 204
2859 204 -3656 3420 -3242 -6875 7963 8199 -8586 -5801 5801 192 -1365 6451 -2293 -10858 3925
2874 3925 10513 -3866 -5405 2919 -2508 -2334 9162 1955 -11754 -1266 9033 -613 -2503 3588
2888 3588 -4472 -6206 8940 6944 -8999 -4446 5465 -832 -509 6619 -3516 -10325 5035 9301
2902 9301 -4483 -4128 2864 -3322 -1504 9615 700 -11475 47 8178 -1460 -1353 3600 -5605
2916 -5605 -5428 9543 5617 -9019 -3130 4690 -1752 545 6820 -4652 -9635 5953 8245 -4692
2930 -4692 -2707 2510 -4397 -472 9905 -529 -10959 1194 7051 -2029 -268 3369 -6511 -4451
2944 -4451 9903 4120 -8813 -1674 4145 -2570 1550 6673 -5617 -8558 6835 6785 -5020 -1484
2958 -1484 2186 -5024 492 9718 -1953 -10216 2328 5984 -2618 788 2928 -7264 -3289 10132
2972 10132 2726 -8422 -457 3422 -3039 2598 6310 -6614 -7522 7373 5424 -5085 -419 1353
2986 1353 -5511 1682 9474 -3303 -9437 3306 5027 -2804 1776 2392 -7699 -1956 10249 1306
3000 1306 -8085 542 2665 -3096 3511 5595 -7510 -6304 7813 4125 -5010 460 650 -5799 2857
3015 2857 9090 -4373 -8600 4030 4080 -2629 2609 1482 -8232 -821 10307 199 -7513 1126
3029 1126 1507 -3040 4678 4869 -8433 -5323 7971 3097 -4397 1252 -337 -5988 4080 8760 -5211
3044 -5211 -7673 4328 2947 -2360 3518 644 -8534 313 9757 -944 -6602 1723 442 -3054
3058 -3054 5480 4180 -8728 -4019 7892 1883 -3866 2062 -1187 -5908 4954 8001 -5893 -6461
3072 -6461 4495 1710 -1952 4168 -260 -8673 1414 9210 -1873 -5644 2216 -513 -2786 6270
3086 6270 3363 -8958 -2872 7691 878 -3156 2491 -2095 -5738 5754 6983 -6488 -5209 4551
3100 4551 710 -1576 4644 -1092 -8424 2552 8470 -2810 -4687 2574 -1271 -2390 6752 2254
3114 2254 -8995 -1664 7264 -141 -2555 2749 -2959 -5186 6465 5956 -6897 -4115 4432 -115
3128 -115 -787 5042 -2171 -8068 3594 7777 -3368 -3753 2508 -2102 -1749 7180 1215 -8937 -538
3143 -538 6698 -755 -1777 2695 -3824 -4465 7195 4796 -7133 -2993 4347 -842 -127 5122 -3178
3158 -3178 -7590 4520 6846 -3912 -2896 2335 -2757 -911 7408 4 -8799 518 6070 -1407
3172 -1407 -805 2602 -4738 -3744 7861 3911 -7179 -2080 3746 -1380 833 5092 -4171 -7133 5100
3187 5100 6058 -4019 -1878 1832 -3577 -124 7676 -905 -8348 1287 5300 -1641 213 2406 -5418
3202 -5418 -3006 8093 2811 -7019 -1069 3088 -1953 1558 4962 -4934 -6342 5561 4858 -4084 -894
3217 -894 1480 -4072 807 7566 -1837 -7792 2096 4401 -1981 1100 2099 -6021 -2306 8115 1764
3232 1764 -6630 -226 2378 -2389 2406 4635 -5586 -5529 5995 3861 -4012 18 985 -4472 1618
3247 1618 7315 -2814 -6985 2799 3514 -2176 1745 1574 -6336 -1302 7972 602 -6283 640 1874
3262 1874 -2473 3003 4116 -6089 -4402 6261 2826 -3870 706 417 -4526 2516 6922 -3755
3276 -3755 -6307 3314 2709 -2108 2432 881 -6710 -225 8024 -302 -5789 1124 1033 -2376 3918 3466
3292 3466 -6729 -3587 6452 1931 -3489 1188 -490 -4640 3467 6428 -4553 -5526 3589 1838
3306 1838 -1834 3042 175 -6797 767 7748 -1174 -5086 1664 248 -2194 4505 2771 -7148 -2627
3321 -2627 6331 1014 -3109 1658 -1252 -4552 4208 5895 -5058 -4735 3769 1067 -1366 3621 -599
3336 -599 -6963 1692 7338 -1828 -4361 1785 -627 -1938 5158 2057 -7407 -1832 6129 334 -2366
3351 -2366 2052 -1947 -4308 4954 5238 -5361 -3786 3696 272 -976 3936 -1272 -6740 2316 6594
3366 6594 -2425 -3566 1941 -1368 -1634 5584 1367 -7303 -892 5727 -392 -1746 2291 -2647 -3953
3381 -3953 5414 4394 -5581 -2872 3499 -416 -435 4147 -2056 -6462 3055 5948 -2859 -2729 1919 -2030
3397 -2030 -1064 5888 593 -7109 27 5260 -979 -1159 2310 -3253 -3431 5872 3481 -5810 -1961 3321
3413 3321 -1053 58 4146 -2793 -5918 3834 5198 -3299 -1927 1904 -2460 -406 6040 -391 -6895
3428 -6895 875 4754 -1397 -495 2119 -3937 -2816 6283 2687 -5854 -1266 2905 -1397 844 4132
3443 4132 -3612 -5516 4456 4540 -3385 -1262 1509 -3026 247 6192 -1201 -6715 1498 4217 -1641
3458 -1641 245 1866 -4466 -2107 6524 1816 -5635 -445 2463 -1687 1543 3993 -4246 -4878 4805
3473 4805 3723 -3432 -531 1052 -3501 968 6134 -1941 -6239 2048 3418 -1674 1006 1544 -5058
3488 -5058 -1382 6730 1035 -5296 200 1779 -2035 2325 3703 -4894 -4267 5054 2837 -3297 221
3503 221 481 -3759 1747 5931 -2719 -5614 2628 2655 -1794 1701 1163 -5283 -558 6637 128 -4842
3519 -4842 898 1140 -2198 2819 3267 -5320 -3367 5244 1961 -3142 837 31 -3833 2491 5602 -3418
3535 -3418 -4887 2990 1913 -1709 2254 556 -5578 212 6474 -624 -4536 1196 474 -2074 3552
3550 3552 2751 -5741 -2598 5319 1151 -2711 1335 -595 -3872 3151 5156 -4006 -4144 3233 1198
3565 1198 -1573 2689 -55 -5615 945 6137 -1378 -3946 1594 -55 -1880 4041 2153 -6012 -1743
3580 -1743 5306 512 -2387 1620 -1259 -3717 3842 4620 -4539 -3584 3265 568 -1224 3057 -781
3595 -781 -5643 1794 5877 -1927 -3292 1745 -717 -1548 4583 1385 -6209 -986 5099 -32 -1848
3610 -1848 1781 -1961 -3504 4452 3990 -4871 -2807 3234 -34 -702 3421 -1472 -5477 2434 5378
3625 5378 -2343 -2582 1787 -1472 -1150 4970 783 -6244 -323 4691 -640 -1191 1950 -2639 -3149 4958
3641 4958 3345 -4992 -1974 3011 -563 -163 3641 -2185 -5220 3131 4724 -2722 -1859 1636 -2088
3656 -2088 -633 5204 3 -6073 483 4225 -1135 -682 1965 -3173 -2594 5321 2519 -5006 -1118
3671 -1118 2713 -1237 372 3639 -2829 -4797 3624 3916 -3096 -1166 1536 -2527 -60 5273 -888
3686 -888 -5809 1203 3735 -1435 28 1817 -3721 -1934 5702 1707 -5001 -458 2261 -1515 1116
3701 1116 3452 -3622 -4298 4171 3310 -3184 -507 1199 -2954 668 5270 -1661 -5383 1862 3169
3716 3169 -1661 656 1441 -4167 -1273 5800 826 -4768 177 1793 -1821 1648 3216 -4171 -3656
3731 -3656 4538 2537 -3102 120 784 -3138 1373 5192 -2343 -5016 2309 2595 -1732 1305 1028 -4674
3747 -4674 -624 5907 136 -4560 676 1241 -1863 2384 2947 -4673 -3017 4749 1835 -2919 638
3762 638 254 -3310 2072 4989 -2927 -4466 2661 1891 -1624 1863 575 -4910 115 5782 -657 -4095
3778 -4095 1194 648 -1847 2998 2442 -5072 -2305 4829 1064 -2608 1083 -415 -3411 2751 4562
3793 4562 -3580 -3751 2891 1128 -1354 2440 -43 -5043 894 5628 -1202 -3627 1489 27 -1725
3808 -1725 3608 1847 -5373 -1505 4791 373 -2159 1528 -1003 -3300 3373 4061 -4015 -3067 3069
3823 3069 480 -1151 2743 -551 -4922 1614 5185 -1899 -3011 1704 -650 -1515 3907 1202 -5490
3838 -5490 -735 4635 -233 -1803 1769 -1614 -3053 3996 3437 -4376 -2408 3057 -95 -705 2944
3853 2944 -1332 -4872 2308 4765 -2376 -2418 1717 -1212 -1005 4320 465 -5581 -25 4354 -737 -1224
3869 -1224 1859 -2239 -2649 4467 2807 -4592 -1627 2769 -693 -226 3147 -2051 -4633 2978 4159
3884 4159 -2697 -1725 1616 -1775 -525 4576 -239 -5484 707 3959 -1065 -620 1705 -2828 -2173 4895
3900 4895 2077 -4638 -980 2565 -1028 321 3148 -2627 -4245 3494 3617 -2838 -1116 1408 -2133
3915 -2133 60 4730 -935 -5189 1258 3392 -1456 -15 1588 -3362 -1704 5060 1336 -4596 -274
3930 -274 2197 -1389 924 3109 -3192 -3686 3911 2830 -2948 -427 1123 -2577 622 4695 -1699
3945 -1699 -4896 1899 2839 -1608 567 1273 -3820 -981 5323 657 -4432 290 1665 -1578 1591
3960 1591 2823 -3853 -3129 4216 2146 -2925 161 731 -2765 1363 4533 -2363 -4436 2371 2234 -1758
3976 -1758 1158 874 -4173 -299 5278 -160 -4052 893 1178 -1709 2179 2393 -4293 -2379 4423 1390
3992 1390 -2815 649 170 -2997 2010 4307 -2984 -3897 2680 1611 -1628 1648 410 -4369 433
4007 433 5198 -831 -3792 1221 540 -1603 2751 1965 -4732 -1737 4499 747 -2542 1081 -316 -2985
4023 -2985 2629 3904 -3462 -3265 2879 997 -1395 2146 -82 -4432 1102 4977 -1449 -3307 1513
4038 1513 -82 -1528 3221 1469 -4894 -1120 4463 169 -2101 1410 -935 -2842 3255 3516 -3846
4053 -3846 -2610 2951 397 -1044 2458 -737 -4492 1732 4637 -1910 -2714 1621 -555 -1199 3695
4068 3695 884 -5059 -389 4222 -384 -1652 1613 -1507 -2618 3692 2914 -4165 -1898 2877 -228
4083 -228 -760 2707 -1345 -4287 2390 4134 -2431 -2052 1792 -1158 -820 3888 141 -5082 366 3979
4099 3979 -875 -1140 1632 -2024 -2281 4206 2157 -4382 -1242 2743 -657 -211 2797 -2016 -4029 2962
4115 2962 3649 -2642 -1534 1567 -1583 -326 4140 -535 -4900 994 3609 -1274 -618 1525 -2671
4130 -2671 -1793 4556 1560 -4402 -598 2446 -1070 385 2810 -2560 -3626 3466 3006 -2895 -825
4145 -825 1384 -2013 162 4216 -1215 -4718 1522 3083 -1551 -8 1415 -3114 -1297 4763 875
4160 875 -4329 -8 2057 -1256 939 2686 -3159 -3152 3809 2395 -2901 -375 1081 -2329 751 4159
4176 4159 -1836 -4392 2038 2554 -1647 599 1174 -3448 -661 4884 202 -4135 556 1592 -1515
4191 -1515 1399 2412 -3625 -2634 4093 1677 -2851 232 622 -2545 1409 4017 -2413 -3902 2359
4206 2359 1994 -1620 1099 735 -3754 -40 4855 -486 -3853 911 1057 -1503 2049 2009 -4054 -2026
4222 -2026 4281 1086 -2611 692 193 -2659 2019 3819 -2932 -3335 2657 1308 -1599 1515 360
4237 360 -3893 658 4658 -1059 -3363 1354 501 -1505 2550 1627 -4333 -1271 4228 354 -2328 1071
4253 1071 -366 -2604 2566 3381 -3495 -2839 2838 792 -1400 1881 -367 -4033 1377 4466 -1670
4268 -1670 -2906 1583 3 -1257 3007 1055 -4616 -595 4223 -186 -1975 1332 -899 -2453 3167
4283 3167 2905 -3876 -2177 2859 187 -1002 2196 -821 -3963 1975 4105 -2103 -2363 1687 -540
4298 -540 -993 3382 425 -4682 15 3978 -673 -1545 1468 -1508 -2201 3643 2376 -4086 -1495 2786
4314 2786 -264 -570 2452 -1467 -3757 2561 3706 -2479 -1837 1656 -1055 -628 3618 -186 -4699 674
4330 674 3632 -1096 -1049 1548 -2013 -1790 3988 1727 -4152 -857 2612 -785 -108 2495 -2007 -3473
4346 -3473 3056 3045 -2792 -1159 1504 -1563 -171 3712 -853 -4486 1332 3244 -1438 -486 1397 -2463
4362 -2463 -1301 4350 1000 -4192 -202 2365 -1039 376 2389 -2649 -3081 3527 2508 -2872 -660
4377 -660 1293 -1854 416 3826 -1548 -4209 1811 2782 -1618 88 1250 -2976 -824 4437 362
4392 362 -4088 339 1916 -1358 981 2204 -3139 -2547 3837 1838 -2846 -21 957 -2119 1018 3684
4408 3684 -2129 -3763 2294 2180 -1711 583 865 -3259 -142 4490 -405 -3842 892 1453 -1430 1511
4424 1511 1960 -3618 -1952 4073 1183 -2775 372 561 -2253 1573 3498 -2712 -3300 2588 1628 -1684
4440 -1684 1057 438 -3463 490 4386 -975 -3479 1226 932 -1374 2034 1504 -3988 -1302 4116 569
4456 569 -2514 787 -15 -2259 2148 3111 -3196 -2735 2764 989 -1457 1452 -117 -3600 1126 4225
4472 4225 -1551 -3004 1521 373 -1265 2495 1120 -4270 -663 4088 -47 -2144 1091 -549 -2184
4487 -2184 2705 2725 -3568 -2164 2863 428 -1206 1876 -536 -3558 1717 3934 -2001 -2486 1674 -203
4503 -203 -1086 2831 479 -4275 -21 3855 -570 -1756 1293 -1101 -1992 3279 2191 -3866 -1516 2920
4519 2920 -4 -867 2010 -1191 -3407 2361 3502 -2415 -1926 1677 -670 -672 3128 -157 -4358 672
4535 672 3559 -1011 -1351 1404 -1544 -1671 3590 1618 -4065 -880 2741 -565 -469 2169 -1726 -3200
4551 -3200 2853 2985 -2688 -1435 1638 -1148 -349 3326 -688 -4144 1202 3255 -1347 -800 1370 -1936
4567 -1936 -1289 3948 1033 -4065 -331 2481 -902 65 2083 -2335 -2860 3259 2463 -2882 -836 1457
4583 1457 -1429 189 3427 -1347 -3953 1792 2812 -1577 -290 1202 -2450 -812 4039 315 -3982
4598 -3982 317 2105 -1166 543 2032 -2726 -2326 3590 1826 -2999 -275 1229 -1727 736 3362
4613 3362 -1974 -3587 2228 2272 -1792 177 943 -2794 -193 4175 -373 -3778 755 1726 -1266 1089
4629 1089 1808 -3244 -1894 3913 1290 -2847 172 796 -1894 1267 3174 -2520 -3223 2552 1753 -1761
4645 -1761 730 636 -3041 304 4161 -876 -3479 1149 1233 -1322 1593 1492 -3550 -1265 3991 632
4661 632 -2683 622 405 -2010 1753 2953 -2921 -2693 2759 1204 -1660 1152 123 -3115 1043 3954
4677 3954 -1464 -3059 1471 809 -1278 1966 992 -3806 -627 3941 -8 -2386 936 -133 -1924
4692 -1924 2311 2466 -3378 -2106 2954 634 -1448 1422 -333 -3153 1552 3677 -1998 -2604 1673
4707 1673 184 -1059 2428 479 -3978 31 3831 -515 -2034 1197 -659 -1814 2796 2065 -3657
4722 -3657 -1480 2949 123 -1116 1702 -925 -3151 2177 3323 -2459 -2051 1778 -288 -790 2700
4737 2700 -68 -3967 667 3574 -972 -1544 1330 -1139 -1546 3262 1467 -3878 -794 2814 -431
4752 -431 -727 1838 -1467 -2925 2662 2790 -2761 -1515 1825 -783 -448 2890 -633 -3899 1299 3266
4768 3266 -1390 -1076 1309 -1577 -1196 3550 839 -4025 -244 2614 -788 -230 1881 -2032 -2594 3131
4784 3131 2301 -2945 -947 1703 -1083 32 3024 -1318 -3705 1890 2791 -1740 -593 1231 -2009
4799 -2009 -646 3845 295 -3857 364 2304 -1034 165 1837 -2465 -2121 3453 1720 -2964 -379
4814 -379 1373 -1446 516 3000 -1861 -3401 2255 2321 -1777 -91 1007 -2397 -209 3848 -365 -3710
4830 -3710 767 1979 -1226 671 1603 -2894 -1586 3798 1153 -2980 92 1033 -1629 1071 2873
4845 2873 -2417 -2999 2593 1789 -1856 348 689 -2605 339 3885 -973 -3383 1330 1476 -1293 1136
4861 1136 1307 -3205 -1148 3829 484 -2837 530 659 -1771 1514 2585 -2891 -2513 2821 1295 -1796
4877 -1796 726 294 -2689 964 3721 -1560 -3000 1549 1026 -1227 1581 836 -3533 -551 3875 -45
4893 -45 -2572 820 152 -1698 2123 2262 -3185 -1914 3015 794 -1610 1169 -137 -2762 1467 3499
4909 3499 -1983 -2601 1740 461 -1149 2015 486 -3640 38 3738 -524 -2168 1119 -261 -1588
4924 -1588 2497 1870 -3454 -1395 3008 205 -1306 1325 -630 -2774 2063 3140 -2426 -2072 1845
4939 1845 45 -924 2267 -78 -3668 685 3527 -1010 -1773 1227 -793 -1405 2875 1296 -3714 -813
4955 -813 2891 -249 -1054 1558 -1094 -2564 2491 2599 -2686 -1541 1832 -427 -521 2519 -567 -3608
4971 -3608 1235 3197 -1395 -1339 1259 -1115 -1102 3160 690 -3807 -210 2685 -591 -611 1549 -1615
4987 -1615 -2284 2966 2121 -2914 -1038 1781 -787 -127 2573 -1076 -3460 1731 2814 -1675 -870 1199
5003 1199 -1567 -697 3412 254 -3663 323 2450 -859 -152 1574 -2070 -1963 3332 1608 -2936 -527
5019 -527 1500 -1131 290 2608 -1673 -3212 2128 2428 -1864 -410 1069 -1880 -227 3538 -328
5034 -328 -3601 800 2169 -1082 281 1391 -2492 -1507 3525 1095 -2950 -94 1280 -1333 744
5049 744 2583 -2085 -2858 2503 1940 -1894 27 847 -2242 249 3511 -882 -3347 1215 1733 -1258
5065 -1258 717 1244 -2795 -1101 3649 570 -2903 402 982 -1488 1198 2401 -2500 -2401 2807 1373
5081 1373 -1807 479 457 -2333 790 3455 -1467 -3100 1514 1242 -1313 1059 896 -3090 -540 3666
5097 3666 17 -2680 747 565 -1480 1640 2086 -2880 -1918 2922 928 -1821 718 111 -2523 1233
5113 1233 3245 -1919 -2702 1793 849 -1206 1556 593 -3187 -28 3610 -415 -2328 982 97 -1496
5129 -1496 2022 1695 -3271 -1389 2970 531 -1519 1075 -307 -2425 1802 2980 -2273 -2293 1920 495
5145 495 -985 1795 99 -3339 509 3423 -907 -2071 1150 -323 -1304 2422 1346 -3454 -938
5160 -938 2915 -2 -1271 1229 -720 -2349 2209 2626 -2497 -1750 1942 12 -682 2064 -311 -3317
5176 -3317 1003 3213 -1263 -1623 1202 -722 -1115 2746 857 -3533 -357 2834 -374 -892 1438 -1206
5192 -1206 -2173 2601 2223 -2786 -1271 1910 -403 -433 2218 -874 -3184 1494 2889 -1618 -1224 1262
5208 1262 -1102 -764 3009 381 -3558 96 2548 -719 -488 1420 -1667 -1826 2963 1722 -2886 -765
5224 -765 1726 -800 -155 2311 -1284 -3017 1944 2510 -1814 -758 1175 -1459 -465 3117 -165 -3510
5240 -3510 568 2339 -941 -112 1352 -1987 -1515 3198 1193 -2961 -298 1576 -1063 348 2270
5255 2270 -1828 -2718 2327 2019 -1961 -322 941 -1804 -69 3158 -640 -3350 978 1890 -1194 273
5271 273 1155 -2352 -1112 3388 738 -2942 147 1299 -1202 725 2218 -2237 -2452 2629 1596 -1921
5287 -1921 60 764 -1973 461 3116 -1115 -3070 1358 1614 -1205 652 948 -2686 -628 3581 226
5303 226 -2841 410 932 -1249 1201 1952 -2613 -2039 2731 1114 -1854 393 398 -2088 868 3051 -1550
5320 -1550 -2718 1671 1165 -1236 1073 689 -2822 -244 3457 -209 -2519 801 593 -1357 1574 1743
5336 1743 -2874 -1522 2898 655 -1754 737 101 -2168 1361 2867 -2020 -2361 1835 734 -1143
5351 -1143 1342 372 -3003 327 3410 -692 -2271 997 163 -1241 1931 1373 -3065 -1064 2950 218
5367 218 -1550 996 -256 -2136 1778 2585 -2321 -1923 1910 382 -997 1644 -65 -2998 759 3155
5383 3155 -1127 -1916 1157 -228 -1106 2259 979 -3216 -551 2874 -153 -1294 1135 -691 -1926
5398 -1926 2198 2168 -2645 -1528 2022 3 -770 1824 -568 -2981 1263 2974 -1486 -1544 1249 -581
5414 -581 -871 2563 506 -3320 -54 2696 -480 -972 1225 -1093 -1776 2552 1838 -2754 -1039 1827
5430 1827 -438 -402 1995 -860 -2891 1656 2651 -1616 -1195 1171 -897 -582 2716 76 -3307 336
5446 336 2502 -782 -584 1216 -1527 -1588 2822 1422 -2847 -659 1756 -731 -126 2069 -1350 -2727
5462 -2727 2067 2262 -1797 -777 1121 -1233 -233 2822 -349 -3275 706 2173 -1037 -166 1246
5477 1246 -1791 -1203 3030 983 -2884 -169 1542 -930 339 2049 -1755 -2433 2357 1849 -1923 -340
5493 -340 970 -1525 31 2889 -855 -3067 1081 1917 -1137 154 1103 -2167 -866 3176 501 -2806
5509 -2806 238 1287 -1099 691 1901 -2205 -2114 2595 1365 -2040 14 809 -1723 495 2823 -1224
5525 -1224 -2823 1426 1525 -1237 529 892 -2376 -493 3256 29 -2625 542 917 -1238 956 1673
5541 1673 -2458 -1750 2732 1038 -1941 293 481 -1835 868 2796 -1655 -2572 1687 1209 -1178 757
5557 757 606 -2575 -34 3282 -379 -2496 849 662 -1206 1438 1511 -2759 -1366 2839 612 -1715
5573 -1715 601 118 -1919 1294 2567 -1996 -2218 1809 736 -1197 1156 290 -2733 306 3150 -749
5589 -749 -2241 978 245 -1211 1709 1254 -2997 -966 2862 255 -1670 830 -219 -1882 1688 2305
5605 2305 -2269 -1847 1933 439 -1011 1416 -16 -2781 815 2997 -1095 -1926 1115 -67 -1046 2027
5621 2027 863 -3037 -562 2715 -173 -1386 1022 -513 -1823 2003 1993 -2451 -1381 1974 21
5636 21 -784 1603 -398 -2687 1186 2757 -1388 -1575 1209 -375 -850 2221 446 -3147 -69 2626
5652 2626 -456 -1058 1129 -894 -1675 2229 1686 -2627 -999 1896 -314 -556 1735 -789 -2619 1551
5668 1551 2483 -1649 -1198 1214 -738 -658 2413 91 -3138 338 2438 -691 -691 1162 -1231 -1428 2570
5685 2570 1324 -2747 -549 1801 -553 -276 1832 -1195 -2549 1895 2182 -1782 -861 1138 -1008 -292
5701 -292 2577 -319 -3094 786 2249 -944 -386 1122 -1599 -1133 2861 866 -2791 -243 1611 -764
5717 -764 133 1818 -1564 -2220 2155 1789 -1871 -420 991 -1311 0 2686 -736 -2910 1077 1887
5733 1887 -1027 -6 1027 -1920 -860 2948 476 -2755 139 1340 -991 416 1717 -1939 -1959
5748 -1959 2410 1439 -1922 -82 855 -1532 401 2622 -1143 -2741 1406 1567 -1199 300 823 -2163
5764 -2163 -499 3034 127 -2591 506 1156 -1095 797 1595 -2200 -1602 2610 920 -1925 291 604
5780 604 -1697 700 2554 -1510 -2440 1599 1211 -1270 639 631 -2326 -65 3029 -361 -2470 830
5796 830 825 -1164 1148 1419 -2450 -1218 2748 640 -1849 484 411 -1767 1094 2370 -1849 -2167 1797
5813 1797 902 -1167 919 364 -2452 313 2973 -790 -2214 964 583 -1099 1382 1076 -2703 -903
5829 -903 2734 230 -1605 724 -56 -1738 1502 2181 -2198 -1762 1878 452 -1014 1255 -11 -2536
5845 -2536 734 2847 -1078 -1960 1138 129 -1009 1751 826 -2897 -448 2659 -141 -1402 925
5860 925 -409 -1680 1851 1955 -2417 -1384 2001 105 -894 1432 -388 -2511 1199 2661 -1415 -1571
5876 -1571 1220 -227 -815 2080 461 -2935 -37 2593 -413 -1075 1045 -731 -1558 2099 1690 -2564
5892 -2564 -972 1889 -152 -595 1578 -684 -2437 1455 2368 -1616 -1251 1240 -553 -634 2188 90
5908 90 -2945 400 2358 -808 -810 1157 -1008 -1386 2330 1203 -2695 -574 1840 -487 -350 1627 -1019
5925 -1019 -2305 1780 2068 -1822 -876 1186 -845 -387 2337 -309 -2855 791 2164 -991 -467 1064
5941 1064 -1372 -1100 2581 810 -2676 -156 1621 -788 -39 1708 -1418 -2088 2154 1637 -1976 -407
5957 -407 1074 -1084 -30 2334 -746 -2760 1156 1900 -1078 -188 989 -1607 -726 2754 352 -2623
5973 -2623 167 1395 -884 282 1520 -1813 -1782 2349 1332 -1964 -195 888 -1349 307 2367
5988 2367 -1108 -2532 1396 1544 -1204 212 822 -1967 -377 2899 31 -2540 431 1177 -999 644
6004 644 1401 -2088 -1531 2483 960 -1867 140 622 -1462 696 2358 -1463 -2287 1635 1279 -1243
6020 -1243 527 627 -2106 -61 2837 -334 -2370 700 836 -1060 961 1271 -2311 -1190 2551 580
6036 580 -1825 461 401 -1646 1053 2253 -1753 -1944 1795 824 -1201 763 388 -2233 265 2739
6052 2739 -780 -2106 929 481 -1024 1260 1028 -2526 -763 2655 178 -1663 745 170 -1589 1352
6068 1352 2033 -2127 -1659 1922 489 -1171 1002 82 -2324 680 2605 -1081 -1890 1150 275 -998
6084 -998 1522 735 -2720 -326 2660 -212 -1505 883 -198 -1532 1674 1761 -2219 -1302 1941 209
6100 209 -931 1276 -145 -2306 1081 2428 -1342 -1541 1229 -56 -879 1800 359 -2757 -15 2483
6116 2483 -483 -1232 953 -484 -1320 1906 1376 -2459 -902 1903 -135 -755 1321 -614 -2204 1419
6132 1419 2229 -1618 -1235 1185 -347 -597 2000 52 -2736 372 2358 -737 -933 1018 -836 -1175
6148 -1175 2205 1116 -2520 -533 1820 -398 -355 1488 -930 -2149 1724 1884 -1720 -890 1207 -713
6164 -713 -356 2121 -302 -2648 659 2146 -908 -615 1008 -1187 -960 2364 620 -2580 -141 1670
6180 1670 -685 -93 1506 -1272 -1893 1933 1599 -1837 -496 1061 -984 -69 2184 -687 -2555 1037
6196 1037 1827 -1160 -187 970 -1412 -658 2549 322 -2541 217 1481 -875 180 1495 -1630 -1596
6212 -1596 2212 1226 -1878 -174 927 -1148 243 2171 -1090 -2383 1399 1520 -1217 6 784 -1699
6228 -1699 -372 2648 -154 -2479 458 1262 -963 449 1335 -1940 -1321 2423 858 -1908 174 657
6244 657 -1292 634 2118 -1500 -2058 1610 1168 -1210 410 560 -1941 -22 2675 -466 -2282 764
6260 764 942 -1033 814 1141 -2180 -965 2492 484 -1749 515 417 -1379 957 1952 -1776 -1845 1750
6277 1750 843 -1195 665 403 -2010 358 2640 -810 -2074 1012 635 -975 1132 883 -2305 -626
6293 -626 2517 75 -1665 672 141 -1375 1249 1806 -2014 -1535 1865 504 -1062 936 117 -2115
6309 -2115 676 2443 -1159 -1750 1170 332 -931 1426 641 -2467 -275 2477 -212 -1429 814 -140
6325 -140 -1402 1580 1465 -2241 -1139 1977 62 -907 1062 -229 -2045 1142 2255 -1393 -1459 1260
6341 1260 -27 -796 1622 277 -2494 162 2364 -554 -1163 909 -541 -1255 1817 1245 -2332 -771
6357 -771 1852 -166 -670 1237 -541 -1984 1401 1984 -1638 -1128 1253 -330 -571 1793 -73 -2514
6373 -2514 465 2256 -736 -962 1006 -752 -1011 2069 827 -2466 -446 1820 -427 -499 1252 -897
6389 -897 -1775 1709 1733 -1778 -808 1194 -608 -278 1893 -421 -2466 855 2030 -946 -552 928 -1057
6406 -1057 -813 2240 517 -2461 -128 1594 -644 -141 1232 -1227 -1640 1944 1378 -1872 -482 1022
6422 1022 -855 -50 1984 -768 -2313 1167 1644 -1128 -248 869 -1295 -525 2299 124 -2445 324
6438 324 1391 -791 153 1243 -1515 -1368 2214 1004 -1924 -91 930 -997 270 1933 -1109 -2112
6454 -2112 1403 1403 -1203 9 708 -1546 -173 2429 -245 -2252 606 1144 -852 432 1070 -1814
6470 -1814 -1027 2267 571 -1848 175 697 -1158 575 1820 -1445 -1900 1605 1012 -1253 306 532
6486 532 -1639 184 2421 -633 -2040 908 813 -937 763 929 -2032 -734 2376 296 -1717 438
6502 438 429 -1267 861 1728 -1746 -1568 1752 707 -1168 612 253 -1714 442 2319 -919 -1907 1035
6519 1035 557 -945 1010 673 -2125 -391 2390 -61 -1557 613 200 -1192 1192 1517 -1973 -1211
6535 -1211 1837 396 -1065 783 8 -1798 844 2129 -1262 -1614 1117 257 -839 1206 416 -2272
6551 -2272 19 2294 -398 -1339 766 -104 -1155 1500 1239 -2128 -948 1856 69 -899 957 -347
6567 -347 -1805 1161 1986 -1471 -1333 1189 -20 -719 1375 122 -2288 340 2169 -640 -1079 902
6583 902 -389 -1033 1689 919 -2192 -557 1819 -242 -660 1045 -530 -1683 1399 1717 -1665 -942
6599 -942 1151 -271 -370 1570 -173 -2232 656 1996 -857 -839 876 -747 -870 1920 607 -2294
6615 -2294 -218 1716 -453 -418 1151 -875 -1534 1682 1396 -1694 -628 1140 -538 -280 1713 -547
6631 -547 -2074 994 1716 -1052 -583 876 -908 -602 2055 294 -2253 127 1567 -623 -170 1082
$$ [...]
8191a33
##END NTUPLES=NMR FID
##END=
