##TITLE=1H_LY-Glu_al_m
 200.13MHz,CDCl3.
 8 sc
 
 11.12.2025
##JCAMPDX= 6.0         $$ Bruker NMR JCAMP-DX V2.0
##DATA TYPE= NMR FID
##DATA CLASS= NTUPLES
##ORIGIN= UXNMR, Bruker Analytische Messtechnik GmbH
##OWNER= pz
$$ XWIN-NMR		Version 3.5
$$ Thu Dec 11 13:52:03 2025 Russian Standard Time (UT+4h)  she@DPX200
##.OBSERVE FREQUENCY= 200.1313
##.OBSERVE NUCLEUS= ^1H
##.DELAY= (6, 6)
##.ACQUISITION MODE= SIMULTANEOUS
##.ACQUISITION SCHEME= undefined
##.AVERAGES= 8
##.DIGITISER RES= 18
##SPECTROMETER/DATA SYSTEM= spect
##.PULSE SEQUENCE= zg30
##.SOLVENT NAME= CDCl3
##.SHIFT REFERENCE= (INTERNAL, CDCl3, 0, 14.3821)
##AUDIT TRAIL= $$ (NUMBER, WHEN, WHO, WHERE, WHAT)
$$ ##TITLE= Audit trail, XWIN-NMR		Version 3.5
$$ ##JCAMPDX= 5.01
$$ ##ORIGIN= Bruker BioSpin GmbH
$$ ##OWNER= she
$$ F:/spectra/data/she/nmr/H-C/1/audita.txt
$$ ##AUDIT TRAIL=  $$ (NUMBER, WHEN, WHO, WHERE, WHAT)
(   1,<2025-12-11 13:49:21.64 +0400>,<she>,<DPX200>,
      <created by zg, POWCHK disabled, PULCHK disabled
       configuration hash MD5:
       00 E9 B6 7A A2 85 ED C7 34 08 36 98 17 FE 4E 26
       data hash MD5: 16K
       84 67 B7 21 46 52 8F B0 C1 54 9C CB 30 25 FC 08>)
$$ ##END=
$$ 
$$ hash MD5
$$ 99 BB 6F 23 D1 A0 4B 01 22 06 41 7F 0F 11 B3 5A
##$RELAX= 
##$RELAX= 
##$RELAX= 
##$RELAX= 
##$RELAX= 
##$RELAX= 
$$ Bruker specific parameters
$$ --------------------------
##$DU= <F:/spectra>
##$EXPNO= 1
##$NAME= <H-C>
##$PROCNO= 1
##$TYPE= <nmr>
##$USER= <she>
##$AMP= (0..31)
100 100 100 100 100 100 100 100 100 100 100 100 100 100 100 100 100 100 
100 100 100 100 100 100 100 100 100 100 100 100 100 100 
##$AQSEQ= 0
##$AQ_mod= 1
##$AUNM= <au_zg>
##$AUTOPOS= <>
##$BF1= 200.13
##$BF2= 200.13
##$BF3= 200.13
##$BF4= 200.13
##$BF5= 200.13
##$BF6= 200.13
##$BF7= 200.13
##$BF8= 200.13
##$BYTORDA= 1
##$CFDGTYP= 0
##$CFRGTYP= 5
##$CHEMSTR= <none>
##$CNST= (0..31)
1 1 145 1 1 1 1 1 1 1 1 1 1 1 1 1 1 1 1 1 1 1 1 1 1 1 1 1 1 1 1 1 
##$CPDPRG= <>
##$CPDPRG1= <>
##$CPDPRG2= <>
##$CPDPRG3= <>
##$CPDPRG4= <mlev>
##$CPDPRG5= <mlev>
##$CPDPRG6= <mlev>
##$CPDPRG7= <mlev>
##$CPDPRG8= <mlev>
##$CPDPRGB= <>
##$CPDPRGT= <>
##$D= (0..31)
0 0.7 0 0 0 0 0 0 0 0 0 0.03 0 0 0 0 0 0 0 0 0 0 0 0 0 0 0 0 0 0 0 0 
##$DATE= 1765446561
##$DBL= (0..7)
120 120 120 120 120 120 120 120 
##$DBP= (0..7)
150 150 150 150 150 150 150 150 
##$DBP07= 0
##$DBPNAM0= <>
##$DBPNAM1= <>
##$DBPNAM2= <>
##$DBPNAM3= <>
##$DBPNAM4= <>
##$DBPNAM5= <>
##$DBPNAM6= <>
##$DBPNAM7= <>
##$DBPOAL= (0..7)
0.5 0.5 0.5 0.5 0.5 0.5 0.5 0.5 
##$DBPOFFS= (0..7)
0 0 0 0 0 0 0 0 
##$DE= 6
##$DECBNUC= <off>
##$DECIM= 32
##$DECNUC= <off>
##$DECSTAT= 4
##$DIGMOD= 1
##$DIGTYP= 9
##$DL= (0..7)
0 120 120 120 120 120 120 120 
##$DP= (0..7)
150 150 150 150 150 150 150 150 
##$DP07= 0
##$DPNAME0= <>
##$DPNAME1= <>
##$DPNAME2= <>
##$DPNAME3= <>
##$DPNAME4= <>
##$DPNAME5= <>
##$DPNAME6= <>
##$DPNAME7= <>
##$DPOAL= (0..7)
0.5 0.5 0.5 0.5 0.5 0.5 0.5 0.5 
##$DPOFFS= (0..7)
0 0 0 0 0 0 0 0 
##$DQDMODE= 0
##$DR= 18
##$DS= 0
##$DSLIST= <SSSSSSSSSSSSSSS>
$$ [...]
##$SUBNAM0= <"">
##$SUBNAM1= <"">
##$SUBNAM2= <"">
##$SUBNAM3= <"">
##$SUBNAM4= <"">
##$SUBNAM5= <"">
##$SUBNAM6= <"">
##$SUBNAM7= <"">
##$SUBNAM8= <"">
##$SUBNAM9= <"">
##$SW= 18.0517328524113
##$SWIBOX= (0..15)
0 0 2 0 0 0 0 0 0 0 0 0 0 0 0 0 
##$SW_h= 3612.71676300578
##$TD= 16384
##$TD0= 1
##$TE= 0
##$TE2= 300
##$TE3= 300
##$TEG= 300
##$TL= (0..7)
0 120 120 120 120 120 120 120 
##$TP= (0..7)
150 150 150 150 150 150 150 150 
##$TP07= 0
##$TPNAME0= <>
##$TPNAME1= <>
##$TPNAME2= <>
##$TPNAME3= <>
##$TPNAME4= <>
##$TPNAME5= <>
##$TPNAME6= <>
##$TPNAME7= <>
##$TPOAL= (0..7)
0.5 0.5 0.5 0.5 0.5 0.5 0.5 0.5 
##$TPOFFS= (0..7)
0 0 0 0 0 0 0 0 
##$TUNHIN= 0
##$TUNHOUT= 0
##$TUNXOUT= 0
##$USERA1= <user>
##$USERA2= <user>
##$USERA3= <user>
##$USERA4= <user>
##$USERA5= <user>
##$V9= 5
##$VALIST= <valist>
##$VCLIST= <CCCCCCCCCCCCCCC>
##$VD= 0
##$VDLIST= <DDDDDDDDDDDDDDD>
##$VPLIST= <PPPPPPPPPPPPPPP>
##$VTLIST= <TTTTTTTTTTTTTTT>
##$WBST= 1024
##$WBSW= 4
##$XGAIN= (0..3)
0 0 0 0 
##$XL= 0
##$YL= 0
##$YMAX_a= 308404
##$YMIN_a= -294204
##$ZGOPTNS= <>
##$ZL1= 120
##$ZL2= 120
##$ZL3= 120
##$ZL4= 120
##$ABSF1= 10
##$ABSF2= 0
##$ABSG= 5
##$ABSL= 3
##$ALPHA= 0
##$AQORDER= 0
##$ASSFAC= 0
##$ASSFACI= 0
##$ASSFACX= 0
##$ASSWID= 0
##$AUNMP= <proc_1d>
##$AZFE= 0.1
##$AZFW= 0.1
##$BCFW= 1
##$BC_mod= 2
##$BYTORDP= 1
##$COROFFS= 0
##$CY= -3
##$DATMOD= 1
##$DC= 2
##$DFILT= <>
##$DTYPP= 0
##$F1P= 0
##$F2P= 0
##$FCOR= 0.5
##$FTSIZE= 0
##$FT_mod= 4
##$GAMMA= 1
##$GB= 0.15
##$INTBC= 1
##$INTSCL= 1
##$ISEN= 128
##$LB= 0.25
##$LEV0= 0
##$LPBIN= 0
##$MAXI= 10000
##$MC2= 0
##$MEAN= 0
##$ME_mod= 0
##$MI= 1.114404
##$NCOEF= 0
##$NC_proc= 0
##$NLEV= 6
##$NOISF1= 3.799351
##$NOISF2= 2.8
##$NSP= 1
##$NTH_PI= 0
##$NZP= 0
##$OFFSET= 14.38212
##$PC= 1
##$PHC0= -3346.701
##$PHC1= 12.59234
##$PH_mod= 1
##$PKNL= yes
##$PPARMOD= 0
##$PSCAL= 0
##$PSIGN= 0
##$REVERSE= no
##$SF= 200.129724274929
##$SI= 16384
##$SIGF1= 3
##$SIGF2= 2
##$SINO= 400
##$SIOLD= 16384
##$SREGLST= <1H.CDCl3>
##$SSB= 0
##$STSI= 0
##$STSR= 0
##$SW_p= 3205.1282051282
##$SYMM= 0
##$S_DEV= 0
##$TDeff= 0
##$TDoff= 0
##$TI= <>
##$TILT= no
##$TM1= 0
##$TM2= 0
##$TOPLEV= 0
##$USERP1= <user>
##$USERP2= <user>
##$USERP3= <user>
##$USERP4= <user>
##$USERP5= <user>
##$WDW= 1
##$XDIM= 8192
##$YMAX_p= 0
##$YMIN_p= 0
$$ End of Bruker specific parameters
$$ ---------------------------------
##NTUPLES= NMR FID
##VAR_NAME=  TIME,          FID/REAL,        FID/IMAG
##SYMBOL=    X,             R,               I
##VAR_TYPE=  INDEPENDENT,   DEPENDENT,       DEPENDENT
##VAR_FORM=  AFFN,          ASDF,            ASDF
##VAR_DIM=   8192,          8192,            8192
##UNITS=     SECONDS,       ARBITRARY UNITS, ARBITRARY UNITS
##FACTOR=    0.0002768,     1,               1
##FIRST=     0,             0,               0
##LAST=      2.2672688,     0,               0
##MIN=       0,             -294204,         0
##MAX=       2.2672688,     308404,          0
$$ Real data points
##PAGE= N=1
##DATA TABLE= (X++(R..R)), XYDATA
0@%%%%%%%%%%%%%%%%%%Qj6J6j6J6j6J8k3K9l2L7m4M7n3O1o9Q1q9R8j10J22j38
40g3J53j69J87k05K25k48K74l01L31l65M02m44M89n40N99o64P40q29R33j059J213
61F49j406J659k001K489l237M512p076J4096o7759k36130J03307J57471n5791
74h9217o343K34048J69916j16669k11766r9027k3482N048N3870P5700N3797O8835
86A14710P9967l3368k01322j85797K5270J49882N6467j5358Q6664J34410l6847
97A74678j88868j10541K3327J2118k7807N6255J61987J12066o0744j59103q7511
108i4143K0831J2411m3918L466J12196J29791L7371p4651j32046q8006K0443N4136
120d2119p131k98J00972J06153l0912j16092o5316p362j8931k2167M3518J15271
$$ plain form
0 0 0 0 0 0 0 0 0 0 0 0 0 0 0 0 0 0 0 0 8 -8 8 -8 8 -8 10 -13 16 -16 21 -23 24 -29 32 -37 44 -45 53 -57 65 -73
40 -73 80 -89 98 -107 118 -130 144 -157 174 -191 211 -233 256 -284 315 -349 391 -438 495 -564 649
61 649 -757 902 -1099 1390 -1847 2665 -4411 9685 -58074 -294204 -190897 -33426 -89217
74 -89217 -95560 138488 308404 191735 -20031 -119058 -142540 -137492 -83622 -7922 45875 114710
86 114710 194677 161309 -40013 -225810 -200540 -50658 5809 -9549 77115 211525 174678
97 174678 -14190 -124731 -101404 -89286 -117093 -60838 101149 213215 152471 -6632 -94143
108 -94143 -73312 -60901 -104819 -101353 10843 140634 178005 103354 -28692 -116698 -96255 -42119
120 -42119 -49250 -49548 51424 157577 126665 10573 -54743 -62105 -81036 -103203 -59685 55586
132E5586Q2932m2035r9346k0049L4339m3335r3663J3032J31037R9070j0069o5919
144D1580n3233j5418M693j7150l4009J6738Q5622P0002j3759o4075m3856j0543
156c3408j5271k4109K1522P8274M6305l5460l1255L2962P165q2969p1923M0625
168f7542R4725M0444k8386l7630o70K2560j1147n6152l3369L6224O2865L1857
180E3779r787k8197j8562n67j0050k5304M656M0330J5146j6241J4314L3656k3945
193B9228p0695k4348M4826M6096k868l2129p545L5129K8026l1508n5657r296L6985
206a3756L3683O353j2998j2947L945J1248j0647k2599j189J0847N01Q737K4938
219B6116K297l2956k5188J0647K4933Q789j9498k2690J5921M5775Q921m4078l2644
$$ plain form
132 55586 138518 96483 -2863 -22912 11427 -31908 -125571 -112539 18498 117568 107499 41580
144 41580 -11653 -27071 -22378 -39528 -73537 -56799 28823 98825 85066 20991 -22865 -33408
156 -33408 -48679 -72788 -51266 27008 73313 37853 6598 39560 46725 -36244 -108167 -67542
168 -67542 27183 67627 39241 1611 941 23501 12354 -43798 -77167 -40943 21922 53779
180 53779 43992 15795 -2767 -3334 -13384 -38688 -34032 6298 21444 5203 19517 53173 29228
193 29228 -41467 -65815 -20989 25107 22239 -9890 -17435 17694 45720 14212 -41445 -50741 -13756
206 -13756 19927 26280 13282 335 4280 15528 4881 -17718 -18907 -8060 -7559 1178 26116
219 26116 28413 -4543 -29731 -19084 5849 14638 -4860 -27550 -11629 34146 43067 -1011 -33655
232c3655J5018K7159P902j0403j7020k724K0655J4453j4076j8304l905J115P117
245f668J9186N805k0267j3974J1125J6023L702j1031k2805o159K9841K8974j6353
258A7399l3819k669K1311J3605m803j9254j5485J1453K5653M541j6155j2142k338
271a2703N804J6040O887j8298j5079J2530J9653M391q595j7881j4885J2654K7155
284A7673k327k7250q720J6549J5736L595j1371k1200m175K3696J7949r226j5786
297d857m012M931J3362Q629j5848k2903M354K2738R787n576j3059j3789L951K2870
311A0578O178k2161j5035J1124J6270Q514k403j7650j5564J3028K2917j071j7263
324b538q032L529J1923J3196p277k5297p614J9051J4829k806r327j0464j418J7164
$$ plain form
232 -33655 -18637 8522 16424 6021 -10999 -13723 6932 21385 7309 -10995 -14900 -13785 -6668
245 -6668 12518 18323 -1944 -15918 -4793 11230 14932 3901 -18904 -25063 4778 33752 17399
258 17399 -16420 -19089 2222 15827 11024 -8230 -23715 -12262 13391 17932 1777 -10365 -12703
271 -12703 -6899 9141 16028 -2270 -17349 -4819 14834 19225 10630 -7251 -22136 -9482 17673
284 17673 15346 -11904 -20624 -4075 11661 15256 3885 -17315 -21490 2206 20155 10929 -4857
297 -4857 -8869 -3938 9424 18053 2205 -20698 -16344 6394 16181 10605 -2454 -16243 -12292 10578
311 10578 16756 -5405 -20440 -9316 6954 15468 13065 -4585 -20149 -7121 15796 14725 -2538
324 -2538 -10570 -7041 4882 18078 10801 -14496 -22110 -3059 11770 8964 -363 -10827 -12245 4919
338D919J2849j3891j9289L190J4864R984L020j0566j8954J862K2116N641j7437
351a692j2371K765J0674J3255P84k0348j3582J3929J6910j084q241o414l338R537
365G84J6107m752j9945o769R969J0943O833m973j9403o958K0545J5521j3345j8983
379a4426k26J1565J3828M777j5063j6480P899J8486J94j0793l781q29K866J0360
393H377L748j2633j0181J497P136R387M201j5277j6855J3108K5182k898k3368
406h576q941J1456J6587P505j2922j9374M163K1073K838j5652p069M532L521L814
420B955K654n900n524J082O1L481J1306j326k1577m312K6686J4746j9733k2874
434a8275L590K1995J4134j2459k4942j431K4362J0760j6965j4127M543Q108M835
$$ plain form
338 4919 17768 3877 -15412 -12222 2642 12626 15646 5080 -13874 -12012 10104 15745 -1692
351 -1692 -14063 -11298 -624 12631 13415 -6933 -20515 -6586 10324 9240 999 -5415 -8753 784
365 784 16891 12139 -7806 -14575 -4606 6337 13170 8197 -11206 -18164 2381 17902 4557 -14426
379 -14426 -14652 -3087 10741 15518 455 -16025 -8126 10360 10554 -239 -4020 -4849 -1983 8377
393 8377 12125 -508 -10689 -9192 -2056 7331 11532 -3745 -20600 -7492 17690 14792 -8576
406 -8576 -17517 -6061 10526 18031 5109 -14265 -10102 10971 13809 -1843 -8912 -4380 -859 2955
420 2955 5609 -291 -5815 -4733 -4672 -1191 10115 8789 -12788 -17100 9586 24332 4599 -18275
434 -18275 -14685 7310 21444 8985 -15957 -17388 6974 17734 769 -13358 -8815 -707 4128
447D128J044o352m889O084K627o063M925J1208r832j9572Q650K6771J641k8246
461g876j7648J6999K9922o66l4119j6380K8327K6175j5755k4541L106J4774M829
474G147j102n658p087N299R609m678q735P715O638j3371j0807J4083J8597p565
488A0085k7405q150L0148K7512k3926m2472J0964M7839N828l8845j5732K2066
500b088J7608n490j2322o009L982R709Q67q050k046N666j032p544r65R981J0068
515A2335q723k3333K499L8106J2815m4355l0646L9135M3999k3038m6330L253L7303
528A3020J1439k3025k0049P694J7980Q14j1899j314P463p76m505J415J790K220
542B267N006p281j5650J1452L1500q033m5373n686M9483K2045m1762l7217K3654
$$ plain form
447 4128 5172 -1180 -6069 15 2642 -3421 1504 12712 2880 -16692 -8042 18729 20370 -7876
461 -7876 -25524 -8525 21397 20731 -13388 -29768 -1441 24734 8979 -15562 -12456 2318 7147
474 7147 6045 387 -6700 -1401 8208 3530 -5205 2510 9148 -4223 -15030 -947 17650 10085
488 10085 -17320 -25470 4678 32190 8264 -34208 -23244 24595 30423 -8422 -24154 -2088
500 -2088 15520 10030 -2292 -8301 -4319 5390 6257 -1793 -3839 1827 795 -6749 -7714 2267 12335
515 12335 3612 -19721 -17222 20884 33699 -10656 -41302 -2167 41832 18794 -27536 -24283 13020
528 13020 24459 1434 -18615 -10921 7059 7873 -4026 -5340 2123 1347 -3158 -1743 47 2267
542 2267 7273 -8 -15658 -4206 27294 19261 -26112 -31798 17685 39730 -2032 -39249 -15595
555a5595M3743k802m1250j3861L0369K0402j8361j5578J2334R064q851k589P588
568D613r40m212J497m537n158J4811J4095k1203k8227J5408L9784k34m4233j9353
582c7889L8325L9085k3063m8328O487M5891N837l5274q709K3400N907j4050j808
595d189P611r76n154j829r97N505R677m121j7790m015K0575J8616j3850l2571
609b3508p70M1596K0868l9790l6053K7969M1365j5068l5850K275K5562K688j5337
622d053l455Q107K832o881l994O320J0679m347j1761k234R949J0357M93j5494
636c482j6703J2958L2835l582m1255j1722L8227K1787k7130k6514J2286K4083
648A1788N59j6401o237J1440O549j0280n002J3162O442j4099r066J0676J0270
$$ plain form
555 -15595 28148 25346 -15904 -29765 604 21006 2645 -12933 -599 8465 -386 -2975 4613
568 4613 3673 -539 958 -3579 -8737 6074 20169 -1034 -29261 -13853 25931 25697 -18536 -37889
582 -37889 436 39521 16458 -31870 -25383 20508 26345 -8929 -17638 5762 11669 -2381 -4189
595 -4189 3422 2446 -2708 -4537 -5534 -29 9648 5527 -12263 -16278 4297 22913 9063 -23508
609 -23508 -24278 17318 38186 -1604 -37657 -9688 31677 16609 -19241 -16966 8596 11284 -4053
622 -4053 -7508 599 3431 -3450 -7444 -1124 9555 5208 -6553 -8787 1162 11519 12012 -3482
636 -3482 -20185 -7227 25608 22026 -19229 -30951 7276 29063 1933 -24581 -12295 11788
648 11788 12347 -4054 -10291 1149 7698 -2582 -7584 5578 12020 -2079 -11145 -469 9801
661I801k215q295j0005j493J8053J4381j8832k5168J0439K9616J534k4899j2501
674a9584J5599J9285l516j8506l199J5387L255j2837p75J2094k195j3199J358
687f833J1565K262o677p428l151R082J4363m808j9670l435J9273J1368j0066j5857
701a0012j919J5390J2846j0230j7426L704J5009k072j0749K569N963n203l641
714e771N833M800k223n522m695L756J2692K054j4509p694J1205J0911k915j0115
728b193p411L344J3170M344j3828r587R489R014n230m640K356j57r49L503K347
743C572j466j274l022j880P229O551q286j0249M677R963J17o486n381j625P292
758b68Q536n382j1656K402J0379J376m860j449j066O8N304K158m595k721R25r10
$$ plain form
661 9801 7586 -709 -10714 -12207 5846 20227 1395 -23773 -13334 16282 17816 -7083 -19584
674 -19584 -3985 15300 11784 -6722 -9921 5466 8721 -4116 -4891 7203 5008 -8191 -6833
687 -6833 4732 6994 317 -7111 -10262 -1180 13183 8375 -11295 -14730 4543 15911 5845 -10012
701 -10012 -11931 3459 16305 6075 -11351 -7647 7362 5290 -5459 -2890 3073 -2130 -5771
714 -5771 62 4862 2639 -2883 -7578 -3822 8870 10924 -3585 -11279 -74 10837 7922 -2193
728 -2193 -9604 -6260 6910 11254 -2574 -12161 -2672 6342 1112 -3528 -1172 -1329 -2278 1225 3572
743 3572 2106 832 -2190 -4070 3159 9710 1424 -8825 -4148 5815 5932 -554 -5935 -7560 -268
758 -268 8268 2886 -8770 -6368 4011 5387 527 -922 -1988 -1920 3384 5542 947 -1774 -849 -1759
774a759J806N038l050r351Q97R032K761m863l902k261K678Q721J339r999l976
789f889P691M838k419k164k604k583M320N475m055n676J117J910K05K811K52o500
805d271j521P131L543l539k506j288L28N583L646o394o511M378N808j288k333
820G66k199l520K347O940q89p650o32M237J380J062J193m897l388O224N386l340
836C020l992m68m31K820M498k976q109J082O403L25j319k355l294P22P512K477
852E915p164l781M560K872K83P12l048m676L578N808j838m851m01n85M68N402
868C254O90p517l123O083M574j597j835l724j023O479N048n412o845K713N257
883C022K98r23k412m351J819N391k91m822L09M31p84K606M404l976o809L971O084
$$ plain form
774 -1759 47 5085 2035 -7316 -6419 2613 5374 511 -3391 -5652 -2974 5747 7086 -2913 -6889
789 -6889 802 5640 3221 1057 -1547 -4130 190 5665 1610 -4066 -2949 -1039 -834 1977 2229 -4271
805 -4271 -5792 1339 4882 1343 -1163 -2451 -2123 3460 7106 712 -5799 -1421 4387 3099 766
820 766 -1433 -4953 -2606 4334 3445 -4205 -4837 -600 780 1842 3035 -1862 -5250 974 6360 3020
836 3020 -972 -1440 -1871 949 5447 2471 -5638 -4556 1847 2172 853 -1502 -4796 -4074 3438 5915
852 5915 -1249 -5030 -470 2402 2685 3397 349 -4327 -749 5059 3221 -1630 -2031 -2616 -2148 3254
868 3254 3944 -3573 -6696 -613 3961 2364 529 -3195 -4218 2261 7309 1897 -4948 -2235 3022
883 3022 3320 2397 -15 -4366 -2547 2844 2553 -2269 -1960 -1529 -2313 293 4697 721 -6088 -2117 3967
900C967P53k363l549l466L869Q524k155j0385j556P048L374k334l447l273J358
915c635O069P69n232j03K999j971m2N297L97p117j574N333L113p26l135n796j89
932e543R668L742r516p295N352P394N49l947n754N49P980L194p243l175O171R48
948C074n348J897N771l518o326J202M818J965j552o087l118O395Q180m407r599
963f653Q96O771M696j269p004m770P319R899n713j1155L729Q923l627o567L577
978i48M375l778m562J637N836K801n915p855M513J1531l80j0303l118N632M208
993C674K117k933q519r02J1752M493j2366p377J0076O548p042n734M795N623k807
1008A398o815J543R687J540j1643m761J2345P982j0106q409M788N595Nj068m282
$$ plain form
900 3967 4720 2357 -1192 -4658 -789 7735 5580 -4805 -6361 687 4061 1727 -1720 -4993 -3635
915 -3635 2434 3203 -2029 -2132 867 -1104 -1146 4151 4548 -2569 -4143 1190 4303 3577 442 -5354 -5543
932 -5543 4125 7867 -1649 -8944 -3592 3802 4351 404 -5350 -4801 3179 6373 -870 -4045 2126 3074
948 3074 -2274 -377 5394 1876 -4450 -3248 1570 3535 1983 -4104 -7222 -827 7353 2946 -6653
963 -6653 -5757 1014 5710 4441 -2563 -7333 -14 9885 4172 -6983 -3254 5669 2042 -4525 -948
978 -948 3427 -351 -4913 -3276 2560 5361 -554 -8409 -3896 7635 7255 -3048 -6166 -534 3674
993 3674 5791 2858 -5661 -6563 5189 9682 -2684 -10061 15 6563 -479 -6213 -1418 4205 1398
1008 1398 -5417 -3874 5813 7353 -4290 -9051 3294 11276 1170 -7239 -2451 3144 3149 2081 -2201
1023b201n171M662J0419l503j1641O4J0904L256p472o179O166Q099l373j0822
1037f792L565J3023l903j5312J867J6357O8j4982l145R743N090l610m515k398
1051d944J899O380J753n608m796L124O519J141n899o397P257Q207p399j0862Q445
1066a180J2189r304j3863Q388J4192n721j4059K181J1577K871o881o645L326P302
1080D373N06m917j928J385M90L054J263p078m505R601O131j1679p055J1823P741
1095I205j1626q041J0687R755p508j0835M002J2065P83j2113m929J0754O466q391
1109B74o306M959L093k539J304N34n477j06Q685M01j0011n24J0041J744q732l120
1125e780P827N722o571q544M932J1037k984j3799N06J3921Q50j2025k000Q228
$$ plain form
1023 -2201 -7372 -2710 7709 4206 -7435 -7371 3533 6789 -683 -6862 -696 7403 4030 -6792
1037 -6792 -3227 9796 5893 -9419 -7552 8805 8873 -6109 -9254 489 5579 1969 -2546 -4944
1051 -4944 -3045 3335 5088 -520 -5316 -2192 4327 5468 -431 -6828 429 8636 1237 -9625 -1180
1066 -1180 11009 1705 -12158 -3770 10422 4701 -9358 -7177 4400 7271 390 -6255 -2929 4373
1080 4373 4879 -38 -1966 -581 -91 2963 4226 -2852 -7357 2244 8375 -3304 -10359 1464 9205
1095 9205 -2421 -10462 225 9980 2472 -8363 -4361 7704 8487 -3626 -8555 2199 8665 274
1109 274 -6032 -1073 2020 -519 785 1319 -4158 -4264 4421 4822 -5189 -5713 4328 6072 -2660 -5780
1125 -5780 2047 7769 1198 -7346 -2414 8623 5639 -8160 -7654 6267 7117 -4908 -6908 1320
1139A320J607l306l14m18r52L108K717l127l866K743M378j056m341j910M586M250
1155E419n554o927N758Q919o866r887O032J0392m521r003K606P081P14l918k512
1170b267O98L897J487l405k575J578J495j89J84k272k458M048L428n332l749O688
1186A256L818p163l215P444L666n549m254L500M297k16m341l406L374M940k715
1201A436m992J805K776q61o66N78j784q51L869J121l985k07M597r76l810J536
1217d14K995r93k516q27J165K629J16n178j242N912J669m777k656M006J054r84
1233d1M16k90j200J908K506k619k123K192R10k238J88J346j326r01N08n42Q57
1250d49K109j542l885K436N140j629m404J100K355J79Rm14k365M84L002p60l081
$$ plain form
1139 1320 2927 -379 -693 -1111 -2063 1045 3762 635 -3231 -488 3890 2834 -1507 -3417 1169 5419
1155 5419 -135 -7062 -1304 7615 749 -9138 -3106 7286 2765 -6238 -3632 3449 4163 245 -2267
1170 -2267 -1569 2328 3815 410 -2165 -587 908 719 903 -1369 -3827 221 3649 -1683 -5432 1256
1186 1256 5074 -2089 -5304 2140 5806 257 -3997 -497 3800 3584 -757 -4163 -789 4151 1436
1201 1436 -3556 -1751 1025 164 -502 76 -1708 -2559 1310 2431 -1554 -1761 2836 1860 -1950 -414
1217 -414 2581 1588 -928 -1755 -590 2039 2155 -3023 -4265 1647 3316 -1461 -4117 -111 943 -41
1233 -41 375 85 -1115 793 3299 680 -1443 749 1659 -579 -391 955 -371 -1272 -764 -1306 -449
1250 -449 1660 118 -3767 -1331 3809 2180 -2224 -1124 1231 1410 1419 1005 -1360 -876 2126 1366 -1715
1267a715R08J208j726L53K030j171j904J413R09j234J750J040l063r64M204J366
1283C404l791p77J578K77J75P06k730j813L219J562k931o73K100r30m67J924K63
1300A096k402Q88J539q65J40J745j690k728K424K591k491k157J543j96j67J958
1316A228j009l104J327L337j016j725J078K00j104J816J313k565r77K163m16j024
1332d78J471J86l154M03K855n77k265M18M89n17J810J086k791r29L165Q41k157
1349a44M71P47j575L73K175j510k145J349P07j695P68J589j898j520K486Q31j430
1366d21J61R11r00O57K096j639k627J892J759j495j010O48m75r60K197k97k446
1383a949O86J908j417k48J979m96k140J521J950j332n80R85j006p31K587L95l503
$$ plain form
1267 -1715 -807 401 -1325 -972 1058 -113 -2017 -604 305 -929 821 1861 -1202 -2166 2038 3404
1283 3404 -387 -1164 414 691 866 1572 -1158 -2971 248 1810 -1121 -1794 306 -624 -1091 833 1096
1300 1096 -1306 -418 1121 256 396 2141 451 -2277 147 2738 247 -1910 -367 -563 -730 1228
1316 1228 219 -2885 -1558 1779 763 -962 116 316 -788 1028 2341 -224 -1201 962 546 -478
1332 -478 993 1179 -1975 -1572 1283 706 -1559 -1141 -652 -1169 641 1727 -1064 -1993 1172 2013 -144
1349 -144 327 1074 -501 -128 2047 537 -1608 -259 448 -1247 -479 1110 -788 -2308 178 1009 -421
1366 -421 -260 651 -249 408 2504 865 -1762 130 1889 394 -616 32 -443 -1403 794 497 -1949
1383 -1949 -1263 645 -772 -1020 959 463 -1677 -156 1794 462 -118 867 -139 -870 1717 2112 -1391
1400a391o4K536p56j107N27k40j378J626J374j781o77J814M86k257K139O96j754
1417b07k16Q89R4j002J490k86k851J339K520j807k408J677J109j023L11N89p81
1434e63N64J407j046j176K032M32k280M73J881j281j690J618O9j818P73J738k330
1451a197q53K524M95k137K95J334k07M49K89j421J8K418r97k273J551J697k702
1468g17j116K453N21k529OJ940r90n11J429k66j388Q43J407m34m95M0n81R97J272
1487A881j787j832K614P88l284n98L608m45l546Q14L245j107j764J242Q73p30
1503b8L36K70j93R6J25q64O76J251k589r95L019P79m038k20M147j075l706J984
1521a025L501k184k550K217J750o01j485J1J273P36j239j592J483J091k593j009
$$ plain form
1400 -1391 -1455 1081 325 -782 -255 -495 -1873 -247 1127 -654 -1331 483 969 -1288 851 1547 -207
1417 -207 -423 466 560 -442 1048 762 -2089 -750 1770 -37 -2445 -768 341 -682 -371 218 -563
1434 -563 1 1408 362 -814 1218 1650 -630 -157 1724 443 -1247 371 440 -1378 -605 1133 -1197
1451 -1197 -2050 474 969 -1168 -873 461 254 703 992 -429 -411 2007 1010 -1263 288 1985 -717
1468 -717 -1833 620 1141 -1388 -1382 558 -432 -943 486 220 -1168 -325 1082 648 153 193 -388 609 1881
1487 1881 94 -1738 876 1664 -1620 -2218 1390 945 -2601 -1787 1458 351 -1413 -171 702 -28
1503 -28 308 578 385 481 606 -258 418 1669 -920 -1915 1104 1883 -2155 -2375 1772 697 -3009 -1025
1521 -1025 2476 292 -2258 -41 1709 1108 -377 -366 907 1643 404 -1188 295 1386 -1207 -2216
1537b216L827k27m056K80M638j317m127K357K700j590k018K414J274j541j203
1552h05P03J667K60k649j008K968J510m255m81L549l08m081J043M912j907m380
1568c262K623L698j829l053J710K023q47j666J74J320P2j992p64L116L56m041
1584b362k47M703k28m772J393M301j841l740K749L303l105k795K637K805j612
1599A189k454j41K242J145k940j370K990J068l750m29M386l77m466J290M871k011
1615A243l468K509J527k423l63J878J206k290j559O70K686j02l525m30L746Q28
1631B133m088n59M190J78m005J368L585k042k891K219K467k141j880J173Q55o18
1647e6m84J11N62j34j526K12L062l62m129O14N104r63m492J156M120j792k500
$$ plain form
1537 -2216 1611 1384 -2672 -2392 2246 929 -3198 -841 1859 269 -1749 665 1939 398 -805
1552 -805 -102 1565 1825 -824 -1832 1136 2646 -1609 -2090 1459 1151 -2930 -1887 3025 1118 -3262
1568 -3262 -639 3059 1230 -1823 -113 1910 1063 -603 -429 891 963 -1029 -1793 1323 1679 -2362
1584 -2362 -2609 2094 1866 -2906 -1513 2788 947 -2793 -44 3259 154 -2641 -4 2801 1189
1599 1189 -1265 -1406 836 1981 -959 -2329 661 1729 -2021 -2450 1936 1559 -2907 -1617 3254 1243
1615 1243 -2225 284 1811 -612 -975 903 2109 -181 -1740 -1070 1616 1514 -2011 -2441 1305 2133
1631 2133 -1955 -2514 1676 1854 -2151 -783 2802 760 -2131 88 2555 414 -1466 -293 562 -56
1647 -56 -540 -429 133 -1 -1527 -1315 1747 1385 -2744 -2130 2974 2011 -2481 -1325 2795 1003 -1497
1664a497J471K141j440j496L75J037k92n97q10K56J416j218n47J430M48k429J384
1681c68L037j820l521K798K859k473k231J774J233j630o33P73L54j03o39p10J172
1698a28J277j742j124K278J006j897l92J927n93j705J923J086k614p90K505L02
1714A319k135k53O43K66J71n47o09P73J033j663l15K214P26k407o0K251k24j575
1732c92J61O96q77K20J016p56j377Q57O96l52j35Qn00N56J109r24r93K121k24
1751I10j779P70J942j209j963J409J193j505n32R01r38n1J277m88r65P72Q46j138
1769e48L72R33p69n54J424J68j688M62J485j222j057J674j56j569K99J186p75
1786c35n31O44j69n42J396N47j416R7J296m62q18J441l90j415N55J079r90r18
$$ plain form
1664 -1497 -26 2115 675 -821 -446 591 299 -298 -1108 -852 564 -654 -1201 229 677 -1752 -368
1681 -368 2669 849 -2672 126 2985 512 -1719 55 1288 -342 -975 -202 152 49 -590 -1300 -128
1698 -128 1149 -593 -1717 561 1567 -330 -722 1205 612 -1093 830 1916 -698 -1488 1017 1319
1714 1319 -816 -1069 -426 -160 11 -536 -1145 -372 661 -1002 -1317 897 1623 -784 -844 1407 1183 -392
1732 -392 -231 465 -412 -192 824 68 -1309 -452 244 -108 -243 -235 -735 -179 930 6 -987 1134 910
1751 910 -869 -99 1843 634 -1329 80 1273 -232 -764 137 -801 -852 425 -63 -1028 -256 590 -548
1769 -548 -176 757 -12 -566 858 1026 -662 -200 1285 63 -994 680 524 -1045 -746 440 -335
1786 -335 -866 -222 -391 -933 463 1010 -406 -309 987 525 -293 1148 758 -657 -102 977 -13 -931
1804i31J259k79j241R32R81j703j08J637k83q72J050J55j271P91J241j015n46
1821b03R00J7j181M89P30j258m79J202k49r13Q36L52j394M42J545p42p54J385
1839G25J82j076K20R08p65p65J177j03j255O03P99j341j67J196l85q07P50K68
1857A64p15M04R82p65q47J281M07j181M13Q56j022m01J116m90j159R90K65j306
1875a008J35J197l85j204J451N34j037L27Q27p53n68J482j07j534O09P20q61r0
1893b65L48n07q73J270N35j162R9R47l43n87J202q6j094O52P96o58j94O78n74
1912A84p03P78O26j037r04J081k97m36J343l06j727N32J791l62j117M75P11n15
1930A17K80L93j096J96R91j006n32J080J92k054L97J907o37j086O10J11o52J049
$$ plain form
1804 -931 328 49 -1192 -260 721 -982 -1090 547 264 -608 442 597 -674 117 1358 343 -203
1821 -203 697 714 -467 22 752 -506 -985 217 -32 -945 -109 243 -1151 -709 836 94 -660 725
1839 725 907 -169 51 959 194 -571 606 503 -752 -149 650 -691 -858 338 -47 -854 -104 164
1857 164 -551 -147 835 70 -777 504 911 -270 143 999 -23 -424 692 202 -957 33 298 -1008
1875 -1008 -873 324 -61 -1265 186 720 -317 10 837 84 -484 998 891 -643 -34 686 -175 -265
1893 -265 83 -424 -1297 -27 508 -654 -555 392 49 -538 664 578 -516 136 932 274 80 758 184
1912 184 -519 259 885 -152 -1056 25 -272 -708 635 329 -1398 -866 925 563 -554 -79 632 117
1930 117 397 790 -306 -110 881 -125 -657 423 615 -1439 -1042 865 228 -858 -248 -137 -789 260
1948B60R25j535p90J692Q62j325l10K4J78N46k3r73k58J525p16j395R16J700j789
1967d86j185J620J149q27m43J93L2N65R56j150j678Q77J579o16q40m19j3O70R98
1986I82j306j524J792J412j999p69K279O85k375j55J882L91j000p44k15N93J547
2003A476m80k368R5J547L72o78l74r46M51J832K60k463J01K596j69j982J15K268
2021A653k10k678L77J991J24q44k737N7L165N12k605m38J755P01n21r1o92o16
2039a097J282J945j771k144J649K197j662j926J029J730o47j830m2J832R49j923
2055d29k412K286L341k002l166J165K863m10j303k75k52J78J747J79k425o09J950
2072D26P27j444j087Q62J072k30j599J55K456O55l472j277M320J919l788k227
$$ plain form
1948 260 1185 -350 -1140 552 1414 89 -221 -197 -19 527 504 -469 -727 798 82 -1313 -397 1303 -486
1967 -486 -1671 -51 1098 271 -172 21 53 618 1574 424 -1254 -377 1202 586 -254 -673 -686 -16 982
1986 982 -324 -1848 -56 1356 -643 -1412 867 1552 -823 -978 904 1295 295 -449 -664 -71 1476
2003 1476 996 -1372 -1277 270 642 -36 -410 -1356 -905 927 1187 -1276 -1175 1421 1252 -730 -615 1653
2021 1653 1443 -1235 -858 1133 1257 413 -2324 -2267 898 1410 -1195 -1633 122 823 302 211 -481 -1097
2039 -1097 185 2130 359 -1785 -136 2061 399 -1527 -498 1232 585 -1245 -1287 545 1494 -429
2055 -429 -2841 -555 2786 784 -2382 -1217 1646 1236 -67 -342 -594 -416 1331 1510 -915 -1524 426
2072 426 1153 -291 -1378 -516 556 326 -1273 -1118 1338 1993 -1479 -2756 1564 3483 -305 -2532
2088b532K707J837j212j509l01M90J145K91j612q38J335P30k79o49l59O80J074
2105I98k53k181P57L044o90l697N71M144p43l778n95L104J276j718k070n4K618
2122G33R55k126j098R29J240l52j00l6m64L54J476j211j743J525K015k377k415
2139b695K569J890j690k373P76K653R81k329k331K079K688n72l144M86K126J87
2155A301j853N76m04J9Q01L59j549n75J606Q10k316J7J543P81j274j712J135J771
2173A036R28l187r91L417J764k896k036R22L003j849p75j78K27P24N75q39j191
2190a346J055R40n46o29N83L87Q9l91q37O82J858r70k688P00L008l29l317n0K364
2209E63L68j181n17k39Q41J127p98r47O57J105n81l75M64j09k74L94k72q31N83
$$ plain form
2088 -2532 175 2012 800 -709 -1010 -520 625 916 -696 -1534 -199 531 252 -397 -756 -76 998
2105 998 745 -1436 -679 2365 1675 -2022 -1451 2693 1950 -1828 -2423 681 1957 239 -1831 -1885 733
2122 733 1688 -438 -1536 -607 633 281 181 145 -319 35 1511 300 -1443 82 2097 -280 -2695
2139 -2695 -126 1764 74 -2299 -1523 1130 2111 -218 -2549 -470 2218 1646 -1498 -1012 1114 1301
2155 1301 -552 24 -380 -361 440 799 -750 -1325 281 1091 -1225 -1208 335 1116 -158 -1870 -735 1036
2173 1036 1964 -1223 -2214 1203 2967 71 -1965 -1043 1960 111 -664 -842 -615 109 684 -155 -1346
2190 -1346 -291 649 103 -526 57 444 533 142 -695 -13 1845 875 -1813 -1113 1895 1566 -1751 -1801 563
2209 563 931 -250 -767 -1006 -165 962 164 -783 -126 979 398 23 487 378 104 498 226 -605 -22
2228b2Q98j418j371J798J405j588j661J451J480p6q19r64L76J705J95j664p37
2245a012J495L46q54J05o2m40K32M12n50j99Q14O5j503O83J462m89j396K21J142
2264D72M55l19r35m89J037J536j361j655N94J252l27l09n1l91k70R39L82r42J29
2283b53L93j81j83J000R7j334OR10N9J72n22j304M01J578J46k084k15J284M50
2302D20n22K81n01m24R03R84r76k20J41l69L49O16J5r34m90J195l28J20n38m84
2322g62j010J594J145j120j153N78R25l29O11n22q63P47J083k16p27j48K01k90
2340b56L78Q40j474n02Q74L95k7n7l67p03O41J426l40j317n6J050m4J56m4j300
2360g27j05J290L67j124k92k3N7K67Q36l33j183M43Q35J11n7k4p11j24J371M90
$$ plain form
2228 -22 876 -542 -1913 -115 1290 -298 -1959 -508 972 896 77 -887 -511 1194 1389 -275 -1012
2245 -1012 483 829 -25 80 18 -422 -190 222 -328 -527 287 352 -1151 -468 994 505 -891 -670 472
2264 472 927 608 -327 -816 221 1757 396 -1259 -665 587 260 -49 -100 -491 -761 178 560 -382 -253
2283 -253 140 -41 -224 776 873 -461 -455 455 514 686 164 -1140 -739 839 985 -1099 -1314 -30 420
2302 420 -102 179 -322 -746 157 1141 165 -55 86 -283 66 682 697 -237 -727 468 140 260 -278 -762
2322 -762 -1772 -178 967 -153 -1306 -728 197 -132 479 -43 -906 -159 924 708 -19 -167 34 -256
2340 -256 122 962 -512 -1014 -140 255 228 171 -196 -899 -258 1168 828 -489 -545 505 461 617 573 -727
2360 -727 -832 458 825 -299 -591 -614 -557 -290 546 213 -970 -527 308 419 362 338 -373 -497 874 1364
2380A364j453o73O62J98L63J54r78p12P17J268p92q58J48J66M10P30k27j249L3
2399g29J182L87l67o2p83p42J341P68q50r26l17M18P74N58m59k015J307J591o56
2418D20o54n76N25L43M56Q72j311j080J085L04k19J26l15o16q0J107J38p74k96
2437e45R7M67P56J34j662l55J743R97j319j048M43K13L40L34j072l94O76O97l97
2456A05j94K16p49k13J193L89p81m41N20k25N68Q03r01j621R23J816l43j646n71
2475a152O34J081J75j139p48O73J146m07r04O86J55o30M17P56l30l83k63J05J9
2494a09O76K12j551p13J822R65j081j319l1J150J276q62j740K51K110mj351p9
2512c78P33N0p41N98J71m97k24J94j61K13N58p03r16N06J405k34j025n20M02J492
$$ plain form
2380 1364 -89 -762 -100 98 461 615 -363 -1075 -358 910 118 -740 -592 -426 -16 714 487 -762 -729
2399 -729 453 840 473 411 -372 -1114 227 995 145 -781 -1098 -680 94 652 193 -1822 -515 1076 420
2418 420 -234 -810 -285 58 514 1386 75 -1005 80 384 165 291 -24 -640 -720 387 525 -249 -545
2437 -545 -448 19 775 909 -753 -1108 635 1632 313 -735 -292 -79 261 595 -477 -871 -195 502 105
2456 105 -89 127 -622 -835 358 747 -34 -475 45 -180 388 1191 290 -1331 -408 1408 1065 -581 -1152
2475 -1152 -518 563 738 -401 -1149 -476 670 263 -641 45 200 -430 -13 743 413 30 -233 -128 -109
2494 -109 567 779 -772 -1485 337 1302 221 -1098 -1129 21 1297 435 -1305 -1054 1056 1052 -299 -378
2512 -378 355 405 -336 262 433 -64 -288 -94 -255 -42 516 -187 -1103 -597 808 574 -451 -971 -569 923
2532I23Q79k182j370J855J611j133j879Q68J096n77j08l03L12J28l05k02J16Q65
2550E94j90j366N83J110J40n78n92o75J260J386p46k627N6K731L25j904j042J084
2568d51J192l92j014j60J232M28j131l82Q59Q40j415n4P41O27p66n11m1k81J505
2587H26M50k134j085J651K079j147k098P0J704J004p37j625K43J883p8j410J12
2604b92J246n70r75J70J093k66p16m83p2J129P63q04j740N67K178L61j776j162
2622a349O29J697Q87k146j359J346J954j210j649P77R22m64q55O23P62n48o06
2639e89l20J003J067n07j621k17J686R87p34j546k41Q12J681n88k169m13K393
2656F84P33j813q80J105O08o43K0M06J90j35j061L83J274L64j787p36J315J173
$$ plain form
2532 923 1802 -380 -1750 105 1716 583 -1296 -428 668 91 -17 -320 -8 120 -185 -387 -271 594
2550 594 404 -962 -379 731 871 293 -299 -974 286 1672 926 -1701 -1645 1086 1411 -493 -1535 -451
2568 -451 741 349 -665 -825 407 835 -296 -678 181 1021 -394 -448 293 920 154 -357 -398 -679 826
2587 826 1276 -858 -1943 -292 1787 640 -1458 -1388 316 1320 583 -1042 -799 1084 1006 -404 -292
2604 -292 954 384 -591 -421 672 406 -310 -793 -865 264 1027 223 -1517 -950 1228 1589 -187 -1349
2622 -1349 -720 977 1864 -282 -1641 -295 1659 449 -1200 -423 499 35 -820 -197 565 17 -589
2639 -589 -909 94 1161 654 -967 -1184 502 1489 755 -791 -1032 -220 1461 873 -1296 -1709 684
2656 684 1417 -396 -1276 -171 437 -206 -186 220 410 275 -786 -403 871 1235 -552 -1288 27 1200
2674A200m12j300n65K18J154J182j570j977J310K161l20j650l53J207M15l52m11
2691f3k3N15q1q72N37J127q00j692N16J469J9q56o46j28R01J139k29j985k17J879
2711E10Q92j188r54L11R70P0l64r41L30R73o97n68J069J80j376m12J406P17n58
2730C70r47k99O48J389J50j566j162J376J025j63o99r73K68R24K84r04m04N00
2748a83M03o95L93O32l96j060N47J198J59r64q56J44J136P89j054j233L86J114
2766D60M89r31m33n54Q46R32l40j037k0R40j4k39L19m4q28J6J154J40p21m19o52
2787i36R22J042o87j365J6J162N12m52n92k72K32Q41O97j153n41N72O06m68M10
2806E46m32n91m4P76J84j24r07m6kJ228K14j068q66R92Q68k41m37l96j67O69J044
$$ plain form
2674 1200 788 -512 -1077 -859 295 1477 -93 -2070 -760 1401 1081 -569 -922 285 700 348 -63
2691 -63 -86 429 348 -524 13 1140 340 -1352 -836 633 652 -204 -850 -978 -77 1062 833 -1152 -1369 510
2711 510 1402 214 -740 -429 541 611 247 -694 -364 609 -88 -656 413 593 -783 -1195 211 928 370
2730 370 -577 -876 -228 1161 1311 -255 -1417 -41 984 821 122 -851 -583 341 625 -279 -683 -183
2748 -183 220 -475 -82 550 154 -906 -359 839 998 34 -822 -678 458 1247 193 -1040 -654 460
2766 460 949 18 -415 -969 -123 809 469 -568 -588 352 338 99 418 374 -454 -438 716 856 135 -284 -936
2787 -936 -14 1028 341 -1024 -1008 154 666 214 -378 -650 -418 423 1120 -33 -574 -2 604 136 546
2806 546 114 -477 -521 255 439 315 -592 -638 -640 588 802 -266 -1132 -140 728 487 50 -346 -513 156 1200
2827A200q98p60m2P59o8O0j41n86k35R09K08l40m09j5R5K80Q33p37q25K94J047
2848F29O9l31n12m81M37P97L1r68n76J037j8r0K71o62k87Q06O10l82n42J41m8
2869f9K8P19l55q67J99N37N00l90m66m20j74J046L61r90k88L17P85j51N8l52m52
2890d24L21P92m12k96kr0Q6M54K38q09o24M74O74k57j15m65k20M31Q84j40j174
2911f74J81P52K79k1n70l14J37O86J67p65l44M08M6m1Q7j7o63J09P31K44k48l48
2933a78m33M91O67L9q00l19N62M38k8k70o57l17J021M53p52o54M07N04M9J62k87
2954I8n88L17N10k73J44Q2o75j84Q55O76j132o50L43Q20Q8l60m93m24M15R77k49
2975B97r49J99J98P22J37l55o37J57P49k78n85M13N6m81o5P01K12j099m04R55
$$ plain form
2827 1200 302 -458 -500 259 191 251 110 -476 -711 198 406 66 -343 -358 -263 17 850 113 -712 -418 629
2848 629 698 367 -145 -626 -189 608 639 -329 -905 132 114 24 295 -367 -654 152 762 380 -162 -21 -69
2869 -69 -41 678 323 -544 -345 192 692 302 -164 -584 -758 288 649 -341 -629 -312 473 322 380 28 -424
2890 -424 -103 689 277 -19 -21 -111 -25 429 667 -142 -766 -292 382 125 10 -455 -675 -244 640 500 -674
2911 -674 -493 259 538 517 -53 -367 -230 456 623 -142 -486 -78 -32 -73 14 -3 -666 -557 174 418 170 -178
2933 -178 -611 -120 547 586 -214 -533 29 467 439 169 -488 -805 216 669 -83 -737 -330 174 223 385 98
2954 98 -490 -173 337 64 208 290 -385 -569 286 962 -170 -820 -477 343 431 71 -422 -846 -431 546 297
2975 297 -652 -453 -255 467 604 249 -388 -231 518 240 -345 68 124 -357 -422 279 491 -608 -1012 -57
2995e7P45k57o85l39Q5J394Mj029m02K55P59J35k59q74K2P08N36q60j74M17k28
3016a04l52O91L66p03o65K93P57N36k80j144k65J306P43j021q35L34M97J70j55
3035A69l19p57M52Q12J54r42j9L48L22l91K59L02l97j99K56M71K41p73j359Q81
3055d89J486q7j739K7J010L87l61l73o42L77R04J97q17l33L68J99L83k52k12k07
3075a74J0j07L34M58j42j073m10J366Q87j317r66M89R90N84q29q08r3J071N55
3094H25n28o23K88L5N9L11k03m33j58L88k21J33M97m38r02O84J116j13j240m09
3114i32J035O80K04j401n32Q08R76k90j110P3L52O9K1J55m38l8K73M39l78K31
3134A97R4o02j28R38M55p78j111L73J045P36r70j362J99J458K14j097k97L55J49
$$ plain form
2995 -57 688 431 -254 -593 -508 886 890 -139 -541 -286 473 608 349 -525 -503 205 741 -119 -293 124 -104
3016 -104 -456 235 601 -102 -767 -474 283 819 539 -605 -870 436 1179 158 -677 -343 154 324 169
3035 169 -150 -907 -455 357 511 -431 -450 -102 220 -171 88 390 -7 -206 50 521 762 -11 -1370 -489
3055 -489 997 910 -829 -802 208 595 234 -139 -781 -404 500 697 -120 -453 -85 114 497 245 33 -174
3075 -174 -164 -271 63 521 379 -694 -1104 262 1149 -168 -1134 -645 345 929 100 -708 -801 270 825
3094 825 297 -326 -38 -3 56 367 164 -269 -427 -39 -260 -127 370 -68 -970 -286 830 717 -523 -932
3114 -932 103 783 987 -414 -946 -138 838 548 -562 -489 -137 -68 -47 108 -330 -368 -95 344 -34 197
3134 197 291 -311 -439 499 954 176 -935 -562 483 1219 249 -1113 -914 544 758 -339 -636 -281 -132
3153a32K61J86k64n14M92L43m35R3K82m10k64M56M37j19r86P2J93P57M34j454
3173e72p07J078J396r21q28K16O50J74k89j2l71J95K54p2r5Q4j68m17K29N02J5
3194C41m70k98j8P27M11k77j271J49J424N0o94p67N58N77j14l82k55rL92j64l1
3215a21J78k60j42J86L49l7k51j19k03L75O35j19n89q84J070J144o10j111K1O44
3235A56M35l50n70j93L54L76j25k55K20r5k68N17K63n85P3kJ72J19J47k82p62
3256f55L21P67R8p59k80K14N18L5m60m20K44Q57l40m32K14J76k07K68J36l21j79
3277b05K9L37N0J00o6o49j43R36Lm22k67l14P89L64j9q81j59R17J76n04l22L88
3299A38l60J35K97L4n96n4M19k96M64j13m67j60P37L06l44n19J90J92K42M26o70
$$ plain form
3153 -132 129 315 51 -463 29 372 -63 30 312 -98 -362 94 531 412 -574 -502 -309 448 882 -572
3173 -572 -1279 -201 1195 274 -554 -338 312 486 197 185 -186 9 263 191 96 180 12 -405 -176 326 341
3194 341 -129 -427 -445 282 693 416 -855 -706 718 768 74 -693 -135 442 328 -54 -309 -318 74 -90 -121
3215 -121 57 -203 -345 -159 190 153 -98 -217 -420 -45 590 471 -118 -1002 68 1212 602 -509 -488 156
3235 156 591 241 -329 -522 -168 208 83 -172 48 -47 -315 202 465 -120 -47 -49 123 242 389 107 -655
3256 -655 -334 433 531 -228 -508 -294 224 259 -201 -621 -377 480 140 -292 -78 98 -109 159 295 -26 -205
3277 -205 -176 161 211 311 245 -404 -547 389 392 -30 -297 -611 178 542 523 -358 -517 400 576 72 -250 138
3299 138 -222 -87 210 244 -352 -406 13 -283 181 68 -399 -559 178 484 140 -379 -189 3 245 671 1
3320An38L89P30m55l33j3J50j9K32J03m96o1K19L85k12L11l43k61J32M23j05n91
3342c52L44j36L59K30n14o43N22M75q7m54r7L03j64M09K13n77j02K08K03k8K16
3363C28m49r0J51L68ml24l28J08L59J21K8p20p7O22N54m23k62k00m3L48O09n59
3385A17l90J86L23J55l27O6k58n4L87J57o17J08J26l10L82N65o67p47O90N99j03
3406C88m97M3R7K41J12k13m19J4L05j09j03K38n66J67L15N34n63k98L73j69L48
3427B38P2j19m20l4N90J90k50n45J16j77N89Qo83k17L33O55l48K4k89j94M57N28
3449E24j84k25j51J04LJ49J10m26q5K02L77l03j18k16m36L18Q73k96p72K16P35
3470C99j05j39k06k32J04L24L13k69l04n0K21p7J13k11m16M69L05o3l16P2j28
$$ plain form
3320 1 -537 -148 582 127 -206 -219 -69 -88 144 247 -249 -310 -91 294 82 393 50 -211 -79 344 239 -352
3342 -352 -8 -144 215 445 -69 -712 -190 285 198 -256 -353 -50 -214 195 408 -169 -271 -63 140 112 328
3363 328 -121 -211 -60 308 304 -20 -348 -240 119 240 268 -452 -529 93 647 224 -38 -238 -281 67 676 117
3385 117 -273 -87 236 391 64 130 -128 -182 205 362 -255 -147 -21 -331 51 616 -51 -798 -108 491 388
3406 388 -109 -66 31 272 384 171 -248 -234 71 -38 -141 97 -469 -302 13 547 -16 -314 59 -110 238
3427 238 310 191 -229 -263 327 517 267 -278 -162 -339 250 258 -425 -642 -309 346 -2 22 -267 -461 -4 524
3449 524 340 115 -36 68 71 220 330 -96 -181 21 398 95 -23 -239 -675 -357 516 220 -552 -336 399
3470 399 294 155 -51 -283 -179 145 458 189 -115 -165 56 -21 92 -119 -535 -66 239 176 -140 -68 -196
3491a96K93K08L54p25m79O43K55p7k19k46k1M16J40p29j50M66N8r0L31P6o68k19
3513e79R12j89j78j07M9j41K20N68n46l89K49K74K19k09l09l50O63L05l48m81
3533c67J42L53j19K7K15j94m08K91L23p5l07J10k17L16L25l11n51J27M36q9k6
3554AJ24o48J65P99M2o08l37Q36k36n9Nr5R0j28N8L6J91m5n68l4O70qm96j45N21
3579A31j14J14M8l48k2K75N33n76m10K55L54Rm6l60K19J12r8l9j41J12j84l74
3601e50M97N76n26l78J37N28j51o1J17l33O5K17K5k96J9n2J54J08r5k92L3N24
3623B66k26k82K03K27k88m0M19J34l71l65N54j31K02l47m03K07N44j16m50j36
3643c99K27J47q1O3L2l52M96l9m09L44J36lj85j08L58k47o8K60k01K06j47k76
$$ plain form
3491 -196 97 305 659 -66 -545 98 353 276 57 -189 -210 206 346 -383 -533 -67 -9 -99 232 308 -360 -579
3513 -579 333 144 -34 -141 -92 -233 -13 555 9 -380 -131 143 362 153 -156 -506 157 462 114 -367
3533 -367 -225 128 9 36 251 57 -351 -60 263 188 -119 -9 -226 90 415 104 -447 -320 116 27 1
3554 1 125 -523 -358 441 483 -125 -462 374 138 79 84 -11 79 -49 9 45 236 191 -377 -411 259 251 -245 -390 131
3579 131 17 131 179 -169 -191 84 617 41 -369 -114 240 249 203 -157 62 174 76 37 -104 8 -176 -550
3601 -550 -53 523 -3 -381 -244 284 133 72 189 -144 -79 138 163 -133 -114 -166 -12 96 1 -291 -258 266
3623 266 40 -242 -39 188 -100 -140 279 413 42 -323 231 100 302 -45 -448 -241 303 187 -263 -399
3643 -399 -172 -25 -106 -43 -11 -363 133 94 -315 29 165 162 -23 -131 227 -20 -88 172 -29 177 30 -246
3665b46K14J33J43k27l67M66J61j78J03o1k07L29J88m71j76K67J79l17Q0P6l23
3686b34o5K05P9N3M7M8m56K30L82p1m51J99J26p4K33J30p25L09K7K82o12O0L53
3709G5o3j7k02M7J50O5J2m8J24O0k87j05M79O1k46l00K46P7m4j47j38J41m6P2
3733c4k04n8J81P8M0L16l99K9K15L9l7k91L78j59l66K35K74k96n10L42L17q4q1
3756g5k42O5L24M1O1m78K49K03j02J9J07m95J69O80l07l00K4J80n21J93L76k85
3778a14J6l56L04M60k8k06m01K82K10n4p1lJ31k46L50j21r6l48L96lk00j31K47
3801A8k08j14M03J29k47j47%K18L37j03k99m1K25J43j30o15L74j03J30q2K00l84
3823b96K95J44j01L1k04O6N7j09L94k51k01O3K34n8J00j03j69j6L56j82m34J34
$$ plain form
3665 -246 -32 101 244 17 -350 116 277 99 202 141 -66 263 451 -20 -196 71 250 -67 13 89 -234
3686 -234 -299 -94 -15 38 85 133 -323 -93 289 218 -233 -34 92 18 251 381 -344 -35 -8 274 -338 -278 75
3709 75 12 -5 -207 -160 -10 55 67 19 143 203 -84 -189 290 351 105 -195 51 128 84 -63 -201 -60 -106 -34
3733 -34 -238 -296 -115 -37 3 319 -80 -51 164 203 166 -125 253 94 -272 -37 237 -59 -569 -227 90 6 -75
3756 -75 -317 -252 72 113 174 -304 -55 148 46 65 172 -323 -154 526 219 -81 -57 123 -398 -205 171 -114
3778 -114 -98 -454 -150 310 282 76 -325 -43 167 113 42 39 170 -76 274 153 57 -291 105 102 -98 -229 18
3801 18 -190 -304 99 228 -19 -166 -166 52 389 286 -13 -54 171 314 184 -431 -57 -160 -30 -112 88 -296
3823 -296 -1 143 42 73 -131 -65 -8 -117 277 26 -175 -112 122 64 164 61 -108 -124 232 50 -384 -250
3845b50K66k37L43Lm12K19J33P7o4M7k44K16j44L28k30m41K70r1L65j43j07j28
3867b24j06M68R5k89J00J09q5K39o9k79r1K90Lk47j03L27k63J53j86M58l50J2
3889c8J83l27J77M9j03k87M23L67l33k24J79O2k10J85j08j43j42K84p0j42J93
3910b5l3k15L13p1P5j33K8J70j37P6p4j21L97k2o4n9j33M8j42M47o4m13K1P9j4
3935f6j26K54j50j32J72M64l13l05K05p0M1N3J35k48k43L67P4k90J21n4L2N0K5
3958dj11o2K32K44m29N8R6l6k91N65l6j97j62L24o8k18K78j92k29J20J71k07R6
3981e8K9Q6l95J76L38l09M1L62q3j66P6k4J31l22K24k56L0k95K26J55K5P7j76
4004a08K03J47j94k6M5J43k58J50L42m07l28M25L1l02J99q5j16l4K56j86N8J22
$$ plain form
3845 -250 16 -221 122 125 -287 -68 65 142 78 125 -119 97 -47 281 51 -390 -120 -211 154 11 -96 -224
3867 -224 -330 138 233 -56 44 153 68 307 238 -41 -132 158 161 -86 -189 138 -125 28 -158 300 -50 -38
3889 -38 145 -182 -5 44 -59 -346 77 444 111 -113 66 128 -82 103 -5 -148 -290 -6 -76 -218 -25
3910 -25 -58 -273 40 -31 44 -89 -61 109 -28 48 -26 -147 250 228 164 105 -28 20 -122 325 261 -152 -131 -52 -66
3935 -66 -192 62 -88 -220 -48 416 103 -202 3 -67 -26 27 162 -86 -329 38 112 -178 -57 -111 -79 -29 -4
3958 -4 -115 -177 55 299 -130 -72 24 -12 -303 262 226 29 -133 191 123 -95 183 -9 -238 -118 53 -154 -58
3981 -58 -29 57 -338 -162 176 -133 -92 270 187 21 97 73 204 -118 106 -150 -120 -415 -189 -34 -9 68 -108
4004 -108 95 242 48 22 67 210 -48 102 444 37 -291 134 165 -137 62 -23 -139 -173 83 -103 -45 77
4026G7P7j66Q2J09n01L64Q4J02m09J59R4J22k05K0M9k63J47L2J45l36J62k6j27
4049b08K14r1k6L06q4j67O4J32J20l21o7L41k45l57N36n4l07J12J58j82M7K08
4071A29j48j8L27m19l2J56R0j31Q2L3J94m71L25Q1l25Q3R8k48j21M1L45j95J11
4094a3Nk48K34L12l14J47K58k64j43J2P1m3k32J83M7j20o5N8N7J69j39J09j36
4117e5R7J41j58j29J08J91l02R9L10k37o9K31k95RK51o1m59L41j94Q7j42K71p6
4140d1o1J17K67l81q3L88j39r1N2J36k75n8R6P1j92L8J73l9J76m6j74j29N5K57
4164A17j71R3K41l98k8J54J34k29Q0K57j31rj84j12k6J74J17M8j37j54K75j3N2
4187A50J17j88K4p9J51q7j84o7J12J66Nl52L25M9j28k45M98j55k07O4jj08J95
$$ plain form
4026 77 154 -12 70 179 -322 42 126 228 -181 -22 72 194 -11 9 58 -205 -58 -26 119 -217 -55 -81 -208
4049 -208 6 -85 -111 195 111 -56 8 140 260 -61 -128 213 -32 -389 147 93 -214 -102 56 -126 -79 129
4071 129 -19 -37 290 -129 -161 -5 85 -46 36 69 263 -208 117 198 -127 -44 54 -194 -315 -274 71 -124 -13
4094 -13 -8 -256 -22 290 -24 123 381 117 -26 -14 57 14 -218 -35 12 -108 -173 -115 -58 111 -28 81 -55
4117 -55 42 183 25 -104 4 195 -107 -8 302 65 -4 227 -68 -59 192 131 -328 13 -181 -94 -236 35 -41
4140 -41 -102 15 282 -99 -182 206 67 -24 28 164 -111 -169 -73 -2 -194 -156 17 -22 154 108 -66 -195 -140 117
4164 117 -54 39 280 -118 -146 8 142 -87 -7 250 119 110 -74 -186 -212 -38 79 127 -10 -164 111 98 150
4187 150 267 79 103 24 175 88 -96 -163 -51 115 120 -232 93 142 14 -231 267 112 -95 -31 -32 -140 55
4210E5j18j3J41q9k1k19M24q8j67j90Q5J38l0J11p2k17o0J48L18k92K24O3o2J14
4234A83J5k13J10J36k81j8J37K27m06k07L10J14m01M06j36l8k47M46J02k74q8
4255a23K19m3J27k9j36j18J31J08j77J81k01j38J13J48jm15M89k1k61K4oN6O2
4278a1Q3L4k95K14O1j14K57k35j92k5J50N9j47N6J65j07l12L02M81k55l80J07
4300a04L16k8k4j69j18K51q9k43K83j81J33k38K13J74m93K32k32M61k82K32pk52
4322a65R2L74M0m96J99J50j67J90k27m8J84J31k17l3K6M6l09J30J43o1m7J91J97
4345C23m75K75L8l04JK67J87k95l1j04O2J60j24r6k2m7N37k65k31K56j40N8L17
4368C47m00o9M05n3m03J89oO7j44O1J66m71K12K39j22j00L06j42p0j13P7M0k67
$$ plain form
4210 55 -63 -76 65 -24 -45 -264 160 72 -95 -285 -200 -62 -92 19 -53 -270 -330 -182 136 -156 68 131 69 183
4234 183 198 -15 95 231 -50 -68 69 296 -110 -317 -7 107 -294 112 -24 -62 -309 137 239 -35 -123
4255 -123 96 53 180 151 15 -103 28 136 -41 140 -61 -199 -86 62 61 -354 135 114 -147 -123 -129 -73 -11
4278 -11 72 106 -189 25 86 -28 229 -6 -198 -223 -73 -14 -161 -105 60 -47 -359 -57 424 169 -211 -104
4300 -104 212 184 160 -9 -127 124 35 -208 75 -106 27 -211 2 176 -317 -85 -317 144 -138 94 87 -165
4322 -165 -73 301 341 -155 44 194 27 217 -10 -58 126 257 40 7 33 79 -230 -100 43 -18 -65 126 323
4345 323 -152 123 161 -143 -142 125 312 17 -14 -118 -56 104 -20 -116 -138 -185 352 87 -144 112 -28 30 347
4368 347 -53 -122 283 230 -173 16 10 77 -67 -6 160 -311 -99 140 18 -82 224 82 12 -101 -24 16 -251
4391b51N38m9j16j13K52m22L7K83j50k91K17Lk45K00J66p1j1J65kj0k13J79j49
4414e3P9n3R7j16K61j44k19j27N28l76o5K14j86L6m6K11qk48K76L4j01L2J57q7
4438I6nJ37k71J9J39k14j42J73qJ13j56P9L3o0K23j76O0nO2n5k77L01J07k20j81
4463b28M18j95R7q8M3P5k70J08P7l07J68J17k29M17q7L7j13o0m5m4K44p0j08Q
4487c5L05k3m71L11l58J39q8J2K09o0J56j31p8K39J35k89M6M2J20j61K81l75M3
4510c1J85j32o0j42K76l7l76K84m0n8K18k11K04N7j27J16q9q3M44m67r5P4L9j40
4534a91J41J23l27K05J26k06J35j77K15ml3P2j8j13L47m36J06K26J6k67k32M76
4556A84K3k62j8J38j81n9N05k30k42L25j79P4j23J31M0Pn2j16n2o8J10n8J42M9
$$ plain form
4391 -251 287 238 122 9 261 -161 -124 159 9 -282 -65 -62 -307 -107 59 -12 -23 142 140 130 -83 96 -53
4414 -53 26 -27 70 -46 215 71 -148 -275 253 -123 -188 26 -160 -124 -170 41 33 -215 61 95 -6 26 183 96
4438 96 91 228 -43 -24 115 -99 -241 -68 -76 37 -119 -40 -7 -67 156 -20 40 35 97 42 -235 66 173 -47 -228
4463 -228 190 -5 92 4 47 122 -148 -40 37 -270 -102 15 -214 203 116 153 40 -20 -65 -109 135 65 -43 -35
4487 -35 270 247 -224 87 -271 -132 -220 -208 1 -59 97 -34 -112 127 262 -27 19 61 181 20 301 -74 -31
4510 -31 154 22 -38 -180 96 59 -317 -33 -73 -131 87 -124 80 137 10 126 37 -46 398 -69 -164 -90 -51 -191
4534 -191 -50 73 -254 -49 77 -129 6 -171 44 40 7 79 61 -52 295 -141 -35 191 207 -60 -292 184
4556 184 207 -55 -73 65 -116 -175 330 100 -142 183 4 78 -45 86 126 133 81 -35 -87 -155 -45 -103 39 88
4580H8j54j58J07J94q4m6N7j96L55M8k4l39L24J10j13pj58J37k87J38%j00J36
4603B8r9k37K45K8kk05J46L48j85p5q1K82j95M3J26j05k69K38Or7J83l7k95J24
4627h5Q7J14n0R0l26q7K66L00k69j09J0K13j65m7J12r0j83L48L2m08M16Q0n16
4650b67J53j43K23P1P0J58j29j92J21k66K00J72l8k15J82p7k13L25j94Q9o6n1
4672h7K41m30O3L72k28J29L10k3n51R5M05j05l9k30n0L9J57N4l29R1K19j67j8
4695h2J57k68R2L07p8r0r8K65o0l02N9K07N4k68K86J07l05J71k11oK69k06k18
4718b18m7L42j14j61L91j64n3j20L82j18l61K04Lj62M16j71Rp0R1l5k05J72Om15
4742c98K33K34O8j35J7L37l09J26R3j00k56J28P3j98p1j1K61j77N3q2m1L35j69
$$ plain form
4580 88 -66 -224 -117 77 -7 -53 4 -192 163 211 187 -152 172 282 169 162 4 141 -146 -8 -8 -108 28
4603 28 -71 -308 -63 -35 -37 -242 -96 252 67 -8 -89 193 -2 41 167 62 -207 31 37 -60 123 86 -209 -85
4627 -85 2 116 66 156 -170 -257 9 309 40 -69 -59 154 -11 -58 54 -36 -219 129 161 -247 169 249 -267
4650 -267 -114 -257 -34 37 107 265 136 -56 65 -201 -1 171 133 -82 100 23 -190 135 -59 30 -36 -87
4672 -87 154 -276 -213 159 -69 60 370 347 -204 -109 296 191 152 -78 -128 -89 68 122 -207 -116 103 -64 -82
4695 -82 75 -193 -101 206 128 38 -60 205 145 -157 -98 109 163 -105 181 288 -17 154 -57 -63 206 0 -218
4718 -218 -265 77 -37 -198 193 29 -24 -144 238 120 -241 -37 -34 -196 220 49 58 -12 79 44 -161 11 17 -398
4742 -398 -165 69 137 2 19 356 47 173 266 166 -90 38 111 -87 -158 -169 92 -85 -32 -114 -155 180 11
4765A1j05J02J94k92J86n8j8j24k5L55k75N3j46K30k3r0P2j65Q7J72k93RK45o
4789I6j49N8J66n8r0L5L74m73j42J21N9Mj5j07J32R5l45J29P2K23km51L45p4j76
4814a73J94j4m8Q7K44l21R7q1NO3k56J75j1q6J8Qj4l3K94m29J84L21j25m55K04
4839a52L04P2k67J06k0p8J81k35j00m6L06L2k60J5L8J29P1K9Lk94L54j97nK55
4863B41N2k52k16K03M09M7p6m54l66K63P01p41q6J76k52L61L68j58l60O69o59
4884a30N82r51Q70k92Q3l05N43L1o60J74K08k07J41l20L26q57J114j36J5o79M74
4905B4L43m96M5j39L87k82N67n71K94p4j07k66J91j10J15J06O8K7j60L5K84n28
4927b47K59J71j27j94K68O5k04Q6l9k94K07J08J56l16j14J56j3j04L22j69J50
$$ plain form
4765 11 -94 8 202 -90 96 38 20 -104 -129 226 -49 4 -142 88 65 -25 47 -118 -31 141 -152 -143 102 96
4789 96 -53 5 171 113 23 58 432 -41 -183 -62 -3 1 -14 -121 11 106 -239 -110 -38 185 183 -268 77 3 -173
4814 -173 21 7 -41 46 290 -31 66 -15 -10 53 -203 -28 -39 -125 -107 -99 -113 -146 148 -281 -97 224 99 -356 -152
4839 -152 152 224 -43 63 43 -35 146 -89 -189 -235 71 103 -157 -142 -104 25 96 125 128 -166 188 -9 -14 241
4863 241 293 41 -175 28 437 484 408 -46 -412 -149 552 -189 -275 -99 -351 10 378 220 -140 529 -130
4884 -130 452 -499 371 79 162 -143 400 431 -229 -55 153 -54 87 -233 93 -764 350 214 229 -450 24
4905 24 367 -129 -84 -223 164 -118 449 -122 172 98 -9 -275 -84 -194 -79 27 95 122 -38 -3 281 -247
4927 -247 12 183 56 -138 130 195 -9 77 38 -256 -49 59 215 -101 -215 -59 -72 -176 146 -23 127
4948A27K26j16j63oK1Rl04J10m94M79K09l80K74K9L41r0n41O12M53o92o51J142
4970E95n42K7j89j52K64j20M40l51J80j81j19K3K16k2l22K33j56O0P0J72k88Q
4992a54J36J17r0j2j59K72N2Q8l35k08K91j67OK4L11l55m2J91K61k75j88%M00
5015A64k22K80r2k16M5J49Q5j98QP9M6j10O6k21L5N36m72l0K68q2j5m31L91R8
5039A61l48K10j00K63k32K13k50j03J22J87k06l4J03K8n4J50j49j25L51L0l05
5060h8Q9n7K6j18K73M7o4l52J56K29R0j17q7Rj06K27m8l03K54l8J25r8R3m01J95
5085f4K09n3j81L2L19m62K46r2k1j41K55q2n8N6M2J0k44J93Q5l8j06Q3k5K02M7
5110B12m22L9L81mk57M7J56m53p0K59o3M7J24Q9j98J49J77l17J6J46J9k67l4L45
$$ plain form
4948 127 353 237 74 68 89 98 -206 -96 -590 -111 98 -282 -8 21 362 272 -269 343 796 104 -547 595
4970 595 53 80 -109 -261 3 -117 323 -28 152 -29 -148 -125 91 69 -253 -20 -176 -116 -46 126 -162 -154
4992 -154 -18 99 9 -3 -162 110 162 250 -85 -293 -2 -169 -163 -139 172 -183 -225 -34 227 -48 -236 -236 164
5015 164 -58 222 130 -86 -41 108 193 -5 3 82 128 18 84 -137 -102 434 -38 -68 200 118 103 -328 63 161
5039 161 -187 23 -77 186 -46 167 -83 -186 -64 123 -83 -117 -14 14 -40 110 -39 -164 187 217 -88
5060 -88 1 -56 -30 -148 125 172 108 -244 -88 141 231 114 27 36 -70 157 109 -194 60 22 147 49 142 -259 -64
5085 -64 145 92 -89 -57 262 -200 46 -46 -67 -208 47 -35 -93 -37 5 15 -229 -36 49 11 -95 -12 -37 165 212
5110 212 -210 -171 210 206 -51 -4 152 -301 -371 -112 -175 -128 -4 85 -113 36 213 -104 -88 58 77 -190 -224 121
5134A21k44R1J26k27j98J54K18j53J10k72L17n7L25j95k14L42j51L1m3J40k13
5155Hj80L04O1j45j51m2J78K9k68J35P1n7P1Q1j66J21J16k91K97Nm07J78K01L0
5179A79l70K03P3k70P5L08k29j63K37j37J19o8J08l92J85L41j44j20l4K93j10
5200H4j13J74L5l01J44J38j86j6J60j91R3p8J77r9m5M9mK09M6l53J2P7L48k39
5224A21k05J29o0l3K38k68k15J32p9M03k23J43j42r6J51J46p0j78J66r7l9M86
5246D10k63j34j23L01q1j47j92J70j83K76M9k42L26j96J38k9l0n3o4P4J97l22
5268a18o5K28Kk2M9p7j59n2K71J15k21j01RK14Q0m8k47O0L77k59ko8k9m5q4J96
5294Dm0L5j13L6j6J43n2J03j40J92j23n8P8k02K06kK03k02l88J41L74k0k28j2
$$ plain form
5134 121 -123 -32 94 -133 -331 -177 41 -112 -2 -274 43 -14 311 116 -98 244 93 124 81 221 8
5155 8 -172 132 193 48 -103 -145 33 62 -206 -71 0 -57 14 95 -71 50 166 -125 172 177 -230 -52 149 179
5179 179 -191 12 85 -185 -110 198 -31 -194 43 -94 25 -43 65 -327 -142 199 55 -65 -99 194 84
5200 84 -29 145 180 -121 23 161 -25 -41 119 -72 21 -57 120 21 -24 25 21 230 276 -77 -65 12 360 121
5224 121 -84 45 -15 -48 190 -78 -293 -161 -240 163 -60 83 -59 -155 -4 142 72 -106 60 -37 -76 410
5246 410 147 13 -110 191 110 -37 -229 -59 -242 34 83 -159 167 -29 109 80 50 -3 -67 7 204 -118
5268 -118 -183 45 47 25 74 -3 -162 -214 57 172 -49 -150 -141 73 153 105 -142 -82 295 36 34 -34 -63 -108 -192 4
5294 4 -36 -1 -114 -78 -94 49 -3 100 -40 152 29 -29 49 -153 53 51 254 52 -336 -195 179 159 -69 -81
5318h1j01m7J44m0J98k81K92n6M0J64j78j37K67l2P8k67Q6j59j48M11p6k58J24
5341e7J67k6j2l7j75O4m5K20J23m26J03Q3j0L6J01j37p6J76j2k08L47j94k60L15
5365F0k2k0k68N1L04J77j08n8n2Q2J7L7l63J1M47k69p5O0m1l38K14J98K2k87L25
5390A04j54J8K27k64p8n7K85J61k54J79j80N2J68L2k97K6K32j92j15q8J73N2l0
5413@O4j90J61Kk85J67K82J90n04O6j38K09j59K65k19o4K79L1j18l47M65j82J9
5436fn2r8K5j05L10P8j46P3k9j29k0L90l25q9J63N5Q1l48Q4j30O9J83J26l93K11
5461b2J19m2LR5j57j12L44k2k19p0N1l4k38M71k96J34J8j07J59k1n7j11j4J90
5485F2L8Pj50K25k40J77k07Q9J32j27o1rN2k37K91j43L4L35l19m9L4O9QJ0j83
$$ plain form
5318 -81 -182 -229 -85 -125 73 -208 84 28 68 232 54 -83 184 152 230 -37 49 -110 -258 153 77 -181 -57
5341 -57 110 84 72 35 -140 -76 -121 99 222 -204 -101 -18 -28 8 109 -28 -104 72 60 -148 199 5 -255 60
5365 60 38 18 -250 -199 105 282 174 116 64 146 163 200 -163 -152 295 26 -49 11 -30 -368 -154 44 66 -221 104
5390 104 -50 -32 195 -69 -147 -204 81 242 -12 167 -13 39 207 239 -58 -32 200 8 -107 -195 -22 30 0
5413 0 64 -126 35 37 -248 -81 201 391 -113 -47 -185 24 -135 130 -89 -153 126 157 39 -308 157 -25 -6
5436 -6 -58 -156 -131 -236 74 152 6 79 50 -79 -99 291 -34 -123 40 95 176 -172 -88 -218 -149 34 160 -233 -22
5461 -22 97 55 58 153 -4 -116 228 206 -13 -83 -32 -66 -304 167 -129 5 23 -84 75 54 -3 -114 -128 62
5485 62 100 107 -43 182 -58 119 -88 1 133 6 -55 -64 -12 -249 42 -101 -67 268 -51 -100 -66 3 11 21 -162
5510a62n7K92J00j19l42K92j51P8j66K38j66J77o1k1R5k41K62m0K28J27l40l13
5532b90J79K39j11o5J91p0j21J43J06k95LJ45n6P7O7k89K42J32O5n14J46J97k33
5555a12N7J14N4j28j3K40j52j24k7k3J61j80M20l93j62J95m5J65J75j30m9j05
5577f2L40k57j02J17r4J01j40O2J01l7r9K05j36j45m6J50m9K62j41l6j15K68L1
5600A78r3k57J0K97L3P6k99j02J02M6O1j34jL0l4K12q2M0O2l23Q0K67k57J32o8
5625b4m3K24j28k72K17j59L17K31j91m26L77Q4j61r9J25l3J72Lj36j14P9Kj84
5648a39K13K05k37k93M9K70q0o1j69Q6J75J21o1o7o9J20O3j31j3N1J41J52k25
5671A01l82K36R1L8j34L21j00l29j41K00J21J1r8j3J45L16j74l68J21K73l04K05
$$ plain form
5510 -162 -219 73 173 54 -288 4 -147 -69 -235 3 -163 14 -47 -68 27 -214 48 8 236 363 23 -290
5532 -290 -111 128 17 -48 143 73 -48 95 201 -94 -91 54 -2 75 142 -147 95 227 292 -222 -76 121 -112
5555 -112 -55 59 113 -15 -28 212 60 -64 -91 -114 47 -133 287 -106 -268 -73 -118 47 222 92 43 -62
5577 -62 278 21 -81 36 -58 43 -97 -35 66 29 -70 135 -1 -146 -192 -42 -91 171 30 -6 -121 147 178
5600 178 85 -172 -162 135 168 244 -55 -157 -55 -9 52 -82 -83 -53 -87 125 43 83 145 -178 -98 169 -88 44 -24
5625 -24 -67 157 29 -243 -26 -185 132 363 172 -254 123 207 46 -53 72 39 211 214 78 -36 43 45 -139
5648 -139 74 279 42 -251 -202 68 -12 -73 -242 -156 19 140 79 12 -57 63 126 -5 -18 33 174 326 101
5671 101 -281 -45 46 84 -50 271 171 -158 -299 -99 22 33 -65 -78 67 383 209 -159 -38 235 -69 136
5693A36j29K4j69K24J36k91r6K04n0j69L9K32j04j79J65O2K16k16K8q4K24J03
5715C06j75m23M35k32j4J41k92JJ14J73r6R1Q0J0j04J37P5k76l0m1j1J1J41j04
5739h3M9J4J73J3m84J28J38QR5k41J00q3L31Rk64MN7nJ85k06K8L0P0o6R3J86j65
5766A14l50n0N75j07j14j65L3K05r8m0Lk57P6K45l4j50N0q5P2M4j1l8J51N4k68
5791a45O1O6J13k39p1L51j16j25J77rN0J7j81k26L46P6r3L75m12l93O80j15K92
5814D79l63K22J71n5m85J78L89j32j48l07N13l91r9j23M7J15R5l56L15J04q2r0
5836cj90J24Q2J30pj54Q2J75j35Q42q37J99l34L50l83L1L55k03j62p3J37k03k36
5859d13K32P17n54m49K41J73K24k20J52r2Q6o2pJ02j20P3j21mJ7n7m1o1J62j9
$$ plain form
5693 136 7 31 -138 86 222 -69 -165 39 -11 -180 -141 91 -13 -192 -27 35 251 35 63 -21 203 306
5715 306 131 -292 143 -89 -103 38 -254 -253 -139 34 -62 29 109 119 15 152 227 -49 -79 -120 -131 -120 21 -83
5739 -83 -34 -20 153 166 -318 -190 -52 -44 51 -190 -90 -173 158 167 -97 -93 -36 -41 144 -62 -34 -4 66 0 93 279 114
5766 114 -236 -286 289 182 68 -97 -64 141 43 3 6 -251 -175 70 36 -114 -64 -149 -77 -33 -44 -82 69 123 -145
5791 -145 -84 -18 95 -144 -215 136 20 -105 72 63 113 130 -51 -277 69 145 52 427 15 -378 302 187 479
5814 479 116 338 509 454 -31 147 536 404 256 -51 462 71 -28 -151 -104 11 106 -250 65 169 87 -3
5836 -3 -193 -69 13 143 136 -18 64 239 104 946 109 308 -26 324 -59 -28 327 124 -38 -111 26 -177 -413
5859 -413 -181 536 -18 -467 -226 -53 171 -49 103 11 97 35 28 130 10 83 -38 -42 -25 -82 -123 -184 -22 -41
5883d1j40O38o6l04j73l30L22J79nj24K77q0l08m2r7L53J00l56l92L54L83l8m7
5906F3P9j79m94j5L72L2l14O13N42n87J39l56L02k24j49K68j55Q8l99K52L28r
5928A97k40J68O3l4K1j27k10j8M45p1k55J60j38j89K74j21l08N10k70J13j29J73
5950A4N4j19M8J27pm05K83k8J63L0L2j86O5R3j6k89J93j4j36m9L36l10j52J95
5974g8K09l7j6L9j60Q6J40p6j39J1J81l2J6j10j41p8L03k0q5j20Q8J3kO2J06k97
6000a37K06J00l14Q3J48P3k76P2N5J24k50k1J68K01k18P0r9o9J06j57K55r5j72
6023a47K18J03j09k38J58Q5N1k95L85j63l07P1L97j28j6k20K74l14K80j48%J56
6045I3j31J83j28q7J24j51N7J38k40M%J20J5J28j98J70k90L37J30k81MR3k25L45
$$ plain form
5883 -41 -181 457 391 87 -86 -416 -94 85 80 -44 233 153 -155 -197 -294 59 159 -197 -589 -235 148 110 63
5906 63 142 -37 -531 -546 -174 -142 -456 157 699 112 251 -105 197 -27 -176 92 -63 25 -374 -122 206 197
5928 197 -43 125 188 154 175 48 -162 -180 265 194 -61 99 -39 -228 46 -75 -383 127 -143 -30 -159 14
5950 14 68 -51 -3 124 117 -288 -5 -33 130 160 192 6 71 164 148 -141 52 38 -98 -147 189 -121 -273 -78
5974 -78 131 94 78 117 -43 43 183 107 -32 -21 160 128 144 34 -107 -185 118 98 13 -107 -19 -6 -8 54 160 -137
6000 -137 69 169 -145 -62 86 159 -117 -45 10 134 -116 -137 31 232 14 84 -15 -84 22 -135 120 25 -147
6023 -147 71 174 65 -173 -15 70 121 -174 211 48 -259 -188 209 81 65 -155 119 -195 85 -63 -63 93
6045 93 -38 145 17 -70 54 -97 -40 98 -142 -138 -138 -18 -3 125 -73 97 -193 144 274 -7 -3 90 -135 210
6069B10k42P4j03r1L63q3Q6k47j1J6J76j70j69J32K79k44M5O2j46M7j39K04K53
6092C02n9r7j80N0P1k2j43O5J53k04j36L61l83J44J02M9J0o8k39J06J30P4j20
6115c4Mq3K36p6J02k7k69j12M94k0m62l1L51Q9m46M0J77J30Q6o4j39J12ko1J94
6140A89k93O0j91J6K73m1M2J35k14k33K43J58k21o9k9M81k26k39K20n0O5K5j57
6163e6m4P6q8M4K28l7p8k55J49m4n9J39O6J51l94L36Nl03L6K65J9p2j94N3J27
6188G0K12l95j20J93R0oJ7O6k23J51N3n7j26K6J85r7k29J75rlr4K63J15j59J86
6213B84l24l6Q7R8j17Mp9K98j46j94M6J8J15K69n14K45k69R0J2N6Ql6P3R1k6p1
6239a8J63r3q2M3K79k84p7j27M02m9j96K31j26j81J74P7q9l50N23j33l17J93l4
$$ plain form
6069 210 -32 42 -61 -152 211 128 214 -33 -44 -28 148 -22 -191 -59 220 -24 21 83 -63 -16 -155 49 302
6092 302 243 146 -34 16 87 65 -78 -13 140 -64 -200 161 -222 -78 24 73 83 15 -224 -118 12 86 -34
6115 -34 -30 -113 123 47 149 122 -147 -259 235 215 -247 -278 73 162 -284 -244 -67 63 149 85 -54 58 56 -5 189
6140 189 -104 -44 -235 -219 54 13 55 190 -24 -257 -14 144 -77 -146 -175 306 80 -159 61 11 76 101 -56
6163 -56 -100 -24 -112 -68 160 123 45 -210 -61 -105 -164 -25 41 192 -202 134 139 -164 -128 137 156 84 -110 -57 70
6188 70 282 -113 -233 -40 50 44 61 127 -96 55 108 51 -75 -49 136 39 -190 -15 -24 -27 -121 142 257 98 284
6213 284 -40 -76 11 109 -8 -4 -83 215 69 -125 -79 -61 54 323 -191 54 -215 -125 -113 -57 -49 -85 -12 79 53 -18
6239 -18 145 52 -30 13 292 8 -69 -196 206 157 -39 192 66 -115 59 136 47 -303 220 87 -230 -37 -71
6262g1O2mL26l12P4k13J04K4R4pP2k85M0L51m1k16p9K54j36j7j57J45N4L0q6p9
6288g3J23k90k3J65J01j16O0n7K60k37K5j7o2K45j15p7N4P2o4q3M13k94k46J89
6312d7kJ39p6m2k9J3j35J84k39M1J83r8k79M97J48m29N0R8O4K7Q3l22J27j4R0
6337C2j00O7M3L92n14L1J16j75l5L3j8M4l7J14n6J07K18m93J35K45q6n1O0L3l76
6362b71Q9M41j34q3q1j16J96J0j79J67l18L15j75p8K17K1p5R9K50j10m11K21M5
6385D0NL8P2L4k20q3J80J9l6L8LO0m7k38l9L10L0j74k41K13O2j9J67k02j27K55
6411A00%K2j05q3P3j04J33j6o3mN6p9K76k43J32j29p3K86k33J14l71J22J80q8
6435i7J63p2o7J57j89K49k11k8Q5L3J45k35J4L0N9L2j46Q1K70m03M62l35M3K2
$$ plain form
6262 -71 -9 -13 313 1 75 -138 -34 -10 84 77 149 -136 -96 255 214 -2 -81 173 37 20 -137 8 62 92 6 -73
6288 -73 50 -240 -263 -98 3 -113 -53 -110 150 -87 -62 -79 -141 104 -11 -88 -34 38 -26 -109 304 10 -236 -47
6312 -47 -49 90 14 -28 -57 -44 -179 5 -234 -193 -10 -108 -387 110 258 -171 -121 -23 41 68 151 -171 -44 -58 32
6337 32 -68 -1 42 434 -80 -49 67 -108 -143 -110 -128 -84 -121 -7 -63 44 262 -231 -96 149 63 12 72 105 -271
6362 -271 -182 259 125 42 -39 -155 41 51 -128 39 -279 36 -139 -217 0 21 -54 45 295 185 -226 -5 40
6385 40 45 83 155 189 -31 -114 66 85 49 87 90 150 103 -135 -174 136 166 -8 -249 -36 26 7 174 -28 -155 100
6411 100 100 122 17 -66 7 -97 36 20 -43 -47 9 -70 206 -37 95 -34 -107 179 -54 60 -311 -189 -9 -97
6435 -97 66 -6 -73 84 -105 144 -67 -95 -10 23 168 -67 -53 -23 36 68 -78 3 273 -130 332 -3 40 62
6459F2j44J52j97J62P5k83L2J83n5J19J24j58p3j36O1n2j6K33O9k22l2K02j29
6482b3P9K8N5k35l1N3l8J83l0k59L90o8m8j54K21k77J39p5J12J21l44J21J91j05
6506Fj37K43k01N4K22k65J52O1l2j99N0j04k7L04qj91J65K6k80J44r6K37J4l50
6530b12J31J0O4P0J48J11k75Q8j04o1n6K37k11K01k89l1O9J87n9j62J35k4L2j11
6554a12J30j74J32j63J94M0k04J12J68p6M9j60J39L5j42L10m11J1K35k00N1J2
6576b4j65j8L54r8n7O0P4k41J66k5L6o1m9J90j07r7R4j73j07J88j7Q6rj9J04m4
6602D1N5m8l09L75j4L6j53K1J39KJ00k56j21K01k2j65K36j42op1J33j93K24k46
6626a83n1J55J69RJ64l64J23M5l32L34j60J86o6Mj6m6K88j49j64j32K25p9J71
$$ plain form
6459 62 -82 70 -127 35 110 -173 -141 42 -13 106 230 72 -1 -137 -76 -128 -144 89 158 -64 -96 106 -23
6482 -23 56 84 139 -96 -127 -74 -112 71 41 -218 172 104 56 -98 123 -154 -15 -90 22 143 -201 -80 111 6
6506 6 -131 112 -89 -35 187 -78 74 135 103 -96 -46 -150 -177 127 119 -72 93 119 -161 -17 -113 124 138 -212
6530 -212 -81 -71 -7 63 211 322 47 135 31 -30 -86 151 -60 141 -148 -179 -110 77 18 -144 -9 -33 -1 -112
6554 -112 18 -156 -24 -187 7 47 -157 -45 123 47 96 -64 75 110 -32 278 -133 -122 113 -87 -36 -24
6576 -24 -189 -207 147 49 -8 52 126 -115 51 26 62 1 -48 142 35 -62 32 -141 -248 -60 -77 9 0 -19 85 41
6602 41 96 48 -261 114 100 136 -17 4 143 145 245 -11 -132 69 47 -118 118 -24 -30 -101 32 -161 63 -183
6626 -183 -234 -79 90 99 263 -101 22 67 -265 69 -91 95 29 33 17 -29 259 110 -54 -186 39 -40 131
6649A31j81M9q4P2JJ92l65q3K98p1%K79l03qK47k1o7p9n1k6n3K08L3k26P4J31
6675I7J85l50k29K87Ok7K0R9k0j96P9k7J9k0k0M5o2K56oj62J26K4j24J38l3k83
6701a78K28J23k44k05K17pK30k77Mj7K85k96P2j46J95R8L1p9P0J9j25j24J57k12
6725a81R4J94k54M7j07J17j91J41o3L43k35J66JK0P9J8k22l1K9L28l73L23o06
6748c63J0R03q87l96L94O70l79k40N05k22j33J65l31N35k68Ro2K20N7m37L60p20
6770f10N90N47l20o56J014l18O2p70K2N83l37M61K95m30J5k73N13l88J80l08K91
6791A63k53J6k6K60q1m03J47J4K58j20M2rk10J86k05L81o4Q2l49N24l45P12n54
6814A66j58k05K28J17l18N18m48Q5j53MN0J75k32J05J20k9J99j74K2k21R1r7j18
$$ plain form
6649 131 -50 -1 -85 -13 -12 180 -185 -268 30 -41 -41 238 -65 -73 174 153 86 7 -44 -70 -123 85 118 -108 -34 97
6675 97 282 -68 -297 -10 -4 -31 -11 88 68 -128 -49 -76 -57 -77 -97 -52 -114 142 136 -26 100 124 0 138 105 -178
6701 -178 50 173 -71 -276 -59 -66 164 -113 -109 -126 159 -137 -65 -211 -16 82 113 34 104 123 -2 -126 31 -181
6725 -181 -87 107 -147 -100 -207 -90 -281 -140 -203 140 -95 71 72 92 171 189 -33 -64 -35 293 -80 243 -363
6748 -363 -353 550 -337 -733 -339 331 -48 -288 217 -5 -138 27 -304 231 -37 -28 -90 130 187 -250 110 -610
6770 -610 -20 527 207 -449 565 247 309 -461 -439 144 -193 268 563 133 148 -125 388 0 180 -128 163
6791 163 -90 -74 -100 160 79 -324 -177 -163 95 -25 17 8 -202 -16 -221 160 96 178 -171 353 8 720 166
6814 166 8 -197 31 148 -170 348 -100 -15 -168 -164 -114 61 -171 -66 54 25 224 50 72 -149 -58 -155 -273
6837b73L12P5k97L3K4J16k2q2K37n97R13l64n18M64L61j71l25p7m6M79r27M61
6859b24l4M35k49j4n4k17M04o6P6l76K34J22j29K33k18m7J91r9j72J43Nj30R0
6882i6M4J10j44J44J28j12m7R7k1n0j85R1P7m5K10P3l25J12N5pj09k31M49k09
6906Io3N1o6j79L44j09k11L54j44J05q8R0l7m4j06N9O4O1j49NL7l8j95J90j0J73
6932A03jk47J28Pj74J03L5O6on0O5r5nJ30l5r0J90j81n0K36j28r4L02k90j1K29
6958A37m1j79L7K6J99m33L73j17j1o4J43k7r6j65K12kk8J7Q1o2j37J36k03J11
6982i3J88q6J85k19k4M2J42j4j42l6M4PJ38j04Q3l8l7K09n20L49j52J62m8j36
7006a00k3KJ39J30q4M5k58J45M9l21L63o2j08K21j36m8o8J49J26k28mL64k61j3
$$ plain form
6837 -273 39 114 -183 -150 -126 -10 -32 -114 123 -474 439 75 -443 21 382 211 -114 -191 -237 242 -685 -224
6859 -224 -258 177 -72 -86 -140 -357 47 -19 57 -319 -85 37 -92 141 -77 -124 67 -32 -204 -61 -56 -186 -96
6882 -96 -52 58 -86 58 186 74 27 124 103 53 -132 -41 36 -9 201 274 -51 61 116 109 0 -231 218 9
6906 9 -54 -3 -69 -248 96 -13 -224 130 -14 91 3 93 56 12 -94 -35 29 90 -59 -54 -17 -55 -250 -60 -70 103
6932 103 102 -145 -17 -10 -184 -81 -46 20 14 -36 29 -66 -71 59 24 -66 124 -57 -107 129 1 -93 209 -81 -92 137
6958 137 96 -83 -46 -20 179 -254 119 2 -9 -73 70 43 -53 -218 -6 -8 -36 -19 62 0 -137 -1 -204 -93
6982 -93 95 9 194 -25 -49 -7 135 121 -21 -57 -13 -6 132 28 111 73 36 245 -275 74 -78 84 36 -100
7006 -100 -123 -121 18 148 64 109 -149 -4 45 -276 87 25 -83 138 2 -46 -114 35 161 -67 -71 293 32 19
7030A9J22j80k32J45J38O3K7P0j77k5M3j01n0L39l12m1J15j08K87j97M1J62o9
7053G9j95J67K9K0m0M1kk42O1r0K4J90J89k27j55J9N1J08Q2q7q0k0L01j63P9j30
7079IK3p8j23K27j45K10k15J75j57J07l57L55o7M1j00p3K43l34J73K23o2j56R0
7102IL8q4Q1p6K03k76J26j09J40O8J23k24j02j10K4K17k15J30O0q5J4L7j40J52
7126AJ56k91J44j48K48j10j67QK22Q7j40j9MM8J1nk60M70l14M0J59k81J53K30
7150B46j94o5Rj20J55J15k97j7J64n8o4L38l59M52l12K33j75j23n5K40J11k76
7172e2r9J97rJ20k11O0L9l7j22j39J03Q9K16k2k5j21J8K8J12k44m3K30Rj56l7
7197i6K50n8j56R1J09m9r7j01J3Q4K16j77J0J78O1l30J66j12j48m8J49J64j38
$$ plain form
7030 19 141 -39 -271 -126 12 75 102 172 -5 -30 13 -88 -138 201 -111 -152 -37 -145 142 -55 -14 148 79
7053 79 -116 51 80 100 60 101 99 -143 -82 -172 -148 42 231 4 -151 -132 -81 27 109 22 -58 -78 223 60 139 9
7079 9 32 -46 -169 58 -87 123 -92 83 -74 33 -324 31 -36 5 -95 -168 75 -259 -86 137 75 -81 9
7102 9 47 -37 44 -32 171 -105 21 -88 52 120 243 19 -83 -193 -169 48 -167 -37 23 -62 -48 -11 -151 1
7126 1 157 -134 10 -138 110 0 -167 -159 63 150 10 -9 -5 43 54 49 -211 259 -55 -15 144 -137 16 246
7150 246 52 -13 -4 -124 31 146 -151 -168 -4 -62 -126 212 -147 305 -7 226 51 -72 -127 113 224 -52
7172 -52 -151 46 37 157 -54 6 45 8 -114 -253 -150 -61 155 133 108 -13 5 33 145 -99 -142 88 97 -59 -96
7197 -96 154 96 -60 31 140 91 -6 -107 -94 -10 206 29 39 217 278 -52 114 2 -146 -194 -45 119 -19
7220a9k31J0N39k71j73L32j69QL9j90L00j64k26Q9J57Q7l2q7Q6j85O3j4J59j55
7244d7j1J66j22L0k01L70j69M08j95l31O8pK55k89J5K00k94K25M8o7k28J96r3
7267g3J67k00L6J03k8K8M1q4L9J58j35K1k4j89J58P1J32q0J5l6k58K01N7k3p8
7292A9l1J40k17J99j80P2j07O7L9Q9q1m4n8K61l11R3J21j96J62n5J28l57K36n9
7316g0P8N3j19J46j42R0K06k4j10j22N9J5j88J64J7j04p5j13L52q4j14k30K78
7339c7J66j65k8nJ6J32K13k29J0r7L4j51q6K38j8L7M8j78n9J82jk5r8K99l06P9
7365b9K11j61PJ71k09j71M39k69k01J98j10M5Q3n6m1J17l6j9Mj4O1J32o2J69k63
7390dm0j18RJ52q9J7J05n1O4l2K63l17j33j1K10j12J67L2lj09J84j52j83L14j13
$$ plain form
7220 -19 -250 -240 299 28 -145 187 18 26 65 -125 175 11 -215 -126 31 118 86 -1 85 -100 -37 -51 108 -47
7244 -47 -58 108 -14 16 -185 185 16 424 229 -102 -34 -41 214 -75 -60 140 -154 71 119 52 -176 20 -73
7267 -73 94 -106 -70 33 5 33 74 -10 29 187 52 73 49 -140 18 89 221 141 156 120 -138 63 120 97 19
7292 19 -12 128 -89 110 -70 2 -105 -38 1 90 9 -35 -93 168 -143 -50 71 -125 37 -18 110 -247 -11 -70
7316 -70 8 61 -58 88 -54 36 242 218 108 -14 45 60 -128 36 53 -51 -126 -239 113 29 -85 -315 -37
7339 -37 129 -36 -64 -69 -53 79 292 63 73 -24 10 -141 -227 11 -7 30 78 -100 -159 23 22 -3 -101 198 -108 -29
7365 -29 182 21 28 199 -10 -181 258 -11 -212 -14 -124 -79 4 -52 -93 24 -12 -31 -27 -41 20 152 90 259 -4
7390 -4 -44 -162 -153 -1 -90 -73 32 -19 45 13 276 -41 -174 -185 25 -87 80 112 109 0 184 32 -151 163 50
7415E0j17L27k20j39L1J34J2j39J61K0K2m38M69k62j18K8J8K07J10l57K96j99
7437a04P8J08j8k4j17J14j7k18K12n6R5k20J86o5N7j32K46L7R6j61p9J01m6Jn2
7462B2J27j91K2J83rj13k60j16L69q1l2J30j28O3r3J02O2k32K01O9N3j46M6M2
7486I0q1j7J54l04K16n6L22k28k79K51o3j04K10q3j15J24j95K57kj57O3J47l55
7509b05k4NL52j18n8P9m6l04K57L19k30j84J85p0K73j37k43J24m4K7K1j00J80
7532E9L3j54J26k75N3P2J39j08J44j15L74o78N43k22J18L8L7J47k23R1q5j10k95
7555b91L59j60j02R2P5J95q6k23K69p9p7L1j28K03R7l03K38n4j41J43j36J38J85
7578B45j32j16J03R1k4l01J13nJ49r2j49J97k08J15R2j85J50P5L3o5k09K22j92
$$ plain form
7415 50 -67 260 40 -99 -68 66 78 -61 100 120 142 -296 173 -89 -207 -179 -161 46 156 -201 95 -104
7437 -104 -26 82 64 40 -77 37 20 -198 14 -42 53 -167 19 -46 11 -121 125 162 258 97 18 119 73 74 22
7462 22 149 -42 -20 163 154 41 -219 -335 34 -47 -79 51 -77 -14 -107 -5 57 -175 26 95 148 2 48 90
7486 90 9 -8 146 -158 58 2 324 96 -183 68 5 -99 111 28 -87 37 -158 99 97 -60 3 150 -205
7509 -205 -229 -224 128 10 -48 31 -15 -319 -62 257 27 -157 28 -42 231 94 -149 -25 -69 -42 -21 -121 59
7532 59 92 -62 64 -211 -158 -86 53 -55 89 -26 348 -330 213 -9 109 147 184 331 108 199 114 4 -291
7555 -291 68 -92 -194 -102 -27 168 82 -141 128 49 -28 3 -125 78 175 -128 110 56 -85 58 -78 60 245
7578 245 113 -3 100 191 167 -134 -21 -26 123 31 -118 79 -129 -14 78 -107 43 118 151 86 -123 99 -93
7601i3K01j93J59q2k17K24r1O4j8J01m8n3L47k23j46K02k8l9J8R4j88%p7J5M5
7626b6K54j43m9%K17j56j71K7o7K23k09K08j91N0J94j51K5j12R8J14k53Q6q3L37
7650B22l03k2J35rJ25j4j38L0J6J02j73R6K28j76n7%k01J20j50R9Q1m5J66j44
7674a2j8P4j32J4q9J31J55J0n4l17M66j62O6J7j90J17l64M8K66J59j04p0j60M40
7698B91k88J63k72J10q6K37j33o8j38K53k49K47q6R7N0k49Q1J08L9l34L08j78
7720i7K20j37j8j54P3J72j60K68k71J85k74J90o8R8P2m6k70J68j35K41R1k58J50
7743D0j52O9O8j99J59j04K80j71J91j85Q2j56j34L00%k41J32J91j97p0N9L7K11
7766B10J3k16N9j00J34N1j36n6r0J79l6J97J43n94K7M06l84K35m7J10J14k52j12
$$ plain form
7601 -93 108 -85 74 -8 -225 -1 -92 -28 -46 55 7 -46 301 78 -68 134 106 67 85 179 -9 -9 -86 -71 -26
7626 -26 228 85 36 36 253 97 -74 -47 -114 109 -100 108 -83 -33 161 10 35 -77 21 135 -118 -32 -115 222
7650 222 -81 -103 32 23 148 134 -4 26 42 144 -29 67 295 119 62 62 -139 -19 -169 -70 11 -34 132 -12
7674 -12 -30 44 -88 -74 -163 -32 123 133 79 -238 228 66 132 149 -41 76 -288 -240 26 185 81 11 -149 291
7698 291 3 166 -106 4 -82 155 22 -46 -184 69 -180 67 -19 78 128 -121 -40 68 107 -227 81 -97
7720 -97 123 -14 -32 -186 -113 59 -101 167 -104 81 -193 -3 -71 27 99 53 -217 -49 -184 57 148 -110 40
7743 40 -112 -43 25 -174 -15 -119 161 -10 181 -4 78 -78 -212 88 88 -153 -21 170 -27 -97 -38 -1 210
7766 210 223 7 66 -34 100 151 15 -41 -131 48 12 209 352 -242 -215 191 -193 42 -5 105 219 -33 -145
7789a45K68j54L5k01K17nj03L56k08k68J74K0J71k69J48J24j05K8k30L61l41L
7811a24K10m12L43j13m1K43k65n3J08K5J30m11J33K68M9j99K43k9n4k04J73r8
7833g8J19J22k32K17n6lk67N6L06j05p7Lm4L3j89K54j93N5K51j07j28J41l2mp2
7858c0pr5J39Q8k74L31k13o7N5J71k42n9J59J37j62L04j98J18j24J4o1j49K11
7881D6l4NQ8k40J4OP5J22r5p6n6K98j95K11j66k15K47j04J4k71L27m6J35nJ88
7906B73k01j62O2J41j23J65k38J79N2k24J45k6n2Q5n0K16j8j96J39l6k02P0Q9
7929H8L7o1k40P8K64j41j07L7J04l22J08K43k60R2R0mj93K16k46L49R8k77K3J11
7953H7j1j39K3J75n6j80O7l3K66l19J00N4o5nR0N4k40K92r7L6r1J64j24k28L38
$$ plain form
7789 -145 123 -31 4 -197 20 15 -88 268 60 -208 -34 -14 157 -112 36 160 55 83 -147 214 -127 -124
7811 -124 86 -326 17 -96 -137 106 -159 -212 -104 -79 51 -360 -227 41 90 -109 134 105 51 -153 20 -78
7833 -78 41 163 -69 148 92 89 -178 -122 184 79 2 5 -39 -6 -195 59 -134 -79 172 65 -63 78 46 42 -30
7858 -30 -37 -132 7 95 -179 152 -61 -128 -73 98 -144 -203 -44 93 -69 235 37 155 31 45 -16 -165 46
7881 46 12 17 105 -135 -121 -115 -40 82 -13 -89 -145 153 -42 169 3 -212 35 -69 -55 -326 1 -45 90 85 273
7906 273 72 -90 -28 113 -10 155 -83 96 148 -76 69 43 -9 76 26 242 224 28 167 131 -71 -1 88
7929 88 125 64 -176 -98 166 25 -82 -45 59 -263 -155 88 -172 -80 10 6 -187 29 -217 132 230 -47 -24 87
7953 87 76 -63 -40 135 79 -101 -34 -67 199 -120 -20 34 -31 -36 54 108 -132 160 63 99 8 172 48 -180 158
7978A58k44J23l2N5jj86L9K04k91K08r5j60K28J30q7j66J31l2k2K59k55j85J97
8001b4M9n9L3J50j28j7J07k27K08J1j20mj27L60l06j5K43k14K03k47L66j78m6
8024A8L7J53j22r4j67J62J39Q2j01k37P0m5K51q3k26Q8PL4j20K16k83L35J3K9
8048A56J53m54K74m77K72k3K26l16J55J7J88j25j33K05l3j08Q2j9Q6l11K31k66
8070b20K28k12K97j82Q6J43j96J45L18o74J21MO8l7J51j11J22L6j52J13n4k7J78
8093A45j16o2J05M5j76m4J50kk7J15k18j77K45m3n4K80j13O7k54M8R9j38O9N2
8117dJ70l42P5K00p3j36J91q1L3j78J97r0K0j75K93r7M4j83L18j54j22K35j14
8140B7j13J56k42M9N5q6J62o0n3K12o3k8k27K47k5Kj85J43J1m9K50m37J94J97
$$ plain form
7978 158 -86 37 5 60 59 -127 -88 116 -175 33 -62 -222 6 136 49 -117 14 -18 -40 219 -36 -221 -24
8001 -24 25 -34 -1 149 21 4 111 -116 92 103 -17 -21 -148 212 -94 -109 134 -80 123 -124 242 64 18
8024 18 55 208 86 -8 -175 -13 126 208 107 -130 -60 -105 146 63 -163 -75 -68 -34 -154 62 -221 114 127 156
8048 156 309 -145 129 -348 -76 -99 127 -189 -34 -17 171 46 -87 118 85 -23 59 40 126 -185 46 -220
8070 -220 8 -204 93 -89 -3 140 -56 89 407 -267 -146 -142 -74 -111 40 -71 51 87 -65 48 -6 -33 145
8093 145 29 -33 72 117 -59 -103 47 45 18 133 -85 -262 -17 -60 -114 166 53 120 -134 -86 13 -125 -56 -4
8117 -4 166 -176 -101 99 26 -110 81 0 33 -145 52 -38 -18 -193 100 3 47 -136 182 28 -94 141 27
8140 27 -86 70 -172 -123 -68 -154 8 -52 -105 107 44 16 -211 36 11 13 -172 -29 -18 -67 183 -254 -60 137
8164A37m5k14K16j7O7j92N3n7K56k30J99j46k10k9K01n3J96rn4j25q9O6O4n9O9
8189ek33L35
$$ plain form
8164 137 92 -122 94 77 144 -48 5 -52 204 -26 173 27 -183 -212 -11 -64 132 123 69 -56 -145 -79 -15 -74 -5
8189 -5 -238 97
8191I7
$$ Imaginary data points
##PAGE= N=2
##DATA TABLE= (X++(I..I)), XYDATA
0@%%%%%%%%%%Pj5J6j6K4l2L4m2N6o7P6r0J11j34J55j80K10k43K82l28L76m27M85
33B58n48O20p01P89q85R88j102J228j366J518j682J859k055K269k504K761l040
50a593L348l689M067m485M953n479O075o759P547q470R573j0912J2582j4732J7618
65I644k1721K8056l9240O4815k32232l2629L92602l9539o4507O3300P4042j73960
77B8631j67032m2706M0699L5534J23821J31276M1768o9024p6822j00496j11036
88a65387l8868J17900J39550K5157k4087P9686O2687j49652k55053m7028J73399
99h1696J34287j3851p729Q0967N7793q4284j65325r3014L7349Q0181N7032O0478
111F2188O7509K143p7784r1494n9242j8456L2251N1840L2590N3276R2909J0559
$$ plain form
0 0 0 0 0 0 0 0 0 0 0 0 7 -8 8 -8 16 -16 18 -24 32 -35 41 -49 62 -72 83 -97 113 -130 152 -176 200 -227 258
33 258 -290 330 -371 418 -467 521 -581 647 -719 799 -883 976 -1079 1190 -1314 1447 -1593
50 -1593 1755 -1934 2133 -2352 2601 -2878 3197 -3562 3985 -4485 5088 -5824 6758 -7974 9644
65 9644 -12077 15979 -23261 41554 -190678 -223307 169295 129756 65249 128549 202591 28631
77 28631 -138401 -181107 -140408 -104874 18947 150223 191991 122967 46145 -54351 -165387
88 -165387 -204255 -86355 53195 78352 54265 133951 196638 46986 -208067 -255095 -81696
99 -81696 52591 38740 31011 111978 169771 85487 -79838 -172852 -135503 -55322 1710 62188
111 62188 129697 131840 54056 -37438 -96680 -115136 -82885 -31045 1545 54821 147730 158289
123A58289j46488j51508R957J01878L2962l5723J7631J03391P1192p4237j52395
134f5051o1949N1793L9178m067M0907Q0623J8016n4428m9160k3150k3776j8375
146f9439Q761M3472P3764N5690k6741r1172n7521J9832L2748k0750l7778L7776
158c1358J10024N0637q2282j01385r47M1873j3161k4873L5992N7459J4712j8045
170C8646j9013j8865k4657k5770n562L9599N9163J5806l6872l0675N139J0578
182G517j6526l9821j8759N0816Q2359Q838p0163l7460L3865J8243l5034k5526
194d1651K1102L3766J6625j379j1780j3254j5431j9743m02L0241K3529j3415j6468
207h260J2776K1013m794l1135l3179N867M9288L3378k6857l7158J1281L0652l901
$$ plain form
123 158289 11801 -139707 -129750 -27872 5090 -30633 -13002 90389 161581 87344 -65051
134 -65051 -127000 -75207 -36029 -40096 811 81434 99450 45022 -4138 -27288 -51064 -69439
146 -69439 -60678 -17206 56558 112248 85507 -5665 -63186 -43354 -10606 -31356 -69134 -31358
158 -31358 78666 129303 47021 -54364 -55311 -13438 -26599 -51472 -15480 41979 56691 38646
170 38646 19633 768 -23889 -49659 -55221 -15622 43541 59347 22475 -8200 -3061 7517
182 7517 -9009 -48830 -67589 -16773 65586 74424 4261 -33199 666 18909 -16125 -41651
194 -41651 -20549 13217 29842 28463 16683 3429 -12002 -31745 -32147 -1906 21623 8208 -8260
207 -8260 4516 25529 20735 -10400 -43579 -37712 11576 44954 18097 -19061 -7780 22872 18971
220A8971k9500j8851O244K5328J9169o641j4770q56j517r700M796J4762p673j7334
234a7572R954K6356Q317j6029k4933j1277K0816K8799r326l2831k330K7421J4814
247B2179j1637k0501j4085P422K5431P157j8188q267J0881O259N71K863p605j7070
261a4590Q42K0536J0344q416j4942q990R436K1002q04k7340j2733J9415K0538
274A4298J990j0400j6785n534J8958J6408j3531k0469L178J4044Q628N017p034
287H768k0731n475J9308J1981j0230j2482l434O120J6883P310j9672k0298Q485
300a3467J9759O487m687j0164q738R851J9897l653k3626q773J0170J0839P845
313A1740k103j8246j0352J6887J6444q817j5136l123N844J4918J2621j1249k3087
$$ plain form
220 18971 -10529 -29380 -23136 2192 21361 14720 -50 -906 -2423 -12123 -7327 7435 -238 -17572
234 -17572 -7618 18738 27055 11026 -13907 -25184 -4368 24431 15105 -17726 -20056 7365 22179
247 22179 10542 -9959 -24044 -16622 8809 15966 -2222 -10489 392 6651 7222 10085 2480 -14590
261 -14590 -13748 6788 17132 8716 -6226 -15216 -5780 15222 14418 -12922 -25655 -6240 14298
274 14298 16288 5888 -10897 -16431 2527 18935 5404 -15065 -11887 2157 10785 15802 8768
287 8768 -11963 -17438 1870 13851 3621 -8861 -12295 -6175 10708 18018 -1654 -21952 -13467
300 -13467 6292 12779 8092 -2072 -10810 -959 18938 15285 -8341 -17114 -6944 3895 11740
313 11740 9637 -8609 -18961 -2074 14370 5553 -9583 -12706 -6862 8056 20677 9428 -13659
326a3659k54J8516Q020n806r808r479M057K0749O688k0658j7409N820J3652Q866
340I295J315j4041j3483J2053K1421l028j8555p820L937J0418J4282o93k1062
353e961r694J4153J2564k576r413j1763k710J8308J7651j2181k3708j163J5238
366a255J1168J394j1357j4458O835K2405L541j8297j0717K852N699R455N430j3240
380e45j4357O725J4604K467o577j0660q579J1033K3558J247k4546j2751J3518
393d863J7152L694j2970j8772J725K4337R907j8479j5090M733O722L866N071l618
407C415j2759p86J1651P303o28p261j3740j153K2858J5267j7695k3763K983K0665
421F357J2533q385k4875r632K4578K2846j4900k5350L308J6338K679l330j062
$$ plain form
326 -13659 -13913 4603 12623 6817 -2991 -12470 -8413 12336 19024 -1634 -19043 -13223 429 9295
340 9295 10610 -3431 -16914 -4861 16560 13532 -5023 -12843 -8906 1512 15794 15101 -5961
353 -5961 -15655 -1502 11062 8486 -927 -12690 -15400 2908 20559 8378 -15330 -16493 -1255
366 -1255 9913 11307 -50 -14508 -7673 14732 18273 -24 -10741 -7889 -2190 7265 12695 -545
380 -545 -14902 -8177 6427 8894 2317 -8343 -16922 -5889 17669 18916 -5630 -18381 -4863
393 -4863 12289 15983 3013 -15759 -14034 10303 20210 1731 -13359 -8626 -1904 1962 7033 3415
407 3415 -9344 -10130 1521 8824 8196 935 -12805 -13958 8900 24167 6472 -17291 -14308 6357
421 6357 18890 10505 -14370 -24002 576 23422 8522 -16828 -13520 2818 5497 2167 1105
434A105l110k083L259M396M737Q84j3432j3019J3292K3813m711k6087r256J5458
448d754J8813L359k0934k3424J2169L5100L118l2896j3991K1734J8592p446j4678
461e238j865R450L901p984j359J2909j317k3017m060K7640J2361k3300k0446R256
475a3069K1787J0824j0690k5997o757L0130K4236k0530l2860M362L0830J1451
487B3717k1186k1092R354K1932m463k1264N912K2137j0297k6631J0583L1675l598
500A6779l1231q117K3145K0905m704k3886j4684J6403K6742j973k8642j5446J7289
513g420K7727m22l1514j5945K8019K4125k3156k5764K1600K4841k1071k3310K1274
526a016K6688j6148l1501L492L2565J3566k5250k7909J0608L1142N121k3938j8513
$$ plain form
434 1105 -2005 -4088 -829 3567 8304 9188 -4244 -17263 -3971 19842 15131 -10956 -20212 -4754
448 -4754 14059 17418 -3516 -26940 -14771 20329 23447 -9449 -23440 -1706 16886 9440 -5238
461 -5238 -7103 2347 6248 -1736 -3095 9814 8497 -14520 -18580 9060 21421 -1879 -22325 -13069
475 -13069 8718 19542 8852 -17145 -23902 6228 30464 9934 -22926 -18564 12266 23717
487 23717 2531 -18561 -9207 12725 8262 -13002 -7090 15047 4750 -21881 -11298 20377 16779
500 16779 -14452 -22569 576 21481 16777 -7109 -21793 -5390 21352 19379 -9263 -24709 -7420
513 -7420 20307 19885 -11629 -27574 445 24570 1414 -24350 -2750 22091 1020 -22290 -1016
526 -1016 25672 9524 -21977 -18485 14080 27646 2396 -25513 -14905 16237 21358 -2580 -21093
539b1093N179K0805J6813j2548l1480Q11L8169J0381l6182j5850L1249J7524k6143
552b365j7051K3181J9562k0842k8893J2829L6953n00m0490j3156L5249K4100k1850
565F727k6172L310J7210J2886N10j8887j7235J7482K9759j0012l4154m35L0950
578A1939P808k6175j2688K2236J7024k2434k5099K1813L4251j7611m1928J0320
590b0544M5163K961l7808j4407K1464J9401j319j5380j5063M682K2688P588k1188
603a762j8706J0476K2765L94k2589q160K1956J3682k3021j6629K6607K1520k8170
616a637k6617K6729L2681j6852l4950J118K8248J2472j7018k1053J464K1289R888
629A5762j2705j4747j443J3278J2889m524j9353j603K2081O230k3022o792K4147
$$ plain form
539 -21093 -15914 4891 21704 9156 -22324 -21513 16656 27037 -9145 -24995 6254 23778 -2365
552 -2365 -19416 3765 23327 2485 -26408 -13579 23374 22874 -17616 -30772 4477 28577 6727
565 6727 -19445 -16135 1075 13961 14471 -4416 -21651 -4169 25590 15578 -18576 -19011 11939
578 11939 19747 -6428 -19116 3120 20144 -2290 -27389 -5576 28675 11064 -30864 -20544
590 -20544 24619 27580 -10228 -24635 -3171 16230 14911 -469 -15532 -10850 11838 19426 -1762
603 -1762 -20468 -9992 12773 13167 -9422 -17582 4374 18056 -4965 -21594 5013 26533 -1637
616 -1637 -28254 -1525 31156 14304 -20646 -19528 8720 21192 4174 -16879 -15415 5874 15762
629 15762 3057 -11690 -13133 145 13034 8510 -10843 -12446 9635 15865 -7157 -13949 10198
642A0198N711k6048p483K6265J3237k2263k2216J0972K6871L092k7405j5343K0486
655c926K3293q322k0714k056J0517Q885K922r270j3043O756J7709l747j7866J273
669g589J4248k852j2884L478J3461Q73j5829q457J5037J8710r706k6310J988K8008
683A2176Q560k0952j3346P689J1546M382n349j2531k924J3296P815j0375p967
696g980N141M136k542p07L041K471k073o669q39J3006P372j6734j4968J4839J9829
711A7323p214j8555l413J0730R366q69j1760p897Q907J1817l429r045l08L288
725a059J256K668R31l802j166J742j221J753O471m405j3643J462J6223L932j3203
740b061r115L936J0951N996o677j3030J011J4179M500q211m643R82P80M090L698
$$ plain form
642 10198 15909 -10139 -17622 8643 21880 -383 -22599 -11627 15244 18336 -9069 -24412 -3926
655 -3926 19367 11045 -9669 -11725 -1208 7677 10599 1329 -11714 -4958 12751 9004 -8862 -7589
669 -7589 6659 3807 -9077 -5599 7862 8735 -7094 -15551 -514 18196 8490 -17820 -15832 12176
683 12176 20736 -216 -13562 -5873 5673 10055 4706 -7825 -10749 2547 10362 -13 -7980
696 -7980 -2839 1297 -1245 -1952 1089 3560 1487 -5182 -6021 6985 14357 -2377 -17345 -2506 17323
711 17323 10109 -8446 -11859 -1129 8237 7368 -4392 -12289 -3382 8435 5006 -4039 -4347 -1059
725 -1059 197 2865 3796 -6 -1172 570 -651 1102 7573 3168 -10475 -9013 7210 11142 -2061
740 -2061 -11176 -7240 3711 9707 3030 -10000 -8989 5190 9690 1479 -3164 -2182 -1402 2688 6386
755F386m827o079J960K939K69K959p39r435k872J0914P392o873p952j17N241P638
771F804J338j0712o703Q707R609l754o536j949j97L077N591k074q309n63N107
786e64K054N11K35n889l654P317Q321m122p555o13K903N098L856n700r899K314
802e387J0177J522o583l807j224K113O552J996p879m625M995M811J049ql731n899
818e928L771R275r94p609k519J509K915M500p84r245l397Q317N687l619l894k020
834d035n9N333N739n026p254K369N585J150n80j975m937Q9P253J825o198l335
850d056J140J179L452K703n796o175M880P504q30l674k626r75L264O920j812q811
866c713r81O377J809j928j011l662j492N298L640l871l815O47J026J064M645r65
$$ plain form
755 6386 1559 -4520 -2560 379 648 3607 2868 -6567 -9439 1475 8867 1994 -5958 -6075 -834 6804
771 6804 8142 -2570 -9273 -566 9043 5289 -1247 -3196 -3393 -316 5275 3201 -5108 -5671 -564
786 -564 1490 2001 2236 -3653 -7307 10 8331 4209 -3346 -3959 -1056 4042 7898 2198 -7701 -5387
802 -5387 4790 6312 -271 -4078 -5302 -3189 3363 5359 -2520 -7145 -2150 2661 3710 3702 -29 -5928
818 -5928 -2157 7118 6124 -1485 -4004 -2495 420 4920 4136 -5109 -8506 -189 5498 1879 -2015 -4035
834 -4035 -4094 1239 6978 1952 -5302 -2933 2652 3802 3222 1247 -3690 -3601 3652 5477 -721 -4056
850 -4056 -2916 -1737 1715 4418 -1378 -7553 -2673 4831 4001 327 -2299 -3274 -10 6910 5098 -3713
866 -3713 -4694 1683 3492 1564 553 -3109 -4601 697 4337 466 -3349 -2702 -1676 -612 4033 3068
882C068p680L7P954K646l462l145k938R11P069J727q682m614O228M203k335k274
898a287p88j964L195M909k405l988K090O99j536K928L033m905m783L552N416m05
914C761l503m347j464P017N248o980p968M635P725j478l622q60k65K212L985j586
930B510m879K009L735l125j870M063j86m962p79L287J870L94l440n604L708J0687
946G418j772j2334n68J1083L548o435m067J047K983L380j519n731J3M833k62l830
962b213R93K058j736j028P42L81K734J715o417m504R615Q601r898j0773P041J1374
978H685k502r643l005N479O291j886p912j325P509J439n294m73L200l69l26J810
994A678j970j184M739J712r351l11J1446J735j3411m687J1072Q095o968j1956
$$ plain form
882 3068 -4612 -4575 3379 6025 2563 -582 -3520 -2609 4460 6187 -2495 -7109 -881 3322 987 -1287
898 -1287 -2075 -4039 -844 4065 1660 -2328 -238 461 -1075 1853 4886 -19 -4802 -1250 4166 3761
914 3761 258 -4089 -5553 1464 6712 -268 -8236 -3601 4124 2646 -976 -1836 -2101 111 4096 2510
930 2510 -2369 -360 3375 250 -1620 2443 2257 -2705 -3484 -197 1673 2067 -1373 -6977 -3269 7418
946 7418 5646 -6688 -7256 3827 7375 940 -3127 -2080 903 4283 2764 -2967 -2954 1879 1617 -2213
962 -2213 -1220 838 -898 -1926 -1184 -803 1931 3646 -2771 -7275 2340 10941 1043 -9730 -2689 8685
978 8685 6183 -3460 -6465 -986 5305 3419 -4493 -5818 1691 3130 -2164 -2637 563 194 -132 1678
994 1678 -292 -1476 3263 4975 -4376 -4687 6759 8494 -4917 -9604 1468 9563 2595 -9361
1008i361J453J1872M903j0794q212Q976Q947o037n808L808K670k943J055J763
1022B292l150l17M399j902o157L220P352l453r308j63J1168N611r717j1941O684
1037e382J7135k304j8530r50J6947L305j3077l148P888J657l857o58L86l96P94
1052a90P17k063m60J907J860j642l753O26P358L196r904r294J2685J4321j1465
1067C899j7576Q422J7249m528j4912q89J0659K243n456l380L044L253j555l462
1081b989K976K869k666j462K470j342j385N624J444j1086l278J4891N996j6104
1095d042j0348J3729J2492q180j3244K429J2022K071r641m054Q231M609o946l212
1109d084P139J736o570o29M771j733j790L271j069p327K688J0375k021j2280j103
$$ plain form
1008 -9361 -7908 3964 8867 -1927 -10139 -1163 7784 1747 -4061 -253 2417 -526 529 2292
1022 2292 -858 -1175 3224 1322 -4835 -1615 5737 2284 -7024 -7187 3981 9592 -125 -12066 -5382
1037 -5382 11753 9449 -9081 -10031 6916 10221 -2856 -6004 1884 3541 -316 -974 -588 -984 -190
1052 -190 527 -1536 -1996 -89 1771 129 -3624 -2998 4360 7556 -2348 -11642 1043 15364 3899
1067 3899 -13677 -5255 11994 7466 -7446 -8335 2324 4567 -889 -4269 -1225 2028 473 -2989
1081 -2989 -13 2856 190 -1272 1198 -144 -1529 4095 5539 -5547 -8825 6066 12062 -4042
1095 -4042 -14390 -661 11831 3651 -9593 -7164 4858 6929 -2712 -6766 1465 6074 -872 -4084
1109 -4084 3055 4791 -1779 -2408 2363 630 -1160 2111 1042 -6285 -3597 6778 4757 -7523 -8626
1124h626J1819O143q374j0103M856J2672p90j2955j176J1294J454r783l05P630
1138C756j073o539J290M048j132j231Q84k372k10M969J831m670m121K519O961
1153D910K090p940p079O914J0694n786j1919L577J0469l137p833K587N418k390
1167E75l677J391K763J212j553k984M72M617N59l019j514K15J076L222N83p130
1183c192l490Q504M895q284o048O587N723m216l961K817K011k85j678n21K638
1198A500J964l491l193L742L919l474l827K017J054M82O71j575l913J181O914
1213C971r97o352J16M984J089k134j282j36J906J113k414j502L434O04n376l26
1229c302N378L53m756k02J536Q34R86K12k727j199M499J954l654j723K022J105
$$ plain form
1124 -8626 3193 9336 962 -9141 -4285 8387 7597 -5358 -6534 4760 6214 -3569 -3874 3756
1138 3756 2683 -3856 -2566 1482 350 -881 3 -2369 -2579 2390 4221 -449 -4570 -2051 4910
1153 4910 7000 -940 -8019 -1105 9589 3803 -8116 -4539 5930 2793 -5040 -2453 2965 575
1167 575 -3102 -1711 1052 2264 711 -2273 -1801 2816 3375 356 -1158 -943 133 3355 3938 -3192
1183 -3192 -6682 1822 6717 -1567 -7615 -1028 4695 479 -3482 -665 1346 1061 -617 -1138 1500
1198 1500 3464 -27 -3220 522 4441 967 -2860 -843 211 693 1364 -211 -4124 -2943 3971
1213 3971 2974 -3378 -3262 1722 2811 677 -605 -741 1165 2278 -136 -1638 1796 2400 -2976 -3302
1229 -3302 2076 2429 -2327 -2529 -993 -159 827 1039 -1688 -2887 1612 3566 -88 -1811 211 1316
1245A316q2l7j792q49K466L30l228J52L459j949k958K250K570j924r65R49K52
1262d0P84J341j533k526K539K571k434k197J855K15j060J197o15k141R36K371
1278A263j613j965K734R51k700L86K353m79j451J207j27r44J750L59l015j42L064
1295A631q09k698P63J391j208N97R41j690m34K776j15k516J044K359j513j086
1311e67J834j62j505R96K53j979M75K093j719k057K055J250k444M17J508n19p33
1328h04J907p85j153J870J064k287p75K215j20j914M49P11j891P96J776j864j419
1345b224K434M92k142R76J649j447o89K115Jj632J119P80k185N70K237j337k440
1362a723J218J462j741k80J286j517k58K497j73k431J108K060j320q55K370l28
$$ plain form
1245 1316 1234 1197 -595 -1444 1022 1352 -1876 -1724 1735 -214 -3172 -922 1648 -276 -1241 -292 -40
1262 -40 744 2085 552 -1974 565 3136 702 -1495 360 575 -485 712 97 -2044 -1108 1263
1278 1263 -350 -2315 419 1370 -1330 -944 1409 930 -521 686 559 -385 1365 1724 -1291 -1433 1631
1295 1631 822 -1876 -1113 278 -930 -333 608 -1082 -1516 1260 1145 -1371 -327 2032 519 -567
1311 -567 1267 1105 -400 596 849 -1130 -655 1438 -281 -2338 -283 967 -1477 -1060 448 -71 -804
1328 -804 1103 318 -835 1035 2099 -188 -963 1252 1132 -782 -333 378 -1513 -717 1059 -805 -2224
1345 -2224 210 702 -1440 -464 1185 -262 -951 1164 1165 -467 652 1432 -753 -183 2054 717 -1723
1362 -1723 -505 957 -784 -1064 222 -1295 -1553 944 771 -1660 -552 1508 188 -667 1703 1375
1378A375k182J487N30j545J68J431j640j195K016N66k711n6K299q01p42J250m51
1395b01j063K374J080k389j046K826n43j549J367j54j727N38J200q94j086J798
1411E31n77o80N86K096k304j302K466L97p75M31l36k063J227K781j272k608R93
1428d09J268j259Q5O22j082l24J211l68q36J601K43k244P18K882r08k201J433
1445D32J040j507L25J216j911j392K475Q73k581q19J501M05m31L47p79k29J891
1462H56q4j750J453J579k006j241K580R55l106m89K304q02j251J362l58j872P70
1479a100K081n09j194m7K88Q23J444j583j746K017J732k602j009L140j47l833
1495b245R69L329j239k957J032J378n12j87L60l74J54O70l03N16J140k038q61
$$ plain form
1378 1375 -807 680 1210 -335 -167 1264 -376 -1571 445 1011 -1700 -1756 543 -258 -1000 250 -201
1395 -201 -1264 1110 2190 -199 -1245 1581 1038 -511 856 702 -1025 -487 713 -181 -1267 531
1411 531 -46 -726 -140 1956 -348 -1650 816 1213 438 869 533 -1530 -303 2478 1206 -1402 -409
1428 -409 859 -400 -315 307 -775 -1099 112 -256 -1092 509 752 -1492 -774 2108 1200 -1001 432
1445 432 1472 -35 290 1506 -405 -1797 678 1551 -1030 -1849 -348 57 -374 -27 -806 -1035 856
1462 856 772 -978 475 2054 48 -1193 1387 2342 -764 -1253 1051 249 -1002 360 2 -1870 -1100
1479 -1100 981 472 -722 -769 -481 342 1786 203 -1543 474 2206 -396 -1405 1735 1588 -2245
1495 -2245 -1276 2053 814 -2143 -1111 267 -245 -432 -72 -446 -292 378 75 591 1731 -307 -1168
1512a168K995N63l455r55M045l35m228J229L101j975k680K107K196j645j498R24
1528g79J464N81j240j116J267J647j772j113K853Jl806K85M356p34n339J385M050
1545A990j681k965J422K616j718r25J365J451m99j813o35K930J016l710o40L666
1561A870M40m742P71M333j707m702K588L781k425l288K063K814j124j705O63J393
1577A023J77j619l67K433M91l809l47M375n5n050K70M792j503m168K410L170k523
1594c00k795K771K860j636k738J199K277P80k711j213K570J177l692o59L774j36
1610A528m577J011M487j774l656K183K944j913k248K693J681k531r50J224J664
1625A766l53k736Q4K786R62m471n41M553n61l890O7M200j556l338K641K555k364
$$ plain form
1512 -1168 1827 2390 -1065 -2020 2025 1690 -2538 -1309 1792 -183 -2863 -756 1440 -205 -1703 -779
1528 -779 685 1266 26 -1090 177 1824 52 -1061 1792 1793 -2013 -1728 2628 1894 -3445 -2060 1990
1545 1990 309 -2656 -1234 1382 -336 -1261 104 1555 1056 -757 -1392 1538 2554 -1156 -1796 1870
1561 1870 2310 -2432 -1661 2672 965 -3737 -1149 2632 207 -3081 -1018 1796 672 -1033 -370 1023
1577 1023 1200 -419 -786 1647 2138 -1671 -2018 2357 2302 -2748 -2478 2314 811 -3357 -947 2223 -300
1594 -300 -3095 -324 2536 900 -1838 -639 1638 2418 -293 -1506 1064 2241 -1451 -2110 1664 1528
1610 1528 -3049 -2038 2449 675 -2981 -798 2146 233 -2015 678 2359 -172 -1122 102 1766
1625 1766 1413 -1323 -1239 1547 2509 -1962 -2503 2050 1489 -2401 -2334 1866 310 -3028 -387 2168 -196
1642a96j335J920N80o02m64K87P25l78r16m53K569n04l830K77M558j056m378J058
1660b138M483j562k826J644K444k010j090J559P45o94n80p84N46J013q83q66R64
1677c5N21k131N28K948j638l047K215L172k076k745K503J821j906r74J310P73
1693A239o80q18n17J078J138j802j516J533J417j954o85K310l81j689J447J697
1709A817k213j069K815L31j946l14R88K17n04m14k18J68R26j126q11K048P62k771
1727a314k95K398O14k180Q14Q36r80R5J430l79j735O58R65j021j86J27m86J56
1745d83J025r30o38J018K83j425L97K268r60j852J046J811j132o38P17l52m37
1762b82Q15M4j160PQ87p67j92R15p65q22J352Q35j346M9J318p34q28J946J45j844
$$ plain form
1642 -196 -1531 389 969 367 -97 190 915 537 -379 -832 1737 1233 -2597 -2320 2238 1182 -3196 -2138
1660 -2138 2345 783 -2043 -399 2045 35 -1055 504 1249 555 -25 -809 -263 750 -133 -999 -35
1677 -35 486 -1645 -1117 1831 193 -2854 -639 2533 457 -2288 215 2036 130 -844 466 1239
1693 1239 559 -259 -776 302 1440 -362 -1878 -345 1072 -882 -1567 743 362 -1327 120 1817
1709 1817 -396 -1465 1350 1681 -265 -579 409 626 122 -292 -510 -342 584 -542 -1353 695 1457 -1314
1727 -1314 -1609 789 1403 -777 37 873 -107 -12 1418 1039 -696 -38 927 -94 -280 -153 -639 -483
1745 -483 542 -388 -1026 -8 275 -1150 -753 1515 555 -1297 -251 1560 428 -210 507 155 -282
1762 -282 533 577 -583 -576 311 -456 -648 267 -498 -1320 32 867 -479 -430 888 154 -674 1272 1417 -427
1782d27L8J346l68q13N32l97r88J133O52j544k63J212np09R98K95j373J72J612
1801A103l95p61P98k57j163P43J198j581r83J195L64q29O30r5j024N49J476n62
1819D06j113P50N60r70P90J010j357r52J288N88j250K61K12j184L08J690q27j614
1837a404P41R88p88L15Q79p37j051J770N10j319K96N39j029J15J147l41j840O44
1855e65J010q89l8P22q99n74J648K04j241l7J240l11l32R11l14j220M79J333r68
1874A59m07P41n46o77R90K77j536k34J483j07o27J016n27q14J002J149q73q84
1892d15Q51o5n69P69M51j645n04J526J37j210J51K00n96Q45P78r29p89J301M81
1911G68r09P36M79j333k23J469l40j198P27O2j033M62J214j175r55R55R74p49
$$ plain form
1782 -427 -389 957 589 -224 308 -89 -1077 56 708 -836 -1099 113 108 -601 397 692 -681 -509 1103
1801 1103 708 -53 745 488 -675 68 1266 -315 -1298 -103 261 -568 62 -33 -1057 -508 968 406
1819 406 -707 43 603 -367 423 1433 76 -876 412 1000 -250 11 223 -961 -653 1037 210 -1404
1837 -1404 -663 325 -463 -148 731 -6 -1057 713 1223 -96 200 739 -290 -175 972 631 -1209 -565
1855 -565 445 -444 -482 240 -659 -1233 415 619 -622 -659 581 270 -62 849 535 -685 -206 1127 159
1874 159 -248 493 -53 -730 260 537 -999 -1233 250 143 -484 532 5 -809 193 1342 469 -415
1892 -415 436 371 -198 571 1022 -623 -1127 399 536 -674 -523 -323 -919 -74 704 -225 -1014 287 768
1911 768 -141 595 1074 -259 -482 987 647 -551 176 238 -795 -333 881 -294 -1249 -294 680 -69
1929f9m36N49n65Q25Q00o80j202J006J107j320j57R13m73j288P51O67j137O1N15
1948a33l74m77J388K27j476O7J460K38n38lr01L96J494l28k173L53J950o68j750
1967a248J033P60j162l56J203l80l12O35j1r31R47J205j147p82N39L58J99O0j148
1986e38o35J844J016k566j262K479J346k345j013J751N50m89l44o2L09R89r9j349
2004d18J92J479p25q37J70Nj53O47k41j931N72K743j83l557R22L414p81k297J52
2023h27J446Q62l46j829j80J676O97j872q02J681k39j045j79J298p94J04J064
2040G15j065j307K003J808k260k107K315K109j284k121N7K042J104k029k230J457
2056g93K962j350l022Q10K620q17j554R16O92o96N76K28j250L12J815m34j831
$$ plain form
1929 -69 -505 44 -521 304 1104 424 -778 228 1335 15 -142 771 298 -990 -239 428 -709 -648 -133
1948 -133 -507 -984 404 631 -845 -778 682 920 382 379 -522 -126 1368 1040 -1133 -780 1170 502 -1248
1967 -1248 -215 545 -617 -973 230 -150 -462 173 162 -769 178 1383 236 -546 -7 351 550 610 -538
1986 -538 -1173 671 1687 -879 -2141 338 1684 -661 -1674 77 627 138 -206 -268 41 1030 931 -418
2004 -418 -226 1253 528 -309 -139 -134 -287 360 119 -1812 -1240 1503 1320 -2237 -1315 2099 1318 -979 -827
2023 -827 619 1481 1135 -694 -874 802 1499 -373 -1175 506 267 -778 -957 341 -453 -349 715
2040 715 -350 -1657 346 2154 -106 -2213 102 2211 927 -1194 -1137 905 2009 -20 -2250 -793
2056 -793 2169 819 -2203 -1393 1227 410 -1144 -228 464 -232 344 572 -678 -366 1449 1015 -816
2073h16j42J903Q06j681j847K70K874P74l734j865M039K296l313k265K694K040
2089B033j856p04Q18L33o2j85q14M8J452o07j173k19P82P64mj088j640J312L267
2108B457q85m756R04M964k06l790m50K703Q79j486j147L84J158q5j260n37J353
2125B00P98j535q77J455K12n5M65j503l99K527J461k727k911L039K756j622k896
2142a612p9K661P03j444k297J331J795m47k034P95K205r99k046J253J392k58j029
2159a10k7o08Q59J840l04l240j83K841J293k356j949L29K485Q24k178j396J364
2176e16K252j873j083K119P57j756q54K084P05j456o90n78K56J621J02k009j109
2193b028J583J624k22j478j098R06K284J13k843o01L249Q8k122j48J813n49j567
$$ plain form
2073 -816 -958 945 1751 70 -1777 -1507 1367 2141 -1593 -3458 581 2877 -436 -2701 -7 2033
2089 2033 177 -527 291 624 562 377 -437 -389 1063 456 -717 -936 -154 610 606 -482 -2122 -810 2457
2108 2457 1572 -3184 -2280 2684 2478 -1312 -1762 941 1820 334 -813 -429 729 644 -616 -1153 200
2125 200 998 -537 -1414 41 253 198 663 -840 -1239 1288 2749 22 -2889 150 2906 1284 -1612
2142 -1612 -1691 970 1673 229 -2068 -737 1058 611 -1423 -628 1577 578 -1468 -215 1177 919 -110
2159 -110 -137 -745 114 1954 1650 -1590 -1773 1068 2361 5 -1944 -1615 870 1694 -484 -1880 -516
2176 -516 1736 -137 -1220 899 1656 -100 -954 1130 1835 379 -311 -889 -633 988 1090 -919 -2028
2193 -2028 -445 1179 957 -521 -1619 -713 1571 1684 -1159 -1760 1489 1577 -545 -693 1120 571 -996
2210i96P50Q16j22o86o95k42J713J014j737j480J007J484J66n23r47o17J594J762
2228B261j503k499R54K438j112j330O02L71l84m73M48K06K50n03q62Q82K000r41
2246H05j870K19J541M05n00o33p57J60J741K61k207m35J234P50q86k98J60R8J15
2265i7L59m69M07K15q57l57J722M99j642r54J322Q10p14m42m66l99J014J211j262
2284a00j339J016R67l90P3j71l55J04R42k26q04O58r2q77P61J006j145j340O28
2303f84Q94N3l89o39m31Q61J590o95j583M77R44K63j42L82j060n80J106Q17j618
2322d34Q6O87r66K0P13k62o77O19M28J16J29J04j068Q4J221N53j158p73O91J63
2342B76J59p9p33j92O08P71j087n19O73J87l23O17R9q20l00J145J42n46l4Ml65
$$ plain form
2210 -996 -246 570 448 -238 -933 -1175 538 1552 -185 -1665 -658 826 992 469 -478 -1095 499 2261
2228 2261 758 -1741 -787 1651 539 -791 -189 182 -202 -675 -227 -21 229 -274 -1136 -254 1746 805
2246 805 -1065 -846 695 1100 600 -33 -790 -630 1111 1372 -835 -1270 -36 714 -172 -470 -310 -212 -97
2265 -97 262 -207 200 415 -442 -799 923 1422 -220 -1174 148 958 244 -198 -664 -1063 -49 1162 -100
2284 -100 -1439 -423 544 154 227 56 -299 -195 747 521 -283 375 283 -594 167 1173 28 -1312 -684
2303 -684 210 263 -126 -765 -1196 -335 1255 560 -1023 -546 398 661 519 901 -159 -739 367 1184 -434
2322 -434 -348 339 -627 -607 106 -156 -833 -214 214 330 459 563 -505 -421 800 1353 195 -578 113 276
2342 276 435 356 -377 -569 39 810 -277 -796 -123 64 -259 358 457 -363 -663 482 624 78 44 48 -317
2363c17P34O38j113p27N04O21k45j35j88o32J76J242n8j144K30P57n53M22L69
2382E81m85o16P27M91m61r3J6o85K41R09k51j144q6P88L81k56j15l59k47J258
2402E94J92j022m55R40J85j41jl52n50K83J443j095n59M91l65K13O55N3j218p1
2422g80M57J135n83K92q36k06R27J047j113j207N97N57J9J07o25r26P25R26j41
2441C72j189L66P25o22L92P52n74p60K09P75K37j28n25p03L61J412n16j664J34
2460i46J166J6J11j52j155L8J695M61j351m82R70K17l84J34J62o76j84M00J08
2479A48M86k44j303l00J975M72j844o83P30J159K45k92j125p15J787Q07p99j432
2497i28O31R14j10k49n32j26M79m72j34O32P75j305j156J347J912p59k024L3J385
$$ plain form
2363 -317 417 1055 -58 -785 -281 340 95 -40 -228 -860 -684 558 500 -644 -414 343 -210 212 581
2382 581 96 -520 207 698 237 144 160 -525 -284 625 374 -770 -856 -68 313 57 -58 -417 -664 594
2402 594 786 -236 -691 249 434 293 292 -60 -610 -327 1116 21 -538 -47 -412 -199 456 509 -709 -780
2422 -780 -323 812 229 521 -315 -521 406 1453 340 -867 -270 287 306 413 -212 -1138 -413 513 372
2441 372 -817 -451 274 -348 44 796 222 -538 -329 446 683 555 30 -673 -312 1100 584 -1080 -946
2460 -946 220 236 347 195 -960 -922 773 1234 -117 -599 371 588 204 338 500 -176 -360 40 148
2479 148 634 390 -913 -1213 762 1234 -610 -1293 -563 596 841 549 -576 -1291 496 1303 504 -928
2497 -928 -297 617 507 258 -274 -400 79 -393 -527 105 880 -425 -1581 -234 1678 919 -1105 -1072 313
2516C13O96o9j285r14Q82J681j42j754m29Q25O55j39l31p48L84O95l64n95J091
2535D52L78j544p21K299R22j757j541R39J721K64j382j690N00J966N61j727p70
2552a130L82J118J73j1j150k28J442L80j279o8J251l62j604N46J930m25j847p35
2570a617J466J488l20k296p80K070J928j593j620M61R54O42O4o55j127P98J184
$$ plain form
2516 313 1009 940 -345 -1259 -377 1304 1162 -592 -1021 -196 459 320 -11 -759 -375 320 -44 -639 452
2535 452 830 -714 -1435 864 1786 29 -1512 -573 1148 1412 30 -1660 -1160 806 1367 -360 -1130
2552 -1130 -748 370 543 532 -618 -846 596 976 -303 -371 880 518 -1086 -540 1390 965 -882 -1617
2570 -1617 -151 1337 1017 -1279 -2059 11 1939 346 -1274 -813 141 783 847 192 -935 -137 1047
$$ [...]
8191h9
##END NTUPLES=NMR FID
##END=
