##TITLE=1H_LY-Gly_al_g.f
 200.13MHz,CDCl3.
 8 sc
 
 11.12.2025
##JCAMPDX= 6.0         $$ Bruker NMR JCAMP-DX V2.0
##DATA TYPE= NMR FID
##DATA CLASS= NTUPLES
##ORIGIN= UXNMR, Bruker Analytische Messtechnik GmbH
##OWNER= pz
$$ XWIN-NMR		Version 3.5
$$ Thu Dec 11 13:43:13 2025 Russian Standard Time (UT+4h)  she@DPX200
##.OBSERVE FREQUENCY= 200.1313
##.OBSERVE NUCLEUS= ^1H
##.DELAY= (6, 6)
##.ACQUISITION MODE= SIMULTANEOUS
##.ACQUISITION SCHEME= undefined
##.AVERAGES= 8
##.DIGITISER RES= 18
##SPECTROMETER/DATA SYSTEM= spect
##.PULSE SEQUENCE= zg30
##.SOLVENT NAME= CDCl3
##.SHIFT REFERENCE= (INTERNAL, CDCl3, 0, 14.3821)
##AUDIT TRAIL= $$ (NUMBER, WHEN, WHO, WHERE, WHAT)
$$ ##TITLE= Audit trail, XWIN-NMR		Version 3.5
$$ ##JCAMPDX= 5.01
$$ ##ORIGIN= Bruker BioSpin GmbH
$$ ##OWNER= she
$$ F:/spectra/data/she/nmr/H-C/1/audita.txt
$$ ##AUDIT TRAIL=  $$ (NUMBER, WHEN, WHO, WHERE, WHAT)
(   1,<2025-12-11 13:40:59.06 +0400>,<she>,<DPX200>,
      <created by zg, POWCHK disabled, PULCHK disabled
       configuration hash MD5:
       00 E9 B6 7A A2 85 ED C7 34 08 36 98 17 FE 4E 26
       data hash MD5: 16K
       1D F4 69 AF CF DC 0A BB C7 7B 28 27 D9 33 96 9B>)
$$ ##END=
$$ 
$$ hash MD5
$$ DC 1A B2 4D 6E 8A C8 20 EB 7E 6A 1E 37 6D 11 F6
##$RELAX= 
##$RELAX= 
##$RELAX= 
##$RELAX= 
##$RELAX= 
##$RELAX= 
$$ Bruker specific parameters
$$ --------------------------
##$DU= <F:/spectra>
##$EXPNO= 1
##$NAME= <H-C>
##$PROCNO= 1
##$TYPE= <nmr>
##$USER= <she>
##$AMP= (0..31)
100 100 100 100 100 100 100 100 100 100 100 100 100 100 100 100 100 100 
100 100 100 100 100 100 100 100 100 100 100 100 100 100 
##$AQSEQ= 0
##$AQ_mod= 1
##$AUNM= <au_zg>
##$AUTOPOS= <>
##$BF1= 200.13
##$BF2= 200.13
##$BF3= 200.13
##$BF4= 200.13
##$BF5= 200.13
##$BF6= 200.13
##$BF7= 200.13
##$BF8= 200.13
##$BYTORDA= 1
##$CFDGTYP= 0
##$CFRGTYP= 5
##$CHEMSTR= <none>
##$CNST= (0..31)
1 1 145 1 1 1 1 1 1 1 1 1 1 1 1 1 1 1 1 1 1 1 1 1 1 1 1 1 1 1 1 1 
##$CPDPRG= <>
##$CPDPRG1= <>
##$CPDPRG2= <>
##$CPDPRG3= <>
##$CPDPRG4= <mlev>
##$CPDPRG5= <mlev>
##$CPDPRG6= <mlev>
##$CPDPRG7= <mlev>
##$CPDPRG8= <mlev>
##$CPDPRGB= <>
##$CPDPRGT= <>
##$D= (0..31)
0 0.7 0 0 0 0 0 0 0 0 0 0.03 0 0 0 0 0 0 0 0 0 0 0 0 0 0 0 0 0 0 0 0 
##$DATE= 1765446058
##$DBL= (0..7)
120 120 120 120 120 120 120 120 
##$DBP= (0..7)
150 150 150 150 150 150 150 150 
##$DBP07= 0
##$DBPNAM0= <>
##$DBPNAM1= <>
##$DBPNAM2= <>
##$DBPNAM3= <>
##$DBPNAM4= <>
##$DBPNAM5= <>
##$DBPNAM6= <>
##$DBPNAM7= <>
##$DBPOAL= (0..7)
0.5 0.5 0.5 0.5 0.5 0.5 0.5 0.5 
##$DBPOFFS= (0..7)
0 0 0 0 0 0 0 0 
##$DE= 6
##$DECBNUC= <off>
##$DECIM= 32
##$DECNUC= <off>
##$DECSTAT= 4
##$DIGMOD= 1
##$DIGTYP= 9
##$DL= (0..7)
0 120 120 120 120 120 120 120 
##$DP= (0..7)
150 150 150 150 150 150 150 150 
##$DP07= 0
##$DPNAME0= <>
##$DPNAME1= <>
##$DPNAME2= <>
##$DPNAME3= <>
##$DPNAME4= <>
##$DPNAME5= <>
##$DPNAME6= <>
##$DPNAME7= <>
##$DPOAL= (0..7)
0.5 0.5 0.5 0.5 0.5 0.5 0.5 0.5 
##$DPOFFS= (0..7)
0 0 0 0 0 0 0 0 
##$DQDMODE= 0
##$DR= 18
##$DS= 0
##$DSLIST= <SSSSSSSSSSSSSSS>
$$ [...]
##$SUBNAM0= <"">
##$SUBNAM1= <"">
##$SUBNAM2= <"">
##$SUBNAM3= <"">
##$SUBNAM4= <"">
##$SUBNAM5= <"">
##$SUBNAM6= <"">
##$SUBNAM7= <"">
##$SUBNAM8= <"">
##$SUBNAM9= <"">
##$SW= 18.0517328524113
##$SWIBOX= (0..15)
0 0 2 0 0 0 0 0 0 0 0 0 0 0 0 0 
##$SW_h= 3612.71676300578
##$TD= 16384
##$TD0= 1
##$TE= 0
##$TE2= 300
##$TE3= 300
##$TEG= 300
##$TL= (0..7)
0 120 120 120 120 120 120 120 
##$TP= (0..7)
150 150 150 150 150 150 150 150 
##$TP07= 0
##$TPNAME0= <>
##$TPNAME1= <>
##$TPNAME2= <>
##$TPNAME3= <>
##$TPNAME4= <>
##$TPNAME5= <>
##$TPNAME6= <>
##$TPNAME7= <>
##$TPOAL= (0..7)
0.5 0.5 0.5 0.5 0.5 0.5 0.5 0.5 
##$TPOFFS= (0..7)
0 0 0 0 0 0 0 0 
##$TUNHIN= 0
##$TUNHOUT= 0
##$TUNXOUT= 0
##$USERA1= <user>
##$USERA2= <user>
##$USERA3= <user>
##$USERA4= <user>
##$USERA5= <user>
##$V9= 5
##$VALIST= <valist>
##$VCLIST= <CCCCCCCCCCCCCCC>
##$VD= 0
##$VDLIST= <DDDDDDDDDDDDDDD>
##$VPLIST= <PPPPPPPPPPPPPPP>
##$VTLIST= <TTTTTTTTTTTTTTT>
##$WBST= 1024
##$WBSW= 4
##$XGAIN= (0..3)
0 0 0 0 
##$XL= 0
##$YL= 0
##$YMAX_a= 111245
##$YMIN_a= -104927
##$ZGOPTNS= <>
##$ZL1= 120
##$ZL2= 120
##$ZL3= 120
##$ZL4= 120
##$ABSF1= 10
##$ABSF2= 0
##$ABSG= 5
##$ABSL= 3
##$ALPHA= 0
##$AQORDER= 0
##$ASSFAC= 0
##$ASSFACI= 0
##$ASSFACX= 0
##$ASSWID= 0
##$AUNMP= <proc_1d>
##$AZFE= 0.1
##$AZFW= 0.1
##$BCFW= 1
##$BC_mod= 2
##$BYTORDP= 1
##$COROFFS= 0
##$CY= -3
##$DATMOD= 1
##$DC= 2
##$DFILT= <>
##$DTYPP= 0
##$F1P= 0
##$F2P= 0
##$FCOR= 0.5
##$FTSIZE= 0
##$FT_mod= 4
##$GAMMA= 1
##$GB= 0.15
##$INTBC= 1
##$INTSCL= 1
##$ISEN= 128
##$LB= 0.25
##$LEV0= 0
##$LPBIN= 0
##$MAXI= 10000
##$MC2= 0
##$MEAN= 0
##$ME_mod= 0
##$MI= 1.114404
##$NCOEF= 0
##$NC_proc= 0
##$NLEV= 6
##$NOISF1= 3.799351
##$NOISF2= 2.8
##$NSP= 1
##$NTH_PI= 0
##$NZP= 0
##$OFFSET= 14.38212
##$PC= 1
##$PHC0= -3340.772
##$PHC1= 1.19234
##$PH_mod= 1
##$PKNL= yes
##$PPARMOD= 0
##$PSCAL= 0
##$PSIGN= 0
##$REVERSE= no
##$SF= 200.129724274929
##$SI= 16384
##$SIGF1= 3
##$SIGF2= 2
##$SINO= 400
##$SIOLD= 16384
##$SREGLST= <1H.CDCl3>
##$SSB= 0
##$STSI= 0
##$STSR= 0
##$SW_p= 3205.1282051282
##$SYMM= 0
##$S_DEV= 0
##$TDeff= 0
##$TDoff= 0
##$TI= <>
##$TILT= no
##$TM1= 0
##$TM2= 0
##$TOPLEV= 0
##$USERP1= <user>
##$USERP2= <user>
##$USERP3= <user>
##$USERP4= <user>
##$USERP5= <user>
##$WDW= 1
##$XDIM= 8192
##$YMAX_p= 0
##$YMIN_p= 0
$$ End of Bruker specific parameters
$$ ---------------------------------
##NTUPLES= NMR FID
##VAR_NAME=  TIME,          FID/REAL,        FID/IMAG
##SYMBOL=    X,             R,               I
##VAR_TYPE=  INDEPENDENT,   DEPENDENT,       DEPENDENT
##VAR_FORM=  AFFN,          ASDF,            ASDF
##VAR_DIM=   8192,          8192,            8192
##UNITS=     SECONDS,       ARBITRARY UNITS, ARBITRARY UNITS
##FACTOR=    0.0002768,     1,               1
##FIRST=     0,             0,               0
##LAST=      2.2672688,     0,               0
##MIN=       0,             -104927,         0
##MAX=       2.2672688,     111245,          0
$$ Real data points
##PAGE= N=1
##DATA TABLE= (X++(R..R)), XYDATA
$$ [...]
$$ plain form
1704 471 762 37 231 566 369 170 173 467 -233 -314 -102 -114 -430 -325 -373 -170 -595 -433 18 12 -11 -104 280
1727 280 691 547 451 441 533 396 200 -22 -123 -266 -243 -112 -530 -482 -257 -434 -490 -29 -51 -81 72 474 365
1750 365 470 258 584 257 386 455 151 -81 -16 48 -25 -466 -390 -230 -151 -378 -423 102 56 -8 -113 253 378
1773 378 130 307 343 420 -29 345 335 -232 -77 3 -302 -629 -614 -439 -278 -274 -49 -49 -176 424 193 456 302
1796 302 414 474 398 242 291 114 -74 -116 -259 -221 -445 -701 -469 -236 -186 -271 -22 166 65 196 510 439 340
1819 340 448 248 105 126 682 64 -130 -86 -137 -767 -285 -307 -327 -436 -136 -119 83 176 103 137 420 342 374 190
1843 190 160 58 146 55 -84 -506 -348 -134 -471 -711 -307 -356 -408 21 -13 23 -118 389 526 278 287 481 95
1866 95 178 286 151 -168 -236 86 -19 -586 -256 -382 -351 -222 -174 -183 -19 80 6 271 636 274 -100 355 230
$$ packed form
1704D71K91p25J94L35j97j99LK94p00q1K12j2l16J05m8K03m25J62M51ok3r3L84
1727B80M11j44r6j0R2j37j96k22j01j43K3J31m18M8K25j77n6M61k2l0J53M02j09
1750C65J05k12L26l27J29O9l04k32O5O4p3m41P6J60P9k27m5N25m6o4j05L66J25
1773C78k48J77L6P7m49L74j0n67J55Q0l05l27J5J75J61MK25%j27O00k31K63j54
1796C02J12O0p6j56M9j77j88m2j43L8k24k56K32K33N0q5K49J88j01J31L14p1r9
1819C40J08k00j43K1N56o18j94M4n1o30M82k2k0j09L00J7K02R3p3L4K83p8L2j84
1843A90l0j02Q8r1j39m22J58K14l37k40M04m9n2M29l4L6j41N07J37k48RJ94l86
1866I5Q3J08j35l19o8L22j05n67L30j26L1J29M8rJ64R9p4K65L65l62l74M55j25
$$ plain form
1889 230 59 -171 183 -206 -222 -35 -35 -641 -516 42 39 -345 34 111 -160 0 622 369 37 359 510 360
1911 360 227 394 41 -284 -264 77 -253 -212 -183 -471 -145 -255 -224 130 160 -74 159 469 323 104 68 390
1933 390 438 -73 120 260 -145 -249 -129 5 -741 -586 26 -12 -323 -89 -41 -75 276 227 278 300 376 283 151
1956 151 210 182 -71 16 -208 -166 -621 -214 -358 -558 -303 -43 -151 -122 -102 244 249 445 444 188 277 486 18 -111
1980 -111 183 275 -208 -371 -105 -395 -491 -305 3 -394 -325 28 187 15 188 453 349 -7 219 550 561
2001 561 196 66 78 129 -324 -439 -279 -252 -30 -265 -345 -153 -50 26 398 49 -118 473 644 0 -1 498
2023 498 338 131 66 -182 -184 28 -325 -431 -312 -66 -293 -569 97 205 147 -116 48 136 379 382 102 298
2045 298 369 314 192 -152 -90 14 -38 -197 -359 -411 -48 -129 -355 -554 340 506 -155 -91 335 547 243 -167
$$ packed form
1889B30j71k30L54l89j6J87%o06J25N58ll84L79P7k71J60O22k53l32L22J51j50
1911C60j33J67l53l25K0L41l30M1K9k88L26j10L1L54L0k34K33L10j46k19l6L22
1933C90M8n11J93J40m05j04J20J34p46J55O12l8l11K34M8l4L51m9N1K2P6r3j32
1956A51N9k8k53Q7k24M2m55M07j44k00K55K60j08K9K0L46NJ96jk56Q9K09m68j29
1980a11K94R2m83j63K66k90r6J86L08l97O9L53J59j72J73K65j04l56K26L31J1
2001E61l65j30J2N1m53j15J60K7K22k35q0J92J03P6L72l49j67N91J71o44jM99
2023D98j60k07o5k48kK12l53j06J19K46k27k76O66J08n8k63J64Q8K43Lk80J96
2045B98P1n5j22l44O2J04n2j59j62n2L63q1k26j99Q94J66o61O4M26K12l04m10
$$ plain form
2067 -167 255 262 253 71 -418 -218 -24 -166 -327 -462 -189 -15 -72 -54 -157 -40 422 481 -5 74 347 390 123
2090 123 -33 -91 171 -42 -330 -362 24 98 -586 -556 -125 319 -92 -427 -109 184 59 354 191 -171 8
2111 8 439 317 -295 115 231 163 -353 -458 -236 140 -336 -445 -192 193 -16 -250 -53 332 467 107 -8
2132 -8 395 548 501 -100 -237 48 111 -205 -25 -369 -360 37 -67 -325 -365 -321 364 139 -159 137 544 448 -183
2155 -183 388 574 93 -134 -342 -16 296 -197 -459 -471 -301 -165 -108 -193 -181 10 -34 345 61 129 425 581
2177 581 226 -151 291 433 87 -252 111 -7 -220 -555 -341 -119 169 -308 -454 -410 428 273 68 -34
2197 -34 68 429 290 354 17 -13 146 101 -268 -245 21 -2 -427 -285 -388 -317 -142 -193 -208 258 588 -59 -42
2220 -42 511 580 121 -78 185 53 -25 148 -71 -165 -107 -214 -114 -499 -74 79 193 -174 157 136 379 267
$$ packed form
2067a67M22Prj82m89K00J94j42j61j35K73J74n7J8j03J17M62N9m86P9K73M3k67
2090A23j56n8K62k13k88l2L86P4o84L0M31M44m11l35L18K93j25K95j63l62J79
2111HM31j22o12M10J16o8n16j05K22L76m76j09K53L85k09k34J97L85J35l60j15
2132hM03J53m7o01j37K85O3l16J80l44RL97j04k58m0M4O85k25k98K96M07r6o31
2155a83N71J86m81k27k08L26L12m93k62j2J70J36N7q5J2J91m4L79k84O8K96J56
2177E81l55l77M42J42l46l39L63j18k13l35K14K22K88m77j46M4Q38j55k05j02
2197c4J02L61j39O4l37l0J59m5l69K3K66k3m25J42j03P1J75n1j5M66L30o47J7
2220d2N53O9m59j99K63j32p8J73k19r4N8j07J00l85M25J53J14l67L31k1K43j12
$$ plain form
2242 267 90 177 422 127 -96 88 195 363 -98 -238 -285 -219 -244 -202 -407 -370 55 107 -130 36 -24 395 212
2265 212 394 175 -44 347 414 -77 75 -19 7 -233 -70 -31 -355 -530 -212 156 -182 -81 19 -246 -25
2286 -25 172 246 62 343 333 275 176 -241 -41 24 120 -239 -239 -326 -25 -205 -170 176 138 -131 132 242 155 460
2310 460 183 185 124 443 78 -183 -2 166 220 -312 -275 -260 -188 -135 -215 19 -112 -139 45 354 183 178 341 78
2334 78 421 290 -36 99 -47 -119 37 -87 -368 -153 -180 -176 -408 -312 -212 -51 193 373 -7 -89 68 295
2356 295 290 336 173 -36 -9 189 93 17 -155 -437 -54 -64 -57 -165 23 -84 109 162 166 53 160 192 380 312 139
2381 139 70 -123 -42 14 37 -336 -510 -149 41 -17 -108 -262 -125 89 283 208 -198 130 368 299 344 105 110 21
2405 21 258 130 55 -366 -262 -56 173 -187 -113 -448 43 -87 -9 66 -8 97 245 209 284 263 80 16 20 55
$$ packed form
2242B67j77Q7K45k95k23J84J07J68m61j40m7O6k5M2k05L7M25N2k37J66o0M19j83
2265B12J82k19k19L91O7m91J52r4K6k40J63L9l24j75L18L68l38J01J00k65K21
2286b5J97P4j84K81j0n8r9m17K00O5R6l59%q7L01j80L5L46l8k69K63J10q7L05
2310D60k77Ko1L19l65k61J81J68N4n32L7J5P2N3q0K34j31k7J84L09j71nJ63k63
2334G8L43j31l26J35j46p2J56j24k81K15k7Mk32R6J00J61K44J80l80q2J57K27
2356B95nM6j63k09K7J98r6p6j72k82L83j0Pj08J88j07J93N3Mj13J07L2J88o8j73
2381A39o9j93Q1N6K3l73j74L61J90n8r1j54J37K14J94p5m06L28K38o9M5k39Nq9
2405B1K37j28p5m21J04K06K29l60P4l35M91j30P8P5p4J05J48l6P5k1j83o4ML5
$$ plain form
2429 55 1 -403 -257 -287 -50 -416 -525 -31 -61 1 142 309 83 79 285 332 -100 -16 -35 269 -109 43 -244
2452 -244 -69 125 -298 -148 -233 -286 -138 -66 55 22 162 -127 59 392 107 207 -51 -136 66 173 -118 -26
2474 -26 -198 147 163 -230 -335 -339 19 158 -257 -241 74 305 -7 -137 230 287 54 253 256 155 62 -216 -346
2497 -346 -122 -56 -200 -139 92 128 -18 -74 21 134 84 683 373 91 132 520 400 35 211 6 -4 17 -72
2520 -72 -128 -197 -221 -368 -107 -68 169 -59 -81 215 155 19 151 48 277 381 317 -101 -303 49 207 64 -10
2543 -10 -268 -15 -104 27 -231 -110 64 152 81 50 375 91 65 288 534 335 100 -112 -129 29 -119 -194 -463
2566 -463 -452 -117 -130 -108 -214 -391 -124 4 20 -296 145 250 268 209 103 238 -14 -69 34 158 -170 -214 -320
2589 -320 -140 90 86 -323 -301 -47 276 285 56 81 189 366 500 42 22 174 257 126 -467 -145 39 -342 -436
$$ packed form
2429E5n4m04J46l0K37l66j09M94l0O2J41J67k26mK06M7m32Q4j9L04l78J52k87
2452b44J75J94m23J50q5n3J48P2J21l3J40k89J86L33k85J00k58q5K02J07k91R2
2474b6j72L45J6l93j05mL58J39m15J6L15K31l12j30L67N7k33J99Lj01r3k78j30
2497c46K24O6j44O1K31L6j46n6R5J13n0N99l10k82M1L88j20l65J76k05j0K1q9
2520g2n6o9k4j47K61L9K37k28k2K96o0j36J32j03K29J04o4m18k02L52J58j43p4
2543a0k58K53q9J31k58J21J74Q8p1l1L25k84k6K23K46j99k35k12j7J58j48p5k69
2566d63J1L35j3K2j06j77K67J28J6l16M41J05J8n9j06J35k52n5J03J24l28m4j06
2589c20J80K30mm09K2K54L23Rk29K5J08J77J34m58k0J52Q3j31n93L22J84l81r4
$$ plain form
2612 -436 84 23 15 -265 -281 -39 135 265 -267 129 326 300 70 250 -56 186 129 -51 -356 -11 246 54
2634 54 -311 -345 -103 -27 54 -102 67 140 170 -28 -1 420 476 196 -172 72 207 -99 -341 -163 -80 70 -130
2657 -130 -272 -281 -19 204 13 -227 -326 164 336 392 -13 -178 248 10 -38 35 23 164 -7 -298 -120 -214 -51
2680 -51 -23 -234 22 179 -120 -84 78 314 287 133 26 90 104 259 23 -135 -80 279 33 -7 -516 19 239
2703 239 -24 -118 -108 72 -47 -126 166 295 -79 63 197 127 309 -60 31 -149 -164 76 16 -311 -152 -45
2725 -45 134 -75 -167 5 128 164 29 19 289 175 92 98 257 112 -104 -85 143 207 -3 -45 -269 -164 -82 53
2749 53 -137 -102 -178 401 196 -5 140 222 448 322 75 -187 -68 256 247 30 -112 -5 -580 -360 -36 -167
2771 -167 -424 -180 151 -54 302 118 -1 -17 5 150 106 86 7 35 199 112 -121 -245 -150 -106 -73 -217 -175 -56
$$ packed form
2612d36N20o1qk80j6K42J74J30n32L96J97k6k30J80l06K42n7j80l05L45K57j92
2634E4l65l4K42P6Q1j56J69P3L0j98K7M21N6k80l68K44J35l06k42J78Q3J50k00
2657a30j42rK62K23j91k40r9M90J72N6m05j65M26k38m8P3j2J41j71k91J78r4J63
2680e1K8k11K56J57k99L6J62K36k7j54j07O4J4J55k36j58N5L59k46m0n09N35K20
2703B39k63r4J0J80j19p9K92J29l74J42J34p0J82l69R1j80j5K40o0l27J59J07
2725d5J79k09r2J72J23L6j35j0K70j14q3OJ59j45k16J9K28O4k10m2k24J05Q2J35
2749E3j90L5p6N79k05k01J45Q2K26j26k47k62J19L24rk17j42J07n75K20L24j31
2771a67k57K44L31k05L56j84j19j6K2J45m4k0p9K8J64q7k33j24R5M4L3j44M2J19
$$ plain form
2795 -56 -64 69 80 139 111 98 100 83 256 -58 -45 164 -43 -149 -273 -59 -280 -130 -135 -195 -247 -111 -82 -114 64 -85
2821 -85 55 -110 199 300 -27 -4 41 52 -79 187 -41 -128 -46 91 60 -188 -394 -119 60 -62 94 -162
2843 -162 -168 264 246 168 97 46 172 -25 116 232 78 -199 19 41 -199 -157 -95 -276 -151 105 -333 -92 -52
2866 -52 109 68 -4 -87 -139 83 359 111 -86 -210 -158 -43 -7 78 -429 52 -48 104 -31 -50 -29 -120 190 360
2890 360 130 63 271 113 37 232 36 -101 -109 -91 49 -225 -303 80 -102 -3 -138 -337 -68 22 260 41 -105
2913 -105 140 43 137 55 277 -204 -371 -26 -135 -232 -121 -252 -358 -391 17 -77 -314 -185 133 99 301 147
2935 147 203 104 340 58 9 120 113 -39 -125 -300 -121 -205 -166 -82 -152 -208 -37 -52 132 186 211 128 -261 276 166
2960 166 85 172 -116 24 284 98 -104 -320 -71 9 -163 -94 -234 -89 122 144 140 8 80 75 325 125 45 -108
$$ packed form
2795e6qJ33J1N9k8j3Kj7J73l14J3K09k07j06j24K14k21J50no0n2J36K9l2J78j49
2821h5J40j65L09J01l27K3M5J1j31K66k28q7Q2J37l1k48k06K75J79j22J56k56
2843a62oM32j8p8p1n1J26j97J41J16j54k77K18K2k40M2O2j81J25K56m38K41M0
2866e2J61m1p2q3n2K22K76k48j97j24N2J15L6Q5n07M81j00J52j35j9K1r1L10J70
2890C60k30o7K08j58p6J95j96j37qJ8J40k74p8L83j82R9j35j99K69R0K38k19j46
2913a05K45r7R4q2K22m81j67L45j09r7J11j31j06l3M08r4k37J29L18l4K02j54
2935A47N6r9K36k82m9J11pj52q6j75J79q4L9Q4p0n6J71j5J84N4K5q3l89N37j10
2960A66q1Q7k88J40K60j86k02k16K49Q0j72O9j40J45K11K2mj32P2nK50k00q0j53
$$ plain form
2984 -108 -12 78 56 96 73 2 -146 -164 -179 28 -196 -234 43 25 26 23 7 -28 459 383 309 27 97 281 -13 46 -80
3011 -80 -309 -141 52 -322 -50 -183 -321 149 -64 -17 50 18 -87 215 170 148 -41 -27 396 243 -74 -53 -167
3034 -167 3 -65 -146 -90 -28 -112 45 -253 -71 37 -151 120 270 191 -109 0 90 8 -69 -36 -270 -128 61
3057 61 74 -39 -332 -76 -103 224 40 -80 -47 108 27 -291 37 265 272 67 243 228 58 44 -33 -183 40
3080 40 -184 -168 -280 -93 48 78 -259 -139 148 177 -16 -99 -111 243 310 197 0 -223 158 153 -212 72 7
3103 7 -243 -213 -170 2 -145 -58 -113 -189 297 295 -150 98 187 320 116 -54 -79 -209 61 268 -123 -363 64 115
3127 115 -41 -97 32 -15 59 -54 147 -42 113 154 -59 254 151 262 97 -46 273 -200 -86 -157 74 -182
3149 -182 -104 -4 41 -121 -19 32 46 144 39 125 146 242 67 156 70 91 -140 -61 60 65 -254 -107 -225 74 -82
$$ packed form
2984a08R6R0k2M0k3p1j48j8j5K07k24l8K77j8Jlj6l5M87p6p4k82P0J84k94N9j26
3011h0k29J68J93l74K72j33j38M70k13M7O7l2j05L02m5k2j89J4M23j53l17K1j14
3034a67J70o8q1N6O2q4J57k98J82J08j88K71J50p9l00J09R0q2p7L3k34J42J89
3057F1J3j13k93K56k7L27j84j20L3J55q1l18L28K28Pk05J76j5j70j4p7j50K23
3080D0k24J6j12J87J41L0l37J20K87K9j93q3j2L54O7j13j97k23L81nl65K84o5
3103Gk50L0M3J72j47Q7n5p6M86km45K48Q9J33k04j70k5j30K70K07l91k40M27N1
3127A15j56n6J29m7P4j13K01j89J55M1k13L13j03J11j65j43L19m73J14p1K31k56
3149a82P8J00M5j62J02N1J4R8j05Q6K1R6j75Q9q6K1k31P9J21Nl19J47j18K99j56
$$ plain form
3174 -82 -13 -95 6 27 -35 46 80 145 191 -89 -252 84 246 54 -43 94 -296 -47 -150 -341 -276 -106 -159 17
3198 17 24 -155 70 -131 -73 141 171 323 -19 -3 307 79 13 -141 -228 -48 376 136 -185 18 22 -130 -82 75
3222 75 -187 42 55 92 78 186 230 -91 278 76 142 38 -161 48 113 -68 -332 22 -110 34 89 27 -84
3245 -84 8 300 -107 -93 28 135 132 21 0 -5 -45 9 -188 -35 -31 -100 -180 -221 -130 -59 -217 -222 213 41 272 130
3271 130 -125 10 94 5 56 26 15 -34 77 20 -94 -255 54 -74 -345 37 23 -65 -101 165 125 -34 32 -46
3295 -46 63 179 195 36 -200 17 -204 -69 -83 -86 -97 -59 -157 -76 -117 4 119 -50 122 -144 -20 -40 302 265
3319 265 -25 100 -11 -99 -14 -58 122 -236 -192 -97 -110 -166 -198 123 68 97 -41 111 -18 -56 31 -81 74 3
3343 3 -158 71 -228 -17 -136 19 71 -245 -84 -137 14 -55 60 128 -15 281 44 69 290 46 5 63 159
$$ packed form
3174h2O9q2J01K1o2Q1L4O5M6k80j63L36J62j92r7J37l90K49j03j91O5J70n3J76
3198A7Pj79K25k01N8K14L0J52l42J6L10k28o6j54q7J80M24k40l21K03Mj52M8J57
3222G5k62K29J3L7j4J08M4l21L69k02O6j04j99K09O5j81k64L54j32J44N5o2j11
3245h4R2K92m07J4J21J07lj11k1nm0N4j97J53Mo9q0m1R1P1j58nM35j72K31j42
3271A30k55J35Q4q9N1l0j1m9J11n7j14j61L09j28k71L82j4q8l6K66m0j59O6p8
3295d6J09J16J6j59k36K17k21J35j4lj1L8r8Q1m1J21J15j69J72k66J24k0L42l7
3319B65k90J25j11q8Q5m4J80l58M4R5j3n6l2L21n5K9j38J52j29l8Q7j12J55p1
3343Cj61K29k99K11j19J55N2l16J61n3J51o9J15O8j43K96k37K5K21k44m1N8R6
$$ plain form
3366 159 31 39 -1 -197 68 -289 -60 116 -234 -68 26 -105 35 62 60 184 -89 59 24 -180 216 52 83
3389 83 -249 254 79 -6 -60 -100 -159 -54 -165 222 134 189 9 -202 87 130 287 308 51 -110 236 -17 124
3412 124 2 -128 30 -148 21 -80 -123 -149 187 -68 63 129 96 -11 156 185 17 -12 349 181 79 -126
3434 -126 70 -55 100 -35 -40 -280 -42 -36 -150 25 86 -227 41 70 142 -67 -72 115 -44 108 276 106 -185
3457 -185 81 93 158 -217 10 -117 -217 -66 12 -60 145 -127 145 40 191 -86 142 -2 28 61 -176 -112
3479 -112 -46 95 150 -86 -83 8 23 67 -151 245 -91 42 158 136 -213 -180 -32 197 -83 -202 310 34 -197
3502 -197 -146 15 89 -39 175 -55 -99 57 46 118 214 180 67 -97 -24 78 195 272 30 123 139 227 -34 -80
3526 -80 -82 23 21 -75 83 -141 -10 -223 -56 133 107 265 -83 -241 37 40 -81 59 53 -181 40 -33 -75 -44 -75
$$ packed form
3366A59j28Qm0j96K65l57K29J76l50J66R4j31J40K7kJ24k73J48l5k04L96j64L1
3389H3l32N03j75q5n4m0n9J05j11L87q8N5j80k11K89M3J57K1k57j61L46k53J41
3412A24j22j30J58j78J69j01m3k6L36k55J31O6l3j07J67K9j68k9L61j68j02k05
3434a26J96j25J55j35nk40K38Oj14J75O1l13K68K9P2k09nJ87j59J52J68j70k91
3457a85K66J2O5l75K27j27j00J51P8p2K05k72K72j05J51k77K28j44L0L3k37O4
3479a12O6J41N5k36LR1J5M4k18L96l36J33J16k2l49L3J48K29k80j19N12k76k31
3502a97N1J61P4j28K14k30m4J56j1P2R6l4j13j64P3J02J17P7k42R3J6Q8k61m6
3526h0kJ05kr6J58k24J31k13J67J89k6J58l48j58K78Lj21J40ok34K21p3m2L1l1
$$ plain form
3551 -75 1 -194 -182 92 -36 -128 51 197 -209 123 21 -100 -231 -23 119 -4 -3 307 21 -124 5 -99
3573 -99 -278 26 -159 -280 56 60 36 -246 29 173 39 91 -21 -65 -32 19 242 217 -29 0 -95 -239 80 -131
3597 -131 -104 68 118 89 -5 117 97 16 -6 -22 -235 -123 188 -54 30 117 -52 -98 222 -8 53 -144 51 -249
3621 -249 140 -25 -170 -28 131 108 -14 124 129 -45 24 -59 95 11 92 -108 -62 -2 -12 41 -92 -51 26 -28 -106
3646 -106 -193 58 87 89 113 -31 -79 -207 120 -50 202 86 -150 1 126 -53 105 55 14 -97 -37 60 -83
3669 -83 -130 174 274 60 101 72 194 151 -36 -105 -88 -13 -146 13 -131 -144 -146 -60 7 119 7 191 138 18 83
3694 83 73 15 -19 97 87 117 -53 134 8 -90 -7 -200 6 -81 73 -130 -242 -19 34 9 219 148 82 -114
3718 -114 205 -57 132 -141 -22 -223 -52 -47 -198 -104 -140 71 -97 85 17 82 87 82 108 93 101 73 144 230 259 243
$$ packed form
3551g5P6j95J2K74j28r2J79J46m06L32j02j21j31K08J42j23JL10k86j45J29j04
3573i9j79L04j85j21L36Mk4k82K75J44j34N2j12m4L3N1K23k5k46K9r5j44L19k11
3597a31K7J72N0k9r4J22k0q1k2j6k13J12L11k42Q4Q7j69m6L20k30O1j97J95l00
3621b49L89j65j45J42J59k3j22J38Nj74O9q3J54q4Q1k00M6O0j0N3j33M1P7n4p8
3646a06q7K51K9KK4j44m8j28L27j70K52j16k36J51J25j79J58n0m1j11O0R7j43
3669h3m7L04J00k14M1k9J22m3j87o9J7P5j33J59j44j3kQ6O7J12j12J84n3j20O5
3694H3j0n8l4J16j0L0j70J87j26r8Q3j93K06q7J54k03j12K23N3k5K10p1o6j96
3718a14L19k62J89k73J19k01J71Nj51R4l6K11j68J82o8O5NnK6j5Qk8P1Q6K9j6
$$ plain form
3744 243 86 303 -58 -86 -59 -123 84 -179 -76 -95 -63 -288 68 -102 -34 105 -23 -22 154 72 -102 60 -136
3767 -136 292 64 -57 -277 -72 28 -67 -128 -87 50 93 -50 -151 176 158 -47 -77 108 28 54 120 44 42 92
3791 92 2 -15 -155 136 167 116 14 -175 -112 60 191 -27 58 136 195 54 -219 -143 41 50 -104 134 5 172
3815 172 -4 -231 -188 -82 -177 -121 35 -81 -45 22 -153 19 -121 159 -17 86 179 25 -198 211 -30 -168
3837 -168 -17 -27 -137 -2 -24 -166 150 39 -236 -175 -107 218 107 -86 24 161 -22 -24 -14 76 -26 65 -46
3860 -46 6 -52 1 -61 -251 -22 60 204 -150 -111 121 -83 171 34 -66 135 37 69 -37 -59 87 -81 -43 167
3884 167 10 -7 -40 30 -177 30 67 105 184 16 -55 54 6 60 65 48 14 -137 -42 1 108 112 89 59 -145 -32
3910 -32 11 -280 1 117 144 -105 -102 -10 113 93 189 240 40 -75 141 -12 -57 -4 -128 30 221 28 -100 -251
$$ packed form
3744B43j57K17l61k8K7o4K07k63J03j9L2k25L56j70O8J39j28JJ76q2j74J62j96
3767a36M28k28j21k20K05J00r5o1M1J37M3j43j01L27j8k05l0J85q0K6O6p6kN0
3791I2r0j7j40K91L1n1j02j89O3J72J31k18Q5P8N9j41k73P6J84Rj54K38j29J67
3815A72j76k27M3J06r5N6J56j16L6O7j75J72j40K80j76J03R3j54k23M09k41j38
3837a68J51j0j10J35k2j42L16j11k75O1O8L25j11j93J10J37j83kJ0R0j02R1j11
3860d6N2n8N3o2j90K29Q2J44l54L9K32k04K54j37j00K01r8L2j06k2J46j68L8K10
3884A67j57j7l3P0k07K07L7L8P9j68p1J09m8N4Nj7l4j51R5M3J07Mk3l0k04J13
3910c2M3k91K81J16K7k49LR2J23k0R6N1k00j15K16j53m5N3j24J58J91j93j28j51
$$ plain form
3934 -251 -100 11 162 -16 55 26 54 -93 103 70 216 54 185 123 -69 -84 -148 -82 -48 -193 -26 -162 15
3957 15 85 97 100 -133 20 72 78 9 281 -115 -99 -96 -31 17 -43 125 -243 -137 -272 -129 -121 -42 -105 -63 48 21 82
3984 82 35 -20 187 18 118 276 80 -41 -13 80 83 96 69 70 -230 -420 -19 -121 74 13 -97 -45 147 84 172
4009 172 -28 153 70 180 32 -40 178 54 -97 -87 -173 -353 -86 32 89 124 168 -55 -81 13 77 32 12 40
4033 40 92 11 -71 53 -88 -150 -46 116 -296 -184 -40 -182 -23 -27 0 -16 -107 -69 -66 111 74 -76 -93 -36 140
4058 140 1 -163 -65 -46 -30 -205 103 289 -105 -131 -40 -69 50 183 198 194 155 -89 162 78 148 165 11 -92
4082 -92 -45 -9 -199 238 76 -72 49 82 -50 97 131 101 -105 13 -57 -33 -33 -3 80 -126 -95 -86 31 30 179 -120
4108 -120 -205 80 60 20 -35 61 151 -31 40 -126 234 157 123 71 -108 -100 -65 -158 0 8 -249 -37 -68 -54 47 -47
$$ packed form
3934b51J51J11J51j78P1k9K8j47J96l3J46j62J31o2j92j5o4O6L4j45J67j36J77
3957A5P0J2Lk33J53N2Oo9K72l96J6LO5M8o0J68l68J06j35J43QP9o3M2J11k7O1
3984H2m7n5K07j69J00J58j96j21K8R3LJ3k7Jl00j90M01j02J95o1j10N2J92o3Q8
4009A72k00J81q3J10j48p2K18j24j51J0q6j80K67J18N7L5M4k23k6R4O4m5k0K8
4033D0N2q1q2J24j41o2J04J62m12J12J44j42J59mK7j6r1L8LJ77l7j50j7N7J76
4058A40j39j64R8J9J6j75L08J86l94k6R1k9J19J33J5ml9k44K51q4P0J7j54j03
4082i2M7L6j90M37j62j48J21L3j32J47L4l0k06J18p0K4%L0Q3k06L1RJ17jJ49k99
4108a20q5K85k0m0n5R6R0j82P1j66L60p7l4n2j79QL5r3J58Qk57K12l1J4J01r4
$$ plain form
4134 -47 -21 -6 6 -67 -44 8 -39 53 -25 86 73 27 -103 228 -204 34 182 -121 -21 -68 50 -74 165 -17
4158 -17 -109 -93 -30 173 125 27 190 169 -44 127 220 -104 70 -116 -127 -203 31 -158 -71 107 -73 -159 -80 205
4182 205 -232 93 97 -39 54 -23 7 28 89 82 138 -258 -208 -100 9 -15 62 40 -50 -22 -9 24 98 -69 42 -6 -36
4209 -36 171 -28 67 38 9 241 105 -200 109 -79 141 -20 -65 -130 -112 18 -111 167 -5 -17 95 80 106
4232 106 185 189 111 222 -55 143 49 82 -57 150 50 -70 -35 -103 77 -148 8 -60 27 49 108 -149 89 32
4256 32 19 77 35 128 -75 256 -93 66 -6 -47 -8 4 131 -67 157 40 -125 -38 70 102 110 370 -39 122
4280 122 26 78 -57 -108 -36 134 -159 19 3 89 42 19 229 140 159 -17 -10 61 181 48 -4 -118 -298 43 261
4305 261 -229 -11 -234 -128 30 56 -57 -70 -83 -111 48 29 -48 -78 29 180 -60 -94 -87 120 114 -17 144 123
$$ packed form
4134d7K6J5J2p3K3N2m7R2p8J11j3m6j30L31m32K38J48l03J00m7J18j24K39j82
4158a7r2J6O3K03m8r8J63k1k13J71R3l24J74j86j1p6K34j89Q7J78j80q6P9K85
4182B05m37L25Mj36R3p7L0K1O1pN6l96N0J08J09k4P7k2r0K8J3L3P4j67J11m8l0
4209c6K07j99R5k9k9K32j36l05L09j88K20j61m5o5J8J30j29K78j72j2J12j5K6
4232A06P9Mp8J11k77J98r4L3j39K07j00j20L5o8J80k25J56o8Q7K2N9k57K38n7
4256C2j3N8m2R3k03L31l49J59p2m1L9J2J27j98K24j17j65Q7J08L2QK60m09J61
4280A22r6N2j35n1P2J70k93J78j6Q6m7k3K10q9J9j76PP1J20j33n2j14j80L41K18
4305B61m90K18k23J06J58K6j13j3j3k8J59j9p7l0J07J51k40l4PK07oj31J61k1
$$ plain form
4329 123 5 -97 42 107 -85 -10 -113 136 -92 120 -187 -119 65 -54 -31 250 130 53 -46 -7 -161 4
4351 4 45 -54 186 -41 -101 -317 -1 26 120 189 176 199 42 -205 150 92 281 -42 -33 -54 -73 -85 118 56 -46 156
4377 156 -5 -91 -214 1 97 14 18 -13 83 19 20 55 203 224 -6 97 23 40 128 -165 -453 -256 -261 -164 -140 76
4403 76 133 59 -93 42 252 8 72 90 172 -30 -105 -124 207 -40 -102 93 -195 121 -45 94 -218 -239 -71
4426 -71 -104 -123 13 -113 102 118 -111 -109 180 276 38 107 -43 -135 -123 -210 71 -209 -161 -11 -103 45 -87 25
4450 25 -101 39 -8 -7 45 210 16 -109 110 50 -75 157 -51 93 -126 221 -30 -67 90 37 -91 -115 -230
4473 -230 -109 53 13 -304 -223 -21 155 -35 230 -42 115 41 -54 -94 -250 68 73 57 -79 140 0 72 119
4496 119 15 -152 -179 109 273 30 113 -31 11 -94 69 164 255 -50 68 -129 15 1 -83 -118 227 134 -150
$$ packed form
4329A23j18j02J39O5j92P5j03K49k28K12l07O8J84j19K3K81j20p7r9L9j54J65
4351DM1r9K40k27o0k16L16K7R4O9j3K3j57k47L55n8J89l23Rk1j9j2K03o2j02K02
4377A56j61q6j23K15R6q3Ml1R6o4JL5J48K1k30J03p4J7Q8k93k88J97nR7K4K16
4403G6N7p4j52J35K10k44O4J8Q2k02p5j9L31k47o2J95k88L16j66J39l12k1J68
4426g1l3j9J36j26K15J6k29KK89R6k38O9j50r2J2q7K81k80M8J50r2J48j32J12
4450B5j26J40m7JN2J65j94j25K19o0j25K32k08J44k19L47k51l7J57n3j28k4j15
4473b30J21J62m0l17Q1K02J76j90K65k72J57p4r5m0j56L18Nj6j36K19j40P2M7
4496A19j04j67k7K88J64k43Q3j44M2j05J63R5R1l05J18j97J44j4q4l5L45r3k84
$$ plain form
4519 -150 88 71 32 -223 30 270 -73 -32 -31 -30 56 -106 53 -110 24 -30 -154 -257 -4 -188 24 -143 -8
4542 -8 161 -83 144 -73 -172 153 -5 -71 197 -17 56 36 -63 32 -103 -45 -94 -203 -33 107 -34 -69 -124 128
4566 128 62 48 205 122 3 -31 135 52 -59 -239 29 -9 -30 -49 53 25 -110 -165 -64 -28 -8 279 179 271
4590 271 -48 39 10 160 20 -2 11 107 64 -92 -68 -161 -199 28 -156 -140 99 -26 31 -1 85 -34 120 -107
4614 -107 25 -105 33 6 45 124 -11 21 -42 70 -111 -215 44 175 -164 -143 122 23 61 91 119 177 81 -184
4638 -184 160 40 -241 -107 -26 121 12 -81 -93 -88 -85 -81 -146 -108 89 6 34 -62 118 -12 -19 -39 36 161 50 -73
4664 -73 -28 192 -107 -212 146 -75 178 -146 -214 -92 -236 -168 20 -72 89 5 -193 109 65 302 -80 67
4686 67 197 -84 -178 138 53 -110 -104 -119 -282 -218 -96 12 63 71 -146 22 7 123 91 -109 71 -56 -145 48
$$ packed form
4519a50K38j7l9k55K53K40l43M1JJQ6j62J59j63J34n4j24j03K53j84K12j67J35
4542hJ69k44K27k17r9L25j58o6K68k14P3k0r9R5j35N8m9j09J70J40j41l5n5K52
4566A28o6j4J57q3j19l4J66q3j11j80K68l8k1j9J02k8j35n5J01L6K0K87j00R2
4590B71l19Q7k9J50j40k2J3R6m3j56K4r3l8K27j84J6K39j25N7l2Q6j19J54k27
4614a07J32j30J38k7L9P9j35L2o3J12j81j04K59J31l39K1K65r9L8L0K8N8r6k65
4638a84L44j20k81J34Q1J47j09r3j2NLMo5L8J97q3K8r6J80j30pk0P5J25j11j23
4664g3M5K20k99j05L58k21K53l24o8J22j44O8J88r2J61q4j98L02m4K37l82J47
4686F7J30k81r4L16q5j63Oj5j63O4J22J08N1Qk17J68j5J16l2k00J80j27q9J93
$$ plain form
4710 48 -12 -11 -68 25 -61 -98 -25 125 131 -10 -95 -21 -50 136 56 80 82 87 109 26 105 128 73 33 112 -202 33 27 26 120 10
4741 10 107 -103 -10 72 106 -7 -63 18 81 43 -137 -272 134 -164 75 28 -149 11 20 144 2 -81 -155 -179 163
4766 163 -53 181 176 -54 124 -7 250 79 -48 21 91 31 -85 139 60 -99 26 -312 54 -43 -51 -92 -5 132
4790 132 28 -11 83 13 105 -5 66 -98 -150 65 25 -13 225 70 -220 105 -30 -42 228 -49 -66 -57 -118 170
4814 170 358 -8 117 -30 239 -182 125 249 144 -25 -26 228 191 -46 87 52 -48 17 52 304 -71 -4
4836 -4 2 23 -95 156 -46 -154 -31 215 -9 25 -321 141 -190 125 -40 170 112 111 219 -14 -99 183 66
4859 66 139 17 -133 77 45 10 -181 53 -81 42 -163 -75 31 155 116 -132 -55 33 -80 -135 18 196 -145
4882 -145 -97 -26 -23 71 38 -126 143 8 120 76 -78 -215 46 -54 -99 11 205 -44 21 179 117 35 -129 -76
$$ packed form
4710D8o0Jn7R3q6l7P3J50Oj41q5P4k9J86q0K4KNK2q3P9K3n5m0P9l14K35ojR4j10
4741A0R7k10R3Q2L4j13n6Q1O3l8j80j35M06k98K39m7j77J60RJ24j42q3p4k4L42
4766A63k16K34nk30J78j31K57j71j27O9P0o0j16K24p9j59J25l38L66r7qm1Q7J37
4790A32j04l9R4p0R2j10P1j64n2K15m0l8K38j55k90L25j35j2K70k77j7Ro1K88
4814A70J88l66J25j47K69m21L07J24j05j69jK54l7k37J33l5j00O5L5K52l75O7
4836dOK1j18K51k02j08J23K46k24L4l46M62l31L15j65K10n8jJ08k33q5K82j17
4859F6P3j22j50K10l2l5j91K34j34J23k05Q8J06J24l9k48P7Q8j13n5J53J78l41
4882a45M8P1LR4l3j64K69j35J12m4j54j37K61j00m5J10J94k49O5J58o2q2j64N3
$$ plain form
4906 -76 71 -60 -57 -18 38 59 102 -140 -276 25 -74 -10 42 17 -147 123 -77 140 88 176 -27 -226 -29 -170
4930 -170 -175 -184 -29 -63 -112 -131 154 3 -131 68 42 116 -16 -139 20 -2 316 -131 33 -119 37 37 -37 85
4954 85 92 -42 72 86 -194 -111 -21 12 176 41 78 226 1 223 53 -76 115 78 87 -6 -175 26 132 325
4978 325 121 -38 235 131 32 -272 -242 -15 77 -125 41 170 50 4 10 102 -65 -131 29 38 -43 -86 -53 -26 55
5003 55 130 -74 -23 -108 -97 35 -119 -22 -43 -28 24 81 29 1 106 45 -117 -42 -169 243 -75 50 -69 -24 -62
5028 -62 12 -44 132 111 119 -81 49 114 -122 99 -247 125 -18 45 52 -132 227 123 -120 160 159 90 17 -172 -134
5053 -134 -145 -111 277 18 127 -143 -33 -43 -145 131 169 176 97 -144 92 -2 43 126 61 204 130 32 127 -308 98
5078 98 64 21 -3 31 -89 -5 158 69 57 -92 -16 -190 9 -152 -90 -187 -161 -12 36 -158 10 107 199 22 -126
$$ packed form
4906g6J47j31LL9N6K1M3k42j36L01r9O4N2k5j64K70k00K17n2Q8k03j99J97j41
4930a70nrJ55l4m9j9K85j51j34J99k6P4j32j23J59k2L18m47J64j52J56%p4J22
4954H5Pj34J14J4k80Q3R0L3J64j35L7J48k25K22j70j29J91l7Rr3j69K01J06J93
4978C25k04j59K73j04r9l04L0K27R2k02J66J29j20m6OR2j67o6J60Rq1m3L3K7Q1
5003E5P5k04N1q5J1J32j54R7k1J5N2N7n2k8J05o1j62P5j27M12l18J25j19M5l8
5028f2P4n6J76k1Qk00J30O5k36K21l46L72j43O3Pj84L59j04k43K80jo9p3j89L8
5053a34j1L4L88k59J09k70J10j0j02K76L8Pp9k41K36r4M5Q3o5J43p4r8R5m35M06
5078I8l4m3k4L4j20Q4J63q9j2j49P6j74J99j61O2r7K6J49M8j94J68R7R2j77j48
$$ plain form
5103 -126 -50 116 -128 62 -56 -92 36 -20 120 30 -101 -100 56 -125 -70 55 -170 -36 8 -89 -67 -71 -292 250
5127 250 145 81 -74 -1 -18 76 -37 46 55 43 33 -58 136 -62 -162 7 167 121 80 92 102 195 -16 44 -124
5152 -124 110 45 100 -80 -27 -1 26 -48 84 -172 -30 15 -91 28 -134 -98 34 -76 55 187 -91 19 -36
5175 -36 118 -130 43 -15 62 -11 94 8 16 -8 27 181 460 -203 70 231 -295 30 -165 -41 373 17 -155
5198 -155 285 -183 121 -412 176 -324 -93 -172 -512 -167 -46 -94 -97 40 -55 -210 149 -61 22 -92 67 -261
5220 -261 -282 -64 -351 -125 -123 -26 29 43 68 -51 197 102 -121 257 371 124 -184 379 -180 122 210 496 -258
5243 -258 -409 -266 -98 -183 -253 69 -21 405 165 -297 66 -452 151 222 644 -44 -127 196 117 -4 -198 235
5265 235 154 241 -152 -63 -74 -131 -142 28 -77 -220 175 775 108 251 458 131 39 302 258 217 124 3 132
$$ packed form
5103a26P6J66k44J90j18l6J28n6J40r0j31JJ56j81N5J25k25J34M4r7K2mk21N42
5127B50j05o4j55P3j7R4j13Q3Rj2j0r1J94j98j00J69J60m6m1J2J0R3k11O0j68
5152a24K34o5N5j80N3K6K7p4J32k56J42M5j06J19j62L6J32j10J31J32k78J10n5
5175c6J54k48J73n8P7p3J05q6Qk4L5J54K79o63K73J61n26L25j95J24M14l56j72
5198a55M40m68L04n33N88n00K31p9l40L45J21m8lJ37r5j55L59k10Q3j14J59l28
5220b61k1K18k87K26KR7N5J4K5j19K48r5k23L78J14k47l08N63n59L02Q8K86p54
5243b58j51J43J68q5p0L22r0M26k40m62L63n18O03P1M22o88q3L23p9j21j94M33
5265B35q1Q7l93Q9j1n7j1J70j05j43L95O00o67J43K07l27r2K63m4m1r3j21J29
$$ plain form
5288 132 185 426 -159 -195 -102 -551 60 572 506 -857 270 -433 49 -35 30 -212 -156 -29 176 -143 242 -292
5310 -292 148 -68 25 -217 252 -466 -151 -146 330 -309 674 357 -119 -356 -19 164 -161 -16 -128 34 447
5331 447 -43 13 -642 -279 66 15 79 290 9 422 -289 44 -31 69 396 86 -121 -176 307 -441 206 36
5353 36 141 -216 27 102 -317 -253 67 111 64 -40 -153 326 -153 -22 96 -5 -60 9 199 -28 78 260
5375 260 -32 61 42 168 -181 64 -49 75 -104 -79 53 -99 -17 65 102 34 91 184 -84 -231 24 -2 -28 29
5399 29 -64 -97 37 97 -54 52 33 85 24 -102 201 -108 -119 30 -55 -55 -76 -17 10 8 202 -58 -93 208 -134 -35
5425 -35 232 62 -34 21 27 -121 -58 -98 3 -38 -94 73 -20 -102 16 -13 -38 -62 69 3 -87 14 -200 9 153
5450 153 84 39 72 -145 61 96 43 0 -41 -143 119 95 57 -48 39 11 -58 165 227 -87 110 37 11 94 4 7
$$ packed form
5288A32N3K41n85l6R3m49O11N12o6j363J127p03M82q4O5k42N6J27K05l19L85n34
5310b92M40k16R3k42M69p18L15NM76o39R83l17m76k37L37J83l25J45j12J62M13
5331D47m90N6o55L63L45n1O4K11k81M13p11L33p5J00L27l10k07n5M83p48O47j70
5353C6J05l57K43P5m19O4L20M4m7j04j13M79m79J31J18j01n5O9J90k27J06J82
5375B60k92R3j9J26l49K45j13J24j79K5J32j52Q2Q2L7o8N7R3k68j47K55k6k6N7
5399B9r3l3J34O0j51J06j9N2o1j26L03l09j1J49q5%k1N9K7kJ94k60l5L01l42R9
5425c5K67j70r6N5Oj48O3m0J01m1n6J67r3q2J18k9k5k4J31o6r0J01k14K09J44
5450A53o9m5L3k17K06L5n3m3m1j02K62k4l8j05Q7k8o9K23O2l14J97p3k6Q3r0L
$$ plain form
5476 7 125 146 -118 -118 -36 141 -28 -21 41 -44 84 212 141 141 -21 -727 615 704 -120 -175 -7 109 -300 151 132
5501 132 -94 187 -30 16 -19 70 165 -124 37 47 -86 -267 178 -54 4 33 -44 -73 -179 14 27 4 89 136
5525 136 -160 117 130 102 59 -89 165 -15 82 53 -251 -165 -26 -58 -88 -171 77 123 93 -64 35 63 136 230 37
5550 37 -74 48 -5 -154 -80 -145 -89 -25 109 -15 -77 -124 -238 -118 -124 89 174 -53 39 -180 111 -181 51 153
5574 153 121 43 -91 -109 50 183 -8 -38 141 -57 -164 215 -94 189 -13 -62 88 93 -22 114 -41 14 -48
5597 -48 -62 -154 -114 183 -142 57 -116 -5 123 102 41 13 180 256 118 282 -435 -223 -214 139 -165 -75 601 150
5621 150 190 -325 -432 92 -165 -34 -88 -154 -89 77 13 18 -37 -122 142 32 -201 19 -174 66 -19 -48 77 -87
5645 -87 -57 -171 78 57 41 -360 -31 -63 -193 -276 -278 164 -271 -7 -53 305 70 -123 182 127 -256 66 -30 47
$$ packed form
5476GJ18K1k64%Q2J77j69PO2q5J28J28p1%j62p06J342Q9q24n5J68J16m09M51j9
5501A32k26K81k17M6l5Q9R5k89J61J0j33j81M45k32N8K9p7k9j06J93J3k3Q5M7
5525A36k96K77J3k8m3j48K54j80R7k9l04Q6J39l2l0q3K48M6l0j57R9K8P3R4j93
5550C7j11J22n3j49P4o5N6O4J34j24o2m7j14J20oK13Q5k27R2k19K91k92K32J02
5574A53l2p8j34j8J59J33j91l0J79j98j07L79l09K83k02m9J50Nj15J36j55N5o2
5597d8j4r2M0K97l25J99j73J11J28k1o1k8J67P6j38J64p17K12RL53l04R0O76m51
5621A50M0n15j07N24k57J31n4o6O5J66o4Nn5q5K64j10k33K20j93K40q5k9J25j64
5645h7L0j14K49k1j6m01L29l2j30q3kM42m35K64m6L58k35j93L05n5l83L22r6P7
$$ plain form
5669 47 -30 33 45 16 -143 -4 79 5 104 -202 132 11 127 -76 -68 -201 149 24 -75 182 187 -113 108 29 -94
5694 -94 -11 -354 -196 -203 6 -277 122 -31 -37 32 12 44 104 126 74 -142 43 102 90 67 -191 -132 -99 -112 40 -20
5720 -20 -32 -193 37 117 6 38 1 -70 -7 -53 126 6 -119 184 30 -28 -81 -29 156 30 -142 1 93 191
5744 191 69 4 20 22 -24 -186 97 38 -61 -64 -39 -72 81 148 -26 76 15 -175 -3 58 -14 -28 110 27 -106 53
5770 53 76 -11 -6 96 106 160 47 -197 240 -223 24 -102 -30 -88 32 0 -34 -261 23 166 -76 -4 37 -12 -60
5795 -60 92 2 23 -29 -31 118 23 -140 -134 -87 -65 172 0 -71 42 41 236 61 30 38 77 -72 -3 -35 58 -35 -7 95
5823 95 -138 89 -163 -159 -50 143 34 -112 -12 -13 -113 39 -112 54 26 -17 -45 52 43 247 -235 -35 11 27
5847 27 140 -145 -2 214 140 -63 -115 46 72 -173 97 -81 23 4 -5 -123 146 -31 66 -162 -188 -175 25
$$ packed form
5669D7p7O3J2k9j59J39Q3p4R9l06L34j21J16k03Qj33L50j25r9K57Nl00K21p9j23
5694i4Q3l43J58pK09k83L99j53oO9k0L2O0K2n2k16J85N9j2k3k58N9L3j3J52o0
5720b0j2j61K30Q0j11L2l7p1O3m6J79j20j25L03j54n8n3N2J85j26j72J43R2R8
5744A91j22o5J6Km6j62K83n9r9lK5l3J53O7j74J02o1j90J72O1p2j4J38q3j33J59
5770E3K3q7NJ02J0N4j13k44M37m63K47j26P2n8J20l2l4k27K84J43k42P2M1m9m8
5795f0J52r0K1n2kJ49r5j63OM7K2K37j72p1J13jJ95j75l1QL9j49O9l2R3r3K8J02
5823I5k33K27k52MJ09J93j09j46J00jj00J52j51J66k8m3k8R7rK04m82K00M6J6
5847B7J13k85J43K16p4k03n2J61K6k45K70j78J04j9rj18K69j77R7k28k6J3K00
$$ plain form
5870 25 -4 -152 -51 -217 -104 -26 -24 137 -7 -6 93 -100 166 -114 -29 -63 91 -96 114 -138 9 111 -29
5893 -29 35 162 -59 -68 45 -127 -19 51 56 -85 -52 23 -33 27 65 338 57 128 41 -54 -14 101 126 -158 97 1
5919 1 -18 76 -69 34 -233 -62 32 -71 64 144 83 121 -50 0 -71 -109 -170 99 19 109 -109 62 131 -55 -52 202
5945 202 28 151 -2 -7 -31 177 -27 144 -49 -85 127 -189 84 -123 114 60 34 109 1 -103 -16 -137 37
5968 37 193 -43 -305 144 -249 -34 159 -90 73 -44 0 111 -23 156 112 -283 -102 131 -37 -70 -28 15
5990 15 -89 -116 -31 -131 -120 -150 -41 -14 66 147 -28 80 -135 47 89 29 85 242 -63 -193 90 123 -39 -8
6014 -8 -83 -137 -85 12 205 43 44 172 121 16 -202 155 -106 73 -87 -155 -97 -89 -81 -148 -124 -137 25 -66 -3 22 -317
6041 -317 71 118 23 -156 -99 174 13 177 -206 109 -162 -27 43 -48 18 -114 -170 -48 66 -117 50 -111
$$ packed form
5870B5k9j48J01j66J13P8KJ61j44JR9j93K66k80Q5l4J54j87K10k52J47J02j40
5893b9O4J27k21rJ13j72J08P0Nj41L3P5n6O0L8K73k81P1q7r5M0J15K5k84K55r6
5919Aj9R4j45J03k67J71R4j03J35Q0o1L8j71N0p1l8o1K69q0R0k18J71O9j86LK54
5945B02j74J23j53nk4K08k04J71j93l6K12l16K73k07K37n4k6P5j08j04Q7j21J74
5968C7J56k36k62M49l93K15J93k49J63j17M4J11j34J79m4l95J81K33j68l3M2M3
5990A5j04k7Q5j00J1l0J09K7Q0Q1j75J08k15J82M2o0N6J57l05j30K83L3j62L1
6014hp5n4N2R7J93j62JJ28n1j05k18L57k61J79j60o8N8QQo7K4j3J62r1O3K5l39
6041c17L88M7r5j79N7K73j61J64l83L15k71J35P0r1O6j32n6J22J14j83J67j61
$$ plain form
6063 -111 -149 -87 8 -103 -248 -85 81 -31 -79 0 -293 7 -139 75 29 -130 79 -166 96 -22 93 -161
6085 -161 142 61 7 48 -21 -33 -92 55 -101 96 96 -105 -155 154 -8 31 306 179 -55 -130 69 97 30 -71
6109 -71 15 52 -161 123 -164 34 52 134 -116 -19 -23 -62 138 88 -239 115 -82 -27 44 94 185 31 247 9 10
6134 10 -98 -196 -195 -35 -75 -93 165 -194 72 -173 -177 9 50 -61 -127 140 194 152 111 156 -99 127 -70 -116 -6
6159 -6 6 -125 -4 -77 134 -21 -31 25 159 -243 -23 165 -194 43 -19 -240 53 -104 -18 -44 -233 -161 22
6182 22 -63 146 -11 -25 181 20 -80 -163 -112 114 104 -23 231 -218 21 -52 -145 -112 -251 86 84 -69 -221 114
6206 114 -20 -13 -59 -90 46 91 119 -54 72 105 103 39 42 -13 91 42 38 74 -86 170 -68 -44 -120 150 -70 -114 2
6233 2 -42 185 -20 -33 -52 -17 12 89 -26 -52 -100 23 -71 -100 118 6 134 81 143 -183 24 95 -180 77 -32
$$ packed form
6063a11l8O2R5j11j45J63J66j12m8P9k93L00j46K14m6j59K09k45K62j18J15k54
6085a61L03q1n4M1o9j2n9J47j56J97%k01n0L09j62L9K75j27k34p5J99K8o7j01
6109g1Q6L7k13K84k87J98J8Q2k50R7ml9K00n0l27L54j97N5P1N0R1j54K16k38J
6134A0j08r8JJ60m0j8K58l59K66k45mJ86M1j11o6K67N4m2m1M5k55K26j97m6J10
6159fJ2j31J21p3K11j55j0N6J34m02K20J88l59K37o2k21K93j57Q6k6j89P2J83
6182B2q5K09j57j4K06j61j00q3N1K26j0j27K54m49K39p3r3L3j39L37kj53j52L35
6206A14j34Pm6l1J36M5K8j73J26L3ko4Ln5J04m9mL6j60K56k38K4p6K70k20m4J16
6233Bm4K27k05j3j9L5K9P7j15k6m8J23r4k9K18j12J28n3O2l26K07P1k75K57j09
$$ plain form
6258 -32 252 142 167 -134 -50 117 -2 -17 111 28 82 21 108 124 -152 -216 -91 -70 -92 -167 26 -131 12 -53 -29
6283 -29 -47 -79 -205 57 -16 -40 -2 -52 -105 60 155 211 -77 219 40 -99 23 -194 -109 7 163 190 -136 297
6307 297 5 193 -85 -54 203 44 -103 -265 -9 -146 -111 -49 -271 -74 -187 -111 -17 -149 125 -109 166 240
6329 240 110 60 -128 27 157 133 -14 132 64 -75 -71 80 -41 116 71 16 -4 -117 -105 92 114 -61 92
6352 92 -59 -164 -158 217 -175 80 -50 15 -114 -99 114 80 -95 -108 -89 -279 36 -151 -54 8 -13 -200 -9 128
6376 128 -50 61 177 64 -5 -218 -15 -62 -67 -109 -7 -159 -127 3 129 18 -183 -36 -13 155 -139 55
6398 55 20 154 -91 69 101 100 -52 -104 -75 -328 -169 -175 -215 -12 72 103 30 168 10 259 68 -24 -6 -137 -80
6423 -80 -120 192 -81 24 -18 -123 -50 -75 -169 160 93 28 -76 97 -110 -86 31 135 72 27 -46 4 92 185 -39
$$ packed form
6258c2K84j10K5l01Q4J67j19j5J28q3N4o1Q7J6k76o4J25K1k2p5J93j57J43o5K4
6283b9j8l2j26K62p3k4L8n0n3J65R5N6k88K96j79j39J22k17Q5J16J56K7l26M33
6307B97k92J88k78L1K57j59j47j62K56j37L5O2k22J97j13P6R4j32K74k34K75P4
6329B40j30n0j88J55J30k4j47J46o8j39MJ51j21J57m5n5k0j13J2J97K2j75J53
6352I2j51j05OL75l92K55j30O5j29J5K13l4j75j3J9j90L15j87R7O2k1j87J91J37
6376A28j78J11J16j13o9k13K03m7nm2J02j52L2J30J26j11k01J47K3J68k94J94
6398E5l5J34k45J60L2jj52n2K9k53J59om0K03Q4L1p3J38j58K49j91r2J8j31N7
6423h0m0L12k73J05m2j05P3k5r4L29o7o5j04J73k07K4J17J04o3m5p3N0Q8R3k24
$$ plain form
6448 -39 175 82 -148 -79 -19 65 170 -190 -8 83 11 -16 144 -55 -143 -240 20 -183 46 -11 -176 -5 320 -65
6472 -65 -15 27 -159 50 -93 273 -131 19 -122 39 18 -28 -64 173 63 92 82 -18 160 41 -50 29 -110
6495 -110 161 164 51 -44 -181 -92 -160 -132 -68 29 132 161 45 131 161 62 -61 163 48 142 193 146 33 74 23 -194
6521 -194 97 -35 132 162 -25 -8 -58 76 -30 98 -20 -109 -87 -170 257 -53 -121 -84 36 -103 53 -50 -77
6544 -77 -16 -29 33 -49 -34 -208 165 33 98 -24 -91 -9 130 172 153 -67 -133 306 -99 3 32 137 77 -34 -143
6569 -143 -249 43 28 179 3 152 84 -209 -37 167 48 -40 -88 227 -31 96 27 66 267 -110 97 -104
6591 -104 0 76 1 199 -25 59 142 -31 -88 -3 -2 105 -20 145 201 71 -16 125 -66 -27 -21 64 -120 21 73
6616 73 -44 2 -17 -67 101 270 -94 97 -9 102 -55 105 -67 -79 115 -83 113 25 -65 -56 -106 -95 39 -19
$$ packed form
6448c9K14r3k30O9O0Q4J05l60J82R1p2k7J60j99q8r7K60k03K29n7j65J71L25l85
6472f5N0M2j86K09j43L66m04J50j41J61k1m6l6K37j10K9j0j00J78j19r1P9j39
6495a10K71Lj13r5j37Q9o8K8O4R7J03K9j16Q6L0r9j23K24j15R4N1m7j13M1n1k17
6521a94K91j32J67L0j87J7n0J34j06J28j18q9K2q3M27l10o8L7J20j39J56j03k7
6544g7O1j3O2q2J5j74L73j32O5j22o7Q2J39M2j9k20o6M39m05J02K9J05o0j11j09
6569a43j06K92j5J51j76J49o8k93J72K04j19q8m8L15k58J27o9L9K01l77K07k01
6591a04J04P6p5J98k24Q4Q3j73n7Q5JJ07j25J65N6j30q7J41j91L9OQ5j84J41N2
6616G3j17M6j9n0J68J69l64J91j06J11j57J60j72j2J94j98J96q8r0Rn0J1J34n8
$$ plain form
6640 -19 11 206 261 3 209 -56 -203 174 195 151 48 3 46 142 -84 102 120 -172 -68 -12 -96 -69 -155 -46
6664 -46 12 100 22 -3 -18 96 -137 -105 198 -76 -3 -6 170 -244 72 -143 56 11 -77 -29 71 -70 -79 33 -196
6689 -196 166 201 -12 58 -38 41 -100 -32 367 262 57 9 86 55 12 -5 13 -19 56 32 92 63 72 223 135 -148
6715 -148 -64 -151 -154 -12 -81 -21 270 80 180 -45 4 0 -104 -4 91 86 37 -125 236 -38 57 116 126 -87 156
6740 156 -199 9 -29 -119 -102 72 9 -154 -88 125 -48 -75 18 -14 7 84 62 153 3 62 10 -94 -22 22 102 93
6766 93 134 22 -65 -41 96 -90 -91 19 120 84 -99 -185 -66 62 59 -54 -120 84 83 -12 -39 149 -164 3 35
6791 35 56 -22 -108 131 -238 -201 -92 73 -130 -85 60 178 176 -18 10 47 -93 -81 -33 -18 -18 -100 -33 55 14 180
6817 180 -164 74 -9 128 -11 -66 -115 92 28 -61 -111 -91 415 171 7 -244 -118 -30 61 -47 -86 2 -13 -217
$$ packed form
6640a9L0J95N5k58K06k65j47L77K1m4j03m5M3R6k26J86J8k92J04N6q4K7q6J09
6664d6N8Q8p8k5j5J14k33L2L03k74P3lJ76m14L16k15J99m5q8M8J00j41rJ12k29
6689a96L62L5k13P0r6P9j41O8L99j05k05m8P7l1m3j7J8l2P5k4O0k9RJ51q8k83
6715a48Q4q7lJ42o9O0K91j90J00k25M9mj04J00R5nm9j62L61k74R5N9J0k13K43
6740A56l55K08l8r0J7J74o3j63O6K13j73k7R3l2K1P7k2R1j50N9n2j04P2M4Q0r
6766I3M1j12q7K4J37j86jJ10J01l6j83q6J19J28lj13o6K04jr5k7J88l13J67L2
6791C5K1p8q6K39l69L7J09J65k03M5J45J18kj94K8L7j40J2M8J5%q2O7Q8m1J66
6817A80l44K38q3J37j39n5m9K07o4q9n0K0N06k44j64k51J26Q8R1j08l9Q8j5k04
$$ plain form
6841 -217 -42 -127 -87 241 -130 36 32 -64 -42 124 -131 69 0 94 -140 -16 -172 -99 -144 -67 79 -168 156 50
6865 50 164 -24 -32 -14 -120 -107 3 43 -60 31 114 15 102 -121 212 -142 25 136 25 99 -19 -136 -128 75
6889 75 99 202 23 78 6 68 48 58 -89 21 51 -47 65 81 110 -45 6 132 147 -148 -37 175 -248 -28
6913 -28 -82 78 -39 29 -81 -63 96 11 124 -258 -17 55 28 98 -92 -195 79 -99 -30 73 34 -65 72 -14
6937 -14 -213 36 113 34 -34 239 -35 -79 -165 -95 22 81 64 97 266 91 -85 -31 -62 -332 76 80 263 -58 78
6962 78 -81 13 -72 -162 -6 111 -68 -12 -21 164 -158 -55 165 -65 100 8 138 -115 -98 248 48 -164 109
6985 109 41 -37 -185 -41 -333 -11 59 106 -46 135 -146 56 43 -78 -18 -23 -14 13 99 87 -55 74 139 -49 69
7010 69 94 49 66 -80 -78 21 109 168 -104 -125 53 -119 -81 38 59 216 41 24 182 -17 9 -65 51 30 19 172
$$ packed form
6841b17J75q5M0L28l71J66mr6K2J66k55K00o9R4k34J24j56P3m5P7J46k47L24j06
6865E0J14j88qJ8j06J3J10M0j03R1Q3r9Q7k23L33l54J67J11j11P4j18j17QK03
6889G5K4J03j79N5p2O2k0J0j47J10L0r8J12J6K9j55N1J26J5k95J11K12m23K20
6913b8n4J60j17O8j10J8J59q5J13l82K41P2k7P0j90j03K74j78O9J03l9r9J37q6
6937a4j99K49P7p9o8K73k74m4q6P0J17N9j7L3J69j75j76N4l1k70M08MJ83l21J36
6962G8j59R4q5r0J56J17j79N6rJ85l22J03K20k30J65r2J30k53J7L46k00k12K73
6985A09o8p8j48J44k92L22P0M7j52J81k81K02j3j21O0nRK7Q6j2j42J29O5j88J18
7010F9K5m5J7j46KR9Q8N9k72k1J78j72L8J19K1J57j75j7J58j99K6p4J16k1j1J53
$$ plain form
7036 172 -91 -24 -135 61 -56 -37 -92 -90 117 185 123 104 63 154 104 -120 29 176 -14 2 -252 136 210 -112
7060 -112 -93 -57 9 -182 41 98 21 -169 -262 -207 14 121 34 -19 23 30 78 -37 -90 114 -86 138 113 345 22
7085 22 -6 96 -25 -128 -37 -74 150 -32 253 -72 -182 34 25 38 -6 -62 92 79 71 173 61 134 73 -129 -101
7110 -101 44 97 81 -118 -206 -49 61 126 -159 20 -108 12 -83 46 -140 -8 94 -30 -95 223 98 15
7132 15 189 -100 -128 -184 -21 40 -79 -69 27 6 -155 -29 -82 179 -198 -22 163 52 254 -160 216 -191 -121
7155 -121 -146 120 140 113 264 39 35 24 -300 381 -287 -426 -84 -12 -21 111 7 -132 147 91 -283 -235 193 243
7179 243 434 184 -397 292 173 469 267 33 -259 -69 -88 7 -105 -24 216 266 38 82 145 9 -57 43
7201 43 -150 -100 25 77 104 -12 117 13 64 -173 98 -144 -88 -148 -131 -84 79 -92 107 337 59 119 -96
$$ packed form
7036A72k63O7j11J96j17J9n5KK07O8o2j9m1R1n0k24J49J47j90J6k54L88P4l22
7060a12J9L6O6j91K23N7p7j90r3N5K21J07q7n3M2PM8j15n3K04k00K24k5K32l23
7085B2k8J02j21j03R1l7K24j82K85l25j10K16rJ3m4n6J54j3qJ02j12P3o1k02K8
7110a01J45N3j6j99q8J57J10O5k85J79j28J20r5J29j86J32J02j24o5L18j25q3
7132A5J74k89k8n6J63O1j19J0R6k1j61J26n3K61l77J76J85j11K02m14L76m07P0
7155a21k5K66K0k7J51k25mj1l24O81o68j39L42P2rJ32j04j39K79n6l74M8M28N0
7179B43J91k50n81O89j19K96k02k34k92J90j9R5j12Q1K40N0k28M4O3j36o6J00
7201D3j93N0J25N2K7j16J29j04N1k37K71k42N6o0J7M7J63j71J99K30k78O0k15
$$ plain form
7224 -96 18 258 79 27 -10 -88 -119 103 63 14 -98 21 84 -8 -150 105 87 82 -70 -1 155 -30 65 -82 -31
7249 -31 -20 58 12 25 -55 49 -91 19 21 259 -149 152 164 -109 -300 -258 -172 -35 -166 76 143 45 107 -176 196
7274 196 -71 -205 -45 15 -41 17 295 -171 100 62 94 5 38 -59 31 67 -194 148 -46 -46 218 -15 -58 18 136
7299 136 -100 -35 10 -206 -95 78 -29 -10 -145 -146 -44 -226 35 -120 -109 -218 115 -6 112 -31 -49 244
7321 244 -6 -33 39 -122 -167 -130 -29 72 -61 -43 -49 8 -13 -18 -146 -27 -61 -106 72 -98 88 96 167 -65 -46 -255
7347 -255 17 -10 -299 42 -266 97 97 -90 207 146 -250 49 131 181 126 -84 -161 204 111 -165 -73 -131 -51 92
7371 92 124 14 -110 28 48 127 -21 160 -2 -32 41 -36 113 -272 -159 30 -114 87 -19 23 -29 -131 39
7394 39 77 78 -282 128 130 -101 189 -110 -140 -40 -36 84 -38 144 160 -7 139 72 51 -139 5 157 -32 202
$$ packed form
7224i6J14K40j79n2l7p8l1K22m0m9j12J19O3r2j42K55j8nj52O9J56j85R5j47N1
7249c1J1P8m6J3q0J04j40J10KK38m08L01J2k73j91M2Q6J37j31K42O7r8O2k83L72
7274A96k67j34J60O0n6N8K78m66K71l8L2q9L3r7R0L6k61L42j94%K64k33m3P6J18
7299A36k36O5M5k16J11J73j07J9j35jJ02j82K61j55J1j09L33j21J18j43j8K93
7321B44k50k7P2j61m5L7J01J01j33J8oN7k1nj28J19l4m5J78j70J86QP1k32J9k09
7347b55K72k7k89L41l08L63%j87K97o1l96K99Q2N0n5k10p7L65r3k76R2n8Q0J43
7371I2L2j10j24J38K0P9j48J81j62l0P3p7J49l85J13J89j44K01j06M2n2j02J70
7394C9L8Jl60M10Kk31K90k99l0J00MJ20j22J82J6j67J46o7k1j90J44J52j89K34
$$ plain form
7418 202 108 63 -90 14 -60 172 -66 -186 -78 185 -70 93 53 -124 -120 -46 98 -44 -68 -218 -21 87 -14
7441 -14 -166 38 -43 240 234 44 144 -209 216 171 -32 -240 121 -5 83 -102 -105 -27 -87 255 -99 70 -293
7464 -293 -60 -121 6 73 -42 -137 -72 170 157 163 134 53 21 -18 190 55 14 39 33 29 -44 -116 -97 200 -102 -22 130
7491 130 43 218 107 -112 -59 -33 -65 171 19 -47 53 58 -40 144 61 -36 13 57 58 177 -78 40 197 208 -78
7516 -78 -103 -65 -128 156 3 71 -6 -48 26 -181 -194 152 59 -188 13 332 127 126 -116 -21 28 -128 165 10 51
7541 51 -75 -87 204 3 -10 -81 19 44 80 35 -153 -21 -43 64 -21 -49 126 -60 -57 -47 -106 134 227 -45 -124
7566 -124 173 96 285 24 -145 -40 -78 48 -71 -79 35 23 148 -9 62 19 3 -44 80 58 183 -80 -36 60
7590 60 271 115 43 21 137 -16 123 70 18 -278 -80 -100 61 46 104 -25 124 122 -27 -106 40 -130 30 -121
$$ packed form
7418B02r4m5j53J04p4K32k38j20J08K63k55J63m0j77MP4J44j42k4j50J97J08j01
7441a4j52K04q1K83oj90J00l53M25m5k03k08L61j26Q8j85lP8o0L42l54J69l63
7464b93K33o1J27O7j15r5O5K42j3Ok9q1l2l9K08j35m1K5omp3p2J9K97l02Q0J52
7491A30q7J75j11k19N3K6l2K36j52o6J00Nr8J84q3r7M9M4JJ19k55J18J57J1k86
7516g8k5L8o3K84j53O8p7m2P4k07j3L46r3k47K01L19k05jk42R5M9j56K93j55M1
7541E1j26j2K91k01j3p1J00K5L6m5j88J32k2J07q5k8J75j86LJ0n9K40R3k72p9
7566a24K97p7J89k61j69J05l8J26j19qJ14j2J25j57P1m3j6m7J24k2J25k63M4R6
7590F0K11j56p2k2J16j53J39n3n2k96J98k0J61j5N8j29J49kj49p9J46j70J60j51
$$ plain form
7614 -121 -119 40 165 45 -108 -96 -46 24 72 -1 206 3 187 -131 102 9 63 -12 -41 9 15 -59 -58 -62 -230 -173 -130
7641 -130 -267 -177 18 -141 37 48 5 69 18 93 -45 117 -38 -154 49 117 -15 -78 -7 60 -35 113 -243 -57
7665 -57 58 -85 -149 28 160 65 152 -21 -170 36 136 40 85 65 54 147 65 -127 88 -24 -14 -158 83 85
7689 85 28 -125 -16 -81 -111 -15 -135 -33 36 169 70 -28 193 -33 -79 -7 90 127 -108 64 110 44 -104 126 4
7714 4 -350 -232 299 32 100 -138 -120 35 23 305 100 98 -151 -2 157 -5 170 174 -110 -105 -33 3 -126 -56 -122
7739 -122 72 -145 -81 58 -15 -246 -26 113 -125 -24 -19 -133 114 -29 5 -101 157 -160 -12 -53 51 273
7761 273 -148 -265 -116 302 23 -47 15 22 36 -116 -35 -115 9 -46 -86 -110 16 -228 -1 -247 48 -151 -52 63
7785 63 97 91 86 -184 -150 26 -90 -81 60 -96 41 -153 49 -69 -22 90 -30 -188 -19 189 74 27 153 -189
$$ packed form
7614a21KJ59J25j20j53J2N0P0M8p3K07k03J84l18K33r3N4p5k9N0Op4Jmj68N7M3
7641a30j37R0J95j59J78J1m3O4n1P5j38J62j55j16K03O8j32o3P1O7r5J48l56J86
7665e7J15j43o4J77J32r5Q7j73j49K06J00r6M5k0j1R3q2j92K15j12J0j44K41K
7689H5n7j53J09o5l0R6j20J02O9J33r9r8K21k26m6P2R7L7k35J72M6o6j48K30j22
7714Dl54J18N31k67O8k38J8J55j2K82k05kk49J49J59j62J75Mk84NP2L6j29P0o6
7739a22J94k17O4J39p3k31K20J39k38J01Nj14K47j43L4j06K58l17J48m1J04K22
7761B73m21j17J49M18k79p0O2PJ4j52Q1q0J24n5m0k4J26k44K27k46K95j99R9J15
7785F3L4onk70L4J76j16RJ41j56J37j94K02j18M7J12j20j58J69K08j15m7J26l42
$$ plain form
7809 -189 -1 -31 37 136 306 -181 -38 -91 59 42 -150 -170 261 -289 72 26 -81 103 -14 156 -84 -141 159
7832 159 -147 75 143 -81 -92 95 -234 -154 25 65 46 6 123 -21 9 79 98 28 -1 -63 28 93 -3 -51 -23 -28
7858 -28 -42 126 -91 -72 149 92 -68 -96 -49 -93 -86 53 69 71 25 -83 -223 -47 124 33 185 -206 -56 20 123
7883 123 -65 -115 -7 116 -221 -60 -40 291 139 -1 -2 68 -133 75 255 78 297 91 118 21 76 48 105
7906 105 -34 93 -67 -114 61 -119 7 -59 159 -68 87 36 111 -134 70 77 10 121 -38 177 11 71 50
7929 50 7 -136 -59 -116 55 -55 -202 -88 7 30 157 -237 52 -242 55 -5 4 -216 -29 232 123 -90 -60
7952 -60 -9 0 82 87 -179 -1 -160 207 -111 -97 14 -23 58 38 -5 27 -216 64 -51 135 -20 179 103 -28 -50
7977 -50 -13 119 -51 183 242 -17 -101 105 3 69 -55 -104 -23 118 -133 -127 -104 -76 -44 62 -82 -82 -124 -79 -40 -121
$$ packed form
7809a89J88l0O8R9J70m87J43n3J50j7j92k0M31n50L61m6j07J84j17J70k40n7L00
7832A59l06K22O8k24j1J87l29Q0J79M0j9m0J17j44L0P0J9p0k9o2R1O5r6m8K8n
7858b8j4J68k17J9K21n7j60k8M7m4PJ39J6Km6j08j40J76J71r1J52l91J50P6J03
7883A23j88n0J08J23l37J61K0L31j52j40jP0k01K08J80j77K19k06K7r7N5k8N7
7906A05j39J27j60m7J75j80J26o6K18k27J55n1P5k45K04Po7J11j59K15j66O0k1
7929E0m3j43P7n7J71j10j47J14R5K3J27l94K89k94K97o0Rk20J87K61j09k13L0
7952f0N1RQ2Nk66J78j59L67l18J4J11l7Q1k0m3L2k43K80j15J86j55J99p6j31k2
7977e0L7J32j70K34N9k59q4K06j02O6j24m9Q1J41k51OK3K8L2J06j44%m2M5L9q1
$$ plain form
8003 -121 229 130 205 116 62 246 -114 -109 140 24 -155 78 -50 -64 -174 53 61 227 14 -175 6 -54 71
8026 71 211 7 -2 -16 -44 -72 -31 -10 -154 -45 75 -95 -44 -55 182 109 -138 48 3 -153 20 31 -40 89 -46
8051 -46 -50 34 -6 17 53 18 -16 -51 -33 38 -126 -10 72 -90 91 185 -112 -148 -201 71 -57 68 -160 34 203
8076 203 33 -6 -99 -75 59 39 44 -115 -188 75 -84 -171 -70 -114 40 103 -271 -84 54 -143 -27 177 -91
8099 -91 -53 190 15 -18 -155 138 -71 -13 -222 -43 154 238 -226 44 -10 26 -228 -77 -35 -108 -54 -56 22 133
8123 133 197 106 39 -36 58 26 -51 -114 -15 46 -178 139 -2 -32 89 -149 154 -230 123 -40 55 -70 84 -12
8147 -12 -33 -73 239 -30 195 -102 88 138 -212 121 150 -46 -239 28 79 130 -89 255 88 -42 -33 -179 -89
8170 -89 66 -147 36 35 -48 -9 25 -2 187 -42 -204 -79 -43 88 72 20 -8 77 134 44 40
$$ packed form
8003a21L50r9P5q9n4J84l60NK49j16j79K33j28j4j10K27QJ66k13j89J81o0J25
8026G1J40k04rj4k8k8M1K1j44J09J20j70N1j1K37p3k47J86m5j56J73J1p1J29j35
8051d6mQ4m0K3L6l5l4l5J8P1j64J16Q2j62J81R4k97l6n3K72j28J25k28J94J69
8076B03j70l9r3K4J34k0Nj59p3K63j59q7J01m4J54O3l74J87J38j97J16K04k68
8099i1L8K43j75l3j37K93k09N8k09J79J97Q4m64K70n4L6k54J51M2p3N4kP8J11
8123A33O4r1o7p5R4l2p7o3R9O1k24L17j41l0J21k38L03l84L53j63R5j25J54r6
8147a2k1m0L12k69K25k97J90N0l50L33K9j96j93K67N1N1k19L44j67j30Rj46R0
8170h9J55k13J83jq3L9L4k7J89k29j62J25L6J31j6n2k8Q5N7r0m
8191D0
$$ Imaginary data points
##PAGE= N=2
##DATA TABLE= (X++(I..I)), XYDATA
$$ plain form
0 0 0 0 0 0 0 0 0 0 0 0 0 0 0 0 8 -8 8 -8 8 -16 16 -16 24 -24 32 -32 40 -48 56 -64 72 -80 92 -104 118 -133
36 -133 149 -166 185 -207 231 -255 286 -316 350 -384 424 -468 516 -569 628 -691 761 -841 929
55 929 -1025 1139 -1272 1423 -1599 1815 -2079 2412 -2847 3442 -4312 5713 -8336 14991 -72373
70 -72373 -97658 24173 35483 57952 87428 84154 5814 -45110 -63316 -69696 -62773 -1879 55016
83 55016 68399 53391 44107 8887 -46025 -72779 -45972 -16518 -5010 15652 53523 59127 19676
96 19676 -24568 -38362 -35834 -26468 -9427 9180 20807 36245 43788 16660 -25905 -32239 -11909
109 -11909 -11494 -17698 6330 31158 17804 -2333 1607 -1960 -22737 -23371 -3231 2510 3024 18948
123 18948 21823 -3503 -15007 5701 12999 -10125 -18988 5973 22733 6891 -11112 -7851 40
$$ packed form
0@%%%%%%%%%%%%%%Qj6J6j6J6k4L2l2M0m8N6o4P2q8J04j20J36j52J72j96K22k51
36a33K82l15L51l92M38m86N41o02O66p34Q08q92R84j085J197j319J452j602J770
55I29j954K164k411K695l022L414l894M491n259O289p754J0025j4049K3327q7364
70g2373k5285J21831J1310K2469K9476l274p8340n0924j8206o380O923O0894N6895
83E5016J3383j5008r284l5220n4912k6754K6807K9454J1508K0662L7871N604l9451
96A9676m4244j3794K528R366J7041J8607J1627J5438P543k7128m2565o334K0330
109a1909M15o204K4028K4828j3354k0137L940l567k0777o34K0140N741N14J5924
123A8948K875k5326j1504K0708P298k3124q863K4961J6760j5842j8003L261P891
$$ plain form
136 40 -3766 -6300 -1617 -905 -3105 1644 5391 -2464 -6972 3221 8868 -245 -194 13237 9465 -10506
152 -10506 -11814 4990 6519 -5542 -4739 3153 1976 691 1993 -8174 -17738 -2831 15555 4739
166 4739 -10443 2342 16609 3295 -11122 -2556 5505 -1711 -3141 8891 10500 -1834 -6209
179 -6209 -1062 -3915 -10287 -4171 3754 -2638 -5731 8552 13614 -5616 -16355 634 12754 1491
193 1491 -5667 5141 10075 2422 -61 1548 -6495 -11260 65 6997 -2722 -6361 3929 4359 -7499
208 -7499 -6356 4370 675 -8092 969 13589 7486 -3599 -722 3749 -933 -1446 2986 -762 -7003
223 -7003 1092 9952 -515 -13585 -6443 5062 456 -6327 662 5610 -756 -1663 6201 4407 -5378
238 -5378 -3186 6896 5783 -1206 892 3430 -3275 -5872 2377 2969 -8581 -9492 4042 7517 -3658
$$ packed form
136D0l806k534M683P12k200M749L747p855m508J0193N647r113N1J3431l772j9971
152a0506j308J6804J529j2061Q03P892j177j285J302j0167r564J4907J8386j0816
166D739j5182J2785J4267j3314j4417Q566Q061p216j430J2032J609j2334m375
179f209N147k853o372O116P925o392l093J4283N062j9230j0739J6989J2120j1263
193A491p158J0808M934p653k483J609q043m765J1325O932r719l639J0290M30j1858
208g499J143J0726l695q767R061J2620o103j1085K877M471m682n13M432l748o241
223g003Q095Q860j0467j3070P142J1505m606o783O989M948o366r07P864j794r785
238e378K192J0082j113o989K098K538o705k597Q249N92j1550r11J3534L475j1175
$$ plain form
253 -3658 -6588 1389 2198 -2233 2898 6747 -1272 -3843 7340 9742 -3144 -6812 2302 2835 -4918
268 -4918 -1262 4275 -3534 -9543 339 6777 -3058 -8134 667 5076 631 674 4680 661 -3873 2639
284 2639 8706 1099 -6761 -1156 5749 1068 -4706 -1831 -135 -4633 -3431 4339 2006 -7802 -4689
299 -4689 6360 4696 -3840 -678 5269 572 -1086 6921 5492 -6190 -4753 6874 4631 -6452
313 -6452 -4589 1992 -1992 -4471 1996 1553 -7043 -5251 5339 5839 -2535 -2519 3428 3391 772 2832
329 2832 3148 -1865 -3231 2600 5380 -2026 -6965 -1790 2650 -1792 -4023 229 -603 -5076 170 7238
345 7238 1122 -6448 838 8485 2452 -2490 2988 2744 -3558 -80 6326 -783 -8796 -1682 5342
360 5342 -1364 -5964 -503 442 -3575 -948 4804 1352 -4519 -102 6626 4076 -1176 -854 2237 1351
$$ packed form
253c658k930P977Q09m431N131L849q019k571J1183K402j2886l668R114N33p753
268d918L656N537p809o009R882O438r835n076Q801M409m445M3M006m019m534O512
284B639O067p607p860N605O905m681n774K875J696m498J202P770k333r808L113
299d689J1049j664q536L162N947m697j658Q007j429j1682J437J1627k243j1083
313f452J863O581l984k479O467m43q596J792J0590N00q374J6N947l7k619K060
329B832L16n013j366N831K780p406m939N175M440m442k231M252q32m473N246P068
345G238o116p570P286P647o033m942N478k44o302L478O406p109q013P114P024
360E342o706m600N461R45m017K627N752l452n871M417O728k550n252L22L091q86
$$ plain form
376 1351 417 1535 571 -4240 -4321 2323 2601 -5370 -6459 1560 2906 -2753 -1384 3553 -266 -3187
392 -3187 4024 6951 -1440 -3590 4127 4530 -2337 -250 3017 -3013 -6055 2021 4622 -4962 -7809
407 -7809 969 4179 -1643 -2697 319 584 289 3505 3980 -593 -2017 2735 4897 91 -3465 -47
423 -47 2137 -2036 -3419 1275 730 -5688 -4513 3090 2990 -3946 -2882 2711 2136 865 3617 1596
439 1596 -3750 658 8271 2711 -6407 -2505 5092 1023 -4641 -1830 103 -3120 -2557 1576 53
454 53 -3474 -812 2828 675 -648 3111 3459 -1501 -2011 5324 6283 -2780 -6852 1415 6158 -867
470 -867 -6649 -2654 1003 -1151 -1337 500 -2838 -3674 2969 5779 -1373 -3733 3807 5490 -1076 -1570
486 -1570 4267 2835 -3626 -2500 3048 1857 -3115 -4065 -2189 -750 1661 741 -4560 -4798 3195 6853
$$ packed form
376A351r34J118r64m811q1O644K78p971j089Q019J346n659J369M937l819k921
392c187P211K927q391k150P717M03o867K087L267o030l042Q076K601r584k847
407g809Q778L210n822j054L016K65k95L216M75m573j424M752K162m806l556L418
423d7K184m173j383M694n45o418J175P603j00o936J064N593n75j271K752k021
439A596n346M408P613n560r118L902P597m069n664K811J933l223N63M133j523
454E3l527K662L640k153j323L759L48m960n10P335R59r063m072Q267M743p025
470h67n782L995L657k154j86J837l338q36O643K810p152k360P540J683o566m94
486a570N837j432o461J126N548j191m972r50J876J439K411r20n301k38P993L658
$$ plain form
502 6853 -411 -5608 575 6959 3257 -1696 61 1917 163 -290 1374 -729 -3882 -1182 1719
517 1719 -2485 -4320 1276 2470 -4524 -4956 5396 7051 -3891 -6526 4287 9041 1024 -4627 -271
532 -271 3336 1541 249 -947 -3511 -2710 1923 1913 -4337 -4668 1457 2583 -2352 -2304 2726 3050 -1081
549 -1081 -805 3198 3791 1219 -1009 -1493 689 4123 1394 -6265 -5288 3332 4866 -4445 -7791 136
565 136 4577 107 -3219 -75 1992 466 1406 3096 487 -1197 2081 3407 -1201 -3010 2094 2831
581 2831 -4552 -5735 2987 4779 -5253 -8397 1862 6419 -954 -5303 4 3949 2490 1268 432
596 432 -1432 892 4500 1953 -3676 -2194 2084 742 -3092 -2565 -176 -570 -1837 -1559 -610 1031
612 1031 1204 -680 -1548 1684 4850 2041 -3023 -1805 4981 5496 -2221 -5894 701 4880 -873 -5437
$$ packed form
502F853p264n197O183O384l702m953J757J856j754m53J664k103l153K700K901
517A719m204j835N596J194o994m32J0352J655j0942k635J0813M754q017n651M356
532b71L607j795j292j196k564Q01M633j0o250l31O125J126m935M8N030L24m131
549a081K76M003N93k572k228m84K182L434k729p659R77Q620J534r311l346P927
565A36M441m470l326L144K067j526R40J690k609j684L278J326m608j809N104P37
581B831p383j183Q722J792j0032l144J0259M557p373m349N307L945j459j222q36
596D32j864K324L608k547n629J482M278j342l834N27K389l94j267K78R49J641
612A031J73j884q68L232L166k809n064J218O786N15p717l673O595M179n753m564
$$ plain form
628 -5437 -1794 1068 -1376 -1736 1123 -764 -3087 1609 4389 -879 -2362 3817 4533 -2426 -2099 4950
644 4950 3596 -4098 -3853 2179 2705 -2022 -4048 -2187 526 1452 -568 -2918 -1951 1751 3305 804
660 804 -1587 -138 3295 3054 -192 -827 1530 1202 -1304 -774 394 -1226 -2496 -807 -667 -1865 204
677 204 1267 -2723 -3290 3900 5162 -2507 -3856 3503 5727 -297 -1738 953 1233 -565 767 430
693 430 -2874 -2730 686 441 -2383 -2136 406 256 -1199 -263 2155 2059 -687 -752 3236 3685 -463 -1923
711 -1923 886 1791 385 -486 -1361 -2891 -1194 2174 -289 -4607 -1643 2604 871 -2060 547 2162
727 2162 -103 203 3139 1885 -1187 -39 1762 291 -725 332 -421 -3148 -1791 1390 505 -3114
743 -3114 -3264 597 2056 339 -1363 266 1561 1253 1335 1686 259 -1039 1361 2398 -682 -2581
$$ packed form
628e437L643K862k444l60K859j887k323M696K780n268j483O179P16o959L27P049
644D950j354p694K45O032N26m727k026J861K713R26k020k350R67L702J554k501
660H04k391J449L433k41l246o35K357l28k506N30J168j620j270J689J40j198K069
677B04J063l990n67P190J262p669j349P359K224o024j441K691K80j798J332l37
693D30l304J44L416k45k824K47K542j50j455R36K418r6k746o5L988M49m148j460
711a923K809R05j406q71q75j530J697L368k463m318K964M247j733k931K607J615
727B162k265L06K936j254l072J148J801j471j016J057p53k727J357L181q85l619
743c114j50L861J459j717j702J629J295l08Q2L51j427j298K400J037l080j899
$$ plain form
759 -2581 -218 565 -2187 -1789 718 -944 -3529 -452 2475 180 -2014 361 1950 654 1178 2170
775 2170 208 -1138 1441 2766 -35 -2306 -900 686 -545 -1910 -1001 -1003 -1678 -746 1004 777 -1116
792 -1116 -418 1728 1870 286 738 1522 361 43 1737 1548 -1583 -2085 767 955 -2165 -2036 -253
809 -253 -722 -1546 283 811 -1112 -1076 1711 2470 -85 -153 1855 1425 18 542 1389 -734 -1581 114
827 114 913 -1375 -2593 -724 131 -1008 -1159 429 -193 -1086 797 2609 464 -1067 1162 2548 723
844 723 -189 648 440 -823 -702 670 -864 -2818 -1413 452 -487 -1791 -463 483 -283 -63 1674
861 1674 1533 -432 191 2349 2084 -485 -467 820 102 -993 -144 -67 -2219 -1922 595 260 -2244 -1963
879 -1963 682 537 -554 666 1533 25 -88 2112 1869 -438 -533 1019 614 -654 -337 -307 -1786 -1602
$$ packed form
759b581K363P83k752L98K507j662k585L077K927k295k194K375J589j296N24R92
775B170j962j346K579J325k801k271J406J586j231j365R09ko75R32J750k27j893
792a116O98K146J42j584M52P84j161l18J694j89l131n02K852J88l120J29J783
809b53m69q24J829N28j923L6K787P59k555o8K008m30j407N24Q47k123q47J695
827A14P99k288j218J869Q55j139j51J588o22q93J883J812k145j531K229J386j825
844G23r12Q37k08j263J21J372j534j954J405J865r39j304J328R46p66K20J737
861A674j41j965O23K158k65k569J8J287p18j095Q49P7k152K97K517l35k504K81
879a963K645j45j091J220Q67j508j13K200k43k307r5J552m05j268L17L0j479J84
$$ plain form
897 -1602 -30 478 -1474 -2151 -280 1530 498 -636 230 1172 809 1075 1766 413 -676 566 1965
914 1965 -323 -2162 -338 240 -1735 -1449 643 -214 -2511 -853 1849 737 -1083 311 1257 789
930 789 1389 1734 291 -1152 659 1993 226 -1693 -1153 -28 -209 -1258 -1364 -849 -575 -673 -100 638
948 638 119 -319 629 1558 686 919 1303 -39 -701 1341 1985 -1437 -2748 173 1095 -1283 -2113 -484
966 -484 -712 -1314 551 699 -1307 -760 1978 1847 -384 -95 1839 1036 -592 243 1478 174 -1552
983 -1552 -1452 -199 203 -997 -2171 -953 405 128 -439 -50 -402 372 1884 1622 -555 -243 2161
1000 2161 1560 -732 -469 811 -26 -887 -352 -628 -1236 -196 -334 -1760 -884 1496 314 -1872 -249
1017 -249 3188 1558 -1046 -140 2091 1591 72 -240 -44 -363 -104 -162 -809 -1842 -1147 169 237 -1525
$$ packed form
897a602J572N08j952o77J871J810j032j134Q66R42l63K66O91j353j089J242J399
914A965k288j839J824N78j975K86K092q57k297J658K702j112j820J394R46m68
930G89O00L45j443j443J811J334j767j919N40J125j81j049j06N15K74r8N73P38
948F38n19m38R48R29q72K33L84j342o62K042O44l422j311K921R22k378q30J629
966d84k28o02J865J48k006N47K738j31k231K89J934q03j628Q35J235j304j726
983a552J00J253M02j200j174J218J358k77n67L89l52P74J512k62k177L12K404
1000B161o01k292K63J280q37q61N35k76o08J040j38j426Q76K380j182k186J623
1017b49L437j630k604R06K231n00j519l12J96l19K59n8o47j033O95J316O8j762
$$ plain form
1035 -1525 -1453 1192 1876 -1197 -1023 2298 2423 -769 -978 2316 2204 -875 -774 104 162 -267 -548 -1361
1053 -1361 -1606 -235 618 -1172 -1586 158 1007 420 105 179 278 1157 1621 177 -535 615 1520 -361
1071 -361 -1670 -437 783 -671 -2263 -1473 735 527 -2144 -1371 1138 1730 -522 -483 1498 1342 200
1088 200 990 1049 -489 -373 1810 758 -1876 -1672 1095 286 -2269 -1797 759 348 -1257 -1045 547
1105 547 1578 348 -335 435 1667 1497 -76 -352 350 1176 280 -997 -1326 -628 255 -397 -1392 -1227
1123 -1227 -715 144 253 -90 -515 224 1685 1289 -336 184 2067 1137 -1095 -359 1779 388 -2341
1140 -2341 -1391 662 273 -1627 -1454 -149 -158 -346 182 114 -460 -100 1491 1135 -467 -168 1492 1371 -458
1159 -458 -1101 496 247 -1039 -1265 -115 11 -1051 -959 -539 -117 460 315 -396 23 1592 1285 22
$$ packed form
1035a525P2K645O84l073J74L321J25l192k09L294j12l079J01Q78N8m29k81q13
1053a361k45J371Q53j790m14J744Q49n87l15P4R9Q79M64j444p12J150R05j881
1071c61j309J233J220j454j592P90K208k08k671P73K509N92k252L9J981j56j142
1088B00P90N9j538J16K183j052k634K04K767q09k555M72K556m11j605K12J592
1105E47J031j230o83P70J232j70j573k76P02Q26q96j277l29O98Q83o52r95J65
1123a227N12Q59J09l43m25P39J461l96j625N20J883r30k232P36K138j391k729
1140b341R50K053l89j900J73J305rj88N28o8n74L60J591l56j602K99J660j21j829
1159d58o43J597k49j286k26J150J26j062R2M20M22N77j45p11M19J569l07j263
$$ plain form
1177 22 88 928 1187 289 -3 -130 -517 -146 -162 -381 -1192 -943 -153 -310 -1044 -622 672 633 -488 205 1571
1198 1571 1279 -555 -188 1375 1224 -734 -488 90 -370 -587 -207 -822 -1434 -655 156 -111 -985 -284 668
1217 668 357 -17 672 798 666 512 688 522 472 32 -77 -574 -252 -338 -656 -1023 -1034 -365 229 -666 -990
1238 -990 491 1009 170 32 1001 1034 155 478 1021 87 -435 417 442 -1001 -990 46 -630 -1391 -465 155
1258 155 -328 -644 132 745 337 405 630 430 588 910 562 221 13 -141 139 -139 -818 -807 -115 -662 -1161
1279 -1161 -663 267 -153 -626 297 686 60 87 1096 751 103 858 1021 -233 -333 484 6 -1045 -574
1298 -574 137 -567 -1292 -585 -99 -727 -170 188 195 -26 164 823 597 436 279 566 571 23 -429 -68 -286
1319 -286 -634 -696 -235 -330 -1155 -492 273 -254 -582 689 555 46 543 1153 574 -151 779 952 -52 -161
$$ packed form
1177B2O6Q40K59q98k92j27l87L71j6k19q11K49P90j57p34M22J294l9j121O93J366
1198A571k92j834L67J563j51j958K46N78m60k17L80o15o12P79Q11k67q74P01R52
1217F68l11l74O89J26j32j54J76j66n0m40j09m97L22q6l18l67j1O69N94q95l24
1238i90J481N18q39j38R69L3q79L23N43r34n22Q52K5j443J1J036o76p61R26O20
1258A55m83l16P76O13m08O8K25k00J58L22l48l41k08j54K80k78o79J1O92n47m99
1279a161M98R30m20m73R23L89o26K7J009l45o48P55J63j254j00Q17m78j051M71
1298e74P11p04p25P07M86o28N57L58Pk21J90O59k26j61j57K87Nn48m52L61k18
1319b86l48o2M61r5q25O63P65n27l28J271j34n09M97O10n79p25R30J73j004j09
$$ plain form
1339 -161 219 -211 -871 -481 -315 -554 -918 -441 -4 -263 1 379 117 260 501 644 799 485 415 608
1359 608 623 -256 -570 31 -193 -613 -624 -396 -506 -1112 -92 261 -494 -518 551 506 -32 535 1013 256 -118
1380 -118 889 666 -154 -311 133 -408 -563 -257 -325 -844 -608 -275 81 -430 -253 167 674 550 410 442
1400 442 526 547 351 652 324 -253 -12 43 -363 -751 -594 -299 -927 -545 260 100 -598 -159 470 559 190
1421 190 396 545 554 429 712 390 -250 -256 206 -239 -674 -582 -288 -645 -714 -210 -101 101 -142 345 495 450
1443 450 530 561 845 514 360 530 155 -212 -119 282 -484 -896 -329 -206 -538 -594 -174 -570 -45 276 444
1464 444 292 354 753 732 360 386 882 221 -275 -262 175 12 -632 -547 -282 -489 -617 -216 71 -111 -333 401
1486 401 476 -134 91 710 446 -8 221 640 118 -421 -367 68 -333 -941 -572 -549 -448 -359 -336 -208 104 310
$$ packed form
1339a61L80m30o60L90J66k39l64M77M37k59K64L78k62J43K41J43J55l14p0J93
1359F08J5q79l14O01k24m20j1K28j10o06J020L53p55k4J069m5n38N67M78p57l74
1380a18J007k23q20j57M44n41j55L06o8n19K36L33L56n11J77M20N07j24j40L2
1400D42Q4K1j96L01l28n77K41N5m06l88J57K95o28L82Q05j60o98M39O29Q9l69
1421A90K06J49Rj25K83l22o40oM62m45m35R2K94l57o9N04J09K02k43M87J50m5
1443D50Q0L1K84l31j54J70l75l67R3M01p66m12N67J23l32n6M20l96N25L21J68
1464D44j52O2L99k1l72K6M96o61m96J3M37j63o44Q5K65k07j28M01K87j82k22P34
1486D01P5o10K25O19k64m54K29M19n22n39N4M35m01o08L69K3J01Q9K3J28L12K06
$$ plain form
1508 310 135 689 390 379 305 463 583 280 -46 -138 13 -243 -417 -625 -402 -330 -400 -792 135 -82 -552 -90
1530 -90 905 512 -66 475 839 205 -155 424 721 -430 -509 79 -87 -705 -770 -324 -255 -583 -492 143 29
1551 29 -77 -36 547 654 397 -255 616 840 185 -196 305 -3 -471 -307 157 -335 -832 -564 -335 -69 -212
1572 -212 -280 -141 290 611 152 61 1015 756 -119 279 911 135 -569 -181 362 -335 -1012 -156 -93 -518 -415
1593 -415 -158 226 -248 -319 396 685 480 -59 509 886 462 -470 98 788 -235 -623 -227 235 -784 -935
1613 -935 -121 -424 -331 -327 -18 -323 215 615 385 684 533 379 48 521 647 -85 -113 299 -306 -1001 -503
1634 -503 -1 -298 -663 -203 57 -58 -315 -110 573 636 309 -78 724 764 267 106 446 402 -346 -291 190
1655 190 -265 -1046 -363 242 -421 -909 28 327 -289 -136 546 538 291 348 612 374 219 117 -389 -303 -83
$$ packed form
1508C10j75N54k99j1p4J58J20l03l26r2J51k56j74k08K23P2p0l92R27k17m70M62
1530i0R95l93n78N41L64o34l60N79K97j151p9N88j66o18o5M46O9l28R1O35j14
1551B9j06M1N83J07k57o52Q71K24o55l81N01l08m68J64M64m92m97K68K29K66j43
1572b12o8J39M31L21m59r1R54k59q75L98O32p76p04L88N43o97o77Q56O3m25J03
1593d15K57L84m74p1P15K89k05n39N68L77m24r32N68O90j023l88L96M62j019j51
1613i35Q14l03R3ML09l05N38M00k30K99j51j54l31M73J26p32k8M12o05o95M98
1634e03N02k97l65M60K60j15k57K05O83O3l27l87Q02M0m97j61L40m4p48N5M81
1655A90m55p81O83O05o63m88R37K99o16J53O82qk47N7K64k38j55j02n06Q6K20
$$ plain form
1676 -83 -386 -557 -399 -392 -593 -382 -36 -387 -333 -14 225 109 317 498 84 540 381 401 252 351 -21 -214
1698 -214 74 -150 -696 -574 105 -180 -670 -405 54 4 -135 361 498 307 204 435 383 128 111 199 42
1719 42 11 -279 -293 -223 -572 -602 -295 100 -446 -383 80 280 299 134 354 130 460 551 349 -13 140 250 -272
1742 -272 -251 -276 -201 -680 -654 -182 -319 -458 -329 110 -12 -13 476 535 316 117 306 420 377 193 67 275 -76
1765 -76 -22 -93 -275 -561 -613 -111 -262 -505 -357 358 217 45 372 563 98 307 678 459 111 -30 43 -108
1787 -108 -142 -304 -401 -533 -472 -306 -183 -181 -127 -178 104 197 216 523 258 296 291 639 173 38 267 58 -63 -424
1811 -424 -335 -266 -661 -498 18 -203 -400 -83 23 195 137 439 319 214 461 519 138 103 68 131 -157 -294
1833 -294 -163 -437 -564 -200 -137 -219 -162 -361 -124 53 297 196 251 251 280 302 228 147 -94 219 -16 -416 -250
$$ packed form
1676h3l03j71J58Pk01K11L46l51N4L19K39j16K08J81m14M56j59K0j49R9l72j93
1698b14K88k24n46J22O79k85m90K65M59n0j39M96J37j91j03K31n2k55j7Q8j57
1719D2l1k90j4P0l49l0L07L95n46O3M63K00J9j65K20k24L30R1k02l62J53J10n22
1742b72K1k5P5m79K6M72j37j39J29M39j22jM89N9k19j99J89J14m3j84j26K08l51
1765g6N4p1j82k86n2N02j51k43J48P15j41j72L27J91m65K09L71k19l48j41P3j51
1787a08l4j62r7j32O1J66J23KN4n1K82R3J9L07k65L8nL48m66j35K29k09j21l61
1811d24Q9O9l95J63N16k21j97L17J06J72n8L02j20j05K47N8l81l5l5O3k88j37
1833b94J31k74j27L64O3q2N7j99K37J77K44j01N5%K9K2p4q1k41L13k35m00J66
$$ plain form
1856 -250 -137 -334 -602 -365 -334 -541 -197 111 195 -324 228 380 275 495 323 351 149 -54 110 -125 -330
1877 -330 -206 -277 -559 -443 -146 -241 -185 -247 -130 298 186 110 292 484 543 130 405 510 -112 -164 317 -64
1899 -64 -411 -258 91 -330 -419 -268 -198 -300 -134 230 -5 -107 415 508 207 352 458 189 9 32 90 10
1921 10 -95 -275 -601 -122 -155 -617 -389 -160 -174 -67 329 165 40 435 471 234 44 651 452 -218 -226 -13
1943 -13 104 -488 -175 -341 -416 -385 -85 -297 -539 37 122 22 145 471 186 242 277 352 427 202 26 -130 80
1966 80 30 -187 -450 -504 -152 -98 -116 -286 -346 156 426 140 -116 394 565 -41 402 403 329 -5 208 -118 -302
1989 -302 -534 -111 -326 -715 -177 365 -49 -336 -268 394 309 55 -134 277 326 367 74 4 258 79 -167 -219
2011 -219 -245 -333 -136 -119 -431 -535 -179 -337 -353 -72 294 297 46 230 402 479 473 167 -33 -134 505 -6 -353
$$ packed form
1856b50J13j97k68K37L1k07L44L08Q4n19N52J52j05K20j72K8k02k03J64k35k05
1877c30J24p1k82J16K97r5N6o2J17M28j12p6J82J92N9m13K75J05o22n2M81l81
1899f4l47J53L49m21q9J51P0j02J66L64k35j02N22R3l01J45J06k69j80K3N8q0
1921A0j05j80l26M79l3m62K28K29j4J07L96j64j25L95L6k37j90O07j99o70qK13
1943a3J17n92L13j66p5L1L00k12k42N76Q5j00J23L26k85N6L5P5P5k25j76j56K10
1966H0n0k17k63n4L52N4j8j70o0N02K70k86k56N10J71o06M43Jp4l34K13l26j84
1989c02k32M23k15l89N38N42m14k87O8O62q5k54j89M11M9M1k93p0K54j79k46n2
2011b19k6q8J97J7l12j04L56j58j6K81L66Lk51J84J72P7ol06k00j01O39n11l47
$$ plain form
2034 -353 -347 -146 -40 -402 -311 -122 -267 -41 -67 150 289 206 115 4 350 581 311 340 -244 -74 404 22
2056 22 -246 -692 17 137 -503 -698 -92 39 34 -271 169 324 257 239 404 182 224 574 90 -140 138 156
2078 156 -122 -239 -529 -277 -257 -245 -443 -298 187 415 -180 -189 18 670 299 -360 -58 436 404 -153 -259 161
2100 161 123 -559 -156 -33 -32 -248 -251 -42 -100 -122 229 170 157 254 559 514 -8 88 131 566 -9 -422 -282 119
2124 119 48 -618 -408 96 10 -320 -218 -172 -37 12 154 -28 166 300 378 149 73 129 326 58 -127 -331
2146 -331 -73 67 -74 -769 -149 236 60 -614 -64 522 361 98 158 244 246 254 20 39 106 -108 -230 -316 -80
2169 -80 -81 -170 -116 -327 -535 36 143 -300 169 376 344 8 40 458 430 364 -105 -61 101 136 -194 -338 -194 -268
2193 -268 -348 -365 -182 127 -203 -150 234 99 190 341 346 332 319 471 243 -92 -202 245 59 33 -382 -455 -28
$$ packed form
2034c53OK01J06l62R1J89j45K26k6K17J39q3r1j11L46K31k70K9n84J70M78l82
2056B2k68m46P09J20o40j95O06J31nl05M40J55o7j8J65k22M2L50m84k30K78J8
2078A56k78j17k90K52K0J2j98J45M85K28n95rK07O52l71o59L02M94l2n57j06M20
2100A61l8o82M03J23Jk16lK09n8k2L51n9j3R7L05m5n22R6M3M35n75m13J40M01
2124A19p1o66K10N04q6l30J02M6J35M9J42j82J94J34P8k29p6N6J97k68j85k04
2146c31K58J40j41o95O20L85j76o74N50N86j61k63O0Q6KQk34J9O7k14j22q6K36
2169h0jq9N4k11k08N71J07m43M69K07l2l36L2M18k8o6m69M4J62L5l30j44J44p4
2193b68q0j7J83L09l30N3L84j35R1J51Nj4j3J52k28l35j10M47j86k6m15p3M27
$$ plain form
2216 -28 102 -418 -492 1 0 -247 -55 251 102 -47 259 220 118 43 257 -116 -118 -60 51 -423 -293 -56 -221
2239 -221 -147 -330 -93 -222 229 322 -126 -57 166 539 81 134 286 182 59 115 -52 -72 -99 -270 -185 -191 114
2262 114 -337 -306 -220 -12 124 97 40 -73 329 589 425 65 183 250 213 -160 -112 -258 -355 -177 -147 -156 -271 -175
2286 -175 -111 -114 190 196 -30 202 325 438 177 189 -7 181 251 117 -358 -244 -193 -257 -417 -82 -274 -210 -9
2309 -9 98 -96 44 89 -26 -5 384 489 64 -84 148 403 121 -33 -189 -116 -241 -34 17 -284 -359 -67
2331 -67 -76 -145 -238 10 210 171 294 171 233 257 424 113 56 -110 -245 -60 -5 -349 -185 -77 -10 -157 36 171
2355 171 -57 3 284 223 197 183 49 179 293 155 -15 8 -78 23 -266 -82 -68 -366 44 -243 -254 -88 -123
2378 -123 43 135 171 11 209 80 379 152 -14 155 -29 243 -24 62 -253 -321 -146 -348 -119 -279 -108
$$ packed form
2216b8J30n20p4M93jk47J92L06j49j49L06l9j02p5K14l73kN8J11m74J30K37j65
2239b21P4j83K37j29M51R3m48O9K23L73m58N3J52j04j23N6j67k0k7j71Q5oL05
2262A14m51L1Q6K08J36k7n7j13M02K60j64l60J18O7l7l73M8j46r7J78L0rj15R6
2286a75O4lL04Ok26K32J23J13k61J2j96J88P0j34m75J14N1o4j60L35j92O4K01
2309iJ07j94J40M5j15K1L89J05m25j48K32K55k82j54j56P3j25K07N1l01p5K92
2331f7ro9r3K48K00l9J23j23O2K4J67l11n7j66j35J85N5l44J64J08O7j47J93J35
2355A71k28O0K81o1k6j4j34J30J14j38j70K3q6J01k89J84J4k98M10k87j1J66l5
2378a23J66R2L6j60J98j29K99k27j66J69j84K72k67Q6l15o8J75k02K29j60J71
$$ plain form
2399 -108 -112 136 83 99 142 229 498 366 99 229 13 8 87 156 65 -161 -139 -262 -92 -149 -152 -85 -189 157 179 -14
2425 -14 66 -68 9 259 231 -9 -305 -5 130 70 -224 -64 -295 -153 -63 -299 -351 -273 159 158 -30 156 -59
2448 -59 -37 154 451 219 153 42 -168 166 120 -284 -434 -80 12 -219 -348 -357 -255 -124 -13 -161 -128 -53 354
2471 354 277 219 252 204 -122 32 122 44 -23 -181 -231 22 -104 47 -177 -223 25 -15 -128 -378 -159 203 309
2494 309 395 -116 48 265 94 181 75 77 -75 -141 81 -158 -250 -151 235 -420 -10 244 13 -198 21 450
2516 450 351 78 -53 210 344 241 -200 -404 -98 166 -293 -380 25 -207 -257 -150 -67 -83 -90 182 -267 -127
2538 -127 210 253 37 164 387 554 210 -151 -367 95 131 -61 -506 -269 54 86 -233 -164 -40 -109 228 29
2560 29 -52 46 387 103 60 74 315 -99 18 -260 -200 -77 -237 -403 -333 -110 180 -365 -282 -12 548 177 -202
$$ packed form
2399a08mK48n3J6M3Q7K69j32k67J30k16nP9O9r1k26K2j23J70n7lO7j04L46K2j93
2425a4Q0j34P7K50k8k40k96L00J35o0k94J60k31J42R0k36n2P8M32jj88J86k15
2448e9K2J91K97k32o6j11k10L34m6m04j50L54R2k31j29rJ02J31J11j48L3P5M07
2471C54p7n8L3m8l26J54R0p8o7j58n0K53j26J51k24m6K48m0j13k50K19L62J06
2494C09Q6n11J64K17j71Q7j06Kj52o6K22k39r2R9L86o55M10K54k31k11K19M29
2516D50r9k73j31K63J34j03m41k04L06K64m59q7M05k32n0J07Q3j6pK72m49J40
2538a27L37M3k16J27K23J67l44l61k16M62L6j92m45K37L23L2l19O9J24o9L37j99
2560B9q1R8L41k84m3J4K41m14J17k78O0J23j60j66P0K23K90n45Q3K70N60l71l79
$$ plain form
2583 -202 -166 295 437 211 15 -143 -268 230 -200 -204 -180 71 -358 -269 -37 -5 79 -179 21 -3 404 232 -77
2606 -77 -199 388 403 -299 -34 -101 191 417 -164 -436 -339 147 -198 -342 -271 -67 -48 -24 46 116 3 409 361
2629 361 331 288 104 107 -119 231 -67 26 -307 -430 -64 53 63 -84 -283 47 333 -11 -264 -246 60 266
2651 266 161 46 137 -14 192 232 -8 46 -40 -26 -124 -32 -104 -173 -223 -178 177 248 62 -18 -88 315 417 -1 -19
2676 -19 223 297 132 -70 -123 -149 -77 76 -139 -179 -83 -336 39 255 62 105 156 -92 173 181 258 11 95 396
2700 396 634 85 -318 -347 -57 249 -84 -329 -235 12 133 -53 -48 131 70 -24 272 318 332 34 173 255 12
2723 12 142 -199 -264 -408 -64 156 -198 -304 -232 24 -117 -315 -105 4 126 89 37 -61 161 12 194 397
2745 397 137 -75 133 -280 99 -82 -208 -236 -151 -45 116 -29 -6 -66 -47 221 173 -143 90 175 335 110
$$ packed form
2583b02L6M61J42k26j96j58j25M98m30mK4K51m29Q9K32L2Q4k58K00k4M07j72l09
2606g7j22N87J5p02K65o7K92K26n81k72R7M86l45j44P1K04J9K4P0P0j13M06m8
2629C61l0m3j84Lk26L50k98R3l33j23L66J17J0j47j99L30K86l44k53J8L06K06
2651B66j05j15R1j51K06M0k40N4q6J4r8R2p2o9n0M5L55P1j86q0p0M03J02m18j8
2676a9K42P4j65k02n3k6P2J53k15m0R6k53L75K16j93M3N1k48K65QP7k47Q4L01
2700C96K38n49m03k9K90L06l33k45R4K47J21j86NJ79o1r4K96M6J4k98J39Q2k43
2723A2J30l41o5j44L44K20l54j06P2K56j41j98K10J09J22l7n2r8K22j49J82K03
2745C97k60k12K08m13L79j81j26k8Q5J06J61j45K3o0J9K68m8l16K33Q5J60k25
$$ plain form
2767 110 -146 75 179 -158 -240 -189 -135 -112 32 -177 -94 169 177 -97 192 247 61 148 118 229 247 264 21 -110
2791 -110 -36 103 -54 -263 -333 -59 -68 34 -95 -391 15 70 154 -32 -21 293 56 167 106 330 52 62 237
2814 237 -208 -203 -18 -158 -275 -199 -58 -293 -342 -183 72 -55 43 -149 -33 142 246 -4 -21 149 -187 4
2836 4 144 -193 -351 -265 -117 70 -101 -232 -99 -83 -6 87 -9 -171 43 255 258 104 17 145 83 -33 -113 -203
2860 -203 -125 -143 -32 75 -162 -223 -199 178 -10 -2 -125 127 19 210 44 117 -154 -172 270 115 174 15 -250
2883 -250 -261 64 256 -305 -207 -201 -56 43 75 200 0 386 233 -99 193 141 121 185 202 146 -55 -262 64 -80
2907 -80 -270 -79 -75 -10 149 41 92 -234 -189 247 86 185 328 -123 147 362 175 -92 50 -8 97 -84 -123
2930 -123 -423 -279 -13 165 119 -100 100 -2 35 216 274 54 118 -61 -4 117 -8 -107 -150 42 62 -114 -388
$$ packed form
2767A10k56K21J04l37q2N1N4K3J44k09Q3K63Qk74K89N5j86Q7l0J11J8J7k43j31
2791a10P4J39j57k09p0K74rJ02j29k96M06N5Q4j86J1L14k37J11o1K24k78J0J75
2814B37m45NJ85j40j17P6J41k35m9J59K55j27R8j92J16J75J04k50j7J70l36J91
2836DJ40l37j58Q6J48J87j71j31J33J6P7R3r6j62K14K12Lj54q7J28o2j16q0r0
2860b03P8j8J11J07k37o1K4L77j88Qj23K52j08J91j66P3k71j8M42j55N9j59k65
2883b50j1L25J92n61R8OJ45R9L2J25k00L86j53l32K92n2k0O4J7n6k01k07L26j44
2907h0j90J91MO5J59j08N1l26M5M36j61R9J43m51K70K15j87k67J42n8J05j81l9
2930a23l00J44K66J78m6k19K00j02L7J81N8k20O4j79N7J21j25r9m3J92K0j76k74
$$ plain form
2953 -388 96 18 -307 71 -29 -105 42 -90 -93 133 47 -51 15 2 50 34 69 -141 30 116 -46 -12 -288 -23
2977 -23 -100 -228 -185 -179 251 51 68 5 -46 179 269 162 -98 -27 156 -75 20 -174 -394 -140 200 22 -123 -183
3001 -183 38 -93 -78 -58 12 -66 31 237 340 106 -108 118 -75 217 203 102 -217 -81 -77 -15 -74 -90 -82 -3 83
3026 83 75 -71 146 89 5 10 364 -41 -168 198 110 55 -141 -240 -23 -129 -40 -106 -202 183 237 105 -55 17 -67
3051 -67 35 217 318 -28 322 137 71 144 195 -120 -112 -166 -146 -203 -88 -160 -31 -74 166 56 -37 -83 129 352
3075 352 199 0 280 397 270 2 -11 156 -7 49 -107 -244 0 -124 -293 -36 -153 281 120 68 103
3096 103 101 86 153 -101 40 228 225 36 -155 -101 -67 108 -77 -186 -87 -150 38 -9 -145 -394 6 322 157 -55
3120 -55 55 204 -30 17 109 -45 -154 -263 -212 -107 144 -263 -153 -117 -16 -132 -161 -209 -11 312 84 55 -61
$$ packed form
2953c88M84p8l25L78j00p6J47j32lK26q6r8O6j3M8j6L5k10J71Q6j62L4k76K65
2977b3p7j28M3OM30k00J7o3n1K25R0j07k60P1J83k31R5j94k20K54L40j78j45o0
3001a83K21j31J5K0P0p8R7K06J03k34k14K26j93K92j4j01l19J36MO2n9j6QP9Q6
3026H3qj46K17n7q4NL54m05j27L66q8n5j96r9K17j06Q9o6r6L85N4j32j60P2q4
3051f7J02J82J01l46L50j85o6P3N1l15Qn4K0n7J15p2J29m3K40j10r3m6K12K23
3075C52j53j99K80J17j27k68j3J67j63N6j56j37K44j24j69K57j17M34j61n2L5
3096A03kj5O7k54J41J88lj89j91N4L4J75j85j09R9o3J88m7j36k49M00L16j65k12
3120e5J10J49k34M7R2j54j09j09N1J05K51m07J10L6J01j16k9m8J98L23k28k9j16
$$ plain form
3143 -61 -132 172 199 394 118 40 262 1 -163 -78 -233 -73 -129 63 -17 -5 -54 -73 204 205 -53 -222 -145 297
3167 297 85 34 212 88 100 -50 -63 -112 -325 80 51 -176 -45 -77 23 -3 -211 162 253 -22 -87 217 222 310
3191 310 -178 -172 6 186 152 -247 -184 -282 105 -234 -100 -306 130 25 22 -185 -38 111 141 216 -20 115 50
3214 50 -16 -90 -142 51 151 -122 -75 12 12 -367 -24 -126 116 -53 -32 64 -241 257 354 33 81 -124 31 244
3238 244 -24 -144 59 106 -47 -224 -62 57 141 -43 117 293 -137 48 37 -28 281 96 -129 -8 17 277
3260 277 -45 -110 -135 45 -49 -95 -135 -133 45 247 -128 -58 -24 90 129 217 160 80 78 -20 395 182 121 -39 -378 44
3286 44 -182 -165 -252 -223 51 40 80 -79 -287 -121 123 30 155 -19 194 87 294 270 -180 -2 -127 -207 106
3309 106 -37 -23 -161 109 151 -54 -200 -98 29 15 -17 205 102 127 275 -6 16 -302 -111 -22 147 -76
$$ packed form
3143f1p1L04K7J95k76p8K22k61j64Q5j55J60n6J92q0J2m9j9K77Jk58j69P7M42
3167B97k12n1J78j24J2j50j3m9k13M05k9k27J31l2J00k6k08L73R1k75o5L04NQ8
3191C10m88OJ78J80l4l99O3r8L87l39J34k06M36j05lk07J47J49L0P5k36J35o5
3214E0o6p4n2J93J00k73M7Q7%l79L43j02K42j69K1R6l05M98R7l21M8k05J55K13
3238B44k68j20K03M7j53j77J62J19Q4j84J60J76m30J85j1o5L09j85k25J21K5K60
3260B77l22o5k5J80r4m6m0KJ78K02l75P0L4J14L9Q8n7q0kr8M15k13o1j60l39M22
3286D4k26J7q7K9K74j1M0j59k08J66K44r3J25j74K13j07K07k4m50J78j25q0L13
3309A06j43J4j38K70M2k05j46J02J27j4l2K22j03K5J48k81K2l18J91Q9J69k23
$$ plain form
3331 -76 17 -108 -132 -175 -198 -2 84 -7 -65 84 61 13 -76 132 163 176 -147 -48 -87 -169 -129 -46 -163 73 -4 130
3357 130 -103 -71 -61 51 269 101 66 266 100 -29 99 -11 -69 14 -86 -16 -26 -91 128 -373 -36 -79 0
3380 0 55 -134 -20 45 -60 -12 -13 -116 -140 65 108 -86 18 88 64 26 -79 -222 -183 -82 -105 15 -89 -81 -399
3405 -399 -21 73 59 -209 -168 108 38 36 -35 -43 25 132 110 -80 -96 -39 -148 116 -22 25 -122 0 3 101 48 88
3431 88 110 211 227 161 162 -47 152 199 71 -127 -354 -116 3 -203 -43 -103 -23 -258 -71 -159 -33 165 45
3454 45 -79 194 119 179 139 -73 -22 53 168 -365 28 -227 142 -164 -56 -125 -219 -59 -92 -50 -171 -144 35 94
3478 94 44 76 232 262 181 33 49 -35 64 107 30 -3 -34 -75 60 -56 -53 -231 -31 41 134 78 -101 159 116 113 135
3505 135 -216 -15 5 143 -122 -17 -351 -101 3 -37 10 -272 -244 -131 137 239 131 212 168 -205 72 -73
$$ packed form
3331g6R3j25k4m3k3J96Q6r1n8J49k3m8q9K08L1J3l23R9l9q2M0Q3j17K36p7J34
3357A30k33L2J0J12K18j68l5K00j66j29J28j10n8Q3j00P0j0o5K19n01L37m3P9
3380@N5j89J14O5j05M8jj03k4K05M3j94J04P0k4l8j05j43L9J01k3J20j04Ql18
3405c99L78R4j4k68M1K76p0kp1qO8J07k2j90j6N7j09K64j38M7j47J22LR8n3M0
3431H8K2J01J6o6Jk09J99M7j28j98k27K38J19k06J60o0Q0k35J87q8J26J98j20
3454D5j24K73p5O0m0k12N1P5J15n33L93k55L69l06J08o9r4J60l3M2j21K7J79N9
3478I4n0L2J56L0q1j48J6q4R9M3p7l3l1m1J35j16Lj78K00P2R3n6j79K60m3lK2
3505A35l51K01K0J38k65J05l34K50J04m0M7k82K8J13K68J02j08Q1m4l73K77j45
$$ plain form
3527 -73 -149 16 39 19 -125 7 -171 -46 19 145 55 -301 -93 -153 -67 28 -14 -55 189 63 11 141 66 145 89
3552 89 -89 61 82 -163 50 -45 -230 22 -136 189 -17 180 88 108 75 55 -86 64 35 -108 192 -54 110
3575 110 -128 -152 -1 50 25 -93 -26 -27 -169 172 -36 -31 -182 49 160 -25 240 104 3 -7 257 2 98
3598 98 -113 9 198 -19 -169 -374 -91 22 24 -69 93 107 125 208 184 182 176 -85 -237 -123 215 -29 125 -80
3622 -80 42 -248 -55 -134 -129 -123 28 192 -93 -423 46 -6 65 332 -47 -144 249 7 -112 -182 -75 -128 -72 168
3646 168 -190 -92 -254 0 -24 65 102 197 83 52 106 142 40 28 253 -82 66 94 -164 -181 146 -136 -52 -24
3670 -24 88 32 -201 122 -63 -87 -15 -88 217 33 -66 201 -43 66 37 -171 11 -108 -163 129 45 32 -297
3693 -297 252 14 0 45 36 -77 139 156 46 100 227 -6 18 36 -177 83 -138 -155 -127 -43 -82 -133 9 -42 16
$$ packed form
3527g3p6J65K3k0j44J32j78J25O5J26r0l56K08o0Q6R5m2m1K44j26n2J30p5P9n6
3552H9j78J50K1k45K13r5j85K52j58L25k06J97r2K0l3k0j41J50k9j43L00k46J64
3575A10k38k4J51N1k5j18O7jj42L41k08Nj51K31J11j85K65j36j01j0K64k55R6
3598I8k11J22J89k17j50k05K83J13Kr3J62J4J8Q3k4kok61j52J14L38k44J54k05
3622h0J22k90J93p9NOJ51J64k85l30M69n2P1K67l79r7L93k42j19p0J07n3N6K40
3646A68l58R8j62K54k4Q9L7R5j14l1N4L6j02j2K25l35J48K8k58j7L27k82Q4K8
3670b4J12n6k33L23j85k4P2p3L05j84r9K67k44J09k9k08J82j19n5K92q4j3l29
3693b97N49k38j4M5rj13K16J7j10N4J27k33K4J8k13K60k21j7K8Q4l9n1J42n1N8
$$ plain form
3718 16 61 77 -69 -40 -7 -17 190 42 65 -47 65 73 153 -113 116 -36 -92 25 -126 -269 -131 -30 -193 98
3742 98 151 140 134 31 119 113 -129 -90 -153 -26 -115 96 -284 -189 114 -111 56 -98 -39 -217 -162 21 98 302 26
3767 26 40 193 -22 256 -74 -81 -94 -257 -28 38 -1 -45 29 -32 22 -251 224 -3 163 -62 139 55 -158 158
3791 158 145 166 155 -80 -55 -89 170 -289 -177 30 -46 -141 -68 -86 -141 6 192 39 9 217 81 45 -162 198
3815 198 110 -73 -25 117 -11 -80 -31 168 -203 -110 203 -24 -156 -270 -70 -223 25 -61 -18 36 27 277 182 17
3839 17 -123 19 -39 -137 -169 128 -25 -164 41 -257 -54 -166 171 -27 24 329 -123 201 50 37 159 50
3861 50 -54 62 55 64 -92 -104 -60 -253 -16 -87 71 -17 -138 10 85 69 46 66 148 14 77 261 83 189 171
3886 171 -69 -283 -131 -3 -112 -17 -218 -171 21 130 44 136 -32 -81 76 139 260 -48 85 115 183 -86 -22
$$ packed form
3718A6M5J6j46K9L3j0K07j48K3j12J12QQ0k66K29j52n6J17j51j43J38J01j63K91
3742I8N3j1oj03Q8ok42L9o3J27q9K11l80R5L03k25J67j54N9j78N5J83P7K04k76
3767B6J4J53k15K78l30pj3j63K29O6l9m4P4o1N4k73M75k27J66k25K01q4k13L16
3791A58j3K1j1k35K5l4K59m59J12K07p6r5P3j8n5J47J86j53l0K08j36l6k07L60
3815A98q8j83M8J42j28o9M9J99l71R3L13k27j32j14K00j53K48q6M3N4rK50r5j65
3839A7j40J42n8r8l2K97j53j39K05k98K03j12L37j98N1L05m52L24j51j3J22j09
3861E0j04J16pRj56j2M4j93K37p1J58q8j21J48P5j6k3K0Q2j34O3J84j78J06j8
3886A71k40k14J52J28j09R5k01M7J92J09q6R2j68m9J57O3J21l08J33L0O8k69O4
$$ plain form
3909 -22 48 48 -160 -46 -151 23 -18 129 96 128 127 -16 -26 96 185 28 31 74 18 -31 -241 -95 -144 82 -73 -82
3935 -82 99 60 -27 -170 110 -94 97 -12 -30 168 184 57 -44 117 -197 -84 158 200 103 -24 -64 -57 -218
3958 -218 217 56 43 51 -5 -170 -16 7 148 -44 61 47 127 64 -32 -133 -243 145 39 7 17 -43 -38 -101 -293
3983 -293 20 -71 81 -13 53 20 165 -37 73 82 141 -90 -64 45 24 94 -114 120 -98 152 -222 -179 -152 -153 -113
4008 -113 -136 -59 35 125 123 157 -62 64 80 152 -202 186 -110 63 -84 84 -167 -63 64 -229 187 -106 137
4031 137 -152 -134 -66 -92 -138 144 14 -1 -13 21 49 -94 42 -19 -290 234 -222 0 -89 -21 -140 -17 24 -98
4055 -98 -4 29 -19 160 14 -95 -96 -166 86 -58 66 -32 -198 32 102 144 -28 -1 -70 -27 18 24 80 -104 -48 88
4081 88 114 95 -35 154 -20 90 91 42 40 -83 -175 -84 9 67 -73 51 -225 42 -141 -5 10 172 35 75 16
$$ packed form
3909b2P0%k08J14j05J74m1J47l3L2jj43j0J22Q9j57LM3n6m9k10J46m9K26j55r
3935h2J81l9q7j43K80k04J91j09j8J98J6j27j01J61l14J13K42M2r7j27m0Pj61
3958b18M35j61j3Qn6j65J54K3J41j92J05j4Q0o3r6j01j10L88j06l2J0o0No3j92
3983b93L13r1J52r4O6l3J45k02J10RN9k31K6J09k1P0k08K34k18K50l74M3K7jM0
4008a13k3P7R4R0kL4k19J26J6P2l54L88k96J73j47J68k51J04J27k93M16k93K43
4031A37k89J8O8k6m6K82j30j5j2L4K8j43J36o1k71N24m56K22q9O8j19J23M1j22
4055i8R4L3m8J79j46j09jp0K52j44J24r8j66K30P0M2j72K7o9M3M5ON6j84N6J36
4081H8K6j9j30J89j74J10Jm9kj23r2R1R3N8j40J24k76K67j83J36J5J62j37M0n9
$$ plain form
4106 16 127 78 173 188 14 88 -18 -48 69 28 -144 -72 122 94 2 -85 59 -57 171 166 -173 168 -3 76 2
4131 2 -48 -70 47 -14 15 -160 -433 6 18 9 -94 -48 -30 -89 0 -57 58 -22 187 11 -199 144 73 -120 -24 -177
4157 -177 67 115 18 -37 -243 -261 17 21 -105 101 35 37 199 -111 -67 152 250 -21 101 143 -23 -123 -20 -267
4181 -267 23 -204 -50 -43 -13 33 146 83 26 153 175 32 -96 88 -154 55 21 6 -287 87 -87 -75 -139 -182
4205 -182 -24 -226 87 130 78 134 -107 105 32 123 109 -183 256 -41 -29 35 -16 97 -152 -98 -202 -19 -85 -172
4229 -172 12 -120 96 109 -106 55 -55 -62 -165 -15 83 118 35 -150 138 185 104 51 131 -109 -105 -105 -1 16 30
4254 30 15 160 126 5 315 206 63 205 -181 -55 1 138 40 -61 -200 106 -1 94 -21 -116 26 97 -100
4277 -100 -41 92 161 91 -141 -153 25 91 -103 27 -41 79 -179 -198 61 14 -270 -179 -18 -157 -1 29 24 2
$$ packed form
4106A6J11m9R5J5j74P4j06l0J17m1j72P2J94k8r2q7J44j16K28nl39L41j71P9p4
4131Bn0k2J17o1K9j75k73M39J2rj03M6J8n9Q9n7J15q0K09j76k10L43p1j93R6j53
4157a77K44M8r7n5k06j8K78Mj26K06o6KJ62l10M4K19R8k71J22M2j66j00J03k47
4181b67K90k27J54PL0M6J13o3n7J27K2j43j28J84k42K09l4j5k93L74j74J2o4m3
4205a82J58k02L13M3n2N6k41K12p3R1j4k92M39k97J2O4n1J13k49N4j04J83o6q7
4229a72J84j32K16J3k15J61j10pj03J50R8L5q3j85K88M7q1n3Q0k40M%J04J7J4
4254C0j5J45l4j21L10j09j43J42l86J26N6J37r8j01j39L06j07R5j15r5J42P1j97
4277a00N9J33O9p0k32j2J78O6j94J30o8J20k58j9K59m7k84R1J61j39J56L0nk2
$$ plain form
4301 2 105 -46 -67 -179 -93 44 43 144 89 -110 52 -91 -95 -95 89 66 -119 -36 -16 -37 -10 30 209 46 -157 306
4327 306 286 220 82 -361 83 245 196 -92 67 -139 -43 -4 -155 -95 -35 -52 48 76 11 -67 20 114 10 -186
4351 -186 59 22 96 -5 -9 -8 -94 -31 323 123 -147 -166 -84 -20 46 -31 209 77 4 -4 46 136 198 158 8 -143 -65
4378 -65 15 -55 98 -79 146 -164 -35 136 -49 -17 73 -67 45 -115 45 81 74 -15 23 -1 -92 -118 -96 -149 10
4403 10 -66 162 -157 -169 228 -110 123 -11 181 -103 23 60 118 16 40 151 25 -73 183 19 41 -57 -187
4426 -187 -62 139 187 42 -124 6 -139 -33 153 164 -100 -17 147 169 -131 22 149 -93 -89 48 71 83 55
4449 55 28 -122 9 -14 -22 34 74 59 -269 -143 71 91 -28 47 27 98 31 -80 -54 195 -89 203 -58 77 -288
4474 -288 99 41 182 -52 82 -195 -142 146 19 -82 31 120 29 105 134 124 -11 41 -127 269 -31 6 107
$$ packed form
4301BJ03j51k1j12Q6J37jJ01n5j99J62j43m%J84k3j85Q3K0k1K7M0J79j63k03M63
4327C06k0o6j38m43M44J62m9k88J59k06R6L9j51O0O0j7J00K8o5p8Q7R4j04j96
4351a86K45l7P4j01mJq6O3L54k00k70j9Q2O4O6p7K40j32p3qN0R0O2m0j50j51P8
4378f5Q0p0J53j77K25l10J29J71j85L2R0j40J12j60J60L6pq9L8k4r1k6K2n3J59
4403A0p6K28l19j2L97l38K33j34J92k84J26L7N8j02K4J11j26r8K56j64K2r8j30
4426a87J25K01M8j45j66J30j45J06J86J1k64Q3J64K2l00J53J27k42MJ37K3J2k8
4449E5k7j50J31k3qN6M0j5l28J26K14K0j19P5k0P1o7j11K6K49k84K92k61J35l65
4474b88L87n8J41k34J34k77N3K88j27j01J13Q9r1P6K9j0j35N2j68L96l00L7J01
$$ plain form
4497 107 181 -46 146 -23 49 203 150 119 3 52 -130 -80 205 104 -183 44 -42 -152 125 249 -5 -93 27
4520 27 44 -216 -157 21 -29 -143 179 -76 158 133 -78 82 127 109 155 27 -167 7 -129 -102 -186 106 -45
4543 -45 143 40 -37 -43 -40 50 -3 -4 110 30 122 163 28 158 -92 10 22 83 -3 -283 -74 103 4 -35 102 -87
4569 -87 23 -124 164 35 -166 -100 92 -52 -135 -174 2 -73 190 -31 -7 54 -49 50 -67 4 -145 -11 17
4592 17 185 155 250 -105 105 -143 167 116 -32 205 232 145 258 -58 -192 -25 -87 4 96 75 181 -134 -101 -25
4616 -25 76 -42 125 -19 143 -65 57 -202 -49 29 75 14 -138 -140 34 102 -6 -90 58 -27 -30 71 85 19
4640 19 -125 -193 77 96 53 20 61 -11 -187 -60 -136 37 104 -121 -11 -134 118 -140 -41 -21 100 11 -93 177
4664 177 -16 -39 38 0 -33 -30 35 24 -35 -157 116 -142 71 102 167 -38 59 -82 -25 27 11 46 -198 -90 -87 -128
$$ packed form
4497A07P4k27J92j69P2J54n3l1j16M9j82N0K85j01k87K27q6j10K77J24k54q8J20
4520B7J7k60N9J78n0j14L22k55K34k5k11J60M5j8M6j28j94J74j36K7q4K92j51
4543d5J88j03p7oLR0n3jJ14q0R2M1j35J30k50J02J2O1q6k80K09J77r9l9J37j89
4569h7J10j47K88j29k01O6J92j44q3l9J76p5K63k21K4O1j03R9j17P1j49J34K8
4592A7J68l0R5l55K10k48L10n1j48K37K7q7J13l16j34J67o2R1R2k1J06l15L3P6
4616b5J01j18J67j44J62k08J22k59J53P8M6o1j52kJ74O8j08q4J48q5lJ01J4o6
4640A9j44o8K70J9m3l3M1p2j76J27p6J73O7k25J10j23K52k58R9K0J21q9j04K70
4664A77j93k3P7l8l3LO5j1n9j22K73k58K13L1O5k05R7j41N7N2j6L5k44J08Lm1
$$ plain form
4690 -128 148 249 55 -121 105 -16 -54 121 -134 25 -51 -119 -3 -63 -39 105 -62 139 -100 225 -47 89
4712 89 56 -86 -59 17 -52 33 -87 92 4 66 -8 -131 111 -122 182 55 130 -160 21 2 -65 -19 -127 -116 105
4737 105 109 -20 -166 -18 -26 -23 -415 -159 95 -45 -153 -169 -125 40 94 172 62 -8 137 221 69 -111 -128 -21
4761 -21 24 -49 41 -57 97 -107 115 86 2 8 58 74 -69 47 -149 15 138 -3 100 -32 60 -38 172 -2
4785 -2 37 41 35 -309 51 -209 10 50 151 84 -3 145 -304 26 9 -3 161 22 24 -104 -13 -30 128 -41 -81 -92
4811 -92 -38 -62 -19 -28 -143 66 -80 23 49 200 69 6 -110 95 158 -6 -25 110 82 181 -210 -136 -54 -21 10
4836 10 70 -27 88 48 150 -18 25 -75 -4 -171 -72 32 -116 -85 -103 -4 -123 -50 -54 109 142 179 76 114 -246
4861 -246 -35 19 84 -22 -77 70 60 -147 -74 -227 -277 75 -141 200 52 -269 142 100 -77 -123 81 1 -6 124
$$ packed form
4690a28K76J01j94j76K26j21l8J75k55J59p6o8J16o0K4J44j67K01k39L25k72J36
4712H9l3j42K7P6o9Q5j20J79q8O2p4j23K42k33L04j27P5k90J81j9o7M6j08J1K21
4737A05Mj29j46J48qLl92K56K54j40j08j6M4J65N4P8j10p0J45Q4j52j80j7J07
4761b1M5p3R0r8J54k04K22k9q4ON0J6j43J16j96J64J23j41J03j32R2r8K10j74
4785bL9Mol44L60k60K19M0J01o7q7J48m49L30j7j2J64j39Kj28R1j7J58j69m0j1
4811i2N4k4M3rj15K09j46J03K6J51j31o3j16K05O3j64j9J35k8R9l91P4Q2L3L1
4836A0O0r7J15m0J02j68M3j00P1j67R9J04j48L1j8R9j19P3mJ63L3L7j03L8l60
4861b46K11N4O5j06n5J47j0k07P3j53n0L52k16L41j48l21M11m2j77m6K04q0pJ30
$$ plain form
4885 124 -18 61 61 65 148 150 -135 29 -29 -105 61 -2 -173 -45 58 -107 -136 -128 -48 -240 -101 -116 -161 105 204 -89
4911 -89 20 226 54 -13 30 -90 63 109 46 -73 -17 169 78 -7 -26 37 -98 96 37 202 42 -139 79 139
4935 139 -124 -87 152 -68 -349 36 8 -221 213 -69 75 -261 -105 79 -139 42 114 59 -90 43 -17 -77
4957 -77 -27 -173 101 110 -8 -54 -93 -22 27 79 -177 7 -11 54 -24 -24 -175 -86 -152 -22 98 -99 93 104 -60 -11
4983 -11 -164 183 96 171 100 28 -277 -218 -78 -129 147 -162 200 -97 145 -25 -212 -12 43 -119 -150 69 -102
5006 -102 -17 -162 -227 -110 -89 -82 132 -171 -82 116 -5 20 16 -27 54 6 186 -69 -93 -94 -275 -42 77 -41 -45 -92
5032 -92 -106 15 -32 -173 -99 19 2 -60 -6 80 -110 34 129 -11 -40 189 -155 -150 213 -31 -214 117 -4 -6 -48
5057 -48 -21 102 16 60 -56 71 -130 76 166 208 24 46 -24 -73 92 59 8 12 -37 -54 52 -43 177 86 -34 -83
$$ packed form
4885A24j42P9%MQ3Kk85J64n8p6J66o3j71J28J03j65k9QQ0j92J39j5m5K66R9k93
4911h9J09K06j72o7M3j20J53M6o3j19N6J86r1q5j9O3j35J94n9J65j60j81K18O0
4935A39k63L7K39k20k81L85k8k29M34k82J44l36J56J84k18J81P2n5j49J33o0o0
4957g7N0j46K74Rj18m6l9P1M9N2k56J84j8O5p8%j51Q9o6J30J20j97J92J1j64M9
4983a1j53L47q7P5p1p2l05N9J40n1K76l09L62k97K42j70j87K00N5j62l1K19j71
5006a02Q5j45o5J17K1PK14l03Q9J98j21K5mm3Q1m8J80k55k4jj81K33J19j18mm7
5032i2j4J21m7j41P4J18j7o2N4Q6j90J44R5j40k9K29l44NL63k44j83L31j21km2
5057d8K7J23q6M4j16J27k01K06R0M2j84K2p0m9J65l3n1Mm9j7J06r5K20r1j20m9
$$ plain form
5083 -83 62 -5 -74 -141 -154 122 150 290 -51 -22 -2 -50 69 -222 74 -118 -58 -7 6 93 33 80 66 202 -103
5108 -103 -66 -23 -63 47 119 121 -11 -6 -126 -110 -39 112 19 -27 -187 -1 -86 -17 69 30 124 2 101 -52 153 138
5134 138 -185 165 -96 -79 7 327 -94 -91 -30 -114 -154 -36 35 72 40 14 43 -41 352 -43 -44 132 -93 36 -78
5159 -78 186 -127 230 -71 68 -7 -144 20 -95 18 91 -182 167 -68 181 204 130 98 -115 -56 -224 63
5181 63 -81 -16 249 -269 214 -319 225 175 232 127 -267 233 -262 -138 613 277 -128 -434 -312 -20 14 280
5203 280 -215 101 -377 -77 -38 61 -174 46 68 18 266 -156 256 -48 -236 -185 -83 224 206 147 97 -89 -90
5226 -90 -387 12 -377 -53 -212 -38 -91 81 -965 185 -384 -265 369 483 -265 229 -46 -247 -560 -316
5246 -316 450 0 302 -210 -275 -137 -280 208 -21 -382 -256 -57 267 -370 320 33 240 162 212 -28 -58
$$ packed form
5083h3J45o7o9o7j3K76K8J40l41K9K0m8J19k91K96j92O0N1J3Q7o0M7j4J36l05
5108a03L7M3m0J10P2Kj32Nj20J6P1J51r3m6j60J86q5O9Q6l9R4j22R9j53K05j5
5134A38l23L50k61J7Q6L20m21LO1q4m0J18P1L7l2k6K9q4L93l95jJ76k25J29j14
5159g8K64l13L57l01J39p5j37J64j15J13P3k73L49k35K49K3p4l2k13N9j68K87
5181F3j44O5K65n18M83n33N44n0N7j05l94N00m95J24P51l36m05l06J22K92L4K66
5203B80m95L16m78L00L9R9k35K20K2n0K48m22M12l04j88N1J02L07j8n9n0j86j
5226i0k97L99l89L24j59J74n3J72j046J150n69J19O34J14p48M94k75k01l13K44
5246c16P66m50L02n12o5J38j43M88k29l61J26J99L24o37O90k87K07p8N0k40l0
$$ plain form
5267 -58 -267 199 318 161 -214 -146 222 -133 7 -236 -583 366 -96 -193 -226 -646 -391 -136 -293 -81 -860
5288 -860 412 195 269 -469 -494 811 -1 -160 280 178 540 -436 362 119 -334 -384 -63 250 34 -93
5308 -93 221 -315 2 252 25 -178 -54 -264 112 25 -247 6 -471 -159 -434 -565 -230 126 282 -2 -285
5329 -285 254 -484 383 -103 349 -225 253 -247 -29 188 171 67 -66 -201 -297 124 -419 -152 319 6 54
5350 54 -231 -595 -90 -245 328 102 -244 -22 134 36 273 -125 -405 -77 -17 -172 -137 -405 -512 -273 38
5371 38 29 140 -144 132 43 111 -111 226 31 -55 -14 -364 42 74 -69 -99 209 -1 -91 -5 86 -33 -1 29 -82
5396 -82 14 -123 31 352 150 198 254 45 128 4 1 80 137 193 -14 -123 -39 12 -215 -95 52 265 81 -124
5420 -124 176 108 -32 -85 259 24 139 25 34 -133 14 117 -68 -50 124 149 282 -8 -39 -149 98 70 40
$$ packed form
5267e8k09M66J19j57l75O8L68l55J40k43l47R49m62r7l3m20K55K55j57K12p79
5288h60J272k17P4p38k5J305q12j59M40j02L62r76P98k43m53n0L21L13k16j27
5308i3L14n36L17K50k27k03J24k10L76q7k72K53m77L12k75j31L35L56J56k84k83
5329b85N39p38Q67m86M52n74M78n00K18K17j7j04j33j35r6M21n43K67M71l13M8
5350E4k85l64N05j55N73k26l46K22J56r8K37l98k80L28O0j55L5k68j07K39L11
5371C8rJ11k84K76q9O8k22L37j95q6M1l50M06L2j43l0L08k10r0Q6R1j19L2L0j11
5396h2R6j37J54L21k02M8N6k09Q3j24lP9N7N6k07j09Q4N1k27J20J47K13j84k05
5420a24L00o8j40n3L44k35J15j14Rj67J47J03j85J8J74K5J33k90l1j10K47k8l0
$$ plain form
5443 40 7 -122 216 -32 11 82 27 -28 13 223 -87 -48 -2 173 10 112 -101 -137 -36 15 -107 90 28 -46
5467 -46 113 132 -56 -32 31 -55 -90 -18 26 -110 111 115 -126 -36 98 -58 118 129 180 -42 -110 191 -275 -289 -300
5492 -300 252 -14 -622 -247 8 -38 -5 -39 -188 -54 65 -28 -4 116 -161 10 -48 153 -20 34 154 205 113
5515 113 177 -30 95 93 -132 -17 -2 29 -99 -155 -145 -2 -173 100 59 -71 26 -47 167 121 -33 -3 -28 -8 -94
5540 -94 -205 -105 193 -148 24 56 -149 -184 52 21 64 -7 -223 154 43 84 -203 135 -55 -33 148 121 16
5563 16 -257 -207 -60 -98 19 -27 111 -197 -133 214 -11 54 211 19 -139 75 35 -107 54 -11 -36 -80 35
5586 35 -46 -158 71 81 -31 -221 -94 33 -185 -35 27 117 -76 192 -41 31 -30 -96 337 -103 72 -96 18
5609 18 69 82 -255 178 442 122 -64 -64 -11 205 121 239 -122 6 77 86 -62 121 215 -94 -72 -28 162 -208
$$ packed form
5443D0l3j29L38k48M3P1n5n5M1K10l10L9M6J75j63J02k13l6J01N1j22J97o2p4
5467d6J59J9j88K4O3q6l5P2M4j36K21Mk41R0J34j56J76J1N1k22o8L01m66j4j1
5492c00N52k66o08L75K55m6L3l4j49J34J19r3K4J20k77J71n8K01j73N4J20N1r2
5515A13O4k07J25kk25J15J5L1j28n6J0J43j71K73m1j30R7p3K14m6j54L0k5K0q6
5540i4j11J00K98l41J72L2k05l5K36l1M3p1k16L77j11M1k87L38j90K2J81k7j05
5563A6k73N0J47l8J17m6J38l08O4L47k25O5J57j92j58K14m0j42J61o5k5m4J15
5586C5q1j12K29J0j12j90J27J27k18J50O2R0j93K68k33P2o1o6M33m40J75j68J14
5609A8N1J3l37M33K64l20j86%N3K16q4J18l61J28P1Rj48J83R4l09K2M4J90l70
$$ plain form
5633 -208 74 -27 42 -2 -96 -169 -95 181 91 -112 18 176 257 -73 20 -106 452 -316 237 150 -71 304 331
5656 331 -299 10 -221 205 16 -330 65 105 13 -53 -27 194 -57 67 134 -106 -41 -108 -148 -183 105 -25 126
5679 126 -54 -117 -75 -114 -39 68 -46 16 68 56 180 107 71 204 -26 138 5 -333 104 368 141 -128 142
5702 142 43 -22 -141 72 117 26 -45 19 92 -204 142 157 122 38 52 -17 13 157 -258 3 -15 -20 -42 150 -2 129
5728 129 -12 51 68 18 -50 116 46 309 230 138 211 118 -57 116 147 48 208 88 41 -16 25 -11 -128 155 84
5753 84 39 57 52 27 -3 49 -43 -50 80 147 102 269 -151 19 -138 17 61 60 -66 -86 -42 104 -14 84 33 -26 -45
5780 -45 -57 31 0 167 113 156 94 155 64 -71 -16 -127 -25 18 123 -15 -76 62 -79 -31 117 -45 -68 104 -49
5805 -49 20 -1 3 -89 97 104 77 -41 -48 -3 76 -173 44 -34 -74 85 152 67 121 164 55 -69 47 122 93 239 -187
$$ packed form
5633b08K82j01O9m4r4p3P4K76r0k03J30J58Q1l30R3j26N58p68N53q7k21L75K7
5656C31o30L09k31M26j89l46L95M0r2o6K6K21k51J24O7k40O5o7m0l5K88j30J51
5679A26j80o3M2l9P5J07j14O2N2j2J24p3l6J33k30J64j33l38M37K64k27k69K70
5702A42r9o5j19K13M5r1p1O4P3k96L46J5l5q4J4o9L0J44m15K61j8nk2J92j52J31
5728A29j41O3J7n0o8J66p0K63p9r2P3r3j75J73L1r9J60j20m7n7M1l6j17K83p1
5753H4m5J8nk5l0N2r2pJ30O7m5J67m20J70j57J55M4jj26k0M4J46j18R8n1n9j9
5780d5j2Q8l1J67n4M3o2O1r1j35N5j11J02M3J05j38o1J38j41M8J48j62k3J72j53
5805d9O9k1Mr2J86Pk7j18pM5P9k49K17p8m0J59O7q5N4M3j09j24J16P5k9J46m26
$$ plain form
5832 -187 -8 35 -110 -108 -177 41 -103 -107 -170 163 -39 -209 220 139 -152 -204 163 131 -131 -42 -103 -116 58 -92
5856 -92 2 7 4 47 106 -59 -156 -25 96 15 94 -120 201 -24 72 -10 -89 196 -58 12 96 119 -32 131 -244 -186
5882 -186 -192 29 -117 -113 -41 97 -113 11 -145 84 25 -17 195 -143 -43 38 45 97 -218 32 -175 -7 -37 -123
5906 -123 144 -101 177 -163 -73 -59 251 -135 -126 -116 37 -160 82 -70 169 132 -145 -57 -117 -99 -24 11 123 24
5930 24 -8 11 -40 46 -5 107 -61 -78 9 59 -268 -113 118 -223 -25 115 58 87 2 41 119 -115 70 144 185
5955 185 121 -192 -24 -47 77 39 101 150 228 -116 -78 -353 -76 39 -143 -99 -61 45 -118 -12 32 110 -31 87
5979 87 36 161 -126 -42 246 67 78 -120 -99 27 174 49 133 135 150 136 -72 117 -96 17 -100 -28 19 51
6003 51 -142 89 89 -96 -10 -253 18 -1 -144 -135 -175 -11 -8 -66 -159 -109 -88 111 -82 -22 129 3 -69 33 -82
$$ packed form
5832a87J79M3j45Ko9K18j44mo3L33k02j70M29q1k91n2L67l2k62Q9o1j3J74j50
5856i2R4NlM3N9j65r7J31J21q1P9k14L21k25R6q2p9K85k54P0Q4K3j51J63l75N8
5882a86oK21j46MP2J38k10J24j56K29n9m2K12l38J00Q1PN2l15K50k07J68l0q6
5906a23K67k45K78l40R0J4L10l86RJ0J53j97K42j52K39l7k77Q8o0J8P5L5J12r9
5930B4l2J9n1Q6n1J12j68j7Q7N0l27J55K31l41J98J40n7K9q5L9P8k34J85P4M1
5955A85o4l13J68k3J24l8O2M9P8l44L8k75K77J15j82M4L8J06j63J06M4P8j41J18
5979H7n1J25k87Q4K88j79J1j98K1J26J47j25Q4KJ5j4k08J89k13J13j17P2M7L2
6003E1j93K31%j85Q6k43K71j9j43Rm0J64Ln8r3N0K1J99j93O0J51j26p2J02j15
$$ plain form
6028 -82 7 124 91 103 16 -23 76 -121 36 -73 -131 -78 -83 -116 -106 -43 -108 -111 92 50 45 136 156 -75 -164 -36 120 -47
6056 -47 -50 111 -244 18 -187 34 -67 -39 1 -152 137 117 126 88 -76 75 118 -76 70 89 -115 -60 0 31 40
6081 40 177 10 -155 -192 -253 109 72 -73 -143 83 89 -100 76 -21 -69 -282 0 19 -152 192 39 -128 5
6104 5 -107 -15 69 118 -124 117 28 45 54 20 30 141 -121 -115 -102 17 -52 -111 -75 -185 -45 -83 172 169 33 -55 -70
$$ packed form
6028h2Q9J17l3J2q7l9R9j97J57j09n8N3nl3J0O3o5lK03m2nR1K0k31q9J28J56j67
6056d7lJ61l55K62k05K21j01K8M0j53K89k0Rl8j64J51M3j94J46J9k04N5O0L1R
6081D0J37j67j65l7o1L62l7j45p0K26Oj89J76r7m8k13K82J9j71L44j53j67J33
6104Ej12R2Q4M9k42K41q9J7Rl4J0J11k62OJ3J19o9n9L6j10J40l8K55lj36q8j5
$$ [...]
8191I2
##END NTUPLES=NMR FID
##END=
