##TITLE=1H_LY-Glu_al_2
 200.13MHz,CDCl3.
 8 sc
 
 12.12.2025
##JCAMPDX= 6.0         $$ Bruker NMR JCAMP-DX V2.0
##DATA TYPE= NMR FID
##DATA CLASS= NTUPLES
##ORIGIN= UXNMR, Bruker Analytische Messtechnik GmbH
##OWNER= pz
$$ XWIN-NMR		Version 3.5
$$ Fri Dec 12 13:34:47 2025 Russian Standard Time (UT+4h)  she@DPX200
##.OBSERVE FREQUENCY= 200.1313
##.OBSERVE NUCLEUS= ^1H
##.DELAY= (6, 6)
##.ACQUISITION MODE= SIMULTANEOUS
##.ACQUISITION SCHEME= undefined
##.AVERAGES= 8
##.DIGITISER RES= 18
##SPECTROMETER/DATA SYSTEM= spect
##.PULSE SEQUENCE= zg30
##.SOLVENT NAME= CDCl3
##.SHIFT REFERENCE= (INTERNAL, CDCl3, 0, 14.3821)
##AUDIT TRAIL= $$ (NUMBER, WHEN, WHO, WHERE, WHAT)
$$ ##TITLE= Audit trail, XWIN-NMR		Version 3.5
$$ ##JCAMPDX= 5.01
$$ ##ORIGIN= Bruker BioSpin GmbH
$$ ##OWNER= she
$$ F:/spectra/data/she/nmr/H-C/1/audita.txt
$$ ##AUDIT TRAIL=  $$ (NUMBER, WHEN, WHO, WHERE, WHAT)
(   1,<2025-12-12 13:33:20.28 +0400>,<she>,<DPX200>,
      <created by zg, POWCHK disabled, PULCHK disabled
       configuration hash MD5:
       00 E9 B6 7A A2 85 ED C7 34 08 36 98 17 FE 4E 26
       data hash MD5: 16K
       8D 1C E1 3C 55 FE 94 1C 38 19 DB A8 17 C7 2B E3>)
$$ ##END=
$$ 
$$ hash MD5
$$ 4C 92 04 D3 EF 03 FE 19 A2 8C 74 D8 F1 89 E9 6E
##$RELAX= 
##$RELAX= 
##$RELAX= 
##$RELAX= 
##$RELAX= 
##$RELAX= 
$$ Bruker specific parameters
$$ --------------------------
##$DU= <F:/spectra>
##$EXPNO= 1
##$NAME= <H-C>
##$PROCNO= 1
##$TYPE= <nmr>
##$USER= <she>
##$AMP= (0..31)
100 100 100 100 100 100 100 100 100 100 100 100 100 100 100 100 100 100 
100 100 100 100 100 100 100 100 100 100 100 100 100 100 
##$AQSEQ= 0
##$AQ_mod= 1
##$AUNM= <au_zg>
##$AUTOPOS= <>
##$BF1= 200.13
##$BF2= 200.13
##$BF3= 200.13
##$BF4= 200.13
##$BF5= 200.13
##$BF6= 200.13
##$BF7= 200.13
##$BF8= 200.13
##$BYTORDA= 1
##$CFDGTYP= 0
##$CFRGTYP= 5
##$CHEMSTR= <none>
##$CNST= (0..31)
1 1 145 1 1 1 1 1 1 1 1 1 1 1 1 1 1 1 1 1 1 1 1 1 1 1 1 1 1 1 1 1 
##$CPDPRG= <>
##$CPDPRG1= <>
##$CPDPRG2= <>
##$CPDPRG3= <>
##$CPDPRG4= <mlev>
##$CPDPRG5= <mlev>
##$CPDPRG6= <mlev>
##$CPDPRG7= <mlev>
##$CPDPRG8= <mlev>
##$CPDPRGB= <>
##$CPDPRGT= <>
##$D= (0..31)
0 0.7 0 0 0 0 0 0 0 0 0 0.03 0 0 0 0 0 0 0 0 0 0 0 0 0 0 0 0 0 0 0 0 
##$DATE= 1765531999
##$DBL= (0..7)
120 120 120 120 120 120 120 120 
##$DBP= (0..7)
150 150 150 150 150 150 150 150 
##$DBP07= 0
##$DBPNAM0= <>
##$DBPNAM1= <>
##$DBPNAM2= <>
##$DBPNAM3= <>
##$DBPNAM4= <>
##$DBPNAM5= <>
##$DBPNAM6= <>
##$DBPNAM7= <>
##$DBPOAL= (0..7)
0.5 0.5 0.5 0.5 0.5 0.5 0.5 0.5 
##$DBPOFFS= (0..7)
0 0 0 0 0 0 0 0 
##$DE= 6
##$DECBNUC= <off>
##$DECIM= 32
##$DECNUC= <off>
##$DECSTAT= 4
##$DIGMOD= 1
##$DIGTYP= 9
##$DL= (0..7)
0 120 120 120 120 120 120 120 
##$DP= (0..7)
150 150 150 150 150 150 150 150 
##$DP07= 0
##$DPNAME0= <>
##$DPNAME1= <>
##$DPNAME2= <>
##$DPNAME3= <>
##$DPNAME4= <>
##$DPNAME5= <>
##$DPNAME6= <>
##$DPNAME7= <>
##$DPOAL= (0..7)
0.5 0.5 0.5 0.5 0.5 0.5 0.5 0.5 
##$DPOFFS= (0..7)
0 0 0 0 0 0 0 0 
##$DQDMODE= 0
##$DR= 18
##$DS= 0
##$DSLIST= <SSSSSSSSSSSSSSS>
$$ [...]
##$SUBNAM0= <"">
##$SUBNAM1= <"">
##$SUBNAM2= <"">
##$SUBNAM3= <"">
##$SUBNAM4= <"">
##$SUBNAM5= <"">
##$SUBNAM6= <"">
##$SUBNAM7= <"">
##$SUBNAM8= <"">
##$SUBNAM9= <"">
##$SW= 18.0517328524113
##$SWIBOX= (0..15)
0 0 2 0 0 0 0 0 0 0 0 0 0 0 0 0 
##$SW_h= 3612.71676300578
##$TD= 16384
##$TD0= 1
##$TE= 0
##$TE2= 300
##$TE3= 300
##$TEG= 300
##$TL= (0..7)
0 120 120 120 120 120 120 120 
##$TP= (0..7)
150 150 150 150 150 150 150 150 
##$TP07= 0
##$TPNAME0= <>
##$TPNAME1= <>
##$TPNAME2= <>
##$TPNAME3= <>
##$TPNAME4= <>
##$TPNAME5= <>
##$TPNAME6= <>
##$TPNAME7= <>
##$TPOAL= (0..7)
0.5 0.5 0.5 0.5 0.5 0.5 0.5 0.5 
##$TPOFFS= (0..7)
0 0 0 0 0 0 0 0 
##$TUNHIN= 0
##$TUNHOUT= 0
##$TUNXOUT= 0
##$USERA1= <user>
##$USERA2= <user>
##$USERA3= <user>
##$USERA4= <user>
##$USERA5= <user>
##$V9= 5
##$VALIST= <valist>
##$VCLIST= <CCCCCCCCCCCCCCC>
##$VD= 0
##$VDLIST= <DDDDDDDDDDDDDDD>
##$VPLIST= <PPPPPPPPPPPPPPP>
##$VTLIST= <TTTTTTTTTTTTTTT>
##$WBST= 1024
##$WBSW= 4
##$XGAIN= (0..3)
0 0 0 0 
##$XL= 0
##$YL= 0
##$YMAX_a= 212354
##$YMIN_a= -225858
##$ZGOPTNS= <>
##$ZL1= 120
##$ZL2= 120
##$ZL3= 120
##$ZL4= 120
##$ABSF1= 10
##$ABSF2= 0
##$ABSG= 5
##$ABSL= 3
##$ALPHA= 0
##$AQORDER= 0
##$ASSFAC= 0
##$ASSFACI= 0
##$ASSFACX= 0
##$ASSWID= 0
##$AUNMP= <proc_1d>
##$AZFE= 0.1
##$AZFW= 0.1
##$BCFW= 1
##$BC_mod= 2
##$BYTORDP= 1
##$COROFFS= 0
##$CY= -3
##$DATMOD= 1
##$DC= 2
##$DFILT= <>
##$DTYPP= 0
##$F1P= 0
##$F2P= 0
##$FCOR= 0.5
##$FTSIZE= 0
##$FT_mod= 4
##$GAMMA= 1
##$GB= 0.15
##$INTBC= 1
##$INTSCL= 1
##$ISEN= 128
##$LB= 0.25
##$LEV0= 0
##$LPBIN= 0
##$MAXI= 10000
##$MC2= 0
##$MEAN= 0
##$ME_mod= 0
##$MI= 1.114404
##$NCOEF= 0
##$NC_proc= 0
##$NLEV= 6
##$NOISF1= 3.799351
##$NOISF2= 2.8
##$NSP= 1
##$NTH_PI= 0
##$NZP= 0
##$OFFSET= 14.38212
##$PC= 1
##$PHC0= -3705.768
##$PHC1= 10.79234
##$PH_mod= 1
##$PKNL= yes
##$PPARMOD= 0
##$PSCAL= 0
##$PSIGN= 0
##$REVERSE= no
##$SF= 200.129724274929
##$SI= 16384
##$SIGF1= 3
##$SIGF2= 2
##$SINO= 400
##$SIOLD= 16384
##$SREGLST= <1H.CDCl3>
##$SSB= 0
##$STSI= 0
##$STSR= 0
##$SW_p= 3205.1282051282
##$SYMM= 0
##$S_DEV= 0
##$TDeff= 0
##$TDoff= 0
##$TI= <>
##$TILT= no
##$TM1= 0
##$TM2= 0
##$TOPLEV= 0
##$USERP1= <user>
##$USERP2= <user>
##$USERP3= <user>
##$USERP4= <user>
##$USERP5= <user>
##$WDW= 1
##$XDIM= 8192
##$YMAX_p= 0
##$YMIN_p= 0
$$ End of Bruker specific parameters
$$ ---------------------------------
##NTUPLES= NMR FID
##VAR_NAME=  TIME,          FID/REAL,        FID/IMAG
##SYMBOL=    X,             R,               I
##VAR_TYPE=  INDEPENDENT,   DEPENDENT,       DEPENDENT
##VAR_FORM=  AFFN,          ASDF,            ASDF
##VAR_DIM=   8192,          8192,            8192
##UNITS=     SECONDS,       ARBITRARY UNITS, ARBITRARY UNITS
##FACTOR=    0.0002768,     1,               1
##FIRST=     0,             0,               0
##LAST=      2.2672688,     0,               0
##MIN=       0,             -225858,         0
##MAX=       2.2672688,     212354,          0
$$ Real data points
##PAGE= N=1
##DATA TABLE= (X++(R..R)), XYDATA
$$ plain form
0 0 0 0 0 0 0 0 0 0 0 0 0 0 0 0 0 0 0 0 0 -4 8 -8 8 -8 8 -8 12 -14 16 -16 20 -22 25 -28 31 -36 39 -44 47 -54 60
41 60 -67 72 -79 88 -97 107 -117 128 -144 156 -173 191 -212 234 -262 291 -330 373 -427 496 -583
62 -583 697 -864 1104 -1494 2204 -3738 8371 -48988 -225858 -17583 131378 -64812 -142783
75 -142783 54230 123598 10796 -8032 35183 -2693 -25616 4565 -15527 -56969 -25553 36286
87 36286 57446 15855 -52751 -37698 59046 37962 -98328 -75171 85651 75656 -51192 -14773
99 -14773 82592 24431 -55547 -22945 -1023 -17930 8033 6436 -38828 8611 84484 15275
111 15275 -79373 -29944 33142 3055 -17640 -8458 -20016 19849 83003 20621 -73766 -19080
123 -19080 55406 -4455 -52281 -290 21258 1047 18574 12995 -26041 305 23238 -47937
$$ packed form
0@%%%%%%%%%%%%%%%%%%%mJ2j6J6j6J6j6K0k6L0l2L6m2M7n3N9o7P5q3R1j01J14
41F0j27J39j51J67j85K04k24K45k72L00l29L64m03M46m96N53o21P03q00R23j079
62e83J280j561J968k598L698n942J2109n7359j76870K08275J48961j96190p7971
75a42783J97013O9368j12802j8828M3215l7876k2923L0181k0092m1442L1416O1839
87C6286K1160m1591o8606J5053R6744k1084j36290K3157J60822r995j26848L6419
99a4773R7365n8161p9978L2602K1922j6907K5963j597m5264M7439P5873o9209
111A5275r4648M9429O3086l0087k0695R182j1558L9865O3154o2382r4387N4686
123a9080P4486n9861m7826N1991K1548k0211J7527n579l9036K6346K2933p1175
$$ plain form
135 -47937 -57741 51079 59348 -47813 -39573 58250 47982 -16701 -22204 -26703 -28921 32119 51916
148 51916 -26901 -43608 34544 46330 -10319 -23392 -22558 -33608 1398 30056 -11586 -15921 41386
161 41386 20433 -39983 6612 54267 -23042 -70529 6082 51339 16368 3272 -5279 -31001
173 -31001 6212 50478 -16570 -80186 -16821 42978 14348 3676 15655 -16331 -16399 35829 14708
186 14708 -47500 -18061 26926 -6052 -5591 51675 25911 -44696 -22599 24269 2654 -15316
198 -15316 -10951 -33380 -15057 59463 46053 -43221 -39952 24224 15110 -10229 5709 -10221 -30340
211 -30340 26115 59771 -3252 -33747 5835 -572 -26621 9610 20860 -31934 -28117 29072
223 29072 26374 -2719 2469 -18573 -42075 14424 54326 -9767 -44653 13548 36598 6167
$$ packed form
135d7937r804J08820Q269j07161Q240R7823j0268o4683n503m499k218O1040J9797
148E1916p8817j6707P8152J1786n6649j3073Q34j1050L5006K8658m1642m335N7307
161D1386k0953o0416M6595M7655p7309m7487P6611M5257l4971j3096q551k5722
173c1001L7213M4266o7048o3616O3365N9799k8630j0672J1979l1986o8N2228k1121
186A4708o2208K9439M4987l2978M61N7266k5764p0607K2097M6868k1615j7970
198a5316M365k2429J8323P4520j3410q9274L269O4176r114k5339J5938j5930k0119
211c0340N6455L3656o3023l0495L9582o407k6049L6231J1250n2794L817N7189
223B9072k698k9093N188k1042k3502N6499L9902o4093l4886N8201K3050l0431
$$ plain form
235 6167 10096 2205 -45074 -24328 39859 16882 -34622 -6666 17659 -8686 5019 30303 -18417
248 -18417 -49365 4998 30523 -1221 3527 14437 -18863 -8811 44099 17566 -45325 -23886
260 -23886 17856 4720 5818 20671 -16741 -34458 20323 31083 -25796 -28612 7126 -4870
272 -4870 -4796 37040 19684 -33499 -8407 32941 2785 -17458 6162 -8228 -24879 22801 39431
285 39431 -18372 -31175 9993 3736 -15697 7575 1479 -32834 -568 44127 10170 -20186
297 -20186 6596 4271 -18815 10708 23667 -23733 -24594 28087 20996 -14679 2697 5112 -30307
310 -30307 -12121 28856 -2124 -32430 7126 23144 -5597 4467 19272 -17944 -25241 20885
322 20885 17590 -19696 -1176 19782 -6600 -3391 24248 -5065 -36097 399 17974 -15411
$$ packed form
235F167L929p891m7279K0746O4187k2977n1504K7956K4325k6345J3705K5284m8720
248a8417l0948N4363K5525l1744M748J0910l3300J0052N2910k6533o2891K1439
260b3886M1742j3136J098J4853l7412j7717N4781J0760n6879k816L5738j1996
272d870P4M1836j7356n3183K5092M1348l0156k0243K3620j4390j6651M7680J6630
285C9431n7803j2803M1168o257j9433K3272o096l4313L2266M4695l3957l0356
297b0186K6782k325k3086K9523J2959m7400q61N2681p091l5675J7376K415l5419
310c0307J8186M0977l0980l0306L9556J6018k8741J0064J4805l7216p297M6126
322B0885l295l7286J8520K0958k6382L209K7639k9313l1032L6496J7575l3385
$$ plain form
334 -15411 -9050 19192 -4248 -15319 21933 14711 -27844 -9396 21622 -4596 -12063 22590 10472
347 10472 -19933 8231 24024 -17403 -22596 11672 -1160 -19151 10902 14050 -19850 -3795
359 -3795 26380 -5305 -24988 9565 11101 -16289 5679 25066 -8189 -11803 22928 6569 -25346
372 -25346 -325 12288 -18909 -9230 24821 404 -24353 8457 17220 -16614 -8902 12412 -10533
385 -10533 -12182 26913 16804 -21545 -1373 24259 -3370 -13554 7919 -6230 -20098 14349
397 14349 20558 -18896 -12238 18692 -3022 -20646 11183 9131 -25579 -5610 28164 6142 -8177
410 -8177 12060 -1057 -19420 14341 24351 -23221 -26812 19407 17705 -8544 1830 -1089 -23280
423 -23280 360 25591 -10449 -28891 11381 18888 -10166 4606 22193 -10925 -21159 13407
$$ packed form
334a5411O361K8242k3440j1071L7252p222m2555J8448L1018k6218p467L4653j2118
347A0472l0405K8164J5793m1427n193L4268j2832j7991L0053L148l3900J6055
359c795L0175l1685j9683L4553J536k7390K1968J9387l3255l614L4731j6359l1915
372b5346K5021J2613l1197R679L4051k4417k4757L2810Q763l3834P712K1314k2945
385a0533j649L9095j0109l8349K0172K5632k7629j0184K1473j4149j3868L4447
397A4349O209l9454O658L0930k1714j7624L1829k052l4710J9969L3774k2022j4319
410h177K0237j3117j8363L3761J0010m7572l591M6219j702k6249J0374k919k2191
423b3280K3640K5231l6040j8442M0272P507k9054J4772J7587l3118j0234L4566
$$ plain form
435 13407 12921 -9223 2647 3855 -18592 3887 34781 -4181 -40843 -5795 19580 -1987 -3403
448 -3403 4179 -16398 -6812 34889 16317 -31346 -11728 22096 183 -9990 14356 5052 -16875
461 -16875 2790 15326 -5979 -3416 3815 -24006 -18676 32286 24119 -32420 -22410 23352 15534
474 15534 -3631 2725 -12549 -22262 20447 36190 -13224 -27094 12473 14635 -8481 286 1816
487 1816 -18992 -6907 14627 -2171 -5612 16769 -3793 -32504 8658 41726 -7008 -39332
499 -39332 1518 26609 9614 5248 -4126 -24579 -1234 32550 2715 -33269 -7491 14897
511 14897 -65 1917 8306 -14080 -13116 16370 4736 -18920 9419 22044 -20882 -18958 36234
524 36234 28022 -27828 -25639 10153 13551 6587 -1464 -24743 -14918 29563 21412 -25883 -19551 11237
$$ packed form
435A3407m86k2144J1870J208k2447K2479L0894l8962l6662L5048K5375k1567j416
448c403P582k0577R586M1701j8572m7663J9618L3824k1913j0173K4346r304k1927
461a6875J9665J2536k1305K563P231k7821N330N0962q167n6539J0010M5762p818
474A5534j9165O356j5274r713M2709J5743m9414j3870L9567K162k3116Q767J530
487A816k0808J2085K1534j6798l441K2381k0562k8711M1162L3068m8734l2324
499c9332M0850K5091j6995m366r374k0453K3345L3784k9835l5984K5778K2388
511A4897j4962J982O389k2386R64K9486j1634k3656K8339J2625m2926J924N5192
524C6234q212n5850K189L5792L398o964q051k3279R825M4481q151m7295O332L0788
$$ plain form
538 11237 1823 -4013 13197 -1410 -19263 11641 25285 -12283 -13313 21579 3008 -30333 499
551 499 31277 1021 -23883 -8487 4917 12570 12680 -19681 -34412 12617 37793 -8004 -27451
564 -27451 10384 16430 -6777 4446 11063 -16202 -9877 21376 4611 -19855 5515 16983 -14834
577 -14834 -16848 12240 9014 -9576 -7610 -7326 -468 25122 12625 -32876 -15878 37822 18731
590 18731 -30157 -11207 20495 3327 -5868 8480 -3744 -14656 8504 8873 -18137 -8439 15951
603 15951 -742 -14504 5471 9629 -3344 3859 1020 -16423 4771 30193 -5776 -33454 10700
616 10700 34805 -8647 -25684 4940 9292 -6840 -529 -1545 -11295 5795 15521 -10867 -14839
629 -14839 14697 9679 -14163 -1391 11348 -4183 964 16112 -7185 -18215 16155 17747 -23637
$$ packed form
538A1237r414n836J7210j4607j7853L0904J3644l7568j030L4892j8571l3341L0832
551D99L0778l0256k4904J5396J3404P653J10l2361j4731M7029K5176m5797j9447
564b7451L7835O046k3207J1223O617k7265O325L1253j6765k4466K5370J1468l1817
577a4834k014K9088l226j8590J966K84O858K5590j2497m5501J6998N3700j9091
590A8731m8888J8950L1702j7168r195J4348j2224j0912K3160L69k7010R698K4390
603A5951j6693j3762J9975M158j2973P203k839j7443K1194K5422l5969k7678M4154
616A0700K4105m3452j7037L0624M352j6132O311j016r750J7090R726k6388l972
629a4839K9536n018k3842J2772J2739j5531N147J5148k3297j1030L4370J592m1384
$$ plain form
642 -23637 -18645 19613 9347 -17270 -4196 7490 -1356 2490 2113 -14580 -2354 23026 1237
655 1237 -22827 5760 24341 -4324 -11613 7498 -697 -9823 10938 6501 -21267 -6071 21506
668 21506 0 -19323 3304 10042 -9232 -3603 8801 -1850 -536 11213 -4273 -11178 16890
681 16890 16590 -21170 -16101 18867 9535 -12573 -1402 1749 -11048 4151 15555 -11743 -19772
694 -19772 10964 12566 -9798 -416 11292 -5871 -5599 13164 2962 -10512 5742 5571 -14392
707 -14392 1044 21996 -5279 -25022 2890 15815 -5527 -7016 1469 -9332 -2035 20320 4622
720 4622 -20145 -813 16652 -1805 -4549 10246 -3310 -13632 9793 14561 -10453 -7648 6860
733 6860 -7276 -10121 14234 7822 -21152 -8608 16278 5825 -4037 3295 -5772 -11633 14296
$$ packed form
642b3637M992L8258j0266k6617J3074J1686q846L846l77j6693J2226K5380k1789
655A237k4064K8587J8581k8665p289J9111q195r126K0761m437k7768J5196K7577
668B1506k1506j9323K2627O738j9274N629J2404j0651J314J1749j5486o905K8068
681A6890l00l7760N069L4968r332k2108J1171L151j2797J5199J1404k7298q029
694a9772L0736J602k2364R382J1708j7163K72J8763j0202j3474J6254j71j9963
707a4392J5436K0952k7275j9743K7912J2925k1342j489Q485j0801P297K2355j5698
720D622k4767J9332J7465j8457k744J4795j3556j0322K3425M768k5014K805J4508
733F860j4136k845K4355o412k8974J2544K4886j0453r862P332r067n861K5929
$$ plain form
746 14296 18188 -12754 -13670 11413 6395 -5781 6494 2075 -18664 -4461 16260 -994 -12512
759 -12512 4079 1419 -10980 8493 17102 -11297 -16550 10198 11327 -3385 3971 2824 -13383
772 -13383 342 20506 -535 -19656 -1040 6805 -5498 2197 9006 -12120 -13422 13134 10601
785 10601 -10168 -2603 5526 -7267 364 19509 2030 -17963 958 12926 -2450 -1820 5569
798 5569 -10987 -12406 14147 11889 -14581 -9339 6713 -1929 -2375 11945 -1134 -16555 3721
811 3721 17222 -1632 -5489 6207 -3969 -8709 12924 10734 -14936 -9573 10404 1225 -5750
824 -5750 6457 -2434 -16991 2604 17114 -3981 -11167 5757 3211 -5170 9683 9232 -13152
837 -13152 -7783 13652 4227 -8321 3437 2172 -11440 1415 13790 -6325 -14983 3928 4731
$$ packed form
746A4296L892l0942r16K5083n018j2176J2275m419k0739J4203K0721j7254j1518
759a2512J6591k660j2399J9473Q609k8399n253K6748J129j4712P356j147j6207
772a3383J3725K0164k1041j9121J8616P845j2303P695O809k1126j302K6556k533
785A0601k0769P565Q129j2793P631J9145j7479j9993J8921J1968j5376O30P389
798E569j6556j419K6553k258k6470N242J6052q642m46J4320j3079j5421K0276
811C721J3501j8854l857J1696j0176m740K1633k190k5670N363J9977r179o975
824e750J2207q891j4557J9595J4510k1095p186J6924k546q381J4853m51k2384
837a3152N369K1435r425j2548J1758j265j3612J2855J2375k0115q658J8911Q03
$$ plain form
850 4731 -6721 4521 8457 -11143 -6617 15848 6451 -10856 862 6519 -6531 1456 13260
863 13260 -4391 -14055 5874 8055 -9226 -2485 6010 -8631 -8017 12278 5470 -11488 252
876 252 8383 -5187 -1221 12508 -1830 -12848 6748 11518 -6559 -3978 7094 -5160 -7407
889 -7407 9611 3243 -14502 -1677 11004 -4542 -6696 9295 1447 -10534 4008 10950 -5544
902 -5544 -3592 9476 -1588 -8030 8929 7523 -12104 -5030 10104 -1898 -7919 5165 172
915 172 -10353 3034 9751 -7902 -6863 10843 1883 -9807 6026 10797 -6927 -4533 9193
928 9193 -857 -7040 7496 3142 -13309 -842 12658 -3890 -11174 4322 2536 -7330 3428
941 3428 6729 -8447 -3605 12405 787 -9548 7096 8944 -10012 -5017 11734 997 -8854
$$ packed form
850D731j1452J1242L936j9600M526K2465r397j7307J1718N657j3050P987J1804
863A3260j7651r664J9929K181j7281O741Q495j4641O14K0295o808j6958J1740
876B52Q131j3570L966J3729j4338j1018J9596M770j8077K581J1072j2254k247
889g407J7018o368j7745J2825J2681j5546k154J5991p848j1981J4542O942j6494
902e544J952J3068j1064o442J6959j406j9627P074J5134j2002o021J3084m993
915A72j0525J3387O717j7653J039J7706q960j1690J5833M771j7724K394J3726
928I193j0050o183J4536m354j6451J2467J3500j6548p284J5496j786r866J0758
941C428L301j5176M842J6010j1618j0335J6644J848j8956M995J6751j0737r851
$$ plain form
954 -8854 2444 1490 -7629 3531 8382 -10747 -10559 10339 5811 -9255 291 6375 -5203 145
968 145 11970 -2142 -10518 6946 8082 -9085 -2283 11309 -2966 -11767 4614 7081 -5653
981 -5653 -2734 852 -7461 467 13663 -2061 -15076 4089 13309 -2991 -3820 6106 -3310 -6022
995 -6022 10884 6810 -12691 -3856 10377 -2832 -8745 7130 3771 -11180 -3275 7680 572
1008 572 -1035 2932 -6806 -5469 14516 10036 -14241 -7127 13315 4409 -6507 2942 1242 -10312
1022 -10312 1392 11266 -5293 -10688 4635 3279 -6880 2183 7359 -5912 -5225 6304 1854
1035 1854 -959 7656 -706 -13585 4625 19255 -4317 -18092 2695 10619 -3298 -2958 1927
1048 1927 -7089 -3998 9657 2237 -9167 827 5199 -4562 850 9953 -2113 -8023 5885 4627
$$ packed form
954h854J1298r54r119J1160M851j9129J88K0898m528j5066R546O084j1578N348
968A45J1825j4112q376J7464J136j7167O802J3592j4275q801J6381K467j2734
981e653K919L586q313P928J3196j5724j3015J9165R220j6300q29R926r416k712
995f022J6906m074j9501Q835J4233j3209n913J5875l359j4951P905J0955p108
1008E72j607L967r738J337J9985m480k4277P114K0442q906j0916R449j700j1554
1022a0312J1704R874j6559n395J5323j356j0159R063N176j3271O87J1529m450
1035A854k813Q615q362j2879J8210J4630k3572j3775K0787P924j3917L40M885
1048A927r016L091J3655p420j1404R994M372r761N412R103j2066n910J3908j258
$$ plain form
1062 4627 -5694 3616 7220 -12262 -10489 14892 10016 -15160 -9799 7307 3236 -1874 1950 -4120
1076 -4120 -6065 7558 8069 -5973 -1894 7122 -3504 -5278 9639 4702 -10727 -1875 8109 -4139
1090 -4139 -4543 8771 -1336 -15770 1390 15376 -1749 -11451 326 4122 2046 5665 -1004
1103 -1004 -9660 3505 12374 -3555 -7700 7427 2883 -10545 1093 10632 -5551 -9725 4539
1116 4539 2037 -6199 3894 5845 -9128 -5747 10699 5744 -5618 -1047 769 -1573 6779 6672
1130 6672 -10397 -7715 11193 4358 -11580 -980 8068 -6293 -7549 7814 3929 -7793 -444
1143 -444 4351 -3577 1524 8719 -2949 -8578 5343 8111 -3309 -1316 1875 -6162 -1076 10584
1157 10584 -1173 -13721 1414 10234 -5591 -6799 7320 1945 -8559 2408 7373 -2559 -1290
$$ packed form
1062D627j0321R310L604j9482J773K5381m876k5176N361J7106m071n110L824o070
1076d120j945J3623N11j4042M079R016j0626j774J4917m937j5429Q852R984j2248
1090d139m04J3314j0107j4434J7160J3986j7125r702J1777L796k076L619o669
1103a004q656J3165Q869j5929m145J5127m544j3428J1638R539j6183m174J4264
1116D539k502q236J0093J951j4973L381J6446m955j1362M571J816k342Q352j07
1130F672j7069K682J8908o835j5938J0600R048j4361j256J5363l885j1722P349
1143d44M795p928N101P195j1668n629J3921K768j1420J993L191q037N086J1660
1157A0584j1757j2548J5135Q820j5825j208J4119n375j0504J0967M965r932J269
$$ plain form
1170 -1290 4869 -2564 -3187 8864 3223 -9779 -1434 7622 -1876 -4191 4054 -2503 -8632 5291
1184 5291 7866 -8543 -6416 8147 2480 -6275 3478 5579 -5163 -1445 6508 -763 -2987 5089
1198 5089 -938 -8582 3357 9001 -6836 -8625 5096 2227 -5495 2544 3646 -7265 -1862 9932
1212 9932 863 -6944 3544 4726 -4940 542 7458 -3071 -5877 4528 1558 -5554 2814 3893
1226 3893 -8725 -4666 9571 2268 -8774 752 4794 -3540 300 7347 -2989 -6844 6203 6105
1240 6105 -5260 -549 5344 -4282 -4611 6447 1450 -8063 -399 3784 -4559 -1522 6921 -2754 -8618
1255 -8618 4657 8057 -4114 -2814 4876 -1574 -2825 6971 2609 -8556 -628 6830 -2732 -3937
1269 -3937 4402 -1540 -8339 3248 6805 -5127 -4272 4838 -974 -3801 6819 3982 -7930 -1222
$$ packed form
1170a290O159p433o23J2051n641j3002Q345R056r498k315Q245o557o129J3923
1184E291K575j6409K127J4563n667q755R753K101j0742L718P953p271k224Q076
1198E089o027p644J1939N644j5837j789J3721k869p722Q039J102j0911N403J1794
1212I932r069p807J0488J182r666N482O916j0529k806J0405k970p112Q368J079
1226C893j2618M059J4237p303j1042R526M042q334L840P047j0336l855J3047r8
1240F105j1365M711N893r626l29J1058m997r513P664M183q343L037Q443r675n864
1255h618J3275L400j2171J300P690o450j251R796m362j1165P928P458r562j205
1269c937Q339n942o799J1587L557j1932Q55R110n812k827J0620k837j1912O708
$$ plain form
1283 -1222 8646 122 -4156 3195 -222 -6485 3513 6775 -6308 -6093 4758 1085 -5134 2998 3173
1298 3173 -7367 -1616 8517 864 -5185 3219 2565 -4724 3203 7746 -4732 -6722 5076 3487
1312 3487 -4669 703 2192 -6715 -2557 7922 -247 -8096 1137 4087 -3334 1427 6949 -3630
1326 -3630 -6092 5855 5069 -4865 279 3691 -4855 -2388 7880 702 -9049 -390 4761 -3053 -1323
1341 -1323 4633 -3444 -6416 5977 6269 -5056 -2145 4933 -1475 -2109 7075 1796 -7964 114 6385
1356 6385 -2203 -3045 3577 -2714 -6773 4539 6031 -6048 -3972 4849 -48 -2774 5389 1979 -7551
1371 -7551 55 8648 -597 -4539 3249 521 -5043 3226 5066 -6195 -5008 4832 715 -4442 2845
1386 2845 1971 -6684 -841 8256 -139 -5329 2555 2497 -3163 3183 5849 -5260 -5250 6215 2833 -5207
$$ packed form
1283a222R868q524m278P351l417o263R998L262j3083K15J0851l673o219Q132J75
1298C173j0540N751J0133p653o049Q404o54p289P927M543j2478j990J1798j589
1312C487q156N372J489q907M158J0479q169p849R233K950p421M761N522j0579
1326c630k462J1947p86r934N144L412q546K467J0268p178r751Q659N151p814J730
1341a323N956q077k972J2393K92j1325K911P078o408o34R184n279r760Q078O271
1356F385q588q42O622o291m059J1312J492j2079K076Q821m897k726Q163l410r530
1371g551P606Q593r245l942P788k728n564Q269J840j1261J187R840m117n157P287
1386B845q74q655N843R097q395n190P884n8n660O346K666j1109J0J1465l382q040
$$ plain form
1402 -5207 -46 2296 -5437 -1416 7012 -355 -6870 1757 3665 -3003 1379 5620 -3508 -5194 6171
1417 6171 4698 -4199 -380 3228 -3703 -1653 6736 -283 -8187 444 4979 -2620 -1860 3593 -2390
1432 -2390 -4869 5092 4581 -4865 -694 4571 -1773 -1898 6450 1066 -7431 363 6353 -2101 -3069 3047
1448 3047 -1994 -5311 3469 4251 -6228 -3416 4528 32 -2661 4187 1389 -5707 1547 6673 -2145
1463 -2145 -3813 3606 -133 -4992 3679 5026 -6081 -4950 4562 1053 -4237 1676 1145 -5721 -106
1478 -106 7192 -608 -4232 2428 2320 -2695 2572 4351 -4967 -3767 5695 1400 -4828 1238 2330
1493 2330 -6017 -1862 6743 -427 -6970 1065 3522 -1992 923 3844 -3264 -3259 5694 2683 -3866 892
1509 892 3056 -4027 -691 6295 -1512 -7813 1690 4376 -3825 -1978 4240 -1987 -5008 4335 4677
$$ packed form
1402e207N161K342p733M021Q428p367o515Q627J908o668M382M241r128j686J1365
1417F171j473q897L819L608o931K050Q389p019p904Q631M535p599P60N453n983
1432b390k479R961n11r446M171N265o344j25Q348n384q497P794N990q454r68O116
1448C047n041l317Q780P82j0479K812P944m496k693O848k798p096P254N126q818
1463b145j668P419l739m859Q671J347j1107J131R512l509n290N913n31o866N615
1478a06P298p800l624O660j08n015N267J779r318J200R462m295o228O066J092
1493B330q347M155Q605p170o543Q035K457n514K915K921p108NQ953l011o549M758
1509H92K164p083L336O986p807o301R503K686q201J847O218o227l021R343L42
$$ plain form
1524 4677 -3757 -1855 3262 -738 -266 5102 -646 -5773 2719 4874 -3304 -2175 3876 -2462 -5351
1539 -5351 4592 4248 -6154 -3542 4688 409 -2769 3613 1772 -4610 1143 5975 -635 -2220 2247
1554 2247 -836 -2813 4130 3278 -6766 -2634 5677 -516 -4775 2972 1946 -6526 -372 7181 -325
1569 -325 -5367 2142 3025 -1794 1775 3160 -3890 -2458 4560 447 -3858 2108 671 -5954 295
1584 295 6636 -2172 -6912 2585 3994 -3618 97 4892 -2524 -3972 5049 4032 -3237 -737 1824
1599 1824 -1930 593 4334 -2766 -5865 2609 3333 -4287 -796 4340 -3621 -4870 5525 4391 -5299
1614 -5299 -1816 4407 -254 -1503 4153 538 -4978 1253 4186 -1802 -1693 2008 -2873 -3290 4775
1629 4775 1974 -6824 -1266 5315 -1045 -3265 4217 1346 -5680 875 6520 -1113 -3456 2051 720
$$ packed form
1524D677q434J902N117m000M72N368n748n127Q492K155q178J129O051o338k889
1539e351R943l44j0402K612Q230m279l178O382j841o382N753M832o610j585M467
1554B247l083j977O943q52j0044M132Q311o193m259P747j026q472O154P553p506
1569c25n042P509Q83m819L569J385p050J432P018m113m305N966j437o625O249
1584B95O341q808m740R497J409p612L715M795p416j448R021j017p269K500K561
1599A824l754K523L741p100l099Q474P24p620L491N136p961j249J0395j134r690
1614e299L483O223m661j249N656l615n516O231K933n988J09L701m881m17Q065
1629D775k801q798N558O581o360k220P482k871p026O555N645p633k343N507j331
$$ plain form
1644 720 -2377 2744 2380 -4517 -2563 3753 -432 -3081 2311 -46 -5654 1712 6445 -2760 -5177
1659 -5177 3768 2910 -2794 1469 4220 -2958 -2953 3885 1560 -3247 511 622 -3865 581 4958 -2724
1675 -2724 -5264 2706 2507 -3108 1445 3897 -3590 -2615 6088 3008 -4543 -222 3415 -1718 -993 3890
1691 3890 -1313 -4584 1884 2761 -2777 -278 2267 -3319 -2970 4931 2486 -5060 -530 4124 -813
1706 -813 -954 4318 -222 -4811 2019 4626 -2741 -2660 2124 -1199 -2757 2984 1557 -4972 -1145 3588
1722 3588 -1119 -1886 3278 38 -4576 2109 5580 -2176 -3159 2774 588 -2448 2720 2284 -4611 -2343
1738 -2343 4040 -352 -3365 1486 177 -3991 1026 4491 -2277 -3435 3089 1326 -2297 2369 2899
1753 2899 -3931 -1945 5100 1272 -3892 463 1197 -3300 444 3734 -2399 -4125 2328 1771 -2641
$$ packed form
1644G20l097N121l64o897J954O316m185k649N392k357n608P366M733r205k417
1659e177Q945q58n704M263K751p178NO838k325m807L758J11m487M446M377p682
1675b724k540P970j99n615M553K452p487R75Q703l080p551M321L637n133P25M883
1691C890n203l271O468Q77n538K499K545n586L49P901k445p546M530M654m937
1706h13j41N272m540m589O830K607p367Q1M784l323j558N741j427o529L827M733
1722C588m707p67N164l240m614O685L471p756r83N933k186l036N168m36o895K268
1738b343O383m392l013M851j309m168N017L465o768j158O524j763l623M666N30
1753B899o830J986P045l828n164M355P34m497L744L290o133j726O453n57m412
$$ plain form
1768 -2641 574 2496 -3279 -1523 4899 1504 -3754 737 2739 -2016 -87 4117 -1763 -4750 1906
1783 1906 2722 -2885 -1036 2186 -2576 -2325 3816 1604 -4145 -130 3430 -1320 -673 3855 -602 -3887
1799 -3887 2310 3840 -2713 -1863 2499 -1571 -2596 3340 1586 -4837 -961 3520 -921 -1932 2386
1814 2386 -366 -3723 2195 4586 -1986 -1789 3194 128 -2140 2880 1821 -4613 -1483 4018 -345
1829 -345 -2620 1321 -24 -3729 1168 4178 -2032 -3223 3010 1291 -2117 2089 2376 -3444 -1295
1844 -1295 4688 602 -3057 1182 974 -3128 477 3306 -2379 -4015 2112 1647 -2434 672 2107
1859 2107 -2639 -1351 4748 1238 -3423 727 2177 -1873 23 3403 -1840 -3772 2395 2313 -3098
1874 -3098 -937 1664 -2472 -1618 4116 918 -4014 -19 3218 -864 -301 3154 -972 -3497 2462
$$ packed form
1768b641L215J922n775J756O422l395n258M491K002m755J929M204n880k987O656
1783A906Q16n607J849L222m762K51O141k212n749M015L560m750O47M528m457l285
1799c887O197J530o553Q50M362m070j025N936j754o423L876M481m441j011M318
1814B386k752l357N918K391o572J97M983l066k268N020j059o434L130N501m363
1829c45k275L941j345l705M897L010o210j191O233j719l408M206K87n820K149
1844a295N983m086l659M239k08m102L605K829n685j636O127m65m081L106J435
1859B107m746J288O099l510m661M150J450m050J896L380n243j932O167q2n411
1874c098K161K601m136Q54N734l198m932L995L237m082N63L455m126k525N959
$$ plain form
1889 2462 3412 -2486 -1351 1870 -1465 -1976 3195 734 -4681 -1042 3301 -483 -1343 2467 -477 -3024
1905 -3024 2636 3726 -2184 -1928 2540 80 -1358 2692 1072 -4595 -799 3484 -577 -2595 1316
1920 1316 65 -2841 1511 3371 -2540 -2841 2799 1528 -1558 1748 1493 -2949 -365 4298 -108
1935 -108 -2894 1289 975 -2679 799 2844 -2689 -3803 2257 1675 -1953 485 1364 -2698 -247 4473
1951 4473 768 -3584 736 2551 -1390 425 2517 -2154 -3026 2729 1938 -2896 -196 1961 -2436
1966 -2436 -1585 3544 746 -4104 78 3028 -372 -176 2249 -1563 -2663 3350 2840 -2724 -1510 2058
1982 2058 -790 -1301 2470 -189 -4236 614 3078 -1850 -1735 2524 -303 -3034 1892 3549 -1885
1997 -1885 -1974 1964 206 -682 2254 147 -4169 283 3737 -1199 -2794 1080 142 -2327 1303 2275
$$ packed form
1889B462R50n898J135L221l335n11N171k461n415L639M343l784q60L810k944k547
1905c024N660J090n910K56M468k460j438M050j620n667L796M283m061k018L911
1920A316j251k906M352J860n911l01N640j271l086L306k55m442K584M663m406
1935a08k786M183l14l654L478K045n533j114O060n82l628K438Q79m062K451M720
1951D473l705m352M320J815l941J815K092m671q72N755p91m834K700K157m397
1966b436Q51N129k798m850M182K950l400J96K425l812j100O013n10n564J214L568
1982B058k848n11L771k659m047M850K464m928J15M259k827k731M926J657n434
1997a885q9L938j758q88K936k107m316M452L454m936j595L874r38k469L630R72
$$ plain form
2013 2275 -2739 -1728 3514 966 -2145 1548 1977 -2357 -745 3342 620 -2077 711 211 -1534
2028 -1534 1626 1903 -3551 -2796 3562 1261 -2869 32 1844 -2095 -430 3499 -314 -2900 1656
2043 1656 2511 -1815 -553 2822 -1460 -2459 1429 1129 -1773 -283 781 -2494 18 3829 -736 -4558
2059 -4558 1336 3526 -1261 -1666 2244 34 -1672 2225 1861 -2377 -260 2359 -1209 -1711 2472 322
2075 322 -3362 -85 1875 -1114 -381 2051 -1339 -2514 3318 3343 -2838 -1849 3350 908 -1720 1070
2091 1070 808 -2316 451 1790 -1620 -1399 1949 -369 -3046 1211 2339 -1984 -1614 1845 275 -1080
2107 -1080 2420 970 -3305 -152 4503 -112 -3297 445 1323 -1417 -141 1029 -1982 -1487 1900
2122 1900 -305 -2384 1420 1355 -2749 -698 3526 224 -2670 711 1348 -1566 847 2434 -2331 -2906
$$ packed form
2013B275n014J011N242k548l111L693M29m334J612M087k722k697K788n00j745
2028a534L160K77n454P55O358k301m130K901J812l939J665L929l813k586M556
2043A656Q55m326J262L375m282r99L888l00k902J490J064l275K512L811m565l822
2059d558N894K190m787m05L910k210j706L897l64m238K117K619l568n02M183k150
2075C22l684L277J960k989P33K432l390j175N832K5o181R89N199k442k628K790
2091A070k62l124K767J339l410K21L348k318k677M257J128m323L70L459j570j355
2107a080L500j450m275L153M655m615l185L742Q78k740J276J170l011M95L387
2122A900k205k079L804o5m104K051M224l302k894L381O37k914K413J587m765n75
$$ plain form
2138 -2906 2669 1991 -2567 -1055 991 -653 -349 1949 -953 -2136 1966 1790 -1904 226 3053 -1249
2154 -1249 -2823 2286 2755 -1917 -1248 825 -1192 -631 2476 -741 -3679 240 2624 -773 -1520 834
2170 834 -845 -1234 2186 1531 -2458 -260 2825 -548 -1481 2496 1004 -3354 -691 2635 -255 -1719
2186 -1719 124 -901 -1555 2075 1765 -2781 -1807 2557 896 -1177 1085 54 -1874 1165 3124 -1457
2202 -1457 -2270 1563 823 -2133 636 2146 -2251 -2420 1632 1409 -1304 18 208 -2269 899 3483
2218 3483 -878 -2721 1475 2114 -985 289 1398 -2072 -1643 2638 810 -2889 -262 1409 -1571
2233 -1571 -742 2213 -469 -2713 667 1809 -336 259 1082 -1768 -1170 3410 1316 -3020 -760 2164
2249 2164 -314 -451 1352 -875 -2865 1088 2096 -1587 -1399 1199 -309 -1002 1952 1612 -2227 -648
$$ packed form
2138b906N575o78m558J512K046j644L04K298k902j183M102j76l694K130K827m302
2154a249j574N109M69m672O69K073k017N61L107l217k938L919K384l397p47K354
2170H34j679l89L420o55l989K198L085l373r33L977j492m358K663L326k890j464
2186a719J843j025o54L630l10m546R74M364j661k073K262j031j928L039J959m581
2202a457q13L833p40k956K769J510m397j69M052k23k713J322J90k477L168K584
2218C483m361j843M196O39l099J274J109l470M29M281j828l699K627J671k980
2233a571Q29K955k682k244L380J142k145N95Q23k850N98M580k094m336K260K924
2249B164k478j37J803k227j990L953J008l683J88K598j508o93K954l40l839J579
$$ plain form
2265 -648 1998 209 -890 1474 -384 -2453 924 2668 -1641 -2369 821 264 -1296 1083 426 -2677
2281 -2677 -629 2434 118 -1802 1003 645 -1666 530 2507 -1000 -1916 1446 906 -1082 856 897
2297 897 -2779 -1201 2686 323 -2214 164 1067 -1157 307 1903 -966 -1995 1751 1790 -1498 43
2313 43 1817 -1369 -971 2084 637 -2138 39 1420 -1340 -403 1682 -782 -2132 1182 1777 -1235
2329 -1235 -370 1597 -660 -756 2324 929 -2095 261 1765 -788 -1073 1622 -423 -2030 829 1410
2345 1410 -1793 -1062 1204 -547 -1025 1972 1040 -2186 42 2319 -280 -884 1546 329 -1691 711
2361 711 1856 -1601 -1076 1487 -339 -1744 1300 1129 -1895 -844 1686 -218 -1465 1478 584 -1727
2377 -1727 508 2331 -1192 -1447 1302 154 -1206 493 936 -1838 -1166 1766 -211 -1844 686 770
$$ packed form
2265f48K646j789j099K364j858k069L377J744m309p28L190n57j560K379o57l103
2281b677K048L063k316j920K805l58k311K196J977l507r16L362n40j988J938M1
2297H97l676J578L887k363k537K378R03k224J464J596k869j029L746L9l288J541
2313D3J774l186L98L055j447k775K177J381k760R37K085k464j350L314N95l012
2329a235Q65J967k257r6L080j395l024K356J504k553k85K695k045j607K859N81
2345A410l203P31K266j751m78K997r32l226K228K277k599o04K430j217k020K402
2361G11J145l457N25K563j826j405L044j71l024J051K530j904j247K943q94k311
2377a727K235J823l523k55K749j148j360J699M43k774O72K932j977j633K530Q4
$$ plain form
2393 770 -1862 360 2412 -514 -1593 1225 1123 -919 804 1192 -1811 -1129 2384 594 -1976 88
2409 88 611 -1364 -250 1841 -742 -1889 739 1538 -1142 104 1529 -1470 -1092 2028 1090 -1686
2425 -1686 -161 1060 -1186 -207 1879 -516 -2568 580 1748 -1260 -728 572 -1126 -1031 1978 1104
2441 1104 -2244 -322 1887 -192 -644 1626 -92 -1891 680 1614 -1016 -1148 737 -928 -1059 1830
2457 1830 938 -2620 -791 2403 229 -1059 793 -140 -1265 1143 2567 -1302 -1670 1419 764 -953
2473 -953 889 654 -1676 -986 1673 -95 -1134 445 -168 -1619 838 2356 -1500 -2293 1595 1856
2489 1856 -723 456 399 -1723 -226 2408 74 -2165 54 852 -951 -49 1211 -1344 -1752 1092
2505 1092 1046 -956 83 1136 -1288 -464 2638 756 -2564 -495 1592 340 -251 512 -1386 -1683
$$ packed form
2393G70k632K222K052k926j079K818j02k042J723L88l003O82L513j790k570K064
2409H8N23j975J114K091k583j147K628P99k680J246J425k999L78L120r38k776
2425a686J525J221k246R79K086k395k052L148J168l008N32J300j698R5L009q74
2441A104l348J922K209k079m52K270j718j799K571R34k630j32J885j665j31K889
2457A830q92l558J829L194k174j288J852r33j125K408J424l869l68L089o55j717
2473i53J842k35k330O90K659j768j039J579o13j451K457J518l856p93L888K61
2489A856k579J179n7k122J497K634k334k239K219P98j803R02J260k555m08K844
2505A092m6k002J039J053k424Q24L102j882l320K069K087j252n91P63j898k97
$$ plain form
2521 -1683 1772 1460 -1859 -946 931 -387 -608 1684 73 -1980 474 1766 -251 -293 1468 -544
2537 -544 -1803 1287 2513 -1749 -1883 693 707 -295 829 -433 -2181 671 2219 -531 -1682 809
2553 809 412 -933 881 1527 -1248 -902 1603 796 -1156 915 483 -2034 -600 2260 386 -1797
2569 -1797 -220 558 -265 1071 794 -2097 -729 2643 1043 -1817 33 1261 -943 -374 1564 -206
2585 -206 -1621 580 571 -1151 174 1165 -988 -1930 1356 1261 -1085 -486 520 -566 200 1960 -354
2602 -354 -2147 1309 1847 -1286 -1196 1257 37 -1116 480 497 -1183 -75 1131 -1132 -759 1435 284
2619 284 -1529 49 1648 -477 -348 812 -634 -1123 1469 969 -2291 -536 1801 221 -1728 300
2635 300 805 -1070 -230 775 -921 -235 1356 20 -1505 1124 1642 -966 -899 1316 396 -962 952
$$ packed form
2521a683L455l12l319R13J877j318k21K292j611k053K454J292k017m2J761k012
2537e44j259L090J226m262j34K576J4j002J124j262j748K852J548k750j151K491
2553H09l97j345J814O46k775L46K505q07j952K071m32k517J434K860j874k183
2569a797J577P78q23J336k77k891J368L372j600k860J850J228k204N69J938j770
2585b06j415K201rj722J325R91k153r42L286r5k346N99J006j086P66J760k314
2602c54j793L456N38l133R0K453j220j153J596J7j680J108J206k263L73K194j151
2619B84j813J578J599k125J29J160j446m89K592n00l260J755K337j580j949K028
2635C00N05j875Q40J005j696O86J591j336j525K629N18k608O7K215r20j358J914
$$ plain form
2652 952 357 -1799 82 1611 -870 -1892 727 632 -1496 22 1049 -276 -457 1012 -147 -879
2668 -879 1409 939 -1815 -385 1997 -70 -1614 196 795 -1062 176 1030 -1203 -1392 1341 823
2684 823 -1387 -67 1347 -529 -633 1247 573 -607 580 501 -1117 221 1731 -1078 -2182 1069
2700 1069 1471 -1102 -745 762 -613 -391 1577 67 -1784 394 1761 -642 -201 979 123 -1056
2716 -1056 822 1169 -893 -416 716 -879 -855 1520 757 -2348 -631 1733 99 -952 431 -46
2732 -46 -730 1452 1346 -1461 -682 1422 84 -648 785 -117 -1991 -367 1780 -230 -1301 307 -145
2749 -145 -1355 1002 1615 -1265 -1559 1325 1217 -624 475 274 -1129 408 2032 -291 -1800 229
2765 229 854 -788 -72 538 -1174 -1398 1355 794 -925 -174 559 -665 77 2188 21 -1792 430
$$ packed form
2652I52n95k156J881J529k481j022K619r5k128J518J027j325j81J469j159p32
2668h79K288m70k754J430K382k067j544J810N99j857J238Q54k233j89K733n18
2684H23k210J320J414j876j04J880o74j180J187p9j618J338J510k809j104L251
2700A069M02k573L57J507j375K22J968j510j851K178J367k403M41J180q56j179
2716a056J878L47k062M77J132j595K4K375p63l105J717K364j634j051J383m77
2732d6o84K182j06k807P79K104j338p32J433r02j874J624K147k010j071J608m52
2749a45j210K357O13k880k94K884j08j841J099k01j403J537J624k323j509K029
2765B29O25j642P16O10j712k24K753n61j719P51P33j224P42K111k167j813K222
$$ plain form
2782 430 1346 -309 -186 386 -698 -585 1806 751 -2054 -670 1015 -415 -442 1003 -137 -1485 575
2799 575 1263 -333 -457 666 -394 -574 1366 1149 -1650 -1058 1251 71 -427 240 -637 -1590 826
2816 826 1786 -750 -1207 726 113 -541 937 747 -1323 -829 1587 361 -871 311 74 -1253 475
2833 475 1514 -581 -1579 579 617 -555 484 328 -1516 -325 1704 459 -1359 126 827 -579
2849 -579 233 1214 -843 -1506 757 504 -1132 -278 386 -1104 -606 1426 296 -1828 -166 1092 -407
2866 -407 22 940 -482 -1427 1153 1369 -1052 -731 550 -605 -536 890 398 -1312 -495 1303 -691
2883 -691 -491 959 -246 -1033 881 1406 -649 -262 1233 72 -510 822 411 -1323 -271 1178 -305
2900 -305 -1250 742 39 -1073 338 865 -841 -735 1491 439 -728 1001 1072 -1224 -445 1495 -102
$$ packed form
2782D30R16j655J23N72j084J13K391j055k805J384J685j430k7J445j140j348K060
2799E75O88j596j24J123j060j80J940k17k799N92K309j180m98O67q77r53K416
2816H26R60k536m57J933o13o54J478j90k070M94K416j226j232J182k37j327J728
2833D75J039k095r98K158L8j172J039j56j844J191K029j245j818J485P01j406
2849e79Q12R81k057o63K263k53j636Q54O64j490M98K032j130k124J662J258j499
2866d07M29R18j422r45K580K16k421L21J281j155O9J426m92j710Q17J798j994
2883f91K00J450j205p87J914N25k055L87J495j161n82J332m11j734J052J449j483
2900c05r45J992p03j112J411N27j706J06K226j052j167J729P1k296P79J940j597
$$ plain form
2917 -102 -814 492 244 -1390 30 993 -800 -1033 999 459 -1116 206 823 -1065 -407 1192 156
2934 156 -919 912 707 -1005 -92 1166 -145 -1064 493 191 -1103 -77 678 -653 -595 1077 382
2951 382 -1154 331 715 -652 -137 1330 -162 -1079 745 731 -982 -29 1040 -670 -1321 838 332
2968 332 -979 -174 343 -654 -455 957 -71 -1268 570 1103 -621 -5 858 -279 -565 916 574
2985 574 -903 -481 921 -197 -647 1144 -3 -1575 -52 922 -216 -726 407 158 -356 1294 747
3002 747 -1403 -684 1287 374 -545 747 119 -900 297 1419 -640 -1252 536 284 -1124 657 778
3019 778 -1028 -958 842 331 -428 28 -254 -1006 816 1835 -552 -1574 542 824 -267 122 139 -1012
3037 -1012 -673 1048 333 -952 35 571 -504 283 1376 -236 -1041 493 892 -84 -283 321 -1106
$$ packed form
2917a02p12J306k48j634J420R63j793k33K032n40j575J322O17j888O58J599j036
2934A56j075J831k05j712R13J258j311r19J557l02j294J026P55j331N8J672o95
2951C82j536J485L84j367N15J467j492r17J824j4j713R53J069j710o51K159n06
2968C32j311Q05N17r97J99J412j028j197J838N33j724O16Q63j137k86J481l42
2985E74j477M22J402j118m50J791j147j572J523R74j138n10J133k49n14J650n47
3002G47k150P19J971r13r19J292o28j019J197J122k059o12J788k52j408J781J21
3019G78j806P0J800n11p59M56k82p52J822J019k387j022K116K82j091L89J7j151
3037a012L39J721p15j285R87N36j075P87J093j612q05J534L99r76j99O04j427
$$ plain form
3054 -1106 -564 1878 482 -1829 -570 944 -90 -331 433 -628 -915 1019 1194 -839 -545 307 -290
3071 -290 -436 1318 388 -1405 -422 1025 9 -294 464 -634 -1422 1017 1406 -758 -1054 382 432 -334
3089 -334 562 80 -1514 140 1267 -142 -429 616 -12 -1078 364 1342 -952 -1031 544 431 -517
3106 -517 174 394 -1189 -230 1837 238 -1245 -182 758 87 661 653 -935 -547 1630 727 -1213 -201
3124 -201 521 -787 -513 930 -6 -1289 63 517 -316 325 1082 -515 -623 1149 1148 -862 -238 558
3142 558 -184 20 718 -450 -1350 311 781 -712 -764 790 -264 -710 472 690 -493 -668 737 131
3160 131 -270 798 -122 -1291 185 1180 -52 -907 357 -60 -636 632 610 -1123 -529 1222 86
3177 86 -985 180 696 -737 -29 779 -122 -489 381 -80 -594 394 776 -749 -1014 1124 508 -724
$$ packed form
3054a106N42K442j396k311J259J514j034k41P64j061k87J934J75k033K94Q52n97
3071b90j46J754r30j793R83J447j016l03P58j098p88K439L89k164k96J436N0p66
3089c34Q96m82j594J654J127j409k87J045o28j066J442R78k294p9J575j13r48
3106e17O91K20j583R59K067j599j483J063R40o71N74qj588L88K177r03j940J012
3124b01P22j308K74J443r36j283J352M54q33O41P57j597j08J772jk010O24P96
3142E58p42K04O98j168r00J661M70j493n2J554j054m46J182K18j183j75J405o06
3160A31m01J068r20j169J476R95j232q55J264m17n76J268k2j733N94J751j136
3177H6j071J165N16j433P08Q08r01l67Q70m61n14R88L82j525k65K138o16j232
$$ plain form
3195 -724 196 121 -834 -150 1101 -300 -1121 888 815 -469 -156 796 -151 -536 427 464 -795 185 409
3214 409 -1180 -430 1225 45 -1324 29 638 -414 98 734 -134 -1104 819 574 -504 72 855
3231 855 -781 -771 775 194 -1101 101 348 -531 -325 825 -390 -1132 781 749 -699 127 662 -211
3249 -211 -519 874 328 -756 109 760 -501 -277 755 31 -1133 209 623 -495 -277 550 -521
3266 -521 -560 1059 497 -983 -213 1196 178 -384 459 282 -949 286 727 -436 -616 615 -39 -527
3284 -527 672 212 -1078 -624 1191 157 -544 232 417 -438 551 700 -733 -879 630 539 -269 -123
3302 -123 214 -778 -469 1373 150 -890 34 561 -467 293 563 -637 -811 755 686 -324 -81 327
3320 327 -509 -401 1370 140 -1315 -10 798 70 -389 554 -832 -705 880 807 -681 -434 564 -80
$$ packed form
3195g24R20p5r55O84J251j401q21K009p3j284L13R52r47l85R63L7j259R80K24
3214D09j589P50J655j180j369J353O09j052N12O36q68r70J923k45j078N76P83
3231H55j636J0J546n81j295J202K47q79K06J150j215p42J913l2j448Q26N35q73
3249b11l08J393n46j084Q65O51j261K24J032p24j164J342M14j118K18Q27j071
3266e21l9J619n62j480P70J409j018n62Q43j77j231J235M41j163j80J231o54m88
3284e27J199m60j290M54J815j034p01P76J85q55R89J49j433j46J509r1q08J46
3302a23L37r92L09J842j223j040R24N27j028P60K70j200j74J566o9j010K43M08
3320C27q36J08J771j230j455J305Q08p28m59R43j386J27J585p3j488K47R98o44
$$ plain form
3338 -80 -8 949 244 -1268 -181 1072 -16 -467 278 -384 -620 709 726 -836 -776 681 74 -221 226
3357 226 105 -1042 394 1422 16 -436 216 141 -339 621 725 -771 -898 539 24 -391 -17 -198
3375 -198 -869 297 1274 -183 -1023 283 725 -228 508 699 -676 -669 1163 204 -619 62 249 -844 -146
3394 -146 804 -371 -922 340 712 -338 134 267 -572 -496 929 656 -557 -127 713 -131 -137 745 -323
3413 -323 -969 212 623 -582 -508 359 70 -510 627 394 -956 -349 695 117 -90 775 111 -431 418
3432 418 1036 -420 -902 504 76 -578 482 583 -821 -427 1051 224 -631 432 299 -572 -38 654
3450 654 -213 -445 581 -166 -368 166 428 -914 -312 455 59 -631 241 377 -604 -65 1026 -81 -819
3469 -819 354 275 -369 304 774 -199 -311 717 -13 -684 210 671 -609 -197 715 -186 -873 14 553
$$ packed form
3338h0P2R57p05j512J087J253j088m51P45o62k36J329J7j562O0J457o07k95M47
3357B26j21j147J436J028j406m52O52p5m80R60J04j496j27J437n15m15L74j81
3375a98o71J166R77j457q40J306M42r53P36J91j375PJ832r59q23O81J87j093O98
3394a46R50j175n51J262L72j050M72J33q39P6J425k73j213M30Q40q44oQ82j068
3413c23o46J181M11j205P4Q67k89n80J137k33j350O07J044n78k07Q65o64n42Q49
3432D18O18j456m82J406m28o54J060J01j404L94J478q27q55J063j33q71N34O92
3450F54q67k32J026p47k02N34K62j342O02P67l96o90Q72J36r81N39J091j107p38
3469h19J173p9o44O73M70r73j12J028p30o71Q94M61j280M12R12r01o87Q87N39
$$ plain form
3488 553 -396 189 377 -275 -423 692 492 -661 86 296 -704 -111 660 -135 -842 208 205 -688 124
3507 124 598 -374 -888 551 496 -460 -152 750 116 -270 644 354 -632 87 831 -205 -344 642 -339 -644
3527 -644 37 367 -531 -381 662 4 -309 319 645 -753 194 855 199 -256 249 15 -248 499 554 -597
3547 -597 -440 605 -90 -303 318 420 -749 -200 650 -82 -346 -48 228 -320 384 469 -402 -406 437 400 -537
3568 -537 -114 117 -524 96 676 21 -817 -5 370 -863 -35 480 -461 -359 751 647 -631 -152 489
3587 489 -70 -71 537 159 -949 -30 724 -507 -340 401 -309 -364 531 573 -827 -72 433 203 -74 452
3607 452 -28 -670 313 578 -187 -363 283 -517 -546 424 527 -658 -494 551 -70 -648 272 -29 -614 728
3627 728 1065 -223 -572 245 155 -338 80 345 -534 -355 418 -56 -411 73 43 -358 163 897 -234 -659
$$ packed form
3488E53r49N85J88o52j48J115k00j153P47K10j000N93P71p95p07J050lq93Q12
3507A24M74r72n14J439n5r56L08R02o34l86R14k90r86P19P44j036j39R86r81l05
3527f44O81L30q98J50J043o58l13O28L26j398R47O61o56m55N05k34k63P47N5j151
3547e97J57J045o95k13O21J02j169N49Q50p32k64K98K76n48P04Q5q71mQ43l7r37
3568e37M23K31o41O20N80o55q38Q12L75j233Q28N15r41J02J110j04j278M79O41
3587D89n59jO08l78j108R19P54j231J67P41p10n5Q95M2j400P55N05k30k77N26
3607D52m80o42R83K65p65j76O46q00k9R70J03j185J64J045o21n78R20l01n85J342
3627G28L37j288l49Q17r0m93M18K65q79J79P73m74l55M84l0m01N21P34j131m25
$$ plain form
3647 -659 74 444 44 235 549 -667 -268 485 526 -674 -96 175 -308 -4 528 -314 -706 121 360 -236
3667 -236 173 607 -343 -489 854 534 -526 -71 417 33 85 486 -458 -798 444 446 -190 -335 166 13
3687 13 -271 472 308 -481 -8 916 -143 -268 512 141 -363 541 891 -95 -228 88 172 -294 571 250
3707 250 -500 -118 680 -399 -323 271 220 -221 486 717 -337 -376 173 124 -377 121 379 -604 -288 655 -3
3728 -3 -535 120 25 -467 -5 809 -250 -599 233 597 -380 -120 486 -349 -162 365 214 -644 -157 215 -589
3749 -589 -134 857 -120 -584 76 342 -325 151 495 -317 -461 734 59 -355 244 197 -317 -77 666 165
3769 165 -644 252 444 -547 67 404 -235 -381 550 475 -273 -248 427 -311 -191 541 52 -630 244 687 -339
3790 -339 -346 465 -154 -480 362 202 -236 -350 444 123 -530 419 300 -425 134 801 -149 -265 172 196 -504
$$ packed form
3647f59P33L70m00J91L14j216L99P53M1j200N78K71m83L04N32q42l92Q27K39n96
3667b36M09M34r50j46J343l20j060M55M88l84N2M01r44l40J242Ko36j45N01j53
3687A3k84P43j64p89M73R24j059j25P80l71n04R04L50r86j33L16Q4m66Q65l21
3707B50p50L82P98j079P6N94n1m41P07K31j054l9N49m9n01M98K58r83L16R43o58
3728cn32O55r5m92M62Q14j059l49Q32L64r77K60O06q35J87N27j51q58M87L72q04
3749e89M55R91r77m64O60K66o67M76L44q12j44J195o75m14N99m7n14K40P43n01
3769A65q09Q96J92r91O14L37o39j46R31p5p48K5O75p38J20P32m89o82Q74M43j026
3790c39pQ11o19l26Q42j60m38j14P94l21o53R49j19p25N59O67r50j16M37K4p00
$$ plain form
3811 -504 315 413 -501 -401 434 -37 -453 190 246 -348 -175 512 -527 -603 441 395 -169 227 605 -335 -523
3832 -523 540 168 -531 37 341 -292 -424 428 -102 -558 267 236 -249 -158 555 -291 -405 568 266 -334
3852 -334 93 173 -89 160 624 -216 -794 349 355 -363 -243 192 -385 153 271 559 -429 19 462 37 -108
3873 -108 732 -45 -615 241 729 -36 -73 220 100 -237 315 250 -808 -349 590 182 -474 -85 202 -277
3893 -277 294 698 -432 -397 206 80 -205 270 107 -657 -327 313 102 -391 -151 94 -47 145 716 -45
3913 -45 -484 233 190 -283 365 498 -457 -111 508 378 -444 -92 78 -401 -206 419 -222 -465 121 219 -359
3934 -359 -91 204 -210 -194 484 273 -397 -2 306 -206 -174 587 -76 -462 222 244 -248 -321 286 155 -205
3955 -205 198 -39 -460 18 420 91 -83 202 14 -304 298 225 86 -227 200 147 -667 37 267 -478 -144
$$ packed form
3811e04Q19R8r14J00Q35m71m16O43N6n94J73O87j039p6J044m6n64L96L78r40j88
3832e23J063l72o99N68L04o33j32Q52n30m56Q25l1m85R1P13q46j14R73l02o00
3852c34M27Q0k62K49M64q40n78J143Op18J20M35n77N38J18K88r88M48M43m25j45
3873a08Q40p77n70Q56M88p65l7K93j20l37N52o5j058M59R39m08o56L89K87m79
3893b77N71M04j130L5O03j26k85M75j63p64L30O40k11m93K40K45j41J92N71p61
3913d5m39P17m3m73O48J33r55L46O19j30q22L52J70m79J95O25o41k43N86R8n78
3934c59K68K95m14J6O78k11o70L95L08n12L2P61o63l86O84K2m92p3O07j31l60
3955b05M03k37m21M78M02l29j74K85j88l18O02p3j39l13M27n3q14P04K30p45L34
$$ plain form
3976 -144 363 -145 -301 274 108 -305 61 707 -120 -307 348 251 7 266 7 -106 -126 470 -201 -478 192
3997 192 231 -469 27 161 -174 -271 59 88 -137 150 234 -30 -166 400 237 -478 -73 270 -218 -261 333 -282
4019 -282 -645 234 142 -532 -55 469 -198 -81 530 210 -545 223 469 -193 -116 454 -348 -514 177 223 -358
4040 -358 -268 -36 -246 -184 536 220 -468 -126 177 -294 -197 243 -157 -387 219 614 64 -254 329 59 -188
4061 -188 247 24 -498 -109 188 284 -358 -35 135 -538 62 354 -376 -302 475 -38 -283 127 200 -358 -166
4082 -166 376 145 -307 83 50 -73 119 173 -60 -297 309 425 -17 -116 29 -399 -152 349 117 -414 284
4103 284 98 -76 212 244 -164 -404 150 263 -334 15 258 -117 196 658 266 -364 147 298 -93 -218
4123 -218 656 96 -509 50 542 -292 -40 74 -125 -363 39 59 -462 -25 572 221 -464 251 226 -320 81
$$ packed form
3976a44N07n08j56N75j66m13L66O46q27j87O55r7k44K59k59j13k0N96o71k77O70
3997A92L9p00M96J34l35r7L30K9k25K87Q4k64j36N66j63p15M05L43m88m3N94o15
4019b82l63Q79r2o74M77N24o67J17O11l20p55P68K46o62P7N70q02j66O91M6n81
4040c58R0K32k10O2P20l16o88L42L03m71R7M40m00k30O06L95n50l18N83k70k47
4061a88M35k23n22L89K97R6o42L23J70o73O00K92p30P4P77n13k45M10P3n58J92
4082a66N42k31m52L90l3j23J92N4k33k37O06J16m42r9J45m28K47N01k32n31O98
4103B84j86j74K88L2m08k40N54J13n97L49K43l75L13M62l92o30N11J51l91j25
4123b18Q74n60o05N59M92q34K52J14j99k38M02K0n21M37N97l51o85P15k5n46M01
$$ plain form
4144 81 471 -247 -169 120 204 -340 265 457 -627 -74 346 -194 -297 10 171 -281 189 421 -171 -83 258
4165 258 -98 -362 311 412 -481 -431 425 324 -459 85 46 -342 -29 225 -249 -303 219 166 5 112 404
4186 404 -390 -279 468 -42 -232 60 165 33 -236 175 -437 -122 199 172 -157 -192 334 -67 -219 419 50
4207 50 -227 -17 291 -123 -116 195 -71 -371 347 82 -28 -295 197 52 -303 435 -170 -274 -190 228 366
4228 366 -41 -37 -114 -259 277 558 -666 -223 -24 -53 -161 -44 264 -521 -255 379 -15 -507 334 -5 -180
4249 -180 371 545 -243 -420 373 205 41 -7 111 -62 -83 331 -11 -285 219 -32 -135 -284 435 -65 -226
4270 -226 106 -49 -92 -100 542 -225 -204 227 114 -340 -77 249 -78 -214 319 -292 -416 407 404 -188 -336 163
4292 163 -364 75 167 64 -232 211 279 -16 -148 181 -88 -39 217 344 54 -315 190 -54 -179 622 71
$$ packed form
4144H1L90p18P8K89Q4n44O05J92j084N53M20n40j03L07J61m52M70K32n92Q8L41
4165B58l56k64O73J01q93N0Q56j01p83N44l9l88L13K54m74n4N22n3j61J07K92
4186D04p94J11P47n10j90K92J05j32k69M11o12L15L21k7l29l5N26m01j52O38l69
4207E0k77K10L08m14PL11k66l00P18k65j10k67M92j45l55P38o05j04Q4M18J38
4228C66m07Mp7j45N36K81j224M43J99k9j08J17L08p85K66O34l94m92Q41l39j75
4249a80N51J74p88j77P93j68j64m8J18j73k1M14l42k74N04k51j03j49P19n00j61
4270b26L32j55m3qO42p67K1M31j13m54K63L26l27j36N33o11j24Q23ln92j48M99
4292A63n27M39R2j03k96M43O8k95j32L29k69M9K56J27k90l69N05k44j25Q01n51
$$ plain form
4313 71 -204 1 64 -67 -33 103 169 -158 -201 406 50 -285 -48 146 -169 67 149 -481 -128 355 -177 -445
4335 -445 200 163 -493 159 201 -175 -13 114 102 -20 34 180 -352 64 65 189 -611 20 68 -340 189 203 -384
4358 -384 -482 306 301 -198 204 372 -552 -187 325 180 -294 -44 266 -19 255 259 -36 -678 -134 275 -131 195
4380 195 152 -269 -324 165 22 -89 24 323 -217 61 334 -57 -330 10 133 -113 -381 162 -224 -134 36
4401 36 219 -455 -56 536 -92 -173 1 -65 -447 -100 340 -232 -321 326 -84 -157 178 145 -403 -166 441 -180
4423 -180 -152 204 227 -85 126 196 -207 -297 284 334 -75 289 62 -310 -199 490 -14 -397 -45 510 -261 164
4445 164 264 -192 -235 416 462 -88 -71 245 -192 108 268 63 -123 -212 79 -246 84 206 24 -466 99
4466 99 -29 -513 93 205 -39 156 212 -79 -459 110 242 -44 21 439 -142 -92 36 138 -98 -309 426
$$ packed form
4313G1k75K05O3j31L4J36O6l27m3O07l56l35K37J94l15K36Q2o30L53M83n32k68
4335d45O45l7o56O52M2l76J62J27j2j22N4J46n32M16JJ24q00O31M8m08N29J4n87
4358c84r8P88nm99M02J68r24L65N12j45m74K50L10k85K74Mk95o42N44M09m06L26
4380A95m3m21n5M89j43j11J13K99n40K78K73l91k73L40J23k46k68N43l86R0J70
4401C6J83o74L99N92o28q1J74o6l82L47M40n72q9O47m10p3L35l3n48K37O07o21
4423a80K8L56K3l12K11P0m03r0N81N0m09L64k27l72J11O89n04l83L52N55p71M25
4445A64J00m56m3O51M6n50J7L16m37L00J60k05j86q9K91l25L30J22j82m90N65
4466I9j28m84O06J12k44J95N6k91l80N69J32k86O5M18n81N0J28J02k36k11P35
$$ plain form
4487 426 170 -514 25 116 -248 -47 -10 186 24 265 237 -303 336 340 -203 -330 467 69 -329 51 290 -395
4509 -395 -141 496 -259 -174 -51 239 -147 275 321 -117 -254 249 92 -248 -48 39 -499 -204 463 -207 -233
4530 -233 -104 76 -389 -86 -42 -115 -505 186 10 -207 -68 218 -127 -57 146 -93 -444 -49 47 -258 -282 145
4552 145 -70 -318 350 -107 78 235 102 -40 -153 -104 -24 -67 -84 313 -91 -406 55 -240 -562 -22 261
4573 261 -301 -58 -35 98 -10 8 41 -85 51 468 -118 149 167 -88 -70 226 267 -395 -159 140 80 -555
4595 -555 71 247 -210 -6 247 19 -245 39 288 -488 99 206 -419 -125 128 233 -205 29 61 -204
4615 -204 -247 247 111 0 -109 200 -210 -38 186 72 -342 70 255 -217 -111 96 380 -261 305 -85
4635 -85 -233 -24 256 -179 -201 -19 12 -278 27 245 -159 118 232 -155 -81 339 34 -70 156 457 -95
$$ packed form
4487D26k56o84N39R1l64K01L7J96j62K41k8n40O39Mn43j27P97l98l98L80K39o85
4509c95K54O37p55Q5J23K90l86M22M6m38j37N03j57l40K00Q7n38K95O67o70k6
4530b33J29J80m65L03M4p3l90O91j76k17J39K86l45P0K03k39l51L95R6l05k4M27
4552A45k15k48O68m57J85J57j33j42j13M9Q0m3j7L97m04l15M61k95l22N40K83
4573B61n62K43K3J33j08J8L3j26J36M17n86K67J8k55J8K96M1o62K36K99o0o35
4595e55O26J76m57K04K53k28k64K84K49p76N87J07o25K94K53J05m38K34L2k65
4615b04m3M94j36j11j09L09m10J72K24j14m14M12J85m72J06K07K84o41N66l90
4635h5j48K09K80m35k2J82L1k90L05K18m04K77J14l87P4M20l05j04K26L01n52
$$ plain form
4656 -95 -10 8 61 -61 248 211 -257 -306 240 68 44 31 -57 -255 -244 438 251 -256 277 -14 -309 98 109 -382
4680 -382 -206 332 281 -89 2 321 -244 5 468 -156 -346 348 167 -264 74 375 129 37 16 159 -168
4701 -168 -26 286 -51 -231 155 21 -49 -103 20 -282 -186 255 -193 -428 91 198 -159 -1 -208 132 -198
4722 -198 230 206 -360 124 151 -99 -79 56 -279 -319 22 104 39 -112 443 96 20 65 237 -279 -308 415 -179
4745 -179 -304 25 -27 -410 -21 52 -185 -139 66 4 -224 113 74 -238 295 177 -182 -49 -150 56 -170 292
4767 292 71 -92 -87 459 166 -91 57 -66 -129 44 99 -89 -67 -76 119 -198 115 546 -164 -209 335 -88 197
4790 197 43 52 -84 -79 351 -86 -218 13 132 87 -53 464 -26 50 65 55 -48 134 66 -89 87 169 50
4813 50 -276 40 -86 44 -138 347 29 -562 98 235 -255 -238 396 -45 -310 108 277 -69 -123 194 -47
$$ packed form
4656i5Q5J8N3j22L09l7m68m9N46j72k4j3q8j98J1O82j87n07N33k91k95M07J1m91
4680c82J76N38n1l70R1L19n65K49M63o24j90O94j81m31L38L01k46r2k1J43l27
4701a68J42L12l37j80L86j34p0n4J23l02R6M41m48k35N19J07l57J58k07L40l30
4722a98M28k4n66M84K7k50K0J35l35m0L41Q2o5j51N55l47p6M5J72n16k9P23n94
4745a79j25L29n2l83L89P3k37M6K05o2k28L37l9l12N33j18l59J33j01K06k26M62
4767B92k21j63NN46k93k57J48j23o3J73N5j88K2rJ95l17L13M31p10m5N44m23K85
4790A97j54Rj36NM30m37j32K31J19m5j40N17m90P6J5j0j03J82o8j55J76Q2j19
4813E0l26L16j26J30j82M85l18n91O60J37m90J7O34m41k65M18J69l46n4L17k41
$$ plain form
4834 -47 -263 286 129 -250 -89 -14 -213 -42 222 145 -38 -68 7 -269 118 384 -37 -490 100 152 -38 -29 508
4857 508 17 -393 314 61 -61 -104 -163 -7 40 130 -24 -227 78 7 -283 -73 195 -218 -155 134 355 -320
4879 -320 -26 127 119 -245 463 100 -121 191 -32 26 -179 116 186 69 211 -231 -395 -125 -125 -41 -87 -56 -184
4902 -184 -79 73 121 -19 -86 83 -79 -49 142 377 -135 -173 240 -297 -340 280 222 -82 125 281 -51 -165
4924 -165 26 45 -66 20 -75 -119 -284 238 -55 -175 215 3 -28 74 334 51 -68 204 189 18 277 101
4946 101 184 -50 190 15 -72 136 112 -109 -63 230 220 -556 -53 -126 20 151 219 -125 -144 156 101 -214 -197
4969 -197 416 40 -206 191 54 -211 -5 168 -133 -162 -1 -30 -84 -72 249 -166 29 162 -81 -2 318 30
4991 30 -21 78 193 213 -402 204 -22 -323 328 275 -226 -258 522 -48 -370 -38 110 -469 206 105 77 -42
$$ packed form
4834d7k16N49j57l79J61P5j99J71K64p7j83l0P5k76L87K66m21m53N90N2j90RN37
4857E08m91m10P07k53j22m3n9J56M7R0j54k03L05p1k90K10K68m13O3K89K21o75
4879c20K94J53ql64P08l63k21L12k23N8k05K95P0j17J42m42j64K70%Q4m6L1j28
4902a84J05J52M8j40o7J69j62L0J91K35n12l8M13n37m3O20n8l04K07J56l32j14
4924a65J91J9j11Q6r5m4j65N22k93j20L90k12l1J02K60k83j19K72j5j71K59j76
4946A01Q3k34K40j75q7K08k4k21M6K93j0p76N03p3J46J31O8l44j9L00n5l15J7
4969a97O13l76k46L97j37k65K06J73l01k9J61k9n4J2L21m15J95J33k43P9L20k88
4991C0n1R9J15K0o15O06k26l01O51n3n01l2P80n70l22L32J48n79O75j01k8j19
$$ plain form
5013 -42 154 122 -224 232 96 37 -140 116 186 132 -47 297 -298 101 6 -216 -42 45 66 125 2 303 -62
5036 -62 -482 136 435 -13 -35 191 -296 -246 59 -451 -123 99 110 -146 -63 89 -91 -313 201 499 14 -55
5058 -55 33 109 -189 222 196 -158 3 249 -281 -200 169 -22 47 132 94 -134 -352 -66 -76 -42 324 274 -151 58
5082 58 128 -124 -15 245 83 -71 251 281 83 -136 8 -78 -188 297 228 -264 167 101 42 -231 59 48 -372
5105 -372 -99 191 -251 -374 77 188 -272 -131 -179 -64 -21 121 63 -101 127 35 146 -23 -65 -375 -39 -55
5127 -55 -17 -287 -147 -157 -129 159 -9 -42 -275 294 -79 -121 337 340 -206 -197 307 260 -67 -6 176 8 -58 179
5151 179 40 -214 -13 324 12 97 97 -98 -104 76 76 143 -207 336 -134 -14 391 17 -195 -364 96 -239 -108
5174 -108 172 -157 -371 -73 234 -4 136 394 -177 -98 -74 162 -221 -5 272 -247 22 13 -113 176 179 207
$$ packed form
5013d2J96l2l46M56j36n9j77K56P0n4j79L44n95L99r5k22J74Q7K1N9j23L01l65
5036f2m20O18K99m48k2K26m87N0L05n10L28K22J1k56Q3J52j80k22N14K98m85o9
5058e5Q8P6k98M11k6l54J61K46n30Q1L69j91O9Q5l8k28k18K86j0L4L66n0m25K09
5082E8P0k52J09K60j62j54L22L0j98k19J44q6j10M85o9m92M31o6n9k73K90j1m20
5105c72K73K90m42j23M51J11m60J41m8J15M3J42n8j64K28r2J11j69m2l10L36j6
5127e5L8k70J40j0K8K88j68l3k33N69l73m2M58Ln46RN04m7l27O1J82j68o6K37
5151A79j39k54K01L37l12Q5%j95oJ80%O7l50N43m70J20M05l74k12j69M60l35J31
5174a08K80l29k14K98L07k38J40K58n71P9K4K36l83K16K77n19K69rj26K89LK8
$$ plain form
5196 207 -475 -94 232 92 -127 -150 108 -35 -83 28 -16 -153 20 188 -112 -17 196 -242 -219 132 -101 -170
5218 -170 -151 416 -2 -223 -23 -31 -232 -3 558 81 87 91 -287 -89 228 352 -55 31 30 99 -282 174 -49 -425
5242 -425 -202 187 187 -225 -115 271 -273 460 322 -216 -393 -25 97 177 411 180 -201 -86 107 -326 25
5263 25 208 65 16 -192 -174 -19 11 -49 28 0 108 95 -186 92 147 68 -221 -228 -62 122 51 131 -91 225 92
5288 92 -152 -220 -133 156 -250 232 135 -79 -278 -54 17 56 9 210 -42 176 109 39 -166 -120 301 58 -240
5311 -240 247 89 -361 21 400 23 85 -4 46 -122 133 79 202 104 208 -2 -23 -5 -247 -211 116 -57 -87
5334 -87 -7 110 89 7 195 0 -192 59 3 -372 43 261 495 31 288 218 -225 -67 133 60 -373 13
5356 13 114 -181 -135 -205 -250 177 116 -125 -331 99 67 -241 27 -81 -36 -21 31 -200 -338 -376 -98 54 -50
$$ packed form
5196B07o82L81L26j40k19k3K58j43m8J11m4j37J73J68l00R5K13m38K3L51k33o9
5218a70J9N67m18k21K00qk01K29N61m77OMl78J98L17J24m07Q6jO9l81M56k23l76
5242d25K23L89%m12J10L86n44P33j38n38j77L68J22Q0K34k31l81J15J93m33L51
5263B5J83j43m9k08J8J55L0o0P7k8J08j3k81K78N5p9k89pJ66J84p1Q0k22L16j33
5288I2k44o8Q7K89m06M82r7k14j99K24P1L9m7K01k52K18o7p0k05M6M21k43k98
5311b40M87j58m50L82L79l77O2q9N0j68K55n4J23r8J04k10k1J8k42L6L27j73l0
5334h7Q0J17k1q2J88j95j92K51n6l75M15K18K34m64K57p0m43J58K00p3m33L86
5356A3J01k95M6p0m5M27o1k41k06M30l2l08K68j08M5J5N2k31j38l8K78J52j04
$$ plain form
5379 -50 -156 87 -192 -142 347 -76 -101 65 143 -314 81 357 -210 -202 -229 12 -154 114 167 -137 -326 148 -35
5402 -35 -445 -17 -224 -174 -25 0 -306 -311 134 -73 -62 -198 103 -171 -16 288 190 -246 -108 359 7 -14 391
5425 391 136 -21 230 197 -13 11 107 -74 -41 351 120 -251 -198 358 170 -179 -59 -221 -84 171 249 -285
5447 -285 -423 178 -70 -166 11 310 -200 67 106 -103 -142 67 -21 98 -80 150 -121 -101 220 103 117 -226
5469 -226 257 -410 183 222 46 -325 243 1 -116 -10 57 -171 -21 74 336 -117 -8 -34 -163 24 -19 -271
5491 -271 109 282 255 50 -105 -41 -341 -140 264 94 -319 -75 -21 35 115 99 218 -130 -55 109 -5 -59 -46
5514 -46 93 -273 122 -9 -485 -116 116 -27 -366 97 -163 7 -120 299 -192 -39 -106 160 -61 87 193
5535 193 -140 -170 29 167 -8 374 6 -121 -53 269 -76 109 62 189 -118 119 5 -395 -186 -41 71
$$ packed form
5379e0j06K43k79N0M89m23k5J66P8m57L95K76n67Qk7K41j66K68N3l04j89M74j83
5402c5m10M28k07N0J49K5l06nM45k07J1j36L01k74J55L04r8m36J38M67l52k1M05
5425C91k55j57K51l3k10K4R6j81L3L92k31l71N3N56j88l49J20j62J37K55P8n34
5447b85j38O01k48r6J77K99n10K67L9k09l9K09q8J19j78K30k71K0L21j17J4l43
5469b26M83o67N93L9j76l71N68k42j17J06O7k28J50R5K62m53J09k6j29J87m3k52
5491b71L80J73k7k05j55O4l00K01M04j70m13K44N4N6Q0j6J19l48P5J64j14n4J3
5514d6J39l66L95j31m76L69K32j43l39M63k60J70j27M19m91J53o7K66k21J48J06
5535A93l33l0J99J38j75L82l68j27O8L22l45J85m7J27l07K37j14m00K09J45J12
$$ plain form
5556 71 -202 -28 41 -235 -94 156 -227 -79 16 104 22 -152 -31 -55 -7 235 -67 -40 -120 -23 -32 -155 -44 51
5580 51 18 17 81 -166 -1 133 -413 -118 16 -147 -520 -15 122 81 200 28 -56 -160 -4 -85 -9 -180 144
5603 144 -26 49 -45 220 -56 -56 181 -270 203 -137 -221 -223 223 92 -79 15 114 -121 -142 -192 -99 -170 -145 361 -108
5628 -108 -80 37 186 -115 163 35 -1 36 161 79 -237 46 44 -16 283 477 -221 -193 -80 132 -58 -157 273
5651 273 -310 -4 -77 13 -184 18 180 -59 114 150 140 -174 -76 -169 -112 99 -242 163 -326 -150 39 92 -58
5674 -58 -96 -86 -31 348 30 -268 124 160 -218 -141 248 -189 16 319 213 17 -77 197 55 -24 68 299 -156
5697 -156 -307 -72 -110 249 88 125 -317 -230 388 57 25 140 -32 -97 260 -150 96 -195 117 -36 27 194
5719 194 22 -131 -7 182 0 -128 -146 173 -313 166 118 -203 10 108 53 -56 -95 20 -283 -5 84 -30
$$ packed form
5556G1k73J74O9k76J41K50l83J48R5Q8q2j74J21k4M8K42l02K7q0R7rj23J11R5
5580E1l3jO4k47J65J34n46K95J34j63l73N05J37m1J19j72q4j04J56q1P6j71L24
5603A44j70P5r4K65k76%K37m51M73l40q4kM46j31j71R4R9k35k1n0R3p1K5N06m69
5628a08K8J17J49l01K78j28l6L7J25q2l16K83ko0K99J94o98K8J13K12j90r9M30
5651B73n83L06p3R0j97K02J62k39J73L6j0l14R8r3N7K11l41M05m89J76J89N3j50
5674e8l8J0N5L79l18k98L92L6l78P7L89m37K05L03j06j96r4K74j42p9R2K31m55
5697a56j51K35l8L59j61L7m42Q7O18l31l2J15j72o5L57m10K46k91L12j53O3J67
5719A94j72j53J24J89j82j28j8L19m86M79m8l21K13R8n5j09l9J15l03K78Q9j14
$$ plain form
5741 -30 -171 226 -131 -17 243 185 -112 97 121 -277 -221 71 -229 -14 -133 90 -85 -146 168 -44 -130 44
5763 44 41 -52 16 118 75 -209 80 223 -187 -48 114 36 -87 20 118 -187 -18 8 -75 87 270 109 -196
5786 -196 88 139 27 -281 -21 136 -385 24 220 -156 -4 -71 286 58 -86 150 -138 -6 207 44 289
5807 289 202 -45 -272 99 9 -150 59 -96 142 -308 144 323 -33 -247 364 43 -362 -112 66 -219 -24
5828 -24 189 -45 -39 145 461 -279 -167 267 -171 151 146 351 -289 53 95 -6 143 -18 -106 -5 -74 250 -16
5851 -16 -132 0 -38 106 99 47 7 288 29 -144 -97 241 221 -293 121 4 -58 139 154 140 32 112 -132 -145
5875 -145 51 318 -5 -12 -46 -8 -113 84 51 128 -190 217 -65 -91 57 154 -174 162 91 -14 -175 93 -123
5898 -123 -144 -57 74 -31 -396 182 51 -103 22 169 43 -272 297 201 -142 45 23 179 94 165 -2 -8 -40
$$ packed form
5741c0j41L97l57J14K60n8k97K09K4l98N6K92l00K15j19K23j75o1L14k12q6J74
5763D4lr3O8J02m3k84K89J43m10J39J62p8j23J07R8l05J69K6q3J62J83j61l05
5786a96K84N1j12l08K60J57n21M09J96l76J52o7L57k28j44K36k88J32K13j63K45
5807B89q7k47k27L71r0j59K09j55K38m50M52J79l56k14O11l21m05K50J78k85J95
5828b4K13k34OJ84L16p40J12M34m38L22nK05o40L42M2j01J49j61q8J01o9L24k66
5851a6j16J32l8J44pn2m0K81k59j73M7L38k0n14M14j17o2J97J5j4j08Q0k44j3
5875a45J96K67l23pl4L8j05J97l3P7l18M07k82k6J48R7l28L36p1j05j61K68k16
5898a23k1Q7J31j05l65N78j31j54J25J47j26l15N69r6l43J87k2J56q5P1j67ol2
$$ plain form
5921 -40 21 -165 -159 100 103 -136 317 168 -12 141 278 -24 -199 153 -40 -162 -108 -63 -81 -180 34 152 -208
5944 -208 236 -59 28 -41 112 227 160 49 333 -98 103 -41 -199 -101 36 -385 120 389 69 -99 -198 202
5966 202 47 -105 432 277 -69 -159 227 -158 -142 -372 190 178 57 263 71 -280 -153 -34 -354 106 -79
5987 -79 96 -5 108 410 -71 133 173 196 273 -13 -264 -615 437 250 -286 -174 52 336 -87 112 -205
6008 -205 63 59 191 -48 -253 -127 149 6 51 211 -368 -104 -162 -332 8 169 -57 71 177 -99 -9 -245
6030 -245 -17 -158 19 293 88 -131 -43 8 -138 -13 -79 24 2 108 53 -329 -125 189 -38 -167 150 90
6052 90 -56 10 22 165 -96 -77 -116 -286 -19 11 -212 -168 113 45 -69 -90 -59 96 -296 192 -21 -75 161 128
6076 128 -124 -64 184 -144 -76 317 -6 7 -51 66 26 -356 216 -80 -4 -20 -65 37 235 136 -355 -169 -70
$$ packed form
5921d0O1j86OK59Lk39M53j49j80J53J37l02j75L52j93j22N4M5j8r9K14J18l60
5944b08M44k95Q7o9J53J15o7j11K84m31K01j44j58R8J37m21N05K69l20j68r9M00
5966B02j55j52N37j55l46r0L86l85J6k30N62j2j21K06j92l51J27J19l20M60j85
5987g9J75j01J13L02m81K04M0K3P7k86k51l51J052j87n36J12K26K84m23J99l17
6008b05K68mJ32k39k05J26K76j43M5J60n79K64n8j70L40J61k26J28J06k76R0k36
6030b45K28j41J77K74k05k19Q8N1j46J25o6J03k2J06n5l82K04L14k27j29L17o0
6052I0j46O6J2J43k61J9l9j70K67L0k23M4K81o8j14k1L1J55l92M88k13n4K36l3
6076A28k52O0K48l28O8L93l23J3n8J17m0l82N72k96P6j6m5J02J98r9m91J86R9
$$ plain form
6099 -70 47 98 -22 121 -8 78 8 181 4 22 -83 -84 84 49 -70 -174 -129 -32 -86 -38 -109 -155 -96 226 450
6124 450 -161 -11 71 -177 -278 126 135 -223 59 419 -111 -67 177 -178 178 114 -118 -141 -30 158 44 51 162
6147 162 45 -215 124 291 37 -58 56 193 -189 153 229 -282 50 31 -92 48 -3 154 247 132 173 -97
6169 -97 -119 117 2 -30 18 130 213 74 28 31 -24 106 246 -211 33 373 -295 92 265 34 -39 25 -290 -76
6193 -76 -201 149 122 -232 71 -48 -250 -83 574 -176 48 108 -151 -97 344 54 -217 -52 172 101 -48 73
6215 73 135 -61 -34 35 36 -141 -8 126 -115 -24 100 139 -144 271 34 -216 -70 292 -27 -52 -288 -57 -299
6238 -299 -82 44 -298 -278 -130 187 -121 490 -150 -174 -100 150 68 -372 -41 288 111 -20 216 -61 145
6259 145 134 82 -19 223 96 -87 -140 13 207 -154 75 -44 -275 31 181 -27 45 8 -54 154 312 116
$$ packed form
6099g0J17N1j20J43j29Q6p0J73j77J8j05jJ68l5j19j04M5R7n4M8p1m6N9L22K24
6124D50o11J50Q2k48j01M04Rl58K82L60n30M4K44l55L56o4k32k3J11J88j14PJ11
6147A62j17k60L39J67k54r5J14J37l82L42P6n11L32j9j23J40n1J57R3j15M1k70
6169i7k2K36j15l2M8J12Q3j39m6Ln5J30J40m57K44L40o68L87J73k31p3O4l15K14
6193g6j25L50k7l54L03j19k02J67O57p50K24O0k59N4M41k90k71J65K24p1j49J21
6215G3O2j96K7O9Jj77J33J34k41R1J24L9k83M15k37k50J46L62l19k5k36K31k42
6238b99K17J26l42K0J48L17l08O11o40k4P4K50q2m40L31L29j77j31K36k77K06
6259A45j1n2j01K42j27j83n3J53J94l61K29j19k31L06J50k08P2l7o2K08J58j96
$$ plain form
6281 116 -301 258 368 -39 -266 -235 -33 -16 103 -49 127 22 116 -77 -344 -340 42 -103 -68 -12 -103 -20 12
6304 12 188 -36 554 -142 48 52 -103 123 -165 -300 195 -147 192 212 -108 -100 -121 382 -223 -43 200 152 92
6327 92 -171 296 131 -178 -82 94 -158 57 26 -279 46 -44 79 -69 57 132 -120 258 34 -264 -181 79
6349 79 -202 -144 35 -148 -122 77 29 51 -48 -33 0 -124 78 36 -16 -466 4 -92 -280 126 65 120 83 -25 -105
6374 -105 -57 -99 95 121 -42 176 -441 -47 159 77 90 11 107 -103 -144 190 35 -116 -5 347 -17 4 478
6397 478 -90 1 106 189 8 -85 10 -28 -135 -205 110 -365 -65 272 21 9 17 52 -79 77 -70 -158 -265 78
6421 78 79 -439 -250 100 -319 129 102 29 26 49 -1 -267 88 97 -106 -183 195 174 -196 -145 -248 -45 -113 -40 -74 -281
6447 -281 -27 -36 -415 115 131 35 -230 277 120 -242 7 -66 86 8 -101 -39 -182 -179 246 -55 -265 49 -294
$$ packed form
6281A16m17N59J10m07k27L1K02J7J19j52J76j05R4j93k67ML82j45L5N6r1Q3L2
6304A2J76k24N90o96J90Mj55K26k88j35M95l42L39K0l20Qk1N03o05J80K43m8o0
6327I2k63M67j65l09R6J76k52K15l1l05L25r0J23j48J26P5k52L78k24k98Q3K60
6349G9k81N8J79j83K6J99m8K2r9J5L3j24K02m2n2m50M70r6j88M06o1N5l7j08q0
6374a05M8m2J94K6j63K18o17L94K06q2J3p9R6k10m1L34j55j51J11L52l64K1M74
6397D78n68R1J05Q3j81r3R5l8j07p0L15m75L00L37k51j2QL5j31J56j47q8j07L43
6421G8Jn18J89L50m19M48k7p3lK3n0k66L55Rk03p7L78k1l70N1j03K03o8P3l4k07
6447b81K54rl79N30J6r6k65N07j57l62K49p3J52p8j09O2j43LM25l01k10L14l43
$$ plain form
6470 -294 -86 63 84 -262 236 60 103 -73 97 95 -347 55 63 -83 212 27 193 -59 27 50 -133 11 47
6493 47 315 -416 15 291 -173 -74 56 26 71 68 -184 -336 -75 -51 -93 363 47 112 -220 176 -118 -420 -77
6516 -77 -60 -119 -291 262 214 -209 70 -231 -265 0 347 -99 126 113 -67 -97 -111 42 -9 -228 -22 -77 -173 4
6540 4 -118 -116 6 -191 246 -159 86 44 -20 -116 69 19 -186 145 -279 -50 -182 97 -20 -139 100 79 -276
6563 -276 -146 67 31 -41 438 -11 67 -7 -70 102 -110 17 47 78 53 -41 -335 -273 183 34 -16 212 -14 -84
6587 -84 151 179 93 -40 -18 0 -12 -60 -37 -189 -89 -44 -111 -132 101 -24 -453 162 131 -82 -211 -20 91 -115
6611 -115 70 336 50 -242 402 12 -15 -26 15 -190 -6 -224 57 -197 36 -28 258 -170 122 -130 -81 238
6633 238 -192 194 -34 184 30 -110 84 117 42 37 -229 -214 -23 87 -287 -299 198 -225 12 110 -109 -76 -196
$$ packed form
6470b94K08J49K1l46M98j76M3j76J70km42M02Qj46K95j85J66k52Q6K3j83J44L6
6493D7K68p31M31K76m64R9J30l0M5lk52j52K61K4m2M56l16O5l32L96k94l02L43
6516g7J7n9j72N53m8m23K79l01l4K65L47m46K25j3j80l0j4J53n1k19K06n5r6J77
6540Dj22KJ22j97M37m05K45m2o4r6J85n0k05L31m24K29j32K79j17j19K39k1l55
6563b76J30K13l6p2M79m49P8p4o3J72k12J27L0L1k5r4k94O2M56j49n0K28k26p0
6587h4K35K8q6j33K2J8j2m8K3j52J00M5o7k1K33j25m29O15l1k13j29J91J11k06
6611a15J85K66k86k92O44l90k7j1M1k05J84k18K81k54K33o4K86m28K92k52M9L19
6633B38m30L86k28K18j54j40J94L3p5nk66J5J91J10l74j2M97m23K37R8k19L3j20
$$ plain form
6656 -196 -28 177 -417 188 78 125 279 -57 24 -137 84 39 -25 186 -182 1 -168 45 268 144 139 -178
6678 -178 -292 -49 124 238 22 34 117 -198 69 13 -318 -394 -90 6 -194 21 128 -75 75 27 128 152
6700 152 190 184 -90 -34 50 -77 75 95 74 -185 281 80 151 -55 -28 210 -218 -180 21 -129 -5 -28 -14 -165
6724 -165 129 247 262 269 214 41 -313 -283 -69 -285 -65 84 -245 -152 130 -2 129 75 -154 100 109 -200 32
6747 32 -94 181 -15 -106 24 18 -215 -127 154 130 161 63 194 -92 -166 -112 -72 -48 -65 159 -298 406 55 220
6771 220 -86 -11 37 -138 -9 162 -46 -205 258 -19 -51 6 357 109 75 129 299 296 213 32 64 29 11 -165
6795 -165 203 6 83 -93 17 142 103 17 87 -74 78 3 -266 -129 226 -13 153 -218 -34 92 50 88
6817 88 135 36 -316 110 178 1 94 -25 -277 -100 70 95 -335 150 259 -49 192 130 -151 -185 -144 180 -171
$$ packed form
6656a96J68K05n94O05j10M7J54l36Q1j61K21m5o4K11l68J83j69K13K23j24nl17
6678a78j14K43J73J14k16J2Q3l15K67n6l31p6L04R6k00K15J07k03J50m8J01K4
6700A52L8ok74N6Q4j27J52K0k1k59M66k01P1k06K7K38m28L8K01j50J24k3J4j51
6724a65K94J18J5Pn5j73l54L0K14k16K20J49l29R3K82j32J31n4k29K54Rl09K32
6747C2j26K75j96r1J30ok33Q8K81k4L1r8J31k86p4N4M0K4j7K24m57P04l51J65
6771B20l06P5M8j75J29J71k08j59M63k77l2N7L51k48l4N4J70lq3j81L2l5j8j76
6795a65L68j97P7j76J10J25l9q6P0j61J52p5k69J37L55k39J66l71J84J26m2L8
6817H8M7r9l52M26O8j77R3j19k52J77J70K5m30M85J09l08K41o2k81l4M1L24l51
$$ plain form
6840 -171 8 102 -102 -15 141 271 -179 -23 -61 -55 276 -65 -76 128 118 9 -190 -141 226 -98 -14 -88 64
6863 64 -9 -254 73 -3 25 410 -299 -159 111 81 -119 -179 87 -31 -287 -51 1 42 81 275 -195 -45 126
6886 126 62 -124 116 58 169 -268 114 -104 72 41 297 24 -239 141 237 37 -9 317 -34 -2 118 37
6908 37 -95 108 -7 78 70 -101 -149 237 238 -58 6 -17 -10 -220 -120 46 -211 -21 56 96 -61 -169 22 -260
6932 -260 -124 86 35 -55 -234 48 65 -100 -60 -17 -193 66 -109 -8 -234 240 203 82 379 73 -34 -42 -3
6955 -3 28 19 144 -50 -68 -218 152 -64 -95 -25 133 176 -237 383 109 113 100 73 -126 -325 49 -146 -18 172
6979 172 -113 -101 2 -116 359 12 215 -46 -160 -51 -6 -204 94 -121 152 173 -28 -9 -130 147 -148
7000 -148 -63 -118 21 286 30 -142 -71 -25 4 49 -135 -107 297 42 84 223 -14 2 -144 67 -21 -91 182 95
$$ packed form
6840a71J79R4k04Q7J56J30m50J56l8OL31l41j1K04j0j09j99M9L67l24Q4p4J52
6863F4p3k45L27p6K8L85p09J40K70l0k00o0K66j18k56K36N2M1L9J94m70J50J71
6886A26o4j86K40n8J11m37L82k18J76l1K56k73k63L80R6k00m6L26l51L2J20q1
6908C7j32K03j15Q5qj71m8L86Jk96O4k3Pk10J00J66k57J90P7M0j57j08J91k82
6932b60J36K10n1r0j79K82J7j65M0M3j76K59j75J01k26M74l7j21K97l06j07qL9
6955cL1rJ25j94j8j50L70k16l1P0J58M3m13O20k74Mj3k7j99j99L74j95J28J90
6979A72k85J2J03j18M75l47K03k61j14J09M5j98K98k15K73K1k01J9j21K77k95
7000a48Q5n5J39K65k56j72P1M6K9M5j84K8M04k55M2J39k37J6j46K11q8p0K73q7
$$ plain form
7024 95 -264 -51 196 -180 59 -162 4 -180 114 250 -140 -140 13 195 -103 286 20 -66 -183 -46 -68 -114
7046 -114 -239 138 -246 45 189 -298 -126 99 -7 175 211 34 199 205 -26 240 117 124 185 -36 -407 -169
7068 -169 6 0 129 219 -109 -30 60 15 117 -88 9 -28 127 -170 -68 -5 241 -5 -110 26 181 57 -81
7091 -81 150 -156 225 94 75 -102 -31 154 86 -146 -153 74 280 -150 -14 154 74 -177 125 -47 352 -149
7113 -149 101 51 341 132 -170 121 -282 44 -132 88 -136 5 158 -120 51 42 125 8 -17 320 -207 239
7135 239 318 -7 -247 12 -269 -88 -142 220 -43 113 5 -7 76 151 -77 158 -25 43 135 69 -58 -130 -216
7158 -216 -218 93 -114 -116 -74 -83 -97 128 248 83 -152 -23 -98 347 -9 158 -140 -122 -42 289 -106 174 -137 -17
7182 -17 -37 34 228 -185 -282 -145 20 10 -10 -289 -63 6 -93 6 -74 131 200 22 -174 -110 -20 -138 153 -84
$$ packed form
7024I5l59K13K47l76K39k21J66j84K94J36l90%J53J82k98L89k66q6j17J37k2m6
7046a14j25L77l84K91J44m87J72K25j06J82L6j77J65Ok31K66j23PO1k21l71K38
7068a69J75oJ29R0l28P9R0m5J02k05R7l7J55k97J02O3K46k46j05J36J55j24j38
7091h1K31l06L81j31j9j77P1J85o8k32pK27K06m30J36J68q0k51L02j72L99n01
7113a49K50n0K90k09l02K91m03L26j76K20k24J41J53k78J71rQ3j17k5L37n27M46
7135B39P9l25k40K59k81J81n4L62k63J56j08j2Q3P5k28K35j83O8R2o6j27p2q6
7158b16kL11k07kM2rj4K25J20j65k35J29p5M45l56J67k98J8Q0L31l95K80l11J20
7182a7k0P1J94m13r7J37J65j0k0k79K26O9r9R9q0K05O9j78j96O4R0j18K91k37
$$ plain form
7206 -84 161 -93 40 5 189 -78 -99 -11 -68 236 46 -96 -1 -26 65 201 -19 -217 196 -137 79 -84 41
7229 41 -113 181 -46 194 11 -99 182 -172 106 9 15 112 292 52 -145 70 143 110 23 -96 -23 -71 -204
7252 -204 -124 67 -85 78 -296 203 64 -224 -55 85 -12 -197 -177 -184 83 95 -44 -46 -100 -156 -12 89 32 -99
7276 -99 62 -246 21 284 209 -25 -59 89 -177 -76 71 254 -160 58 -168 -229 -170 0 125 -75 35 -51
7298 -51 -157 -6 93 -87 -39 105 -41 -201 43 -146 -130 -88 255 64 -16 -256 97 177 77 164 59 -84 160
7321 160 49 21 249 72 60 284 -66 197 59 146 -84 -39 120 154 -53 -223 -130 -296 145 -48 113 -168
7343 -168 11 88 -222 -202 154 -98 -105 -145 -186 -180 -116 10 231 -5 68 104 -183 276 162 -13 -183 149 216 -153
7367 -153 60 -5 -300 39 120 26 -185 -70 -63 49 -27 -96 -144 -151 -45 -107 117 36 26 19 -276 -53 335 -182 -49
$$ packed form
7206h4K45k54J33l5J84k67k1Q8n7L04j90j42R5k5R1J36k20j98M13l33K16j63J25
7229D1j54K94k27K40j83j10K81l54K78r7OR7J80k40j97K15P3l3q7j19P3m8j33
7252b04Q0J91j52J63l74M99j39k88J69J40r7j85K0pK67J2j39kn4n6J44J01n7j31
7276i9J61l08K67K63p5k34l4J48k66J01J47J83m14K18k26o1N9J70J25k00J10q6
7298e1j06J51R9j80M8J44j46j60K44j89J6M2L43j91q0k40L53Q0j00Q7j05j43K44
7321A60j11k8K28j77j2K24l50K63j38Q7k30M5J59L4k07j70R3j66M41j93J61k81
7343a68J79P7l10K0L56k52pm0m1OO4J26K21k36P3L6k87M59j14j75j70L32O7l69
7367a53K13o5k95L39Q1r4k11J15PJ12p6o9m8pJ06o2K24q1j0pk95K23L88n17J33
$$ plain form
7392 -49 71 -37 -74 33 -14 18 -136 151 77 -65 94 -12 -17 77 2 -173 -72 159 -172 -122 13 -252 -134
7415 -134 -109 -69 -113 -122 118 335 65 -129 -192 -268 -128 30 -48 -182 -18 209 159 117 -17 109 7 70 91 75
7439 75 -81 123 153 -130 58 -197 65 10 0 -222 127 175 -180 -122 -90 256 -116 -153 -85 -39 -38 141 130 -314
7463 -314 -6 325 -71 148 -13 207 67 -96 -2 -58 -194 -43 -102 8 209 -70 170 -32 90 42 158
7484 158 174 46 -439 100 219 -60 24 80 175 179 71 164 -176 35 -62 17 262 93 55 55 178 -110 -100 117
7508 117 284 -9 78 295 244 133 86 -132 -19 -134 -50 19 -182 30 -2 154 37 -213 -29 -9 -70 -227 111
7531 111 -133 -47 -17 -88 116 -155 -339 147 124 -226 -346 29 -59 32 135 -270 -182 41 -69 78 166 168 -83
7554 -83 -6 141 159 5 72 -89 106 -140 -349 57 130 103 56 -165 107 -341 -142 -13 36 -45 -139 166 95 31
$$ packed form
7392d9J20j08l7J07m7L2j54K87p4j42J59j06nR4p5j75J01K31l31N0J35k65J18
7415a34K5M0m4rK40K17k70j94o3p6J40J58p8j34J64K27n0m2j34J26j02O3K1j6
7439G5j56K04L0k83J88k55K62n5j0k22L49M8l55N8L2L46l72l7O8M6JJ79j1m44
7463c14L08L31l96K19j61K20j40j63R4n6j36J51n9J10K01k79K40k02J22m8J16
7484A58J6j28m85N39J19k79Q4N6R5Mj08R3l40K11r7P9K45j69l8%J23k88J0K17
7508A17J67k93Q7K17n1j11m7k18J13j15Q4O9k01K12l2J56j17k50J84K0o1j57L38
7531A11k44Q6L0p1K04k71j84M86k3l50j20L75q8R1J03m05Q8K23j10J47Q8Kk51
7554h3P7J47J8j54O7j61J95k46k09M06P3k7m7k21K72m48J99J29M9q1r4L05p1o4
$$ plain form
7578 31 -156 173 11 52 178 50 153 52 248 -319 43 -69 -25 16 -346 132 -129 11 144 -115 -38 134
7600 134 146 67 -112 317 37 -238 -57 46 73 126 -48 -113 18 -69 50 -88 -301 -149 -33 56 14 -33 213
7623 213 -174 12 193 128 -2 254 -89 -115 -85 149 -225 107 195 -92 -113 162 -94 -228 107 -171 1 -177
7645 -177 -26 66 -25 60 115 -22 -139 -129 -19 151 -226 255 208 226 145 98 -290 86 76 86 124 -94 26 -262
7669 -262 -119 -63 -4 -68 -13 111 -80 197 -93 170 -167 -96 -88 104 -112 -163 -70 -91 -40 -66 116 -95 -68 284
7693 284 191 105 175 9 66 84 -296 -130 24 170 17 -32 -58 154 -77 -181 -186 233 31 211 -68 7 -89 91
7717 91 -14 -28 21 83 -91 -65 115 -195 -180 257 156 163 -110 -148 -19 -26 2 268 -88 95 234 -30 16 197
7741 197 86 129 42 -11 63 29 153 -149 -191 -126 -64 -146 86 29 282 -23 130 31 151 -63 -71 -216 -166 -199 -18
$$ packed form
7578C1j87L29j62M1J26j28J03j01J96n67L62j12M4M1l62M78k61J40J33k59P7J72
7600A34J2p9j79M29k80k75J81J03K7N3j74o5J31q7J19j38k13J52J16Q9m2m7K46
7623B13l87J86J81o5j30K56l43k6L0K34l74L32Q8k87k1K75k56j34L35k78J72j78
7645a77J51R2r1Q5N5j37j17J0J10J70l77M81m7J8q1m7l88L76j0J0L8k18J20k88
7669b62J43N6N9o4N5J24j91K77k90K63l37P1QJ92k16n1R3k1N1k6J82k11K7L52
7693B84r3q6P0j66N7J8l80J66J54J46j53m9k6K12k31j04nM19k02J80k79P5r6J80
7717I1j05j4M9O2j74K6J80l10J5M37j01Pk73l8J29pK8K66l56J83J39k64M6J81
7741A97j11M3q7n3P4l4J24l02m2O5O2q2K32n7K53l05J53r9J20k14qj45N0l3J81
$$ plain form
7766 -18 72 212 72 6 9 15 197 -6 -220 -195 -36 -62 -5 -249 -125 172 132 -10 10 156 22 -151 158 -118
7790 -118 -326 72 -46 -86 19 213 -192 179 52 -60 -104 -206 -113 -42 -42 118 25 168 -15 -240 59 -224
7812 -224 -42 109 -126 -111 382 -21 -275 -198 114 -72 -106 60 369 -53 55 -100 -136 69 113 -66 -179 -41
7834 -41 8 195 323 249 231 -258 183 64 26 -188 196 85 54 87 167 -183 229 -58 20 -26 136 139 5 27
7858 27 -16 115 207 -155 -197 157 115 -266 19 88 78 100 -181 -34 -97 -122 -227 277 -311 -202 368 71 -245
7881 -245 306 -21 -236 171 -42 30 -25 18 7 -90 46 126 98 35 169 -36 54 143 28 113 -30 44 -113 51
7905 51 287 95 -243 145 14 -104 74 166 144 225 -203 -89 -232 1 -200 -81 -239 -536 10 313 -235
7926 -235 -88 110 -92 -206 214 -171 -159 -28 -292 8 24 31 21 190 -33 61 80 151 -37 55 -17 50 55 74 125
$$ packed form
7766a8R0J40j40o6LOJ82k03k14K5J59k6N7k44J24K97m0j42K0J46j34j73L09k76
7790a18k08L98j18m0J05J94m05L71j27j12m4j02R3P1%J60r3J43j83k25K99k83
7812b24J82J51k35J5M93m03k54P7L12j86l4J66L09m22J08j55l6K05M4j79j13J38
7834d1M9J87J28p4j8m89M41j19l8k14L84j11l1L3Q0l50M12k87P8m6J62Lj34K2
7858B7m3J31R2l62m2L54m2l81K85O9j0K2k81J47o3k5j05N04n88J09N70k97l16
7881b45N51l27k15M07k13P2n5M3j1r7J36Q0k8o3J34k05R0Q9j15Q5j43P4j57J64
7905E1K36j92l38L88j31j18J78R2k2Q1m28J14j43K33k01J19j58k97N46L03n48
7926b35J47J98k02j14M20l85J2J31k64L00J6Pj0J69k23R4J9P1j88R2p2O7NJ9N1
$$ plain form
7951 125 -145 -117 -45 -87 -61 -217 -304 -19 -139 -219 -106 -19 46 -191 -124 -78 81 124 -149 148 -15 -37 -42 68 -82
7976 -82 -63 -182 -7 4 -93 47 -16 65 156 -39 -52 60 58 -136 48 -22 -428 -167 -133 -150 -143 78 -66 -44 162
8001 162 -162 -55 -114 -234 -147 -56 72 -303 -301 -66 60 194 187 -66 -87 -80 -72 17 -62 81 170 -70 23 31 -53 10 59
8028 59 88 70 178 16 -43 199 -103 7 144 -122 -56 4 -8 112 -18 339 -377 163 -37 -62 303 59 -263
8051 -263 177 173 48 34 73 -154 -63 -30 101 -75 100 61 58 -301 222 226 -119 -334 -118 182 -114 -7 16 -160
8075 -160 -48 -131 -105 21 -128 57 -87 64 -320 22 161 -147 -40 52 -10 279 -10 -418 -26 7 53 -402
8097 -402 34 -69 177 237 366 90 -22 139 -98 0 -11 82 -45 -58 -17 -80 -178 -35 -24 71 203 -211 172
8120 172 1 -210 -266 -177 74 -7 -267 49 27 -196 217 3 211 9 -6 245 49 -90 -32 277 26 59
$$ packed form
7951A25k70K8P2m2K6j56q7K85j20q0J13Q7O5k37O7M6J59M3k73K97j63k2nJ10j50
7976h2J9j19J75J1r7J40o3Q1R1j95j3J12kj94J84p0m06K61L4j7PK21j44K2K06
8001A62l24J07n9j20Q7R1J28l75KK35J26J34pk53k1PQQ9p9J43Q9k40R3Qq4O3M9
8028E9K9j8J08j62n9K42l02J10J37k66O6O0j2J20j30L57p16N40k00k5L65k44l22
8051b63M40mj25j4L9k27R1L3J31j76J75l9ll59N23Ml45k15K16L00k96J07K3j76
8075a60J12q3K6J26j49J85j44J51l84L42J39l08J07R2o2K89k89m08L92L3M6m55
8097d02M36j03K46O0J29k76j12J61k37R8j1R3j27j3M1o3r8J43J1R5J32m14L83
8120A72j71k11n6Q9K51q1k60L16k2k23M13k14K08k02j5K51j96j39N8L09k51L3
$$ plain form
8142 59 -231 -87 33 -49 -227 -9 205 -3 -180 164 -56 -203 9 146 60 -165 271 -211 -74 151 -20
8163 -20 -108 -186 -200 20 168 -162 200 201 34 -323 -9 -194 209 39 -47 -32 -5 26 241 266 -183 -45 -83 12
8187 12 -2 142 -48 155
$$ packed form
8142E9k90J44J20q2j78K18K14k08j77L44k20j47K12J37q6k25M36m82J37K25j71
8163b0q8p8j4K20J48l30L62Jj67l57L14j85M03j70q6J5K7L1K15K5m49J38l8R5
8187A2j4J44j90K03
8191A55
$$ Imaginary data points
##PAGE= N=2
##DATA TABLE= (X++(I..I)), XYDATA
$$ plain form
0 0 0 0 0 0 0 0 0 0 0 0 0 -8 8 -8 8 -15 16 -16 24 -26 32 -40 48 -56 64 -74 88 -103 118 -136 154 -176 200
33 200 -226 254 -288 322 -361 404 -450 502 -558 617 -684 756 -836 923 -1018 1120 -1235 1359
51 1359 -1499 1652 -1823 2014 -2228 2475 -2756 3085 -3471 3934 -4504 5221 -6155 7433 -9287
66 -9287 12241 -17683 31032 -136040 -79936 212354 9233 -105181 34435 115619 -12150
77 -12150 -11213 40361 -18203 -87693 -18605 28887 18047 11009 23474 8656 -1941 -19298 -9243
90 -9243 22887 -13659 -101478 -26955 135848 84885 -103351 -75615 77459 56661 -55217 -51942
102 -51942 -14582 -2340 48336 61981 -17374 -31826 36381 16037 -50968 -15803 21699 -28614
114 -28614 -33799 30498 34389 8057 12977 -26516 -66238 14207 76688 -20230 -85533 11063 83203
$$ packed form
0@%%%%%%%%%%%qJ6j6J6k3L1l2M0n0N8p2Q8j04J20j38J62j91K21k54K90l30L76
33B00m26M80n42O10o83P65q54R52j060J175j301J440j592J759j941K138k355K594
51A359k858L151l475L837m242M703n231N841o556P405q438R725j1376J3588j6720
66i287K1528k9924M8715j67072N6104K92290k03121j14414J39616Q1184j27769
77a2150R37N1574n8564o9490O9088M7492j0840p038J2465j4818j0597j7357J0055
90i243L2130l6546q7819P4523J62803n0963j88236K7736J53074k0798j11878L275
102e1942L7360J2242N0676J3645p9355j4452O8207k0344o7005L5165L7502n0313
114b8614n185O4297L891k6332M920l9493l9722Q0445O2481r6918o5303R6596P2140
$$ plain form
127 83203 37467 -7050 -29567 -45277 9286 55569 -22067 -74686 17862 64454 -15498 -27882
139 -27882 35034 2417 -58384 -15541 27309 1081 4673 22434 -11954 -5697 56317 27674
151 27674 -62159 -50166 17358 23124 9102 1047 -29471 -10484 60287 30043 -70145 -47829
163 -47829 36712 10511 -34754 14161 37589 -7484 -2352 25819 -6172 -19738 9776 -14494
175 -14494 -38406 25807 57054 -13453 -36488 16801 15246 -18147 -7589 -18089 -43475 13209
187 13209 63680 -403 -41384 23264 41467 -18847 -22901 6664 -12880 -12383 26907 11866 -15686
200 -15686 18400 21513 -34253 -24124 25755 -6120 -43227 4219 31726 -1076 4889 22249
212 22249 -17476 -23041 28828 12557 -43456 -9934 41714 11069 -12367 12443 634 -21248
$$ packed form
127H3203m5736m4517k2517j5710N4563M6283p7636n2619R2548M6592p9952j2384
139b7882O2916l2617o0801M2843M2850k6228L592J7761l4388O257O2014k8643
151B7674q9833J1993O7524N766j4022q055l0518J8987P0771l0244j00188K2316
163d7829Q4541k6201m5265M8915K3428m5073N132K8171l1991j3566K9514k4270
175a4494k3912O4213L1247p0507k3035N3289j555l3393J0558j0500k5386N6684
187A3209N0471o4083m0981O4648J8203o0314m054K9565j9544M97L9290j5041k7552
200a5686L4086L113n5766J0129M9879l1875l7107M7446K7507l2802N965J7360
212B2249l9725n565N1869j6271n6013L3522N1648l0645k3436K4810j1809k1882
$$ plain form
224 -21248 7310 6674 -36943 -14710 33982 4738 -21696 19905 20698 -27715 -10885 24719 -9281
237 -9281 -23180 19723 15738 -13942 18372 31153 -26067 -31944 21536 9260 -31123 -5712 12402
250 12402 -11315 6518 31949 -13001 -37099 12742 22950 -18456 -6230 20912 -4753 -4777 34173
263 34173 11926 -33660 -8401 14488 -15485 -8816 23347 -7547 -30469 20568 34736 -19377
275 -19377 -24944 6803 -8459 -10381 29373 14542 -31276 -678 40174 4985 -19270 2984
287 2984 -9414 -25826 17285 31697 -19289 -23287 18940 8493 -12474 8260 -3506 -39381
299 -39381 -3834 42062 7586 -20629 10060 10636 -11272 15285 21503 -32382 -32607 26246 24451
312 24451 -12156 591 4604 -24093 -3043 32369 -7465 -42929 -2338 22535 2962 12131
$$ packed form
224b1248K8558o36m3617K2233M8692k9244k6434M1601P93m8413J6830L5604l4000
237i281j3899M2903l985k9680L2314J2781n7220n877N3480j2276m0383K5411J8114
250A2402k3717J7833K5431m4950k4098M9841J0208m1406J2226K7142k5665k4L8950
263C4173k2247m5586K5259K2889k9973O669L2163l0894k2922N1037J4168n4113
275a9377n567L1747j5262j922L9754j4831m5818L0598M0852l5189k4255K2254
287B984j2398j6412M3111J4412n0986l998M2227j0447k0967K0734j1766l5875
299c9381L5547M5896l4476k8215L0689N76k1908K6557O218n3885k25N8853j795
312B4451l6607J2747M013k8697K1050L5412l9834l5464M0591K4873j9573R169
$$ plain form
324 12131 18210 -22282 -21604 30772 22774 -25584 -14890 8640 -5620 8106 33117 -7661 -43486
337 -43486 -305 25605 -8743 -13078 5345 -15546 -11407 38566 27724 -30299 -20624 17373 3889
350 3889 -3339 17026 -6300 -29883 14474 39028 -6657 -24303 -877 -9251 -13391 22627 13902
363 13902 -34503 -15962 31737 15515 -9705 2805 -8977 -25380 16912 38489 -11631 -28413
375 -28413 13982 17125 -5828 7449 2348 -35027 -16364 30709 11122 -20687 -609 5674 -12811
388 -12811 9526 26818 -17081 -34902 11405 25588 1593 5840 5308 -21865 -3082 35624 3103
401 3103 -40556 -10685 17580 -2318 862 15972 -13493 -24522 16581 18714 -18398 -8482 11989
414 11989 -9103 -4596 33474 14679 -28892 -8984 19067 168 -4841 6168 -17823 -20987 26971
$$ packed form
324A2131O079m0492O78N2376p998m8358J0694K3530j4260J3726K5011m0778l5825
337d3486M3181K5910l4348m335J8423k0891M139M9973j0842n8023R675L7997j3484
350C889p228K0365k3326k3583M4357K4554m5685j7646K3426q374m140L6018q725
363A3902m8405J8541M7699j6222k5220J2510j1782j6403M2292K1577n0120j6782
375b8413M2395L143k2953J3277n101l7375J8663M7073j9587l1809K0078O283j8485
388a2811K2337J7292m3899j7821M6307J4183k3995M247n32k7173J8783L8706l2521
401C103m3659K9871K8265j9898L180J5110k9465j1029M1103K133l7112R916K0471
414A1989k1092M507L8070j8795m3571J9908K8051j8899n009J1009k3991l164M7958
$$ plain form
427 26971 28209 -25873 -24819 14766 5557 -11520 7254 1928 -17684 8190 27257 -4223 -11557
440 -11557 14959 -1266 -23548 9075 23205 -15696 -18765 13654 7197 -6834 9005 -3354
452 -3354 -32972 -811 34880 -2503 -30455 6400 23310 324 273 3789 -14024 -3066 20860
465 20860 -3681 -21540 14425 19755 -21564 -13862 22715 1536 -26010 -1637 8479 -8672
477 -8672 6916 18561 -14982 -16993 25851 18334 -24277 -12879 15844 5081 -940 6690 -9489
490 -9489 -9206 21736 6981 -35010 -10960 30661 159 -29457 4807 21725 -5124 -5441 8012
503 8012 -7007 -5021 18080 1245 -20882 8936 24925 -8146 -16072 8657 3164 -9096 3423
516 3423 -5751 -21525 12596 30952 -18879 -33701 22282 31075 -19420 -22455 11330 10508 1601
$$ packed form
427B6971J238n4082J054L9585r209j7077J8774n326j9612K5874J9067l1480p334
440a1557K6516j6225k2282L2623J4130l8901l069L2419o457j4031J5839j2359
452c354k9618L2161L5691l7383k7952L6855J6910k2986n1L516j7813J0958K3926
465B0860k4541j7859L5965N330m1319P702L6577k1179k7546K4373J0116j7151
477h672J5588J1645l3543k011M2844p517m2611J1398K8723j0763o021P630j6179
490i489K83L0942j4755m1991K4050M1621l0502k9616L4264J6918k6849l17J3453
503H012j5019J986K3101j6835k2127K9818J5989l3071p926K4729n493j2260J2519
516C423r174j5774L4121J8356m9831j4822N5983Q793n0495l035L3785q22q907
$$ plain form
529 1601 7376 -4575 -10192 15874 12617 -21856 -11184 18512 -2388 -20666 6761 12520 -10563
542 -10563 -774 9797 -16071 -9931 29215 9328 -36067 -7384 38724 14840 -20191 -11129 2758
555 2758 7401 12937 -7149 -27936 2296 27487 -6915 -23170 12325 12120 -21512 -7550 20000
568 20000 -307 -12073 9779 3581 -12115 14921 23602 -19240 -27877 14822 23581 -4510 -14167
581 -14167 -11702 -3014 22297 15952 -30750 -26696 25376 19574 -23352 -7106 21988 -1685 -14396
594 -14396 13954 13146 -11034 -3078 4499 -9752 2180 22876 -4143 -28500 -801 19355 2683
607 2683 -7187 -10258 -19243 6074 35457 371 -38395 -465 35945 1690 -20580 6053 8481
620 8481 -11105 1575 13753 -3062 -5505 3158 -10253 -8212 18308 6760 -27341 -11209 20011
$$ packed form
529A601N775j1951n617K6066l257l4473J0672K9696k0900j8278K7427N759k3083
542a0563R789J0571k5868O140L9146j9887m5395K8683M6108k3884l5031R062J3887
555B758M643N536k0086k0787L0232K5191l4402j6255L5495k05l3632J3962K7550
568B0000k0307j1766K1852o198j5696K7036Q681m2842q637M2699Q759k8091r657
581a4167K465Q688K5311o345m6702M054N2072n802m2926J6246K9094k3673j2711
594a4396K8350q08k4180P956P577j4251J1932K0696k7019k4357K7699K0156j6672
607B683r870l071q985K5317K9383l5086l8766L7930L6410l4255k2270K6633K428
620H481j9586J2680J2178j6815k443Q663j3411K041K6520j1548l4101J6132L1220
$$ plain form
633 20011 9115 -3255 2234 -11339 -14142 23742 26993 -23626 -27464 20285 22968 -8989 -6543
646 -6543 2557 -8037 -1890 9624 -5588 -10035 7737 -1457 -15850 11395 23944 -13852 -24356
659 -24356 11351 17182 -2877 1805 1241 -16243 3052 30439 850 -31379 -5386 17694 745
672 745 -6029 862 -9170 -6160 14722 4487 -14935 2181 10911 -12624 -5867 24231 7702
685 7702 -21994 -2663 17252 1397 -2654 4077 -12955 -13672 18910 15487 -20397 -15324 11550
698 11550 4623 -4777 4900 -3801 -13632 9425 18202 -8591 -8571 14733 1257 -15374 8279 15723
712 15723 -12715 -13512 9466 3763 -4780 6025 -3207 -18771 3516 20359 -6858 -17765 7082
725 7082 9503 -4319 6519 8683 -12685 -5601 17528 2255 -14730 4642 9486 -11834 -4395
$$ packed form
633B0011j0896j2370N489j3573k803L7884L251n0619l838M7749K683l1957K446
646f543R100j0594O147J1514j5212m447J7772r194j4393K7245J2549l7796j0504
659b4356L5707N831k0059M682n64j7484J9295K7387k9589l2229K5993K3080j6949
672G45o774O891j0032L010K0882j0235j9422J7116Q730k3535O757L0098j6529
685G702k9696J9331J9915j5855m051O731j7032p17L2582l423l5884N073K6874
698A1550o927r400R677q701r831K3057Q777k6793K0K3304j3476j6631K3653P444
712A5723k8438p97K2978n703q543J0805r232j5564K2287J6843k7217j0907K4847
725G082K421j3822J0838K164k1368P084K3129j5273j6985J9372M844k1320P439
$$ plain form
738 -4395 14877 -2393 -15666 1664 4429 -8341 3582 10174 -11335 -8145 18179 8161 -14077
751 -14077 153 10551 -6082 -2912 12223 -2593 -12563 8592 8682 -13991 -5076 11709 -6036
764 -6036 -13501 8721 7297 -11002 348 10876 -5721 -4793 12826 1350 -13196 6109 12946
777 12946 -8212 -5246 11093 -2032 -11538 6433 5244 -13121 -2304 10832 -6277 -9370 11577
790 11577 5358 -12850 958 12075 -4849 -4299 11509 90 -11321 8014 11793 -9995 -6458
803 -6458 9519 -3239 -10260 7709 4892 -14086 -2581 11377 -3579 -6565 9004 12 -12442
816 -12442 6669 14861 -6819 -7435 9976 1432 -7787 7927 5278 -14937 -4725 13391 -753
829 -753 -10436 4429 1012 -11140 3566 12414 -8095 -10828 9475 6131 -5375 6083 7082 -11148
$$ packed form
738d395J9272j7270j3273J7330K765j2770J1923O592k1509L190K6324j0018k2238
751a4077J4230J0398j6633L170J5135j4816r970K1155R0k2673Q915J6785j7745
764f036p465K2222j424j8299J1350J0528j6597R28J7619j1476j4546J9305O837
777A2946k1158K966J6339j3125r506J7971j189j8365J0817J3136j7109l093K0947
790A1577o219j8208J3808J1117j6924N50J5808j1419j1411J9335L779k1788L537
803f458J5977j2758p021J7969k817j8978J1505J3958j4956k986J5569q992j2454
816a2442J9111Q192k1680o16J7411q544r219J5714k649k0215J0212J8116j4144
829g53r683J4865l417j2152J4706Q848k0509k733K0303l344j1506J1458R99j8230
$$ plain form
843 -11148 -3409 15027 1391 -12541 1693 4059 -7747 3302 10848 -10359 -14121 9197 7971
856 7971 -9106 -802 5789 -7831 -1699 16603 2703 -13561 1811 9277 -4432 7 9516
869 9516 -7459 -12737 9812 10484 -9815 -5562 3699 -6807 -2939 13460 533 -16881 1165
882 1165 14631 -683 -3456 6323 -4475 -8190 11975 10662 -12119 -7016 9048 -1207 -5755
895 -5755 8034 74 -16646 -1419 14142 -971 -7639 3447 -1674 -6052 11411 11547 -12594
908 -12594 -9744 11833 6692 -4465 3257 -395 -11805 2389 14061 -5438 -13529 3697 3212
921 3212 -7482 4651 9461 -11087 -9656 11804 7222 -6061 2195 2674 -8981 3129 17174
934 17174 -2595 -16715 1690 8764 -3109 -269 2546 -11072 -5744 13880 3991 -13686 -1068
$$ packed form
843a1148P739J8436j3636j3932J4234K366j1806J1049P546k1207l762K3318j226
856G971j7077Q304O591j3620O132J8302j3900j6264J5372P466j3709M439R509
869I516j6975n278K2549O72k0299M253R261j0506L868J6399j2927j7414J8046
882A165J3466j5314k773R779j0798l715K0165j313k2781N103J6064j0255m548
895e755J3789p960j6720J5227J5561j5113o668J1086n121m378J7463J36k4141
908a2594K850K1577n141j1157P722l652j1410J4194J1672j9499q091J7226m85
921C212j0694J2133M810k0548J431K1460m582j3283Q256M79j1655J2110J4045
934A7174j9769j4120J8405P074j1873K840K815j3618N328J9624r889j7677J2618
$$ plain form
947 -1068 8447 -5607 -2526 13021 570 -12164 3225 10690 -2326 -975 4475 -8646 -7250
960 -7250 13410 6892 -14819 -6736 8177 -55 -2401 6058 -5071 -11791 8295 13775 -7774 -7725
974 -7725 9766 2420 -7301 6015 7399 -8409 -5180 6164 -799 -2521 5925 -4325 -13964 5372
988 5372 14574 -7266 -11897 5409 4058 -3370 7025 4721 -11965 -1802 16005 1529 -12187
1001 -12187 2983 7363 -6527 -2620 7173 -2441 -6807 2340 -1436 -5891 7333 5831 -13588 -5597
1015 -5597 15950 4852 -11809 161 7261 -3559 709 9226 -4800 -9770 7747 7564 -8893
1028 -8893 -4228 6095 -2776 -5462 4457 413 -5726 4520 3229 -9774 1574 15498 -3464
1041 -3464 -15513 6697 14555 -5087 -7522 4780 -53 -3645 5760 310 -10418 501 7842
$$ packed form
947a068R515j4054L081J5547j2451j2734J5389P465j3016J351N450j3121J396
960g250K0660o518k1711Q083J4913q232k346Q459j1129o720K0086N480k1549M9
974g725J7491p346r721J3316J384j5808L229J1344o963j722Q446j0250r639J9336
988E372R202k1840m631J7306j351p428J0395k304j6686J0163J7807j4476j3716
1001a2187J5170M380j3890L907R793r614m366R147l776m455J3224j502j9419P991
1015e597K1547j1098j6661J1970P100j0820M268Q517j4026m970J7517j83j6457
1028h893M665J0323q871k686R919m044o139J0246j291j3003J1348J3924j8962
1041c464j2049K2210P858j9642k435J2302m833l592R405n450j0728J0919P341
$$ plain form
1054 7842 -4996 -5339 6471 351 -7279 4206 5248 -6479 1315 10027 -6132 -9443 12727 10996
1068 10996 -13074 -8431 10611 3858 -6761 -569 -425 -5121 3288 4349 -7634 -3145 8217 -1259
1082 -1259 -7991 6734 7510 -7437 -1630 9180 -1874 -5286 8890 2591 -13817 -632 14855
1095 14855 -1440 -12994 123 5081 -1710 767 -81 -7110 1164 9823 -3000 -7865 8255 6346
1109 6346 -9936 -1023 12582 -964 -9293 3727 3796 -6447 1750 6792 -8437 -8861 8280 6553
1123 6553 -7290 -3445 2029 -1828 3760 6891 -6705 -7034 10158 6566 -9568 -514 10767 -4311
1137 -4311 -9449 7215 6612 -8189 -4136 3464 -3203 -1259 7376 -2567 -10855 3407 9832 -1929
1151 -1929 -2954 3067 -2930 -785 11078 2163 -12521 138 11209 -3333 -7969 6367 2067
$$ packed form
1054G842j2838l43J1810o120p630J1485J042j1727P794Q712j6159l311K2170j731
1068A0996k4070M643J9042o753j0619O192J44m696Q409J061j1983M489J1362r476
1082a259o732J4725P76j4947N807J0810j1054l412J4176o299j6408J3185J5487
1095A4855j6295j1554J3117M958o791K477q48p029Q274Q659j2823m865J6120j909
1109F346j6282Q913J3605j3546q329J3020O9j0243Q197N042j5229m24J7141j727
1123F553j3843L845N474l857N588L131j3596l29J7192l592j6134R054J1281j5078
1137d311n138J6664o03j4801M053P600o667J944Q635r943q288J4262O425j1761
1151a929j025O021n997K145J1863q915j4684J2659J1071j4542m636J4336m300
$$ plain form
1164 2067 -10749 -823 8668 -1756 -5413 1963 -1549 -3078 8373 4511 -9961 -2632 10379 2181
1178 2181 -4238 3053 -953 -7683 4881 9318 -7511 -9461 6505 3991 -6925 966 4948 -6090
1192 -6090 -4592 7443 2499 -4233 2584 1079 -5575 4376 10392 -5423 -10042 5805 6316 -4717
1206 -4717 -502 2574 -7387 -3476 9441 1370 -10542 -233 5700 -3085 -558 6939 -2164 -6694
1220 -6694 5580 5969 -3975 -49 4310 -5957 -3616 9988 2504 -11303 -2439 6667 -1926 -2922
1234 -2922 4072 -3496 -7671 6048 7914 -5634 -3758 6055 -409 -2991 6871 2965 -8195 -431
1248 -431 7304 -1511 -3954 4261 -2182 -8607 3802 7817 -6440 -6657 4742 1554 -3081 4922 2685
1263 2685 -7855 264 9433 -271 -5678 3725 1500 -5832 2802 6565 -6006 -6695 4840 1428
$$ packed form
1164B067j2816R926R491j0424l657P376l512j529J1451l862j4472P329J3011q198
1178B181o419P291m006o730J2564M437j6829j950J5966k514j0916P891L982j1038
1192f090J498J2035m944o732O817j505o654R951O016j5815m619J5847N11j1033
1206d717M215L076r961L911J2917q071j1912J0309N933q785K527P497r103m530
1220f694J2274L89r944L926M359j0267K341J3604p484j3807Q864R106q593r96
1234b922O994p568m175J3719J866j3548J876R813o464k582R862l906j1160P764
1248d31P735q815k443Q215o443o425J2409M015j4257k17J1399l188m635Q003k237
1263B685j0540Q119R169r704n407R403k225p332Q634L763j2571o89J1535l412
$$ plain form
1277 1428 -5483 2510 2946 -7788 -2223 9482 1009 -6698 2004 3551 -3264 2723 6890 -5097
1291 -5097 -5948 6691 4020 -6259 179 3112 -5915 -2851 7418 -83 -8001 1276 4191 -3894
1305 -3894 -16 6533 -3058 -6268 6592 6135 -5124 -977 4224 -3183 -2436 6858 306 -8645 232
1320 232 5379 -3661 -2583 4437 -2800 -6445 5069 5915 -5508 -1874 5551 -1562 -2738 6981 2422
1335 2422 -7810 -266 6862 -1889 -3783 3402 -1847 -6522 3847 5412 -6364 -4528 4744 49
1349 49 -3632 4989 2915 -6701 311 7947 -660 -4178 3796 668 -5361 3269 6023 -5710 -5519
1364 -5519 4596 874 -4940 2122 2147 -6871 -1004 8283 -155 -5861 2894 3361 -3457 2082 5948
1379 5948 -3982 -4876 5432 3094 -4857 863 2965 -5921 -2239 7221 -484 -7484 1090 3752 -3105
$$ packed form
1277A428o911P993M36j0734N565J1705q473p707Q702J547o815N987M167j1987
1291e097q51J2639k671j0279O438K933r027L064J0269p501p918R277K915q085
1305c894L878O549r591l210J2860m57j1259M147N201p407P47R294o552q951Q877
1320B32N147r040J078P020p237l645J1514Q46j1423L634P425p113j176R719m559
1335B422j0232P544P128q751j894P185n249m675J0369J565j1776J836R272m695
1349D9l681Q621k074r616P012P636q607l518P974l128o029Q630K754j1733J91
1364e519J0115l722n814P062K5r018N867R287q438n706Q755M67o818N539L866
1379E948r930q94J0308k338p951N720K102q886L682R460p705p000Q574K662o857
$$ plain form
1394 -3105 870 5594 -3631 -5331 6292 5081 -4869 -475 3977 -2869 -2081 6576 310 -7982 116
1409 116 4579 -3335 -1731 4298 -2721 -5957 4842 5277 -4982 -2345 4729 -1275 -1788 6257 1636
1424 1636 -7267 669 6935 -1735 -3635 3131 -1468 -5540 3568 4622 -5692 -3619 4355 -507 -3279
1439 -3279 4738 2301 -7026 306 7776 -347 -4097 3207 852 -4117 3171 4586 -5508 -4992 4628
1454 4628 1359 -4153 1274 1466 -5784 -77 6886 -1277 -5059 3314 2347 -3586 2861 5818 -4459
1469 -4459 -4722 5737 3282 -4428 -17 2166 -4812 -1113 6256 -882 -6921 1113 3194 -2562 694
1484 694 3785 -3617 -3807 6558 3733 -4689 696 3988 -3435 -1939 6522 209 -7647 224 4636
1499 4636 -2272 -1896 2571 -2918 -4015 4648 3507 -4825 -696 4198 -1541 -1050 6225 118 -6853
$$ packed form
1394c105L975M724r225j700J1623j211r950M394M452o846P88Q657o266q292Q098
1409A16M463p914J604O029p019l236J0799M35j0259K637P074o004n13Q045m621
1424A636q903P936O266q670j900O766m599m072R108J054j0314K073P974m862k772
1439c279Q017k437r327P332P470q123l750P304k355m969P288J415j0094N16R620
1454D628l269n512N427J92p250N707O963q163l782Q373r67n933O447K957j0277
1469d459k63J0459k455p710M411K183o978L699P369p138o039Q034K081n756L256
1484F94L091p402j90J0365k825q422N385L292p423J496Q461o313p856P871M412
1499D636o908L76M467n489j097Q663j141q332M129M894n739M91P275o107o971
$$ plain form
1514 -6853 1779 6598 -2835 -3877 3332 -806 -5206 2761 4211 -5200 -3896 3590 331 -1910 3135
1529 3135 120 -5025 2215 6922 -2272 -3332 3968 326 -4150 3652 5001 -6061 -4559 5325 1512
1544 1512 -4880 981 1243 -4779 -325 5467 -899 -4247 1775 1486 -2006 3560 3793 -5219 -2531 6475
1560 6475 1437 -5256 1457 2794 -5231 -1633 6578 -816 -7148 637 4286 -2175 -504 2752 -2500
1575 -2500 -2160 4913 2328 -3857 1371 2978 -3531 30 6297 -1726 -7339 2190 5015 -4021 -2583
1590 -2583 3642 -1681 -5094 3672 4089 -4167 -2032 3216 -125 -110 4285 -1223 -4738 2732 4789 -3316
1606 -3316 -2312 3961 -1851 -4718 4293 4178 -6004 -3709 4918 474 -3089 2357 1422 -4270 1014
1621 1014 5531 -1002 -2255 2272 -319 -2373 4230 2364 -6320 -2214 5766 -360 -5338 2452 1754
$$ packed form
1514f853Q632M819r433j042P209m138m400P967J450r411J304P486l259k241N045
1529C135l015n145P240M707r194j060P300l642m476P802J349j1062J502R884l813
1544A512o392N861K62o022M454N792o366l348O022k89l492N566K33r012K688R006
1560F475n038o693O713J337q025L598Q211p394o332P785L649o461J671L256n252
1575b500L40P073k585o185N228J607o509L561O267q023n613R529K825r036J438
1590b583O225n323l413Q766M17q256K135N248l341J5M395n508l515P470K057q105
1606c316J004O273n812k867R011j15j0182K295Q627m444l563N446r35n692N284
1621A014M517o533j253M527k591k054O603j866q684M106P980o126m978P790o98
$$ plain form
1636 1754 -5341 -731 6148 -868 -5010 2190 2475 -1954 1964 2906 -3521 -1788 5081 1254 -3480
1651 -3480 1323 966 -4656 461 5676 -2676 -6229 2787 4014 -3774 -390 4025 -2155 -3266 4213
1666 4213 2969 -3009 67 2088 -2071 362 4694 -2137 -5476 2106 3202 -3688 -1355 2983 -2930
1681 -2930 -3741 4886 2882 -5614 -1681 4424 -386 -1449 3741 531 -3974 1308 4133 -1938 -1491
1696 -1491 2344 -2116 -3484 3920 2326 -5672 -2089 4521 -469 -2567 2661 513 -4427 1688 5538
1711 5538 -2030 -3199 2862 1041 -2184 2322 2402 -4615 -1683 3930 -408 -3204 1695 235 -4525
1726 -4525 503 5550 -2324 -4629 2724 2173 -1927 1729 3012 -3509 -1902 4909 1688 -3802 435
1741 435 1300 -3170 -91 4136 -2500 -4781 2233 2171 -2704 557 2946 -3387 -2234 5178 2159 -4043
$$ packed form
1636A754p095M610O879p016m142P200K85m429L918R42o427J733O869l827m734
1651c480M803l57n622N117N215q352l553R016J227p788L384M415o180j111P479
1666D213j244n978L076K021m159K433M332o831l339P582J096o890K333M338n913
1681b930q11Q627k004q496L933O105m810j063N190l210m505N282K825o071M47
1696a491L835m460j368P404j594p998L583O610m990k098N228k148m940O115L850
1711E538p568j169O061j821l225M506Q0p017K932N613m338k796M899j460m760
1726d525N028N047p874k305P353n51m100L656J283o521J607O811l221n490M237
1741D35Q65m470L079M227o636k281P014o2m875L261K389o333J153P412l019o202
$$ plain form
1757 -4043 85 2667 -1494 -69 3883 -1515 -4706 2028 2974 -3286 -1213 1950 -2707 -2426 4417
1772 4417 1969 -4804 -514 3709 -1048 -676 3813 -433 -4091 2123 4273 -2289 -2190 2263 -1089 -2287
1788 -2287 3025 1354 -5020 -1521 3658 -362 -1995 2423 -207 -3666 2146 4552 -1963 -2386 2772
1803 2772 707 -1844 2909 1612 -4506 -1331 4471 -15 -3405 809 278 -3489 1247 4222 -2409
1818 -2409 -3371 2679 1644 -1994 1807 2391 -3493 -1208 4978 1065 -3868 600 1138 -2848 545 3212
1834 3212 -2604 -4167 2127 1993 -2561 429 1796 -3020 -1565 4576 1180 -3773 695 2861 -1598
1849 -1598 167 3238 -1563 -3998 2156 2951 -2910 -1049 1729 -2101 -1947 3650 914 -4405 -59
1864 -59 3422 -935 -724 2707 -470 -3316 2864 3562 -2527 -1980 2200 -955 -2298 2872 937 -5045
$$ packed form
1757d043M128K582m161J425L952n398l191O734R46o260K073L163m657K81O843
1772D417k448o773M290M223m757L72M489m246l658O214K150o562R9M453l352j198
1788b287N312j671o374L499N179m020j633M418k630l459N812K406o515m23N158
1803B772k065k551M753j297o118L175N802m486l390M214n31l767M736K975o631
1818b409r62O050j035l638L801N84n884K285O186l913m933M468N38l986L393K667
1834C212n816j563O294j34m554K990J367m816J455O141l396m953M468K166m459
1849a598J765L071m801k435O154P95n861J861K778l830J54N597k736n319M346
1864e9L481m357K11L431l177k846O180O98o089N47M180l155j343N170j935n982
$$ plain form
1880 -5045 -864 3655 -1028 -1823 1881 -170 -3045 2197 3558 -2201 -2112 3032 353 -1676 2407 1472
1896 1472 -3768 -767 4082 -545 -2886 1105 90 -3096 1084 3129 -2201 -2490 2689 1044 -2008
1911 -2008 1674 1873 -2935 -534 4408 502 -3291 1179 1194 -2610 362 2928 -2673 -3430 2274 1469
1927 1469 -2699 86 1907 -2400 -831 3979 402 -3431 1293 2224 -1909 246 3400 -1347 -3532
1942 -3532 2158 2226 -2595 -818 1538 -2341 -1608 3221 386 -4079 135 3076 -937 -473 2628 -728
$$ packed form
1880e045M181M519m683p95L704k051k875N242J361n759Q9N144k679k029M083r35
1896A472n240L001M849m627k341L991j015l186M180K045n330k89N179j645l052
1911b008L682J99m808K401M942l906l793M470J5l804K972K566n601p57N704q05
1927A469m168K785J821m307J569M810l577l833M724R31m133K155L154m747k185
1942c532N690O8m821J777K356l879P33M829k835m465M214K941m013M64L101l356
$$ [...]
8191A26
##END NTUPLES=NMR FID
##END=
