##TITLE=1H_IG-Metereph
 200.13MHz,Dmso.
 8 sc
 
 12.12.2025
##JCAMPDX= 6.0         $$ Bruker NMR JCAMP-DX V2.0
##DATA TYPE= NMR FID
##DATA CLASS= NTUPLES
##ORIGIN= UXNMR, Bruker Analytische Messtechnik GmbH
##OWNER= pz
$$ XWIN-NMR		Version 3.5
$$ Fri Dec 12 14:38:25 2025 Russian Standard Time (UT+4h)  she@DPX200
##.OBSERVE FREQUENCY= 200.1313
##.OBSERVE NUCLEUS= ^1H
##.DELAY= (6, 6)
##.ACQUISITION MODE= SIMULTANEOUS
##.ACQUISITION SCHEME= undefined
##.AVERAGES= 8
##.DIGITISER RES= 18
##SPECTROMETER/DATA SYSTEM= spect
##.PULSE SEQUENCE= zg30
##.SOLVENT NAME= DMSO
##.SHIFT REFERENCE= (INTERNAL, DMSO, 0, 14.3821)
##AUDIT TRAIL= $$ (NUMBER, WHEN, WHO, WHERE, WHAT)
$$ ##TITLE= Audit trail, XWIN-NMR		Version 3.5
$$ ##JCAMPDX= 5.01
$$ ##ORIGIN= Bruker BioSpin GmbH
$$ ##OWNER= she
$$ F:/spectra/data/she/nmr/H-C/1/audita.txt
$$ ##AUDIT TRAIL=  $$ (NUMBER, WHEN, WHO, WHERE, WHAT)
(   1,<2025-12-12 14:37:09.45 +0400>,<she>,<DPX200>,
      <created by zg, POWCHK disabled, PULCHK disabled
       configuration hash MD5:
       00 E9 B6 7A A2 85 ED C7 34 08 36 98 17 FE 4E 26
       data hash MD5: 16K
       07 DF C7 94 6D 0D 4A B3 61 B2 B2 35 59 3A E3 99>)
$$ ##END=
$$ 
$$ hash MD5
$$ EC 4F 58 18 7F 15 AB FA 80 09 E5 D8 7B BE 57 1C
##$RELAX= 
##$RELAX= 
##$RELAX= 
##$RELAX= 
##$RELAX= 
##$RELAX= 
$$ Bruker specific parameters
$$ --------------------------
##$DU= <F:/spectra>
##$EXPNO= 1
##$NAME= <H-C>
##$PROCNO= 1
##$TYPE= <nmr>
##$USER= <she>
##$AMP= (0..31)
100 100 100 100 100 100 100 100 100 100 100 100 100 100 100 100 100 100 
100 100 100 100 100 100 100 100 100 100 100 100 100 100 
##$AQSEQ= 0
##$AQ_mod= 1
##$AUNM= <au_zg>
##$AUTOPOS= <>
##$BF1= 200.13
##$BF2= 200.13
##$BF3= 200.13
##$BF4= 200.13
##$BF5= 200.13
##$BF6= 200.13
##$BF7= 200.13
##$BF8= 200.13
##$BYTORDA= 1
##$CFDGTYP= 0
##$CFRGTYP= 5
##$CHEMSTR= <none>
##$CNST= (0..31)
1 1 145 1 1 1 1 1 1 1 1 1 1 1 1 1 1 1 1 1 1 1 1 1 1 1 1 1 1 1 1 1 
##$CPDPRG= <>
##$CPDPRG1= <>
##$CPDPRG2= <>
##$CPDPRG3= <>
##$CPDPRG4= <mlev>
##$CPDPRG5= <mlev>
##$CPDPRG6= <mlev>
##$CPDPRG7= <mlev>
##$CPDPRG8= <mlev>
##$CPDPRGB= <>
##$CPDPRGT= <>
##$D= (0..31)
0 0.7 0 0 0 0 0 0 0 0 0 0.03 0 0 0 0 0 0 0 0 0 0 0 0 0 0 0 0 0 0 0 0 
##$DATE= 1765535828
##$DBL= (0..7)
120 120 120 120 120 120 120 120 
##$DBP= (0..7)
150 150 150 150 150 150 150 150 
##$DBP07= 0
##$DBPNAM0= <>
##$DBPNAM1= <>
##$DBPNAM2= <>
##$DBPNAM3= <>
##$DBPNAM4= <>
##$DBPNAM5= <>
##$DBPNAM6= <>
##$DBPNAM7= <>
##$DBPOAL= (0..7)
0.5 0.5 0.5 0.5 0.5 0.5 0.5 0.5 
##$DBPOFFS= (0..7)
0 0 0 0 0 0 0 0 
##$DE= 6
##$DECBNUC= <off>
##$DECIM= 32
##$DECNUC= <off>
##$DECSTAT= 4
##$DIGMOD= 1
##$DIGTYP= 9
##$DL= (0..7)
0 120 120 120 120 120 120 120 
##$DP= (0..7)
150 150 150 150 150 150 150 150 
##$DP07= 0
##$DPNAME0= <>
##$DPNAME1= <>
##$DPNAME2= <>
##$DPNAME3= <>
##$DPNAME4= <>
##$DPNAME5= <>
##$DPNAME6= <>
##$DPNAME7= <>
##$DPOAL= (0..7)
0.5 0.5 0.5 0.5 0.5 0.5 0.5 0.5 
##$DPOFFS= (0..7)
0 0 0 0 0 0 0 0 
##$DQDMODE= 0
##$DR= 18
##$DS= 0
##$DSLIST= <SSSSSSSSSSSSSSS>
$$ [...]
##$SUBNAM0= <"">
##$SUBNAM1= <"">
##$SUBNAM2= <"">
##$SUBNAM3= <"">
##$SUBNAM4= <"">
##$SUBNAM5= <"">
##$SUBNAM6= <"">
##$SUBNAM7= <"">
##$SUBNAM8= <"">
##$SUBNAM9= <"">
##$SW= 18.0517328524113
##$SWIBOX= (0..15)
0 0 2 0 0 0 0 0 0 0 0 0 0 0 0 0 
##$SW_h= 3612.71676300578
##$TD= 16384
##$TD0= 1
##$TE= 0
##$TE2= 300
##$TE3= 300
##$TEG= 300
##$TL= (0..7)
0 120 120 120 120 120 120 120 
##$TP= (0..7)
150 150 150 150 150 150 150 150 
##$TP07= 0
##$TPNAME0= <>
##$TPNAME1= <>
##$TPNAME2= <>
##$TPNAME3= <>
##$TPNAME4= <>
##$TPNAME5= <>
##$TPNAME6= <>
##$TPNAME7= <>
##$TPOAL= (0..7)
0.5 0.5 0.5 0.5 0.5 0.5 0.5 0.5 
##$TPOFFS= (0..7)
0 0 0 0 0 0 0 0 
##$TUNHIN= 0
##$TUNHOUT= 0
##$TUNXOUT= 0
##$USERA1= <user>
##$USERA2= <user>
##$USERA3= <user>
##$USERA4= <user>
##$USERA5= <user>
##$V9= 5
##$VALIST= <valist>
##$VCLIST= <CCCCCCCCCCCCCCC>
##$VD= 0
##$VDLIST= <DDDDDDDDDDDDDDD>
##$VPLIST= <PPPPPPPPPPPPPPP>
##$VTLIST= <TTTTTTTTTTTTTTT>
##$WBST= 1024
##$WBSW= 4
##$XGAIN= (0..3)
0 0 0 0 
##$XL= 0
##$YL= 0
##$YMAX_a= 171424
##$YMIN_a= -150092
##$ZGOPTNS= <>
##$ZL1= 120
##$ZL2= 120
##$ZL3= 120
##$ZL4= 120
##$ABSF1= 10
##$ABSF2= 0
##$ABSG= 5
##$ABSL= 3
##$ALPHA= 0
##$AQORDER= 0
##$ASSFAC= 0
##$ASSFACI= 0
##$ASSFACX= 0
##$ASSWID= 0
##$AUNMP= <proc_1d>
##$AZFE= 0.1
##$AZFW= 0.1
##$BCFW= 1
##$BC_mod= 2
##$BYTORDP= 1
##$COROFFS= 0
##$CY= -3
##$DATMOD= 1
##$DC= 2
##$DFILT= <>
##$DTYPP= 0
##$F1P= 0
##$F2P= 0
##$FCOR= 0.5
##$FTSIZE= 0
##$FT_mod= 4
##$GAMMA= 1
##$GB= 0.15
##$INTBC= 1
##$INTSCL= 1
##$ISEN= 128
##$LB= 0.25
##$LEV0= 0
##$LPBIN= 0
##$MAXI= 10000
##$MC2= 0
##$MEAN= 0
##$ME_mod= 0
##$MI= 1.114404
##$NCOEF= 0
##$NC_proc= 0
##$NLEV= 6
##$NOISF1= 3.799351
##$NOISF2= 2.8
##$NSP= 1
##$NTH_PI= 0
##$NZP= 0
##$OFFSET= 14.38212
##$PC= 1
##$PHC0= -3707.921
##$PHC1= 8.39234
##$PH_mod= 1
##$PKNL= yes
##$PPARMOD= 0
##$PSCAL= 0
##$PSIGN= 0
##$REVERSE= no
##$SF= 200.129724274929
##$SI= 16384
##$SIGF1= 3
##$SIGF2= 2
##$SINO= 400
##$SIOLD= 16384
##$SREGLST= <1H.CDCl3>
##$SSB= 0
##$STSI= 0
##$STSR= 0
##$SW_p= 3205.1282051282
##$SYMM= 0
##$S_DEV= 0
##$TDeff= 0
##$TDoff= 0
##$TI= <>
##$TILT= no
##$TM1= 0
##$TM2= 0
##$TOPLEV= 0
##$USERP1= <user>
##$USERP2= <user>
##$USERP3= <user>
##$USERP4= <user>
##$USERP5= <user>
##$WDW= 1
##$XDIM= 8192
##$YMAX_p= 0
##$YMIN_p= 0
$$ End of Bruker specific parameters
$$ ---------------------------------
##NTUPLES= NMR FID
##VAR_NAME=  TIME,          FID/REAL,        FID/IMAG
##SYMBOL=    X,             R,               I
##VAR_TYPE=  INDEPENDENT,   DEPENDENT,       DEPENDENT
##VAR_FORM=  AFFN,          ASDF,            ASDF
##VAR_DIM=   8192,          8192,            8192
##UNITS=     SECONDS,       ARBITRARY UNITS, ARBITRARY UNITS
##FACTOR=    0.0002768,     1,               1
##FIRST=     0,             0,               0
##LAST=      2.2672688,     0,               0
##MIN=       0,             -150092,         0
##MAX=       2.2672688,     171424,          0
$$ Real data points
##PAGE= N=1
##DATA TABLE= (X++(R..R)), XYDATA
0@%%%%%%%%%%%%%%%%%%%%Oj4J6j6J6j6J6k1K9l2L2l8M6n0N6o2P0q0Q8j00J12j22
$$ 0 0 0 0 0 0 0 0 0 0 0 0 0 0 0 0 0 0 0 0 0 6 -8 8 -8 8 -8 8 -13 16 -16 16 -22 24 -26 30 -32 38 -42 46 -54 58 -64
42f4J36j52J68j85K03k24K47k71K99l30L63m00M43m90N44o10O84p68Q73j001J164
$$ -64 72 -80 88 -97 106 -118 129 -142 157 -173 190 -210 233 -257 287 -323 361 -407 466 -535 629
63F29j379J676k116K824m173P641l3759p7435N4530J17054P4397k3579p6666q5834
$$ 629 -750 926 -1190 1634 -2539 5102 -28657 -106092 -51562 65492 139889 116310 39644 -46190
77d6190p0925l2977N1087J23983J03285j0138r5059o9278J4842M7390J6824k0879
$$ -46190 -117115 -150092 -99005 24978 128263 118125 23066 -46212 -31370 16020 32844 11965
89A1965k7101l1486l8157p039P4295J24089O4858o2909j30461q4991M264M9923
$$ 11965 -15136 -46622 -84779 -91818 -17523 106566 171424 108515 -21946 -106937 -102673 -52750
101e2750M7358L4234J5522k1880m7760j4323N7820P8500K432r2809j04448k9416
$$ -52750 -5392 28842 44364 22484 -25276 -39599 18221 96721 99153 6344 -98104 -127520
113a27520M6252O9218O0072M4048O570n3072q4401l9734M0010O3594J0105m8149
$$ -127520 -81268 -12050 48022 92070 98640 45568 -38833 -78567 -38557 25037 35142 -13007
125a3007m3817M889L9043M3870M0490K3987k8271q8353q9406r738P8012Q6953
$$ -13007 -56824 -51935 -12892 30978 71468 95455 67184 -21169 -110575 -120313 -42301 44652
137D4652K3636l2156l4154r745M008R969J8611J0594k9924o4776m1029L5608Q8141
$$ 44652 68288 36132 1978 -7767 -3759 6210 24821 35415 5491 -59285 -100314 -64706 23435
150B3435O4785o5m2833m6152l5765k2600P552M3278M2374m343m6063k7976L0448
$$ 23435 88220 88155 45322 -830 -36595 -59195 -51643 -8365 34009 29666 -16397 -44373 -13925
163a3925N9227K8683k3540m9550m5660l0467p0M5050P1444M2549k3802o2073l5882
$$ -13925 45302 73985 50445 895 -44765 -75232 -75302 -30252 41192 83741 59939 -2134 -38016
176c8016J5629L2302Q211j6628j9685j3672p763J1952M4113N2529J2537m7650
$$ -38016 -22387 9915 18126 1498 -18187 -31859 -39622 -27670 16443 68972 81509 33859
188C3859o7438l3551J4497L3471K6648J5827M432j4928k4806n497K9084L4724
$$ 33859 -33579 -67130 -52633 -19162 7486 23313 27745 12817 -11989 -17486 11598 46322
200D6322o584n1240n0261o123L5864M5384L1931J1577j3276l8722m1463q156K9816
$$ 46322 39738 -11502 -61763 -67886 -32022 13362 45293 56870 43594 4872 -36591 -44747 -14931
213a4931L3141j153k8383j9225J0138K6737K2472J2743j211k4024m5143l5601
$$ -14931 18210 17057 -11326 -30551 -20413 6324 28796 41539 40328 16304 -28839 -64440
225f4440P906M6981M4761P454k1774k2038p555K651P676J0765K080j9636l2690
$$ -64440 -56534 -9553 35208 42662 20888 -1150 -8705 -6054 1622 12387 14467 -5169 -37859
238c7859j2654K9416N0326K8642j1653l3857k9387j4695p41J3657K3864J5512
$$ -37859 -50513 -21097 29229 57871 46218 12361 -17026 -31721 -32462 -18805 5059 20571
250B0571q115k2602q066J9368K7981O700j9272k8307k1596q162R290K9575L5856
$$ 20571 12456 -10146 -18212 1156 29137 35837 16565 -11742 -33338 -41500 -32210 -2635 33221
263C3221J5056k0448l6291j7871J0582K0305O095r485j3177q243J40J4921K6834
$$ 33221 48277 27829 -8462 -26333 -15751 4554 10649 1164 -12013 -20256 -20116 -5195 21639
276B1639K2256n682l4368l5642j0209J7374K3679J3544L555k938r840j0066R82
$$ 21639 43895 38213 3845 -31797 -42006 -24632 -953 12591 16146 13208 3368 -6698 -5716
289e716J4936J2506r071k7017k1681K960K3579K6403J5434K68j5099k4961j9826
$$ -5716 9220 21726 12655 -14362 -36043 -33083 -9504 16899 32333 32601 17502 -7459 -27285
302b7285K413K0624J7714l175j7417j0507Q619J7918J3762K724q858k0367k2986
$$ -27285 -24872 -4248 13466 10291 -7126 -17633 -9014 8904 22666 25390 16532 -3835 -26821
315b6821j0017J3502K8765K0387j625j5166j3248k643L170M997M689j502j1951
$$ -26821 -36838 -23336 5429 25816 24191 9025 -4223 -6866 -3696 1301 5990 4488 -7463
328g463j5016j327J9794K7252J2203j1508k3390j8795n912N639J3645J4523M540
$$ -7463 -22479 -23806 -4012 23240 35443 23935 545 -18250 -24162 -18523 -4878 9645 14185
341A4185r106j2767r42J3652J4193m84j5440j8020r749J804J2184J9118J5861
$$ 14185 5079 -7688 -8630 5022 19215 18731 3291 -14729 -24478 -22674 -10490 8628 24489
354B4489J536j5384j9926p811P777J1681L519n127q078m290K788J1074J5616Q618
$$ 24489 26025 10641 -9285 -17096 -9319 2362 5881 754 -7324 -11614 -8826 2248 17864 26482
368B6482r287k2696j9731j317J4919J7190Q324j441o871p566l251M368Q468L005
$$ 26482 17195 -5501 -25232 -26549 -11630 5560 13884 12443 5572 -1994 -5245 -877 7591 10596
382A0596q661j5836q245P007J6424J4656N496m316j2903j4251q317M551J3368
$$ 10596 1935 -13901 -22146 -15139 1285 15941 21437 17121 4218 -10033 -18350 -13799 -431
395d31R304k686r721n304N454J0536Q189l46r458j4654j1732n04J3681J7890Q692
$$ -431 8873 6187 -3534 -8838 -3384 7152 15341 14995 5537 -9117 -20849 -21353 -7672 10218 18910
410A8910m974j1455q402j56M073M044J681m231o964n416L912J2737J3187K615
$$ 18910 13936 2481 -5921 -6077 -2004 2040 3721 -510 -7474 -12890 -8978 3759 16946 19561
424A9561r313j4562j0500j193O732J0202P872M08p018p115O63Q229P177k131j0176
$$ 19561 10248 -4314 -14814 -16007 -9275 927 8799 9207 2189 -4926 -4263 3966 11143 9012 -1164
439a164j1386l505M547J1170J1374N936m368j1485r901j784N957O762J133l602
$$ -1164 -12550 -16055 -11508 -338 11036 16972 12604 1119 -8782 -10566 -4609 2153 3286 -316
453c16m381j240L893O995P211J162p664j3001q856J675J0278J0808M432k394o750
$$ -316 -4697 -5937 -2044 4951 12162 13324 5660 -7341 -16197 -14522 -4244 6564 10996 8602 1852
468A852n260j028M313N068Po630q215k363O257J1003P693K80n963r231p237j303
$$ 1852 -3408 -4436 -123 4945 4952 -1678 -9893 -12256 -5999 5004 12697 12977 7014 -2217 -9454 -10757
484a0757N138P234L795k234m915j870K928N356L330j604o271p872m767K017R576
$$ -10757 -5619 1615 5410 3176 -1739 -3609 -681 4675 8005 6401 130 -7742 -12509 -10492 -916
499i16R570L643m530q052n258M47L738L569L06l473m636j070M632P190N582q15
$$ -916 8654 12297 7767 -285 -5543 -5096 -1358 2211 2517 -956 -5592 -6662 -2030 5160 10742 9927
515I927p248q595m190J314N719O052L059q91m404l356Q45L361L485j685n138n587
$$ 9927 2679 -5916 -10106 -8792 -3073 2979 6038 5147 743 -2613 -1768 1593 5078 3393 -1745 -7332
531g332j405L743P244O019J575m565p212m839M76M180M140R44l068k418j97K424
$$ -7332 -8737 -4994 2250 8269 9844 5279 -1933 -6772 -6296 -2116 2024 2968 -100 -2518 -2715 -291
547b91M492K351j182n339o341k311J997O376N288J837k342m179l413j83K648K791
$$ -291 4201 6552 5370 31 -6310 -8621 -6624 -248 5040 6877 4535 356 -3057 -3240 -592 2199
563B199k9l029l869o26L302N686M124j063m585n752l482J231M300M184J492k058
$$ 2199 2170 -859 -4728 -5354 -2052 3634 7758 6695 2110 -3642 -7124 -5893 -1593 2591 4083 2025
579B025k887q54J406K730J238j570l375l936j090K614M829M308J146k925m906
$$ 2025 -862 -1716 -310 2420 3658 2088 -1287 -5223 -6313 -3699 1130 5438 6584 3659 -1247
594a247l001J29K773K856M67j805k343o07K359M043J960j235m527m284j735J943
$$ -1247 -4248 -4119 -1346 1510 1977 172 -2171 -2778 -419 3624 5584 4349 -178 -4462 -6197 -4254
610d254M193L427O66j366k933j743Q93J697J479j048k553k028j89K222L727K577
$$ -4254 -61 3366 4032 2666 -267 -2010 -1117 580 2059 1011 -1542 -3570 -3759 -1537 2190 4767
626D767M8k917m264k486Q05K938L182Q70j647k548R5Q83K528J129j299l181l045
$$ 4767 4815 1898 -2366 -4852 -4047 -1109 2073 2943 1296 -1252 -1157 -274 2254 3383 2084 -1097 -4142
643d142p27K585L673K514M08k325k859j646N09J387J687K18j703j751p4K235K473
$$ -4142 -4869 -2284 1389 3903 4311 1986 -873 -2519 -2010 -623 1064 1282 -421 -2172 -2246 -11 2462
660B462J923r16l282l369j555J653K970K619J165k394k153p92R26J801P06o64
$$ 2462 4385 3469 187 -3182 -4737 -3084 -114 2505 3670 1276 -877 -1669 -743 1058 1764 1100
676A100k429j859K11K002L015J732k52k168k948j514M68K309J447P01j450j346
$$ 1100 -1329 -3188 -2977 -975 2040 3772 3520 1352 -1596 -3110 -2642 -333 1114 1815 365 -981
692i81l69J449J695J021j123k470k440l40J521K777K478p0j811k472p13N94J450
$$ -981 -1350 99 1794 2815 1692 -778 -3218 -3558 -2037 740 3218 3148 1337 -1135 -1848 -1254 196
709A96J074n50j338j183k46K376K003Q27p53k473k204j030J180K207J334M03j077
$$ 196 1270 720 -618 -1801 -2047 329 2332 3159 2406 -67 -2271 -3301 -2121 86 1420 1823 746
726G46r53q98Q65J047J016j169j605j547k05J901K334J306k21j907k093r68Q98
$$ 746 -207 -1105 -240 807 1823 654 -951 -2498 -2703 -802 1532 2838 2617 710 -1383 -2351 -1453
743a453J621P04m0j158q21K65R46J570L49p61j768j661l55R79J873J783J69j427
$$ -1453 168 872 832 -326 -1147 -882 64 1634 1983 1222 -546 -2207 -2562 -1583 290 2073 2242 815
761H15j646l47N34P62J079q19j370p36L86J152J708Q78m31k027j695l46O47J568
$$ 815 -831 -1178 -644 118 1197 378 -992 -1728 -1342 -190 1518 2396 1965 -62 -1757 -2103 -1456 112
779A12Q84J17o97q23l50R34R02K05o66j473r31j15J156J674J425m47j495j449
$$ 112 996 1113 416 -407 -757 177 1079 1284 618 -855 -1786 -1901 -745 929 2354 1907 412 -1037
797a037l48M47J040N95q2r34r86N19J086J141J50n44j644j144m6Q80J403Q19k57
$$ -1037 -1385 -938 102 697 615 -319 -1305 -786 300 1441 1591 1047 -597 -1741 -1787 -907 496 1315 1058
816A058q05n64m89J54R67N39p18o01n94l8R26J092L34J9r98j443j29M20J142L91
$$ 1058 253 -311 -800 -646 321 860 142 -459 -1053 -1091 -165 927 1261 1280 282 -1161 -1290 -870 272 663
836F63j01n67o91J96O20O70J23n28j231p55L15R21Q93P63n3o87j001m08O08L28
$$ 663 562 -5 -696 -500 120 790 913 385 -846 -1601 -1286 -365 528 1291 1238 551 -450 -858 -250 78
856G8M84j04p39n39K24P49R30J2k64q73j080j09O77Q88L35K6o71k16j33J72O50
$$ 78 562 458 -281 -820 -596 153 1083 1095 831 -42 -1122 -1231 -554 334 669 695 24 -192 -325 -153 497
877D97J71l91q86q4n1N68P58K92k23n32p26l13N57N38K09Q1o35l04J41M34N94
$$ 497 668 277 -609 -693 -744 -176 582 874 651 119 -607 -920 -363 175 384 465 -170 -474 -333 101 695
898F95j61l8p66l04l5M38M84L95o9o73m79j9M12L17J80L2o72j19j90N36O22J57
$$ 695 534 496 -270 -574 -609 -171 313 708 639 -34 -513 -532 -120 197 377 409 -263 -382 -572 -36 586 743
920G43k15o89l87k58L21O85L79n13N6n4k81p9P34k0l13j04p66J93M81N64J73m78
$$ 743 528 -161 -548 -806 -485 200 579 66 122 68 -213 -292 442 422 109 5 -761 -568 -87 477 650 172
942A72m1m41k68K88L01L40L4k42l75r4J39N29j92N1k26m46J79P1L85L32l16N9
$$ 172 131 -310 -578 -290 11 351 385 143 -232 -326 -187 342 150 201 -25 -471 -292 -221 164 496 180 239
964B39m50m50L26N88j09K92n16k50K0J86N58K85n59j8n86j79M10N89P0k43k07
$$ 239 -211 -661 -335 253 144 436 -80 -330 -310 -124 434 719 160 142 -444 -623 -213 376 446 203 -4
985dk86O2L55j17M82m22l57j05J65K76N15j13L7q48j26K15L07O2J48l94J28o3
$$ -4 -290 -228 127 10 492 70 -287 -392 -227 49 564 451 488 -360 -486 -271 36 98 246 -148 -20 -83
1007h3j11M45n6K43k58l30l38J45K9O20J06J6n05k14N1L5N92l75Pj16p8j32K15
$$ -83 -194 251 195 438 180 -150 -488 -343 -314 306 412 428 -77 -291 -240 -205 387 12 19 -97 -175 -307 -92
1030i2L70K97j83k76m46j4Q9M85m0K42m33k56j6L27J55O1J72o03l35M8L43L77
$$ -92 278 575 392 116 -330 -344 -255 230 190 432 -1 -257 -273 54 209 270 442 -161 -496 -448 -105 272
1052B72J09j90m08K16k47j17N19o0Or3m08L28J44K80J23k2n80l25J11K34L12L00
$$ 272 381 191 -217 -1 -248 -365 154 94 100 7 -401 -73 71 351 474 452 -128 -453 -342 -108 204 504
1074E04j71p2n11J6J29M12q9J4m99j09J80L60K60j78mo0j72n31N67J56j65P2k98
$$ 504 333 261 -250 -234 -105 307 218 232 -267 -376 -196 164 424 246 242 182 10 -521 46 202 37 109 -189
1097a89k7J67O9J38K52m10m7m49K42K54L34k63K77l53Ok35K12L58Ok1k42k64J49
$$ -189 -216 -49 20 158 410 0 -47 -496 -254 0 334 71 348 -5 1 -234 -22 336 342 321 79 -185 -36
1120c6j40M72M7k33j63j25J9M5L9o4J83k28K70l05L05J23M9j41k08j69J02O2n7
$$ -36 -176 296 343 110 -53 -178 -159 -114 -75 -139 44 -184 86 -219 86 209 258 117 -91 -260 -158 -96 -153
1143a53M32P9m53O8K31kj50L4n7k69L9j32L11M28j14j86q0k96q5K11K75J68j00
$$ -153 279 358 -95 -27 204 202 52 86 29 -240 -201 -333 -22 406 292 106 26 -270 -355 -144 131 299 199
1166A99r3k16n2L79j28j1p8k76j17K87J34k8j1n0j47J03P6j8n8J54j57K9k08K36
$$ 199 106 -110 -162 217 89 78 0 -276 -393 -106 28 0 -11 -61 -208 -105 -29 -47 -105 49 -108 -79 -287 -51
1190e1J82J76P2j76m48L3k41J46L44J01k17Q3M7n6K46q6j1k36r4k72L50Q9J89
$$ -51 131 307 379 203 -245 -212 -453 -307 37 138 -79 4 51 -5 241 155 144 -92 -186 -458 -108 -19 170
1213A70K68m80O8k43K7K17Q7j02p6k77P6K46K09K06k05J75p00kjN07R1L5k36o8
$$ 170 438 -42 26 -217 -190 27 114 12 -64 -341 -265 -19 190 396 191 366 -334 -336 -337 170 261 296 60 -8
1237hr0n1L71j71J47j95k97j09L17R1L77n2k74k46P4N9Q9K52l21K85j79j94J8
$$ -8 -98 -149 222 51 198 3 -294 -403 -86 5 382 330 56 -190 -116 -57 32 284 -37 248 69 -125 -107
1260a07M95j96P9m14m70K81P8M82K98j71N6m88l1M3M20k36K1k32k95j23O02K26
$$ -107 388 192 271 -143 -613 -332 -254 228 526 355 411 -77 -108 -65 355 119 140 -92 -387 -510 92 318
1282C18J2J21k03l15k72K03K82Q4L37m96J2k00L3K48k23L0k22k07O5O2N55K28
$$ 318 330 451 248 -67 -339 -136 146 230 567 71 83 -117 -84 164 -59 -29 -251 -458 -393 -331 224 452
1304D52j57p2o49J49K23K50k2j99J87l24L47n0J0K52l91k15k17j89O17P8lP1L57
$$ 452 295 223 -426 -277 -54 196 174 -25 162 -162 185 135 145 397 6 -209 -426 -615 2 80 77 148 505
1327E05o66NP6L02J61m29p0j67l2O04k18K96r2m03l65J43NJ25N8P8q0r8N24r7
$$ 505 -161 -156 -80 222 383 -46 -116 -283 -315 289 71 367 275 -128 -493 -350 -345 -220 -162 -84 -164 -262 262 165
1351A65J72J70k15m80k69j60N30L25K69j13l73k21M1J92K3Q3l59L1j89K81L04
$$ 165 337 507 292 -188 -457 -617 -87 238 507 394 21 -200 -159 33 56 139 -220 -189 -378 -97 207
1372B07N43k60m57l32j76k2L06L63j44N6j9k21R6n7N90k27r3p32n1J31J057M28
$$ 207 750 490 33 -299 -475 -497 -191 172 28 84 65 -156 -60 -117 473 246 153 -579 -630 -499 558 986
1394I86j259O71n57j52q5M82J4r5n5J77k90J14N21J75n66l50k32j67K57N01K69
$$ 986 -273 398 -159 -311 -396 86 100 5 -50 127 -163 -49 472 647 81 -269 -501 -668 -411 90 359
1415C59P7k13j93r3j5j35L26j91k41R4nP4P72l9j78k23m37j48q7M67N7K85l79
$$ 359 436 223 30 -63 -78 -213 113 -78 -319 -225 -230 -156 616 577 399 176 -261 -409 -496 -29 28 313 -66
1438f6o2k6N09Lnl75J4o13j1K71L87M86m18J62M7l35q0j20M44p0m19j1j70M61
$$ -66 -128 -154 355 358 353 -22 -8 -621 -632 -361 26 512 94 256 303 -32 -112 -232 212 142 -277 -288 -458 3
1462CM50R5l61q4n94L9L58LJ64K6k8r3R5K06j31k26l7k99j04K59L00M09M2m9l81
$$ 3 453 548 187 103 -491 -452 -94 -91 73 99 71 -22 73 279 148 -78 -115 -414 -518 -259 41 450 492 443 62
1487F2l99k4P1J85LJ6k01N6o5N73k09K44j95l15m39Q2K74N95k08J71j22p6NpK69
$$ 62 -337 -361 -290 -105 -102 -86 -287 -231 -296 277 68 312 117 -198 -637 -555 -281 314 106 277 155 79 84 77 346
1512C46j70k12l81N41m98K33N43J32k10l19m02j77L80QL73oP9k88K04Q8O0K74
$$ 346 176 -36 -417 124 -374 -141 402 534 324 5 -397 -574 -194 -186 187 181 260 -28 176 264 324 598
1534E98m68l91l17O4L40L55L43k40j22l45J0L12k59K29l02k94K85L21j29N04k51
$$ 598 130 -261 -578 -514 -174 181 524 284 162 -183 -173 139 -120 109 -193 -487 -202 119 -10 494 243
1555B43j2j70k33n84M16M82K45J7m08K26j54K63K12j40n04l00j87L06L84K64q9
$$ 243 231 61 -172 -756 -340 142 387 404 -4 222 68 331 543 403 -101 -401 -588 -282 102 366 277
1576B77P5n20R0l62J59M9M02J6J9l26K07J52N0J19k88j83k49o1J72K81K61p6p0
$$ 277 352 -168 -78 -440 -281 -232 170 186 205 -121 86 238 288 407 119 -64 -313 -374 -202 79 340 264 194
1599A94j61j17K19j44J42k67k02L9J00M12K6K47k97l03rm1q0J36K20Pr8j41m9
$$ 194 33 -84 135 -9 133 -134 -336 -297 -197 215 241 488 191 -112 -121 -162 -242 -106 114 121 23 -118 -167
1622a67M03K42l74J04m68k09k0L41J85L15R8p44J53r0K83Rk88K45m8Lk8K03L39
$$ -167 236 478 104 208 -260 -469 -489 -148 37 352 450 -294 -141 -231 52 61 -227 18 -30 -27 -55 148 487
1645D87n7m20k60r0J2m7L68M8J88n4j68J08J04K3j66j75J5m85K22N41K54k6k48
$$ 487 430 10 -250 -340 -328 -375 -7 41 229 175 7 115 219 242 76 -99 -84 -569 -347 194 448 422 174
1668A74l12J22m6j32J47J4J45k99K3MJ12L66j5k93k24j35L09j80K46L72k38j98
$$ 174 -138 -16 -62 -194 -47 -33 112 -187 -164 -160 -48 318 303 10 -214 -349 -40 -220 26 398 160 -38
1690c8NK2l8K22r1k44j44K71N7k8M01J67j87l98j26k4J14k36M13M4J54m09L19
$$ -38 -33 -11 -49 173 82 -162 -306 -35 22 -6 395 562 375 -23 -149 -173 -59 -295 118 162 316 -93 226
1713B26n4k61L15m71K42k27N4J49L58J72m88J88j08j83M7K10k17k03J00j34N43
$$ 226 172 -89 226 -245 -3 -230 -176 -27 331 503 15 203 95 -88 -41 169 -48 -251 -151 -285 258
1734B58m70O89k73k5j81l67J29K27J50n0K25m08K51r2J61j4k7j06o78M48qK59
$$ 258 -212 477 204 179 -2 -369 -240 -13 137 87 312 -96 155 63 224 210 183 77 -601 -153 -161 98
1756I8K18j56K32n20J20n9k9Q7K27k14l29O12j36J44J23l29N1k76R5r3q0J28J06
$$ 98 316 160 392 -128 -8 -67 -96 -9 218 4 -325 287 151 295 418 89 140 -136 -41 -134 -214 -86 20
1779B0K51j16k18J98J61m31J05r5j28k45K44M02Q1K7p1n57M28j95k12L90p2j22
$$ 20 271 155 -63 135 296 -135 -30 -125 -253 -498 -254 148 229 256 185 -372 56 -139 -351 39 -33 -155
1801a55j23J02j68L18n3K56n6o40K48K26l1K39P3O7n7m23J02J27k26K45j01pJ85
$$ -155 -278 -176 -344 -26 -79 177 121 -519 -271 -45 -76 163 236 303 246 -177 -75 52 -174 71 -30 -37 148
1824A48j28J01l5J22p1j9l96q4J3J14J59J41q5m1j28J27J27p2J45j58m49M56j6
$$ 148 20 121 86 208 137 118 -278 -362 -349 -235 -76 65 -20 -61 -189 -62 65 -7 138 -20 -469 -13 -29
1847b9K00l1J40k80q8j82J01J87K20k52O6O6m14K89j44L83M2l1o07J67N0J29m6
$$ -29 171 140 280 0 -88 -270 -169 18 238 -14 52 118 -296 -7 -151 232 274 243 -364 -197 -147 -18 -64
1870f4K79j15o0m2o1k88N08j93k44K57n3J08k01N19q2k72R7l01j07K82J36R8l02
$$ -64 215 100 40 -2 -63 -351 157 -36 -280 -23 -76 32 -169 350 268 -4 93 -208 -315 -33 103 201 -101
1893a01J83Kj43L73j10l25j96j35K42l7J23M61k43j9Q6l68J86L49l01k29J00J8
$$ -101 82 84 -59 314 204 -121 -317 -452 -210 -247 -124 337 94 75 161 -207 -21 328 27 -202 -102 -84
1915h4o0L87k8K23l02m67J55n06Q22r0q1J73q8K01k59n3N4q8J33o3k40Q9M6K61
$$ -84 -144 243 215 438 136 -331 -176 -682 140 50 -31 142 54 255 -4 -57 -3 -91 42 -21 -261 -172 -126 135
1939A35M3J78k56q4j13p1J05K7K45j84l53K52P4J28J45k70k63J86L8k65N23J30
$$ 135 178 356 100 16 -97 -168 -63 -36 209 25 -328 -76 -2 126 271 1 -262 -76 -38 -303 220 350
1961C50n7j77j7k58K66L9m9j7k58J50l12J43L53L08j54l63l40K42L3MK14J66j71
$$ 350 293 116 99 -159 107 146 97 80 -178 -28 -340 -197 156 464 310 -53 -393 -151 -118 -114 100 266 95
1984I5k47M5jK93p9J12j46m04M32k73K82J31O3o3l08j27j41O42n3p0q1l16j76
$$ 95 -152 -107 -108 185 106 218 72 -332 100 -173 109 240 303 240 -68 -195 -336 306 253 183 102 -214 -390
2007c90M42k20M06Q0j65l63l17K24L0N55j88R9O4j53l87L73J05M8l76K19l04L45
$$ -390 52 -168 238 318 153 -210 -527 -303 -273 282 94 193 257 104 -283 90 195 243 -133 86 -218 127
2029A27J64J97j14l91J6k11J10L58n6m2R8k51j64K28p0M98l14j85j81J0j62M15
$$ 127 291 488 374 -17 -1 -212 -102 256 200 158 256 5 -159 69 -1 497 183 -2 -183 -173 -335 80
2051H0K12j61o8j59p6%k1K19P4j55J34m30O21j93K12k9j26n33o5J26K96R8kJ19
$$ 80 292 131 63 -96 -172 -172 -193 26 100 -55 79 -351 270 77 289 260 134 -399 -464 -338 -42 56 54 173
2075A73k35k30L09P5R1n9l44J85J6K19j00K03O3k09l12j11M5K42L37k70mk97J03
$$ 173 -62 -292 17 92 183 124 -220 -35 -19 200 100 303 366 157 -155 -266 -221 21 358 88 84 -213 -110
2098a10J0O02j06j72k10l48j00J66M00N0o9j67r4M3K44k98L29J4o3m16m3N85J42
$$ -110 -100 502 396 224 14 -334 -434 -268 132 182 113 -54 -148 -105 139 -159 170 184 121 -295 -338 247 389
2121C89j4j3l55J7k75K34M5J52Q5j06l89j19N88j56L70l47l58O4l52M30N5K06
$$ 389 375 362 7 24 -251 -17 28 180 265 159 -230 -349 239 83 453 106 -252 -188 -540 -110 -55 151
2143A51K98l18m05J08l8L21J04j11k24n14K38K10K45L16k53r6l38J24J56L32j53
$$ 151 449 131 -274 -166 -204 117 221 110 -114 -628 -390 -180 65 381 128 32 -306 -182 -26 306 153
2164A53j17J20k70L7N8M39m97M38m49n57K39L92J99R8J49p6n40k0j85O92l57L15
$$ 153 36 156 -114 -77 -19 420 -77 361 -88 -645 -406 -14 185 283 432 356 -184 -204 -389 303 -54 261
2186B61o12M6L16QP2N0M0j00l08j23K38K82K29l33O4k85L25l17J45P7K72n55j21
$$ 261 -351 -305 11 19 91 141 181 81 -227 -350 -112 170 399 66 130 -155 170 -147 -2 75 347 -208 -329
2209c29O9j7K45L23Kk64r5j94K47J22j18J44m2l98L4L75K12J2m56J20k59n6K75
$$ -329 -260 -277 -32 291 293 29 -66 -260 -13 109 -9 135 93 -305 -271 104 316 328 -128 -8 -267 -323 -48
2232d8j1L00J95m07l80L37l40O00j2J9jn83K85n6M75N0k0m70j10n1J46K83K43
$$ -48 -59 241 436 29 -351 -14 -354 246 234 253 252 -331 -46 -102 373 423 403 -67 -177 -228 -82 201 444
2255D44k95J60n58J82R0J22k41O3k07O7j21L23N2M75j19n43p7n9J85J40K16m05
$$ 444 149 309 -249 -67 23 145 -96 -33 -240 -173 -294 29 81 556 437 -106 -183 -242 -57 83 299 -106
2277a06k31L27N0q0J56Q9j72k28j89J33L09L0K19l05M4l10J09lM90J5l56l23M9
$$ -106 -337 -10 40 -40 116 205 33 -195 -384 -251 58 88 307 2 46 -264 -155 -158 332 347 -9 -332 -283
2300b83K8L22M4P9j99L2j86j41J95J47k2j04Q5n2k88M75K24j39j84k44j18M7N29
$$ -283 -255 67 111 190 -9 23 -163 -304 -109 38 16 -88 -3 -55 -343 132 356 217 33 -211 -329 -282 247
2323B47j66L06Ln42p7J79Q9k63M12k12l80l1K88K25o2M54l50j6l75J68PK53J69
$$ 247 81 387 390 -152 -229 -50 39 -224 188 -24 -404 -435 -147 78 16 470 120 104 -271 -103 -96 157 326
2346C26j60l09%J37N9m4K54j65o15M43j56J24O18j38l02j21r8J63K24J7j79k72
$$ 326 166 -143 -143 -6 53 9 263 98 -517 -74 -230 -106 512 374 72 -49 -147 16 240 257 78 -194
2368a94K00l38J51K67L06o6k52j32j54K9K06N8K52n29K47m11K24L38k46K45k18
$$ -194 6 -332 -181 86 392 326 74 -58 -212 -183 23 81 333 -196 51 -360 -136 202 -44 201 -17
2389a7o8l97M07P3M43j4j98j29n2j45K19J23j87k69K33m80K69O66j7k86j84j92
$$ -17 -85 -482 -75 -2 441 427 229 100 48 -97 122 245 58 -211 22 -458 -189 477 460 174 -10 -202
2411b02l35L29J52K07J80j74k55J42n1K4K62j81k89o2J10l32N38J49J68l59l63
$$ -202 -537 -208 -56 151 331 157 -98 44 -7 17 279 98 -191 -253 -143 -475 63 212 380 21 -342
2432c42J26J58rL02k27mj99n9K36K36J07R1m88K2l85J08K78M78n1l03j54j10O3
$$ -342 -216 -58 -67 235 8 4 -195 -254 -18 218 325 416 -72 -50 -435 -327 -49 429 378 75 -79 -189 -126
2455a26J99J27j04j09m5P2J7NL61j09l92j83j8J64nL19J58k77l52J02L13R1j16
$$ -126 73 200 96 -13 -58 14 31 36 397 288 -104 -287 -305 -141 -146 173 331 54 -298 -196 117 208 92
2478I2o0j34n4r0M7J40L43m85O06m82j1O29o60J94o8k99J20k30M69K20R4j12j88
$$ 92 32 -102 -156 -246 -199 -59 284 -201 405 -77 -88 541 -119 75 7 -292 -172 -402 67 287 381 269 81
2501H1p06K20K78J68L55j26j84p81O27pJ60o71Q57l39l79l90M49M91j68M77j26
$$ 81 -625 -405 -127 41 396 270 86 -695 -68 -75 85 -586 271 -68 -447 -837 -388 103 -65 412 286
2522B86o86L90j004J520j098J428jk014J447q65M75L58J22n73K04k19j04L56L48
$$ 286 -400 -10 -1014 506 -592 836 835 -1179 268 -597 -122 236 358 -215 -11 -230 -334 22 370
2541C70p09j6k50J44J215j033M15M46j026j35O94J0k3L7L14k80L51j40p08K93
$$ 370 -339 -355 -605 -461 754 -279 136 582 -444 -579 115 125 102 139 453 173 524 384 -324 -31
2561c1Q94p28k28q3J97k2L5J27r2j6n13L93L14j46k1k43K57o03N97L67m02J83
$$ -31 863 135 -93 -176 21 -1 34 161 69 53 -460 -67 247 101 80 -163 94 -509 88 455 53 236
2583B36n31Q3L45j35J35J34j68j66K66j77Mn38O29P4n89K69R0L83k01L6J85n69
$$ 236 -295 -212 133 -2 133 267 99 -67 199 22 26 -512 117 191 -398 -129 -39 344 143 179 364 -205
2605b05o3L0q7M03k6O3O7j28P6j35j19L12j10l22J44J96J35q5k04Q5P7o7n23K06
$$ -205 -268 -238 -325 78 52 115 182 54 130 -5 -124 188 78 -244 -100 96 231 146 -58 27 104 37 -486 -280
2629b80K75J9o4r5K00k85J59J07J3J37l43p7J00J36J1J67j57R2q0J53l5l05L25
$$ -280 -5 14 -50 -145 55 -230 -71 36 49 186 -157 -234 -134 2 13 180 23 115 35 188 153 -152 173
2652A73m89J95R4l7J39J98q2k01J28j92J6q6j20M14J91n45J30J27Q1j05k36K20
$$ 173 -316 -121 -27 -64 75 273 191 -10 118 -74 -58 -144 -264 150 341 -204 -74 53 134 29 -207 13
2674A3k26N6K6K44r1K42m0M2n17n6M46j86J96q4P1K7j01J8j29K43k41q2j58j24
$$ 13 -213 -157 -131 113 22 264 224 266 -251 -307 139 -47 149 65 136 163 62 80 -49 194 -47 -129 -287 -411
2698d11K86K35J16j71J20q5P7q9k98J84l52J04K84l6K07r7P2K7q7O5k6O7m98Q9
$$ -411 -125 110 226 55 175 90 167 78 -220 -36 -388 -284 0 -36 171 74 146 173 86 151 125 192 -306 -217
2722b17J31O6L5K71PJ18k78m22K78j53R9Q5M7k4l7L6k03J78j6P3k90L5R3J68J9
$$ -217 -86 -20 15 286 293 411 133 -289 -11 -164 -65 20 67 43 6 42 -161 17 1 74 -216 -181 -88 80 99
2747I9m5k16Rk6j6J96j55K52k97M18j52J52k42K28n8o0n7l20o6L39J36L35l32
$$ 99 54 -162 -153 -179 -195 1 -154 98 -199 219 67 219 -23 205 147 87 30 -290 -356 -17 119 454 122
2770A22N3j74J9Jp3Q4j31j54R4J48j17M05J16j49K7l13j34j4k15M52k91L44J09
$$ 122 175 1 20 21 -52 32 -99 -253 -159 -11 -128 277 393 244 271 -42 -176 -190 -405 47 -244 100 209
2793B09j57r0M0M1Pj80ol68L80L99O6k09M5j78l44L18M2j01Q9k20J50M0K92J05
$$ 209 52 -38 2 43 50 -130 -136 -504 -124 275 341 132 177 -1 -345 -27 15 -86 3 -217 -67 -27 265 370
2817C70m3l16m9k20j87M39r2K84k62J62P3k64Q9J80p4l54j83K60J86r4N05l61
$$ 370 327 11 -38 -258 -445 -6 -98 186 -76 86 159 -105 -16 164 90 -264 -447 -187 -1 -95 410 49
2839D9L23l17m15j36N33j53K05k0n0m45M49M02l78M69n87J09l30P8K91L4J04j93
$$ 49 372 55 -360 -496 37 -116 89 69 19 -426 23 425 47 516 -71 38 -292 -214 77 111 215 22
2861B2K20j41m00k05M71m0R3k33K67j41J90K76k43J96m32o5k46J45M32J23j81
$$ 22 242 101 -299 -504 -33 -73 20 -213 54 -87 103 379 136 332 -100 -165 -411 -266 166 289 108
2882A08j20K27j64J20q6j42j68l9m9L67k54L39R3N5l87j63J43j34P8P2j30O7J62
$$ 108 -12 215 51 171 85 -57 -225 -264 -313 54 -200 139 232 287 -100 -263 -120 -254 -176 -104 -234 -167 -5
2905eP1L8J87r5j68k28O4k51K09K16L0L27j64k99J05K20k96M0j63J08j25Q8K44
$$ -5 66 104 291 196 28 -200 -136 -387 -178 38 68 395 231 -68 37 257 -39 1 -162 -54 -179 -91 153
2928A53k05K79j42P8k80l54L84p3K14r8K12j54k13K77k5l0J51o79Q6J60J20j4
$$ 153 -52 227 85 163 -117 -471 -87 -160 54 -44 168 14 -199 78 53 23 174 -505 -419 -259 -139 -153
2950a53K85jJ4k68K13l24n3O4R4p2J52j55L61K14n9j25l01l25m4L21K07j84K09
$$ -153 132 131 145 -123 90 -234 -287 -223 -129 -201 -49 -204 157 371 312 187 -114 -439 -483 -162 45 -139 70
2973G0O7k1j2K48n25J29j92J0K04m1J51L59l22j88Lj4M9j84L3J76j24J81j3l5
$$ 70 137 116 104 352 -173 -44 -236 -226 -22 -63 88 447 125 -63 -60 -74 -25 -209 -176 0 -124 57 44 9
2997IL07l17L32n40k83J79J68K40J87mo0r2Po4k17J92k32J16k87nM93j00L87r8
$$ 9 316 -1 331 -209 -492 -313 -145 95 282 278 218 126 133 69 -148 44 -188 -72 -359 -364 129 29 416 318
3021C18m0o79%K09lK90r5m1K20j48lK01m76k2M2k81J81P6K28M52j85k27J40k49
$$ 318 278 -401 -401 -192 -195 95 0 -41 179 31 28 229 -247 -269 -227 -508 -327 -251 -23 429 244 17 157 -92
3045i2J9L8l9J15l2J91l81K03J76J3K6k08l49N5J30J90R3J34k70K30l11M1J39
$$ -92 -73 -35 -74 41 9 200 -181 22 198 211 237 29 -320 -265 -135 55 148 282 12 242 -69 -28 111
3068A11m1P6l3k72N2O6L10J30j50j88k87km4O6K20r0J48j94J35J5K21M3j02l14
$$ 111 70 146 113 -159 -107 -41 269 399 249 61 -226 -228 -272 -206 14 -76 72 -122 13 28 249 292 190 -124
3092a24j89M8L57q0K48k15ok84J71l4o5K56j78J2O2K42R9j3k87J27j35l40J18
$$ -124 -313 -265 92 12 260 45 39 -245 -74 -108 -173 83 -95 -83 -21 221 320 307 20 147 12 -328 -210
3115b10R5J17J9L05m81L65j99o4J49O3k77m8J39l69M60j83K86K84l86q4n8k45
$$ -210 -115 2 21 326 -155 210 11 -53 96 159 -118 -166 -27 -396 64 -119 167 451 65 -19 -77 -322
3137c22L14J76j87P6K3r8J56j08N5l41n5k2K57J23J06o5l6j7R5k39m1K02M6l83
$$ -322 -8 168 -19 57 80 -18 138 30 85 -256 -311 -333 -76 47 153 88 52 35 130 -109 -150 52 98 -285
3161b85n1K48J5K92J32P7j29l91l51K65P7J03J59l25K88k79J75L02N6p6l44l40
$$ -285 -336 -88 -73 219 351 428 299 -92 -443 -178 -101 2 161 -164 124 -155 20 322 378 302 -42 -382
3183c82R1J74Q2J63m4K11k21j69k21K32J90j81j34J18K96r6m4M0J41k06k07j9
$$ -382 -291 -117 -35 128 84 295 74 -95 -316 -84 106 -75 -209 -91 205 109 65 105 246 40 -167 -186
3205a86J7k8J68P7J85P2j89n8q1j66O4j20L31m64P2M32L74Ll37j72j45k73K94
$$ -186 -169 -197 -29 48 233 305 116 58 -23 -189 -125 -245 86 -378 -306 126 500 503 166 -6 -151 -424 -130
3228a30k9K20J26j08n4k49L71L44j89j80m97n7N66k84K43J43o3j28k31J48L8l14
$$ -130 -159 61 187 79 25 -224 147 491 302 122 -375 -432 134 -150 93 236 173 45 -186 -38 0 -314
3250c14K96k19n1K69R9%OL19m41J59l34O3M4J45K31j75j31Q3K78n14K16K0m73
$$ -314 -18 -237 -288 -19 80 80 86 405 -36 123 -211 -148 -104 41 272 97 -34 49 327 -187 29 49 -424
3273d24K84n4LL25K22j53j44m8m54L00r1J57j42J98M5L18k98j78L24q5l40J65
$$ -424 -140 -194 -191 134 356 203 59 11 -443 -143 -234 -77 -219 -21 24 342 44 -134 190 105 -235 -70
3295g0L6q8K41Pj46J81k8j36J32r7K61l50k05L52k19o7J34J15R0k08J6q6o3j24
$$ -70 -34 -122 119 126 -20 161 133 -3 129 32 293 -57 -262 90 -129 -196 -62 53 143 -65 -49 -135 -198 -322
3319c22N1L95q6O4M6r4j72J95j1j10k10l5K31J58K42K42l99M1n92L50j12N6J60
$$ -322 -271 124 38 102 148 54 -118 77 66 -44 -254 -289 -58 100 342 584 185 226 -366 -16 -128 -72 88
3342H8o8N1l08L36K13k67k7m0l10l1J33L6L97j17J56k4m50J87k06N4L3M0L7j3
$$ 88 20 71 -237 99 312 45 18 -22 -332 -363 -230 -194 203 86 242 218 -232 -45 -251 -197 -164 -124 -87 -100
3366a00O9O6K05l7ml11K0k54M27k16L00j04J14J81k61r7J21j4j52j93JJ33K31
$$ -100 -31 35 240 203 199 -112 -92 -346 81 -135 165 61 175 356 95 -2 119 105 -47 -240 -239 -106 125
3389A25K24J2k85j64r8k3K29r0j1J72Ol95L92j49P2Q2l14N8K10n00L37j21K13
$$ 125 349 361 76 -88 -186 -209 20 -70 -81 91 97 -298 94 -55 17 99 -215 -157 53 -447 -110 -231 -18
3412a8J22j67N2k20K14l2L61o19K93o0J02L81k33M3k44l67L47l17K69N71o73K59
$$ -18 104 -63 -11 -231 -17 -49 312 -307 -14 -74 28 409 176 219 -25 -392 -45 -362 -93 478 -195 64
3434F4j29K97r5M1J23k74k33J27l18L99m0Q0J24m3l54J82J35j90PR2k38j28J34
$$ 64 -65 232 137 178 301 27 -206 -79 -397 2 -38 42 166 123 -231 -49 86 -104 -97 -5 -243 -371 -237
3457b37N37Q1J1j40k60o2l24L67Lk26M90j02k94L56j98J45J61o95O5J34J17P4
$$ -237 300 381 392 252 -8 -70 -394 -27 -24 -250 240 138 -156 200 2 147 308 -387 -322 -188 -71 3
3479CJ60K8j44J61l19m9J12j29L9K34o5k13L80O1J89m39J85l34J35j16R5Nj43
$$ 3 163 191 47 208 -111 -160 -48 -177 -138 96 31 -182 198 259 448 9 194 -140 -5 -121 -26 -21 -164
3502a64L54Qk28M7L5RNr0N9r5L15k11L59k31k55j88K30j40J83q1k63Q13k82k43
$$ -164 190 198 -30 17 52 61 66 -24 35 -60 255 44 403 172 -83 -271 -41 -181 2 -79 -342 471 189 -54
3526e4l3J12J99L1k10j78P8r5K57M83n64K19k09k54J54r9KJ16m2j2K8j34L47J89
$$ -54 -87 25 224 255 45 -133 -55 -150 107 590 26 245 36 -218 -64 -163 -161 -45 -87 -99 -71 -205 142 331
3550C31m67K24o4k02k74M87J9J21k11n8O8NQ1K55m28k3j9K91l66L94M3L10l76
$$ 331 -136 88 24 -178 -452 35 54 175 -36 -94 -26 -21 60 315 -113 -136 -155 136 -230 164 207 517 141
3573A41l26%l25M24L48j86k24J72r1J34J9k19J09m2J97m14J52J58K77j15p2l71
$$ 141 -185 -185 -510 -86 262 76 -148 24 -67 67 86 -133 -24 -66 131 -283 -131 27 304 189 117 -254
3595b54J80L6K60l23L60k10k44P5J63j01J42Ro7L3m91K45P2L81j60J03j36k40
$$ -254 -74 -38 222 -101 259 49 -195 -120 43 -58 84 93 26 59 -432 -187 -115 266 106 209 73 -167
3617a67M7K96o9k19J34r2l1K43q2J67j35j6k61K38O3l1j27O1L86l65k5M7Mj44
$$ -167 -120 176 107 -112 22 -70 -101 142 60 227 92 76 -185 53 116 85 -42 19 405 40 15 62 66 -78
3641g8R1K6r2k1Q6K99M7m14J09K1j98J70J30k73jJ95j17m2j79M84M3l45J06R0
$$ -78 13 39 -53 -74 12 311 358 -56 53 74 -124 46 176 -97 -98 97 -20 -62 -241 243 286 -59 47 137
3665A37k79K72J56j45J62m65m5K82J41l46K41m1n6m17J86K60j7j4j13r5K72n48
$$ 137 -142 130 286 141 303 -162 -207 75 216 -130 111 70 14 -403 -217 43 26 12 -101 -196 76 -472
3687d72K40R2J27j33J43L2L9J09j6k6k45J45l2m12K86L34k53J39r6J7M5n1l7Q7
$$ -472 -232 -140 -13 -146 -3 29 68 177 161 135 -110 35 3 -409 -123 211 -42 97 1 18 63 12 -25 62
3711F2J02P4j84j32J56Q7j97L07l48r4L4J63O9j76J35n4k75K66J31J03k35j34
$$ 62 164 238 54 -78 78 165 -32 275 -73 -167 -133 30 99 -77 58 4 -271 -5 126 229 -6 -140
3733a40n7L06l64P7N30o44J64M12n01L05J27k07p9K6p7K43j77n6N7K66j70K41
$$ -140 -197 109 -255 -178 352 -292 -128 284 -217 88 215 8 -71 -45 -122 121 -56 -112 -55 211 41 282
3755B82m09J59j35K74k19M8J47k39l5K92j37k17L73m14O1M47l61R6K16p2j47N3
$$ 282 -127 32 -103 171 -48 0 147 -92 -127 165 28 -189 184 -230 -169 278 -83 13 229 157 10 63
3777F3j42K54j34Q9ol03N8j40K39j8L10k93j07J13j89QL74o2j8n1q1l15M17Q2
$$ 63 -79 175 41 130 124 -179 -121 -261 -22 -40 270 -23 -130 -17 -206 -198 176 114 96 45 -36 -351 66 148
3801A48k28K17j65j76J60m9L66j79m7k24K27K92o85K92L6p5K75n9k52K91nl01
$$ 148 -80 137 -28 -204 -44 -93 273 94 47 -177 50 342 -343 -51 -15 -90 185 126 -126 165 160 -141
3823a41K48m6l56J32J27O6R0o7J0m9k10L76j93L10n18L76k48J57r8O3J77k14p8
$$ -141 107 61 -295 -163 -36 30 120 53 63 14 -196 180 -13 297 -221 155 -93 64 -34 29 206 -8 -86
3846h6K10j63q0J53P3j92p0K25r0O0J06k42n5o8M47J48m67K09kN9K40m14P9oJ13
$$ -86 124 -39 -119 34 107 -85 -155 70 -20 40 146 -96 -151 -219 228 376 -91 118 116 175 415 1 80 74 187
3871A87k85J02j40K03q9K03j42p9j01m0K55k98K66J10m6nk68J56r9J19p7r4J99
$$ 187 -98 4 -136 67 -22 181 39 -40 -141 -181 74 -224 42 152 106 101 -167 -11 -110 9 -68 -162 37
3894C7j31k3q8L04k25J27j63J83J54k83J17J59j35Kk89K03J94j11J58J77m70l0
$$ 37 -94 -117 -205 99 -126 1 -162 21 175 -108 9 168 33 35 -254 -51 143 32 190 367 -103 -133
3916a33k6K74j54L76k27o4j25J43j05M33n33J91J22p3l17L75R3l68J90j29j2m6
$$ -133 -159 115 -39 337 110 46 -79 64 -41 392 -141 50 172 99 -218 157 250 -118 72 -57 -69 -115
3938a15j59L16K30k82K00j43J45j56j85J77l2p9K30NNn0q1j46K87k25j5j51L00
$$ -115 -274 42 272 -10 190 47 192 36 -149 28 -4 -83 147 152 157 107 26 -120 167 -58 -73 -224 76
3961G6l7r8R6l1r0o6L08l34K22P7k04OJ57K26l35P3l6j96M6J52J07l37K93j39
$$ 76 39 -59 37 6 -84 -150 158 -176 46 123 -81 -75 82 308 -27 46 10 -186 -140 12 119 -218 75 -64
3985f4J09j76pK60J53k14q6R5J46L22o78L32K5k37J93j83k00M14o1N5k04r2J6
$$ -64 45 -131 -138 122 275 61 -25 70 216 538 -140 192 217 -20 173 -10 -210 204 143 198 -6 -98 -82
4008h2J70j83J87J16k53O5J45l56K2l9O1L78l00n1K86j85L20k80L3q7j31J90J39
$$ -82 88 -95 92 208 -45 20 165 -191 -169 -208 -147 231 -69 -120 166 -19 301 21 54 -33 -164 26 165
4031A65j43J71r6k79M4K63l73K67L54k97M4j89K75l44J1K05k2KJ83j54r1J85k15
$$ 165 22 193 97 -182 -138 125 -248 19 373 76 120 -69 206 -138 -127 78 56 58 241 87 -4 181 -34
4054c4r9j46lN59j42k14K38j30k62J67q7J62J60k22L7p5j94L36l42M70Qk23MJ84
$$ -34 -133 -279 -282 277 135 -79 159 29 -233 -66 -153 9 169 -53 -16 -91 -285 51 -291 179 187 -36 -32 152
4078A52Jr2J2NK44k27j51m6l4L20k58L60m27L4l9q8J76O6J3k16m0M22j85k28K67
$$ 152 153 61 73 78 322 95 -56 -102 -136 184 -74 286 -141 -107 -146 -234 -58 8 21 -195 -235 187 2 -226 41
4103D1K1l8j99L09j32J21L8p9mk58K05J33Q8j96L6k77K56k04j00M3J22K11l70
$$ 41 62 24 -175 134 2 123 161 82 78 -180 25 158 246 50 86 -191 65 -139 -239 -196 -74 137 -233
4126b33L30m3J8o0J8k1l34K50J30o7Q1j56n5O4mN5KJ36L4q9j62Q0Q5m6Jp8q0J72
$$ -233 97 54 72 12 30 9 -325 -75 55 -12 69 -87 -142 -78 -82 -27 -25 111 145 56 -106 -26 59 13 14 -64 -144 28
4154B8J31k17P2j15or3M22j72K09k27k2P3k82K01M7k99K41K12m30K16Q1j16J55
$$ 28 159 -58 14 -101 -107 -200 222 50 259 32 10 83 -199 2 49 -250 -9 203 -227 -11 70 -46 109
4177A09Nj92R5k6j09j44J43L58l36O2J17L4N7q0O2m11R8M03k91M9M1J66k91J33
$$ 109 114 -78 17 -9 -118 -262 -119 239 -97 -35 82 116 173 93 155 -256 -158 245 -46 3 44 210 -81 52
4201E2rp6k81K67K59j41L8n6l2K1p7L4J7j51n2J4J99k93K05J34l9P9nj91J48N
$$ 52 43 -33 -314 -47 212 71 109 53 21 42 -35 -1 16 -135 -187 -173 26 -267 -62 72 33 112 107 -84 64 69
4227F9N8o67Q29j16j07k3j4m4K19k96l2J5Q7J45p4k04M55k84k66K16j79K17k6
$$ 69 127 -540 289 173 66 43 29 -15 204 -92 -124 -109 -22 123 49 -155 300 16 -250 -34 -213 4 -22
4250b2Q3q9O4J94n1m14J29K63J10k92L7R6m9j56K75j15l40M60J69k61m75M78j38
$$ -22 61 -28 36 230 179 -235 -106 157 267 -25 12 108 59 -97 178 63 -277 183 352 91 -384 94 -44
4273d4K0L5K10l0l82K39j43j55M9K65J69l07qr7Q1Q9j22K69k9l52K84j85M01k58
$$ -44 -24 11 221 191 -191 48 -95 -250 -201 64 233 -74 -82 -179 -98 -9 -131 138 109 -243 41 -144 257 -1
4297aj20Q7J00N7m00L39L7N5k28J93j99O2j82K03q0o9L80k85o8J49j61R9m2J7
$$ -1 -121 -34 66 123 -277 62 99 154 -74 119 -80 -18 -200 3 -77 -146 234 -51 -119 30 -131 -32 -74 -57
4321e7J99n7J41j22j41k6j44J53O2%n8k5k15K59j00KJ95J21j64j52m9P6M9K7L15
$$ -57 142 85 226 104 -37 -63 -207 -54 8 8 -50 -75 -290 -31 -131 -129 66 187 23 -129 -178 -102 -53 -26 289
4346B89l86J45j94K01K5k19L10m22K85K5n9k57J0J98Kj09q7K76o3J58J46j52J9
$$ 289 -97 48 -146 55 80 -139 171 -251 34 59 0 -257 -247 -49 -47 -156 -243 33 -30 128 274 122 141
4369A41q9j53k05K63Q7j49R7J81j90j1J08n42O47k40j13L43j38j6P0k62L56m13
$$ 141 52 -101 -306 -43 44 -105 -8 173 -17 -28 80 -462 185 -55 -168 175 37 21 91 -171 185 -228
4391b28L3L25P1n34L87j73k23L90r6K21j45p1PJ64r2J16q4j19J4K17l03J26k7
$$ -228 -195 130 201 -333 54 -119 -342 48 -48 173 28 -43 -36 128 36 152 68 -51 -37 180 -123 3 -24
4414b4o7M2K75j81r2J67n8k33P3L76m11K99j99K71l61K52J8k37J89q4o1N5l3Q5
$$ -24 -91 -49 226 45 -47 120 62 -171 -98 278 -133 166 -33 238 -123 129 147 -90 99 15 -46 9 -24 61
4438F1k23J91j80K23J0m20L91k33J82m20M37q1J09k16J56j02j09j14N91n3l30
$$ 61 -162 29 -151 72 82 -338 53 -180 2 -418 19 -62 47 -169 -13 -115 -224 -338 253 200 -130
4459a30M83m65L75k00M4P2J12o5k01Nj92L58j57j06N8K3Q3k67K54K50n00J72J14
$$ -130 353 -112 263 63 107 179 291 226 25 30 -162 196 39 -67 -9 14 97 -170 84 334 -166 6 120
4482A20k79L26k48q9K27r8J90j62j73J84j97K16K42l64k0K50q0j24K28l03N2j65
$$ 120 -159 167 -81 -170 57 -41 149 -13 -186 -2 -199 17 259 -105 -125 125 45 -79 149 -154 -102 -267
4504b67K88J62j18Rj18K8R0p1k2J33j53P8j57J01N3q5J07J09j95O0J4j01J49j90
$$ -267 21 183 65 74 -44 -16 74 3 -19 114 -39 39 -118 -17 36 -49 58 167 -28 32 46 -55 94 -96
4528i6j75J97J53r4j40K55M0k60n1K4N6J00O3k52K26MJ54m54J46N8J02P0j11j23
$$ -96 -271 -74 79 -15 -155 100 140 -120 -171 -147 -91 9 72 -180 46 50 204 -250 -104 -46 56 126 15 -108
4552a08j30L81%k35J08j17pJ01K1p7K64l15K11m4j11n1KL38n22L93k67K7L7l03
$$ -108 -238 143 143 -92 16 -101 -108 -7 14 -63 201 -114 97 53 -58 -109 -107 231 -291 102 -165 -138 -101 -404
4576d04K91j41M79J11l90K16j43N3k4j07J29k53J62o0l2L15l37J88k99K71j29
$$ -404 -113 -254 225 336 -54 162 19 72 48 -59 70 -183 -21 -81 -113 202 -135 53 -246 25 -104
4597a04R4q7m6L38j65j54J60J34l73n4J39k2p6J55P8j83K02L48n26K83r1j74L38
$$ -104 -10 -97 -143 195 30 -124 36 170 -203 -257 -118 -140 -216 -61 17 -166 36 384 -142 141 50 -124 214
4620B14j91m4J32j35q8N1j00J71P1k26L41r6m4j14M3j04K55k60L5M05j81j39P6
$$ 214 23 -21 111 -24 -112 -61 -161 10 81 -145 196 100 56 -58 -15 -119 136 -124 -89 316 135 -4 72
4643G2j36J63q5O3n5J05j68k38N0L75j37j44L26o0o1J52j78j69K54k24K06j55
$$ 72 -64 99 14 77 22 127 -41 -279 -229 146 9 -135 191 131 70 222 44 -125 129 -95 111 -44
4665d4N9K86l72j3J35o0p6J60l52M70j45m8k0K94k63R9j1L9j86R5P3k9p3k20J08
$$ -44 15 301 -71 -84 51 -9 -85 75 -277 193 48 0 -20 274 11 110 99 138 -48 47 120 91 18 -202 -94
4690i4p4N7K69j92M8j53j40k9K46j26J71J50l7o0o6Q3o5J35l23R7J43j73M5l1
$$ -94 -168 -111 158 -34 14 -139 -279 -308 -62 -188 -17 133 96 36 -30 53 -12 123 -200 -103 40 -133 -88 -119
4714a19L19k26k30K58M1k2N6P4K1j24k5J3P5k46mK08N1k3q2j25K51O7p7j62L2
$$ -119 200 -26 -256 2 43 21 77 151 172 48 23 36 111 -135 -139 69 120 97 15 -110 141 208 131 -31 1
4739Ar8l3L6J88l11J88m2nk93M63j70N5M36l16k84J14K03k75L5Q9m0j13K21j32
$$ 1 -97 -130 -94 94 -217 -29 -71 -76 -369 94 -76 -21 415 99 -185 -71 132 -143 -108 -19 -59 -172 49 -83
4763h3R5J82l17L11m25J89P0J8Q6k29rM11k86l8L10k02j22J27K21J13j59n23J82
$$ -83 12 194 -123 188 -237 -48 22 40 126 -103 -112 299 13 -25 285 83 -39 88 309 422 263 -260 -78
4786g8j5J98k27L4k25K00K56m8q2k02Q8K81j19m51N24j08k10J05N6K25j12j63
$$ -78 -93 105 -122 -88 -313 -113 143 95 13 -189 -101 180 61 -390 134 26 -184 -79 -23 202 90 -73
4808g3l0Q7j24j58N83j55k61K2J53P3r8K0J0l29L23j03K35k38J52L3k10k2K93
$$ -73 -103 -16 -140 -298 285 130 -131 -109 44 117 19 39 49 -280 43 -60 175 -63 89 122 -88 -110 183
4831A83j71j4K7J4K8r0K14M9l25J51j45J71j7K4j31K57j05O3r9j10J70l03L27
$$ 183 12 -2 25 39 67 -23 191 240 -85 66 -79 92 75 99 -32 225 120 183 84 -26 144 -159 168
4854A68L4k91K03j90j23K27k55O2J35r0Q2l7J01M3j09l4R3r9J04JPl45O47m21
$$ 168 202 -89 114 -76 -199 28 -227 -165 -30 -120 -38 -75 26 69 -40 -74 19 -80 24 25 32 -313 334 -87
4878h7kj0J57J68k3J82r5o41L56o2K90l68q9K71M1q8j40K79k40LK01j90N7m6j93
$$ -87 -89 -99 58 226 203 385 290 -351 5 -57 233 -135 -224 47 88 0 -140 139 -101 -98 103 -87 -30 -76 -269
4903b69M89j9Q2l02P1R4l15M39m01K36J24k42K7Q8j65o6j22J27J91q1K37k68K
$$ -269 220 201 283 -19 52 146 -169 270 -131 105 229 -13 14 102 -63 -129 -251 -124 67 -14 223 -45 -43
4926d3J20j60L14k23Q5k89L54j32n1J40j53J37p5L6k66K64l4j10J91j87L18k93
$$ -43 77 -83 231 8 93 -196 158 26 -25 115 -38 99 24 60 -206 58 24 -86 105 -82 236 -57
4948e7J11O5J25J06k07k28n6l4R6j2j74K31J75p4j61Q7r5J9Q4L2j65K01q0J19
$$ -57 54 119 244 350 143 -85 -141 -175 -79 -91 -265 -34 141 67 -94 -7 -102 -83 1 33 -132 69 -11 108
4972A08k60K85j31J43j75k2K03j56l2nk8M8n1R7K28k40k32K58J38l3r7N8k54J80
$$ 108 -152 133 2 145 -30 -52 151 -5 -37 -42 -70 -22 -73 24 252 12 -220 38 176 143 46 104 -150 30
4996C0K14m22j87N49j83l3r4N56m96J22k18L17L17L12q05QN4L07J19l73M3m86
$$ 30 244 -178 -365 184 1 -32 -126 430 -66 56 -162 155 472 784 -21 -13 41 348 467 94 137 -349
5018c49M18k26M55l30K13l56K34j15Q7J15o4r5j67K71l2L56n12O83m90l89O0L51
$$ -349 69 -157 298 -32 181 -175 59 -56 31 146 82 -13 -180 91 59 415 -97 586 96 -293 -233 118
5040A18M00j85n99R49q47K51l72M38r7M1o9p3J22J4o58M07J97M36o16p74O69O27
$$ 118 518 333 -266 683 -164 87 -285 153 56 97 28 -45 77 91 -567 -160 37 473 -143 -917 -248 379
5062C79K9k14K39n23J06J7P03j311Q44k73K17k78r9o0O6J97k39K39K21l99j7R6
$$ 379 408 194 433 -90 16 33 736 -575 269 -4 213 -65 -164 -224 -158 39 -200 39 260 -139 -156 -60
5084f0J29p3J68k44J09m7n1J71%k40J84o1J70j67K55m94N39l55P6O7R%q8j79l10
$$ -60 69 -4 164 -80 29 -18 -69 102 102 -138 46 -15 155 -12 243 -251 288 -67 9 76 85 85 -3 -182 -492
5109d92O38j69p2J8K61j95j14j04J67Q6j78K61j20L01k28j10j42J71J85k61P8
$$ -492 146 -23 -95 -77 184 -11 -125 -229 -62 24 -154 107 -13 288 60 -50 -192 -21 164 -97 -19
5130a9m6P7j12J56n8J13Q8k58J19o9L59m05rJ28J98m5J6k44j70K80j31J78m1l39
$$ -19 -65 12 -100 56 -2 111 199 -59 60 -9 350 -55 -64 64 262 217 233 -11 -181 99 -32 146 105 -234
5154b34Q7O2j37K11n1r3P7J61l5L0k28j73Q9J60No4K6J94j03j80J84Q8k07K83
$$ -234 -147 -85 -222 -11 -62 -155 -78 83 48 78 -150 -323 -234 -74 -69 -133 -107 87 -16 -196 -12 76 -131 152
5178A52k95j00L79o1r8K2Q6O7l11K42LK88k24j38J82j94j78L18j63j51J78p6L8
$$ 152 -143 -243 136 75 -23 -1 85 152 -159 83 86 374 150 12 194 0 -178 140 -23 -174 4 -72 -34
5201c4O7j79P5o6J22j08l3L91j06L7k23K12j09j11j67K8J79L6m0j44J61%Qj71
$$ -34 33 -146 -71 -137 -15 -123 -156 235 129 166 -57 155 46 -65 -232 -204 -25 11 -29 -173 -12 -12 -4 -175
5225a75K2p9J80J8O4j43K20L9k75j14lK29j88K66j52L16N1l24K69k88J60o86Q14
$$ -175 -153 -232 -52 -34 30 -113 107 146 -129 -243 -246 -17 -205 61 -91 225 276 -48 221 -67 93 -593 221
5248B21j87J32j74k34K57Q5p1k07L49j67J12k0k63J56J24l59J25L37Q9j50m56
$$ 221 34 166 -8 -242 15 100 29 -178 171 4 116 96 -167 -11 113 -246 -121 216 305 155 -301
5269c01O17l57K4K75j61k47K80j93K08j99L8Q2r9Kj35M26k75mJ31l0O2l79J75
$$ -301 316 -41 -17 258 97 -150 130 -63 145 -54 -16 66 -33 -31 -166 260 -15 -19 112 82 144 -235 -60
5292f0N3N8J9j68kK30m14J62j82K25J94j55l3o0L93l46J2J63m29O00l66J41l19
$$ -60 -7 51 70 -98 -100 130 -284 -122 -304 -79 115 -40 -73 -133 260 -86 -74 89 -340 260 -106 35 -284
5315b84J23J43p1K26j0k1o6J29k03N1M3lj16J24P0r4m9M8j06l4L63k30m34M85
$$ -284 -161 -18 -89 137 127 106 40 169 -34 17 60 57 -59 65 135 41 -8 40 -66 -100 263 33 -401 84
5339H4Jl4j3j32M0j54L77k13k8M9J31k08J45J10m21K36K11Lj46j50K70j55J18
$$ 84 85 51 38 -94 -54 -208 169 -44 -72 -23 108 -100 45 155 -266 -30 181 184 38 -112 158 3 121
5362A21j40j84J85M5R4J49j87j71J13K76j48p5O22o98j075J412o73N26j44k19
$$ 121 -19 -203 -18 27 121 270 83 -88 25 301 153 78 700 2 -1073 339 -334 192 48 -171
5382a71K81o4k80L11M9k92M6K24k06M7M8j4k66L48O1j22k20K24k85L86J00l70
$$ -171 110 46 -234 77 126 -166 -120 104 -102 -55 -7 -21 -287 61 122 0 -220 4 -281 105 205 -165
5404a65K74k75R0j86NJ75K79l11L84k94N11p13L72R4o5J84l38Qk1k12k3J67K02
$$ -165 109 -166 -76 -262 -257 -82 197 -114 270 -24 487 -226 146 240 175 359 21 29 8 -204 -227 -60 142
5427A42l94J02Q7n62M37M0Q34n57l8J36j56j5K35n85K97q9L70j37O2M94n46O8
$$ 142 -252 -150 -63 -625 -188 -148 686 129 91 227 71 56 291 -294 3 -86 284 147 209 703 157 225
5449B25j7l28J65l9L5j15%j6M32k25l3j45J48m89L79j22k62L66K67j21j45K28
$$ 225 208 -120 45 6 41 -74 -74 -90 342 117 84 -61 87 -402 -23 -145 -407 -41 226 105 -40 188
5471A88l49J92p4J01j62L5k64P9L18k1j81oQ6J71p1j06k46K53m3K02j70o2l5M9
$$ 188 -161 31 -43 58 -104 -69 -333 -254 64 43 -138 -144 -58 113 42 -64 -310 -57 -100 102 -68 -130 -165 -116
5495a16k58K42J77j38j06K2J89J29m8j84j58K27L4k47L07L1O4j41j89K32P5q7
$$ -116 -374 -132 45 -93 -199 -177 12 141 93 -91 -249 -22 12 -235 72 103 167 26 -163 69 144 57
5517E7P5k7j09J68l10J43Q3L3j06L9j10Q5r3J75j37L61j91Q1j17n7P7l29M30k21
$$ 57 132 105 -4 164 -146 -3 80 113 7 46 -64 21 -72 103 -34 327 136 217 100 43 120 -209 221 0
5541@j43k7K69k93K92j83L75J57r12L27N23n4m09l25k37Q04J34l09k21L91K0k95
$$ 0 -143 -170 99 -194 98 -85 290 447 -465 -138 385 331 -78 -403 -640 164 298 -11 -232 159 179 -116
5563a16K88k33J02J68j66j22j9J24O0Q4k90j22L69k37J82l57K01L69l99L02k72
$$ -116 172 -61 41 209 43 -79 -98 26 86 170 -120 -242 127 -110 72 -285 -84 285 -114 188 -84
5584h4j52L51j57j24K12j93J90k74J31j68J66N4J26r9L6L7j38O4R1K48l10l9J02
$$ -84 -236 115 -42 -166 46 -147 43 -231 -100 -268 -102 -48 78 -21 15 52 -86 -22 69 317 7 -32 70
5607G0n7L3j79j72R4j58M27p1K83M4k51J33j65J18k73j32J8K10j22K44J82k38
$$ 70 13 46 -133 -305 -211 -369 58 -13 270 314 63 196 31 149 -124 -256 -238 -28 -150 94 276 38
5629C8P1j87N0r7Q6r7Ll8J46o5J57m54j51M81l9j2R9N0O0jj53L9J72q0O3j74q4
$$ 38 109 -78 -28 -125 -39 -136 -133 -171 -25 -90 67 -387 -538 -57 -96 -108 -9 41 101 100 -53 -14 158 78 141 -33 -117
5656a17J23m08O32l29R9J50j78J19k28L0K18j84J11No5JJ5r5J12P1k54J95K4k94
$$ -117 6 -402 230 -99 0 150 -28 91 -137 -107 111 -73 38 43 -22 -21 -6 -101 11 82 -172 23 47 -247
5680b47J83o7J84K36r7j38L7j09k26K81L26n02J81m8J17k23J1J18m6R9k8j86J09
$$ -247 -64 -131 53 289 192 54 91 -18 -244 37 363 -139 42 -6 111 -112 -101 17 -29 70 42 -144 -35
5703c5L4j14L12l60J94k97J43j34L40k12q5K27N6J31k35J3m1j0J31J51n07L53
$$ -35 -1 -115 197 -163 31 -266 -123 -257 83 -129 -214 13 69 200 -35 -22 -63 -73 58 209 -298 55
5725E5j15L21k88Q2M5R8r1l4l3PJ00j76J09M6M0m04J39J98J4n7q0K96r1p2jk4
$$ 55 -60 261 -27 55 100 198 107 73 40 47 147 -29 80 126 166 -238 -99 99 113 56 -24 272 181 109 108 84
5751H4p9R6j9N5o8j79K55j11m5m5o2J69J13J4n20J19L22k66K67n9J20j0j55k34
$$ 84 5 101 82 137 69 -110 145 34 -11 -56 -118 51 164 178 -342 -223 99 -167 100 41 161 151 -4 -238
5775b38L86l08N8O8R9j68P5Qm1J05K18k03j19K90k97N8Q7N3j19q8J48N3j06j09
$$ -238 148 -160 -102 -34 65 -103 -28 -20 -61 44 262 59 -60 230 -67 -9 78 131 12 -76 72 125 19 -90
5799i0M4J3k7N0R0j40J95n1J19l4k95K92j88k2K0R6k45K6L27r3J49k30R8J1n1
$$ -90 -46 -33 -60 -10 80 -60 135 84 203 169 -126 166 -22 -44 -24 72 -173 -147 180 87 236 6 104 115 64
5824F4j03M2P4m25L60K35k7q1m4O5J19m17K89k88q9N60n2k3r2p4j8k20J85J32
$$ 64 -39 3 77 -348 12 247 220 139 95 160 279 -138 151 -137 -226 334 282 259 167 93 75 -145 40 172
5848A72j76Q1L1J95j9j99j09q5Q2M7j54L22k48K66l83K97n9OJ1k4k16J01R5j21
$$ 172 -4 77 108 303 284 85 -24 -109 -27 20 -134 188 -60 206 -177 120 61 67 78 54 -162 -61 34 -87
5872h7J28m75P55m8m9m08O5J26j49J71k93J01L89l59Q0Q7j46k29K27K08o1o6j36
$$ -87 41 -434 321 273 224 -184 -119 7 -142 29 -264 -163 226 -133 -53 34 -112 -341 -114 94 33 -33 -169
5895a69J56j39j53L14K95k55O8K1j98k03J45m4J34LN6P9K55n00J7L35j74j79%
$$ -169 -13 -152 -305 9 304 49 117 138 -60 -263 -118 -162 -28 -25 31 110 365 -135 -118 217 43 -136 -136
5918a36K24m49L40L61l08j43J80J11l62J51K51k53k4J24q8J33k7j73N0P7K3j71
$$ -136 88 -361 -21 340 32 -111 69 180 -182 -31 220 -33 -57 67 -21 112 85 -88 -38 39 62 -109
5940a09J41R8r6j20J41j87N9qJ57J5qk4o8J29q8j70O0j0K33k29q7J93J08k61L43
$$ -109 32 130 34 -86 55 -132 -73 -81 76 91 83 59 -9 120 32 -138 -78 -88 145 -84 -171 22 130 -131 212
5965B12k40K73K24m21k2j54J29j0J20j32Q8Q4l09L15m9o2j00k2p3q8K91J70m7
$$ 212 -28 245 469 48 26 -128 1 -9 111 -21 67 151 -158 157 108 46 -54 -76 -149 -237 54 224 177
5988A77M82n00k42J29O86j209J15K61pO1P1P1o5K87m05J65k63J75QO6J91p7k53
$$ 177 659 159 -83 46 732 -477 -362 -101 -108 -47 24 95 30 317 -88 77 -186 -11 -3 63 254 177 -76
6011g6r8j65N89on49K23n9j55L33k37N44l58j4J15j03K07m34K97j95L06n6J35
$$ -76 -174 -339 250 244 -305 -82 -141 -296 37 -200 344 -14 -28 87 -16 191 -243 54 -141 165 109 244
6033B44l58J70j78K7j50J45J34Kp4J13l86N39p1k38J91j7j4j20j76K22n9O2k8
$$ 244 -114 56 -122 -95 -245 -100 34 36 -38 75 -311 228 157 -81 110 93 79 -41 -217 5 -54 8 -20
6056b0N6m4J42nj06K4k13M21k12p7q1j1K62m84M12P2j80m6Q7J61p8j57K13j13
$$ -20 36 -8 134 129 23 47 -166 255 43 -34 -115 -126 136 -348 64 136 -44 -90 -3 158 80 -77 136 23
6080B3o0r3K2o9J21L8j5j71L59k07j8K4j42M8n9L4J99j85lJ48J04j59P3j25k2
$$ 23 -37 -130 -108 -177 -56 -18 -33 -204 155 -52 -70 -46 -188 -140 -199 -165 34 -151 -154 -6 98 -61 12 -113 -135
6105a35L23r7j80k34O20l22J05J6K53k03j12J07j06l1J7k3J89Nl7k83M10j64j39
$$ -135 188 91 -89 -323 297 -25 80 96 349 146 34 141 35 4 21 -2 187 192 155 -128 282 118 -21
6128b1Qj2Q9j60j02K23OK2l7M6q2j06Q3O5J04l41j52M63j95J35K5k59L97l22M3
$$ -21 -13 -25 64 -96 -198 25 31 53 16 62 -20 -126 -43 22 126 -215 -367 96 -99 36 61 -198 199 -123 -80
6153h0K36k90P7J4l8L7l0J91N9k81N0J74k28J33K19l25J84j64j64l6J97K3kk35
$$ -80 156 -134 -57 -43 -81 -44 -74 117 176 -105 -55 119 -109 24 243 -82 102 -62 -226 -262 -65 -42 -44 -279
6177b79L17m0J04j03k8N5J76j09j28j34J66j21L04k87M33j79j61K79j77p7k62
$$ -279 38 -2 102 -1 -29 26 202 93 -35 -169 -3 -124 180 -107 326 147 -14 265 88 11 -251
6198b51L91k64J27L0N8O3j47J78J2p8O3j39q9K3k8K34j51o2L3q1O7m5j38J62O3
$$ -251 140 -124 3 33 91 154 7 185 197 119 182 43 -46 -23 -51 183 32 -30 3 -78 -11 -56 -194 -32 31
6223C1J25K7j62N0k5j90J41ML2j0P3o7Oj48K26k5k28K4K2K40l19l1J85L4k96K58
$$ 31 156 183 21 71 46 -144 -3 1 33 23 96 29 35 -113 113 88 -140 -116 -94 146 -173 -204 -19 15 -281 -23
6249b3J23p7j76K42L9l10L01k01K77J1J14k11j2j55K06k02qN3j2M2M9K53l45J92
$$ -23 100 23 -153 89 128 -182 119 -82 195 206 320 109 97 -58 148 -54 -62 -9 -21 21 70 323 -22 170
6273A70k64j86R4R8J05l66L29n7j52J58m0K17j89J02K5R6j58j0K84k41K13j83
$$ 170 -94 -280 -186 -88 17 -349 -20 -77 -229 -71 -111 106 -83 19 44 140 -18 -28 256 15 228 45
6295D5j3K2m16M82J96m53N75l77k8K89M40r34%J91O62r16j54k79N18N65o3r88
$$ 45 32 54 -362 120 316 -137 438 61 33 322 762 -172 -172 19 681 -235 -389 -668 -150 415 352 -636
6317f36R03o36q00R77J003m40r63N94l22n1P1N00l15M3J74j41r5J64p1L38j59
$$ -636 267 -369 -1169 -192 811 371 -592 2 -320 -371 -300 200 -115 -72 102 -39 -134 30 -41 297 138
6338A38j19K11j50k3K80j99q32M54J89j65M88l65N34r75L32L33k14J55j22J77
$$ 138 19 230 80 57 337 138 -694 -240 -51 -216 272 -93 441 -534 -202 131 -83 72 -50 127
6358A27o7j01J91pl4j60J86k8r4k80K53k77N12n26O92n15k61k44J65M47J99QJ56
$$ 127 60 -41 150 143 109 -51 135 107 13 -267 -14 -291 221 -305 387 -128 -389 -633 -468 -21 178 186 342
6381C42j141Q24J038j630Q09j27n4o1K35j20l9k50L1N2K87k64K40p7OJ10J0j92
$$ 342 -799 25 1063 -567 242 115 61 0 235 115 76 -174 -143 -91 196 -68 172 95 101 211 221 29
6403B9K00m95M8P1J32L1%J66n3m9q6J29J35k30j08K3K6J63k33j30P7L76J4j74
$$ 29 229 -266 -218 -147 -15 16 16 182 129 80 -6 123 258 28 -80 -57 -31 132 -101 -231 -154 222 236 62
6427F2k15P75o49J73J20k05m36R43l53k99J25k50M86m93j01k03O0L46L8M16m47
$$ 62 -153 622 -27 146 266 61 -375 568 215 -84 41 -209 277 -216 -317 -520 -460 -114 -76 340 -107
6448a07K62N1k95qR8K73k59j48J38m6k1J62jk9K9n5N09m70j59j04L40n18L67J02
$$ -107 155 206 -89 -97 1 274 15 -133 5 -41 -62 100 99 70 99 44 553 83 -76 -180 160 -358 9 111
6472A11m1j93L79j48k98J73q9M67k77l1k87J2M22Q4o12K55j12K54n7M6k50K31
$$ 111 70 -123 256 108 -190 -17 -106 361 84 53 -234 -222 200 284 -328 -73 -185 69 12 58 -192 39
6494C9R1M21r47P21l60j15L58k06P68o59j29K5M27J98m35p39N05M74n87N19n39
$$ 39 130 551 -396 325 -35 -150 208 2 770 111 -18 7 434 632 197 -542 -37 437 -150 369 -170
6515a70j16Q86k25m12q5K83j56j26j92J85K34k34N2l72N44l5j76K07l7l31L03
$$ -170 -286 600 375 -37 -122 161 5 -121 -313 -128 106 -128 -76 -448 96 61 -115 92 55 -276 27
6536B7J87J64l80q9M30k89P2o1j15K98k05j05j23L23q8Lk0K9K6j85oJ06q3J05
$$ 27 214 378 -2 -91 339 50 122 61 -54 244 39 -66 -189 134 46 49 29 58 84 -101 -107 -1 -84 21
6560B1J97k56K3J68j32K70k36ON9j10M4K26k65j38K42J4k16l7K4M43m02j36M3
$$ 21 218 -38 -15 153 21 291 55 61 120 10 54 280 15 -123 119 133 -83 -120 -96 347 -55 -191 -148
6583a48J65j46j0J85o6j32Q4N0J08Kj73L20k62K0L7n4M0K12m41L97l4l10L1M25
$$ -148 17 -129 -139 46 -20 -152 -68 -18 90 92 -81 239 -23 -3 34 -20 20 232 -209 188 154 -156 -125 300
6607C00k2j13l52R7k18L75j93K04l87L51r3J22m1l0j08J46l8J18j09n8p0J84K9
$$ 300 278 165 -187 -90 -308 67 -126 78 -309 42 -51 71 30 0 -108 38 0 118 9 -49 -119 65 94
6630I4k40R9K66j74j38K8j52L34k75J05L4K16N4k58JK19l34J26Q2j63k10K02L1
$$ 94 -146 -47 219 45 -93 -65 -217 117 -158 -53 -19 197 251 -7 -6 213 -121 5 87 -76 -286 -84 -53
6653e3M4j72O65k91m60N94k70n6j9LP2m1K01k95j65M00j1k56M2M5K55m2k81J94
$$ -53 -9 -181 484 193 -267 327 57 1 -18 -15 57 16 217 -78 -243 157 146 -110 -68 -23 232 190 -91 103
6677A03j60J40j19o9j71J64K25o9k13J21L0N3N3lJ9j0L9j19Q4k65J67J2q3K04
$$ 103 -57 83 -36 -105 -276 -112 113 44 -169 -48 -18 35 88 85 104 94 133 14 98 -167 0 12 -71 133
6701A33n4J38r8L0N0j98N8j0r4J00k60K57m2k62L6J89M8l0k5qk9N6j7M4m7j84
$$ 133 79 217 119 149 199 1 59 49 -45 55 -205 52 10 -252 -216 -27 21 -9 -34 -42 -71 -15 -32 12 -35 -219
6727b19K97l67M04k38K10k24J21m8j03Km8N17k24j9j92J62K75k92K41n33K16J79
$$ -219 78 -289 115 -123 87 -137 -16 -64 -167 -165 -213 304 80 61 -131 31 306 14 255 -278 -62 117
6749A17n05L39lJ79J3J4m78N59j35m7j0l0J30m43J41J39RoQ6q2j58J73L44j99
$$ 117 -388 -49 -52 127 140 154 -324 235 100 53 43 13 143 -300 -159 -20 -11 -17 69 -13 -171 2 346 147
6773A47J16l22j43J13Q7K45q4k28K88k16J41k96K17l3LJ60j99m4J2M0O2j74n9
$$ 147 263 -59 -202 -89 -2 243 159 -69 219 3 144 -152 65 32 35 195 -4 -48 -36 4 66 -108 -167
6796a67k9Q5J8M3P4k38K22j11J79p8M3o7J37J3j60q8K19l09K10J23j62J39m41
$$ -167 -196 -111 -93 -50 24 -214 8 -103 76 -2 41 -26 111 124 -36 -124 95 -214 -4 119 -43 96 -345
6819c45L19l5O4n2J54l48M13l4ok29KJ35L6j08q2P0j14L64n1K0m84K34j45J95
$$ -345 -26 -61 3 -49 105 -243 170 136 130 -99 -97 38 74 -34 -116 -46 -160 204 153 173 -311 -77 -222 -27
6843b7q1L5J67r9j51J90j58J43j18J58r0k16J54K51Jj45m6j48K45L8j22k0j7o0
$$ -27 -108 -73 94 -5 -156 34 -124 19 -99 59 -31 -247 -93 158 159 14 -32 -180 65 103 -19 -39 -56 -116
6867a16K65K2j11l6qK17p6J07j98n7J40o9J5k15K39m2r3j63L04k3k42J41m6P3
$$ -116 149 171 60 24 16 233 157 264 66 9 149 80 95 -120 119 77 -16 -179 125 102 -140 1 -45 28
6891B8j70K0j25J42J03Oo4R7K01k67J24j40r5K94k10J56l22M73k99J14r6J52k98
$$ 28 -142 -122 -247 -105 -2 4 -60 37 238 -29 95 -45 -140 154 -56 100 -222 251 -48 66 -30 122 -176
6914a76K28J37r9r6Q1j98k52L90M4j63K81l66M6M3J39l6k59K35j02j09K68j03
$$ -176 52 189 90 -6 75 -123 -375 15 59 -104 177 -189 -143 -100 39 3 -256 -21 -123 -232 36 -67
6936f7K17m34N56k29j47K39l08L6j20K52j49K72J48m07J39J28j8n7K14m09K10
$$ -67 150 -284 272 43 -104 135 -173 -137 -257 -5 -154 118 266 -141 -2 126 108 51 265 -144 66
6957F6N1J4k94J61k20K58o4l4J94l35J81J03j96K17l50O7J73q8K35j75q0J12J52
$$ 66 117 131 -163 -2 -222 36 -28 -62 132 -203 -22 81 -115 102 -248 -181 -8 -96 139 -36 -116 -4 148
6980A48k54p5L90l85N6L81k47k49J66j5K9k61K83J50J58n4k39k08m2L63k58K43
$$ 148 -106 -181 209 -176 -120 261 14 -235 -69 -84 -55 -316 -33 117 275 221 -18 -226 -268 95 -163 80
7002H0n1j56Q9qp6J30k01L28r8r4j29L80J89n03N5K4K81j08o6j39J21j0J61m45
$$ 80 29 -127 -38 -46 -122 8 -193 135 37 -57 -186 194 383 -120 -65 -41 240 132 66 -73 48 38 199 -246
7026b46J60n6J8L7R8L9p8j27k09M24j12Lp7J39k2L14l31K15l82M22m64O2R9k44
$$ -246 -86 -142 -124 -87 11 50 -28 -155 -364 60 -52 -49 -126 13 -9 305 -26 189 -193 229 -235 -173 -74 -318
7050c18J19J59k21O9Q1J56p6J25j43j00rM60l57J83j16K6M5K5p3j03r7m0L59l13
$$ -318 -199 -40 -261 -192 -111 45 -31 94 -49 -149 -158 302 -55 128 12 38 83 108 35 -68 -165 -205 154 -159
7074a59K3K03P4q4j37J53k88K79R2k62Q7K8K12j44J25l57L2J48J26r5r9L91k54
$$ -159 -136 67 141 57 -80 73 -215 64 156 -106 -19 9 221 77 202 -155 -123 25 151 56 -43 348 94
7097I4r7k54J41N6J51R7j87J08j44r8J96j31J44lK42k14j19L3J5r5r0M47J38o91
$$ 94 -3 -257 -116 -60 91 188 1 109 -35 -133 63 -68 76 73 315 101 -18 15 30 -65 -155 292 430 -261
7121b61P2L56j61J35l42M01j31j14L48k78l3Q3p1J52j85R0m3j24K51l26L28k83
$$ -261 -189 167 6 141 -201 200 69 -45 303 25 -8 75 4 156 -29 61 18 -106 145 -181 147 -136
7143a36m6K59j80P5r3L01Q5j61n9M3K0P4K1j76k66K99k55o5J77L7r4Oj50L31k02
$$ -136 -182 77 -103 -28 -121 180 265 104 45 88 108 182 203 27 -239 60 -195 -260 -83 -46 -140 -134 -284 47 -155
7168a55K63j87j47J46j72N04k12k84J59jj96J25P8n4J71M0j87K1K5KL2K21l5l6
$$ -155 108 -79 -226 -80 -252 252 40 -244 -85 -86 -282 -157 -79 -133 38 78 -109 -88 -63 -61 -29 192 157 121
7192A21m5r8J32k25P1J0n8j4j61L85j5k90R7J4R8J41j30j61k06L30Q1j7J20k46
$$ 121 76 -22 110 -115 -44 -34 -92 -106 -267 118 103 -187 -90 -76 22 163 33 -128 -334 -4 77 60 180 -66
7216f6P6L0o0J21p0j57L28l59K51j1j2j87N3j63J22J07j14K19q8K04n31K76l52
$$ -66 10 40 -20 101 31 -126 202 -157 94 83 71 -116 -63 -226 -104 3 -111 108 20 224 -307 -31 -383
7239c83K04L23k20K91l15K40l00m6K22J34J16k97R1o8j07M3K12J18m08L23%k29
$$ -383 -179 144 -76 215 -100 140 -160 -206 16 150 266 -31 60 -8 -115 -72 140 258 -150 173 173 -56
7261e6J61l23K13mp2J11RJ64k00Q5k01M76l08m31L84L4J25j95o0j4J41j78M0M4
$$ -56 105 -218 -5 -9 -81 30 39 203 3 88 -113 363 55 -376 8 42 167 -28 -88 -102 39 -139 -99 -55
7285e5L54n53P1N6L08j41J2J35r8j36K31k1l79J50k0L28j92j22J62k05j08L93
$$ -55 299 -254 -183 -127 181 40 52 187 89 -47 184 163 -216 -66 -86 242 50 -72 90 -115 -223 170
7307A70j73K12j41j15J35k21J70J19j90J83j45M1k66J37N17k78j93L18l62P9Q1
$$ 170 -3 209 68 -47 88 -133 37 156 -34 149 4 45 -221 -84 433 155 -38 280 -82 -3 78
7328G8K04m16k31R4K54M3L73o47M01j97K03k34J44Q2k60j12L15Q6j30J43k29M1
$$ 78 282 -134 -365 -271 -17 26 399 -248 153 -44 159 -75 69 151 -109 -221 94 180 50 193 -36 5
7350EkK91m18J7J4J81kK20k34j4j07P8j0L8l3q7k5j13J84o6K13j31R0j88O4k6
$$ 5 3 294 -124 -107 -93 88 86 306 72 58 -49 29 19 57 24 -63 -88 -201 -17 -83 130 -1 89 -99 -35 -61
7376f1J78m0J14n4J4r2k12O8j7O9j24n1O6K5j1N92k82J29r9k84p7J35J47j01p1
$$ -61 117 77 191 137 151 59 -153 -85 -102 -33 -157 -208 -142 -117 -128 464 182 311 212 -72 -149 -14 133 32 -39
7401c9K06m7l48K85j69N3O3r7J13k0k5m2j91K70p2L95j41l4j31K51l26l7P1r1
$$ -39 167 120 -228 57 -112 -59 4 -93 20 0 -25 -67 -258 12 -60 335 194 160 29 280 -46 -83 -12 -103
7425a03K9K26k19KJ42J28j46p3O6p2K94r8l62R5J73j91j63L09k51J23J35n5K30
$$ -103 -74 152 -67 -65 77 205 59 -14 52 -20 274 176 -186 -91 82 -109 -272 37 -214 -91 44 -11 219
7448B19j49n8J45l26R2k77K44R0P5j61O1L82m84L28k46L38l00r5Q0j13P2J08q1
$$ 219 70 12 157 -169 -77 -354 -110 -20 55 -106 -45 337 -147 181 -65 273 -27 -122 -42 -155 -83 25 -56
7471e6k1L51j64k44N8Q1M4k62nL42k04J4j43J46J62J79l8r0j54q4kj06J73j63
$$ -56 -77 274 110 -134 -76 5 49 -213 -218 124 -80 -66 -209 -63 99 278 240 150 -4 -88 -90 -196 -23 -186
7495a86K14q1L22k50K5J57m44L70k29K21k00m3p2Q3K3Q6L7j36J28L0o7L02m8j04
$$ -186 28 -53 269 19 44 201 -243 127 -102 119 -81 -124 -196 -113 -90 -4 33 -103 25 55 -12 290 242 138
7519A38r9J05o8p2J46n5m1j84P4j79M31%l28L96l59n5J10J04j12K00p3N3J45j34
$$ 138 39 144 76 4 150 95 54 -130 -56 -235 196 196 -132 264 -95 -150 -40 64 -48 152 79 132 277 143
7543A43j07k29J92Kn7j62K45k7K9K62k7m11K89q2l87L00j78K43o6r9M0P3M5N9
$$ 143 36 -193 -1 1 -56 -218 27 0 29 291 264 -147 142 60 -327 -27 -205 38 -28 -127 -87 -14 31 90
7567I0j96R6R5j3k10RJ85l36L64j18k7q7J43j9K61p6j88N8K67k72k30R8J40L1
$$ 90 -106 -10 85 72 -138 -129 56 -280 84 -34 -61 -148 -5 -24 237 161 -27 31 298 26 -204 -106 34 65
7591F5k54J15R1J16l7j54k40K53j7J08o9J52q4j16k7J3L6J53j48p6K60m33j8K73
$$ 65 -189 -74 17 133 96 -58 -298 -45 -62 46 -23 129 45 -71 -98 -85 -49 104 -44 -120 140 -293 -311 -38
7615c8j6K7j67K60M3j26K01j25p5j35l7K18j05r7J1M25k52j0k2M9l66M66l34K50
$$ -38 -54 -27 -194 66 109 -17 184 59 -16 -151 -188 30 -75 -172 -161 264 12 2 -20 29 -337 129 -205 45
7639D5p8j7K02j67l17K41RK36l79K40k21L16o90J686j206j23r27J016J122j36
$$ 45 -33 -50 152 -15 -332 -91 -82 154 -225 15 -206 110 -580 1106 -100 -223 -1150 -134 988 852
7659H52k05j127J021o70N75n41j8J56J8k95J93Q4o4P8n6J57pk25J59k27K4M88
$$ 852 647 -480 541 -129 446 -95 -113 43 61 -234 -41 43 -21 57 1 158 151 -74 85 -142 -118 370
7681C70n24p5l4J25J01J89J27k5l21L6%L7J12m2J32l66K16k22P0K88k17m2M9k3
$$ 370 -154 -229 -263 -138 -37 152 279 254 -67 -31 -31 6 118 76 208 -158 58 -164 -94 194 -23 -65 -16 -39
7705c9j41K74N4j45q3lL7q3L7L42m07K35J01l67J67J41j13K0k66K59j16K67k67
$$ -39 -180 94 148 3 -80 -83 -46 -129 -92 250 -157 78 179 -188 -21 120 7 27 -239 20 -96 171 -96
7728i6R5L0K9J33j85j25J91k52M69k73n7J26k61L8R8m5m8O4k02J55j22K56O5J00
$$ -96 -1 29 58 191 6 -119 72 -180 289 16 -41 85 -176 -138 -40 -85 -133 -69 -271 -116 -238 18 83 183
7752A83k8j86M00m53K0J52j43QN0N9N9j72J09Pr0q8n7N5J93m52L94R9j31O0L2
$$ 183 155 -31 369 -84 -64 88 -55 -47 3 62 121 -51 58 65 -25 -113 -170 -115 78 -374 20 119 -12 48 80
7777H0P4r2km5j51J28J83r0J28j48J30l35P6n1J8O4J74l55J93p5J35J00J86j70
$$ 80 154 62 60 15 -136 -8 175 85 213 65 195 -140 -64 -115 -97 -33 141 -214 -21 -96 39 139 325 155
7801A55k98J86M7L5j51J01q8N5J9o7J9J45J55m86K7J49k59K22J49m21L82o9n7
$$ 155 -143 43 90 125 -26 75 -13 42 61 -6 13 158 313 -173 -146 3 -256 -34 115 -306 76 7 -50
7824e0J05N7o9k04L7K35j00J24j02L5J42m66K83n7J5M4j38j29J50J94O1o8r5j64
$$ -50 55 112 43 -161 -124 111 11 135 33 68 210 -256 27 -30 -15 29 -109 -238 -88 106 167 99 4 -160
7848a60J96L8k01K0J78r6N2N8L4O2M2j06L5r5K9q9q0j39J84j08kM09l54O5k35
$$ -160 36 74 -127 -107 71 -25 27 85 119 181 223 117 152 57 86 -3 -83 -222 -38 -146 -148 261 -93 -28 -263
7873b63P4J66o3J7Q3p6R5j29J09j21k17L44O5J81k10q9L85n96L47l44J07J69J5
$$ -263 -189 -23 -86 -69 14 -62 33 -96 13 -108 -325 19 84 265 55 -34 351 -245 102 -242 -135 34 49
7896D9L2o2O9k0k46K60n82N94R4j15j9j47R8k50J32j25K52j82L70r2j61OJ70j25
$$ 49 81 19 88 68 -178 82 -500 94 188 73 54 -93 5 -245 -113 -238 14 -168 202 110 -51 -45 125 0
7920@k80M89J9l55J12q7r5J06J70m6P9J52k57n5K98k96q8Q2J51j97j96M67j14
$$ 0 -280 209 228 -127 -15 -102 -197 -91 79 33 112 264 7 -48 250 -46 -134 -52 99 -98 -294 173 59
7943E9q5j48J18J56j66J89j88J12J44k7m10M33l37J66K51k46j65J29M3k06J93
$$ 59 -26 -174 -56 100 -66 123 -65 47 191 164 -246 187 -150 16 267 21 -144 -15 28 -178 15
7964A5k07K10n6j61L60k1j71J62K3L8p7k61L42k8j56L14n69J61M1M23l44Q4l74
$$ 15 -192 18 -38 -199 161 140 -31 131 154 192 115 -146 196 168 12 326 -243 -82 -41 382 38 122 -252
7987b52J87Q3M9K4j82j33J67J19k70P1n4J46q9K76k27K96l62P5Q9J79J51j28j90
$$ -252 -65 18 67 91 -91 -224 -57 62 -208 -137 -191 -45 -134 142 -85 211 -151 -76 13 192 343 215 25
8010B5J50k03KK00l70J21K87m18J50J39j06p2L9J86k87N3L49l60l02J09mL69K9
$$ 25 175 -28 -26 174 -196 -75 212 -206 -56 83 -23 -95 -56 130 -157 -104 245 -115 -417 -308 -312 57 86
8033H6r25J060j80j84k44Q18j23l85M6m49M18l8P2m89O47K35n63J71j83J48j77
$$ 86 -839 221 41 -143 -387 431 308 -77 -31 -480 -62 -100 -28 -517 130 365 -198 -27 -210 -62 -239
8054b39J46L38k77n8No99M26J053j099N55R7o18J16Q67j56m61O2j341R85P77j0
$$ -239 -93 245 -32 -90 -85 -784 -358 695 -404 151 248 -370 -254 613 457 -4 58 -1283 -298 479 469
8075D69q52m5N89k53J0m64J004N0q66J13l12O53q4K25m50N22m37M19l20M1K54
$$ 469 -383 -428 161 -92 -82 -546 458 508 -358 -245 -557 96 12 237 -213 309 -128 291 -29 12 266
8096B66L21o61m8j94J62K32K67l42k3Ml39O73p08J090r29M63l97K37k04k5j96
$$ 266 587 -74 -122 -316 -154 78 345 3 -20 -16 -355 318 -390 700 -229 234 -163 74 -130 -155 -351
8117c51O25p5K5k16J95p09P8L01K40l64L55l63K17O77l33k91j6K18m66K83k73
$$ -351 274 199 224 8 203 -506 -428 -127 113 -251 104 -259 -42 635 302 11 -5 213 -253 30 -243
8138b43J64K74m56M74j02j26J1K40m85J41K92J98l84m3n9M0j86L31j51M0J88n19
$$ -243 -79 195 -261 213 111 -15 -4 236 -249 -108 184 382 -2 -45 -104 -64 -250 81 -70 -30 158 -361
8160c61K88L02r8q5J2J4k38J55j9r1K9q4L29j37j86L91k27k03K90J63j04k22J75
$$ -361 -73 229 131 46 58 72 -166 -11 -30 -121 -92 -176 153 16 -170 221 -6 -209 81 244 140 -82 93
8183I3o7p8n3K53j50L80o86M69
$$ 93 26 -52 -105 148 -2 378 -308 161
8191A61
$$ Imaginary data points
##PAGE= N=2
##DATA TABLE= (X++(I..I)), XYDATA
0@%%%%%%%%%%%%%qJ6j6J6j7K5l2L6m4N0n9P3q7J01j16J35j55J75j99K28k59K92
$$ 0 0 0 0 0 0 0 0 0 0 0 0 0 0 -8 8 -8 8 -9 16 -16 20 -24 26 -33 40 -47 54 -62 73 -82 93 -106 122 -137 155
35A55l30L69m13M63n18N79o42P10p88Q74r66J065j175J295j428J575j733J909
$$ 155 -175 194 -219 244 -274 305 -337 373 -415 459 -507 558 -617 678 -750 825 -908 1001
53A001k106K326k573K854l175L546l981M498n128N913o926Q287j0226J3233j8577
$$ 1001 -1105 1221 -1352 1502 -1673 1873 -2108 2390 -2738 3175 -3751 4536 -5690 7543 -11034
68a1034L0982j18944l7971J79468N6309o798o1857k4532k3470L154K0639M4730
$$ -11034 19948 -98996 -136967 42501 98810 92012 30155 5623 -17847 -14693 5946 50676
80E0676j2178q3709r4359J3785J15328J20865L0738m1875o9745o5932o0203j2203
$$ 50676 38498 -45211 -139570 -125785 -10457 110408 141146 99271 29526 -36406 -96609 -108812
92a08812N9890R3140K9033n9308p0341J2240P9456O0711j0195n7798o8968n9562
$$ -108812 -48922 44218 73251 13943 -56398 -44158 35298 96009 85814 28016 -40952 -100514
104a00514k7895M3754J12382R9408j422r1404q2377m821M1807K4947q265j6791
$$ -100514 -128409 -84655 27727 127135 125713 34309 -48068 -52889 -11082 13865 5600 -11191
116a1191j6563k2256o430M8559Q9679N1410m6807j07326p6733r49M4517M7730
$$ -11191 -27754 -50010 -56440 -7881 81798 133208 86401 -20925 -97658 -98607 -54090 -6360
128f360L9667K4722j3469m8997l4682K7048O3480J9404n9152q2934l0574L6362
$$ -6360 33307 58029 44560 -4437 -39119 -12071 51409 70813 11661 -71273 -101847 -65485
140f5485O2273N4455L4346J32m9884p5962m0778K9949O0638K2540k8613l3711
$$ -65485 -3212 51243 85589 85721 35837 -40125 -80903 -50954 9684 32224 3611 -30100
152c0100J080K7061K8271K2576J4093j7295o3030p2080j4622O0763Q1230L4411
$$ -30100 -29020 -1959 26312 48888 62981 45686 -17344 -89424 -104046 -43283 37947 72358
164G2358k0789l6823k3314r371L092J9138J9956j1309m8419l8652K2070P2359
$$ 72358 51569 14746 -8568 -17939 -14847 4291 24247 12938 -35481 -74133 -52063 20296
176B0296N8462M18m2833m6670l2005j4600R535L8562M1473N250l3768k9521J2191
$$ 20296 78758 79176 36343 -10327 -42332 -56932 -47397 -8835 32638 37888 4120 -25401 -13210
189a3210L9179K0955j5895l4324l2099k1158j386L2766N9393M2306j3798n6355
$$ -13210 25969 46924 31029 -3295 -35394 -56552 -57938 -25172 34221 76527 62729 6374
201F374m4316P55K8122J8202l067j1504j1624q595O346L2424M2027J0306l9553
$$ 6374 -37942 -37187 -9065 9137 6070 -5434 -17058 -25653 -19307 13117 55144 65450 25897
214B5897n9145l0737J4282L4366K7598J5458L794j2539k4718j3994J5426K8422
$$ 25897 -33248 -63985 -49703 -15337 12261 27719 31513 18974 -5744 -19738 -4312 24110
226B4110L513l2656l8005q223K6313L7111K7893J0914j1410l5668m0435j2645
$$ 24110 27623 -5033 -43038 -51261 -24948 12163 40056 50970 39560 3892 -36543 -49188
238d9188K6059L6033R758j9713j9755K567J8866J7342Q635l058j9791l3592k6994
$$ -49188 -23129 12904 22662 2949 -16806 -14239 4627 21969 30604 27546 7755 -25837 -52831
251e2831O325L9398L9746J0178j7973k2513j2372k885M635J0442Q188q448k3136
$$ -52831 -46506 -7108 32638 42816 24843 2330 -10042 -12927 -8292 2150 10338 1890 -21246
264b1246j4489J7460L9606K7043o608l0597k9997j5691O48J5886K4964J7670n199
$$ -21246 -35735 -18275 21331 48374 41766 11169 -18828 -34519 -33871 -17985 6979 24649 19450
277A9450k1757j2613J1216K1711P174j4735k2439j5780l729Q908K2803K8504J3731
$$ 19450 -2307 -14920 -3704 18007 25181 10446 -11993 -27773 -31502 -22594 209 28713 42444
290D2444j5461l1617k0876L627J6993J0802j177p671o709l207P692J9982J8743
$$ 42444 26983 -4634 -25510 -21883 -4890 5912 4735 -2936 -9645 -12852 -5160 14822 33565
303C3565k040k7831l2600j1602J5700K5050J6905M186n720j1659j1392j787J1014
$$ 33565 31525 3694 -28906 -40508 -24808 242 17147 21333 15613 3954 -7438 -9225 1789
316A789J1551l995j9354j6804K281J8789K1383J2051P6j3161k2014j8725j255
$$ 1789 13340 9345 -10009 -26813 -24532 -5743 15640 27691 27767 14606 -7408 -26133 -27388
329b7388J7991K0362L995j2098j1945J305J1766J1129L574o432j6317j9279q716
$$ -27388 -9397 10965 14960 2862 -9083 -7778 3988 15117 18691 12259 -4058 -23337 -32053
342c2053J2056K6251K0078m56j5441j4801n657J929N058N328J442o724j0430k753
$$ -32053 -19997 6254 26332 25876 10435 -4366 -10023 -8094 -3036 2292 3734 -2990 -13420 -16173
356a6173J3457K0557J0859q580j9660j7725p262N303J4363J5719O990p455j3709
$$ -16173 -2716 17841 28700 20120 460 -17265 -24527 -19224 -4861 10858 17848 10393 -3316
369c316o083P739J2871K847j0901j5068q489J932J1482J6811J3124L51j4123j8583
$$ -3316 -9399 -1660 11211 14058 3157 -11911 -20400 -18468 -6986 9825 22949 23300 9177 -9406
383i406q121N316J0932O032j688m823l734M55O279J0876O991n617j7792j6819
$$ -9406 -17527 -12211 -1279 4753 3065 -1758 -5492 -5037 1242 12118 19109 13492 -4300 -21119
397b1119k961J2315J6880J0354K18p610r937n943K287Q181N206m980j2375p539
$$ -21119 -24080 -11765 5115 15469 15687 8077 -1860 -7803 -5516 2665 7871 2891 -9484 -17023
411a7023M833J4324J3086M297n426j2258j2604o735L709J1769J0523L39p179n965
$$ -17023 -12190 2134 15220 19517 14091 1833 -10771 -17506 -13797 -2028 8495 8834 1655 -4310
425d310R58O434O179M59n894j0550r800j283J0756J6074R475l308j1537j0295
$$ -4310 -3352 3082 9261 9720 3826 -6724 -16524 -17807 -7051 9023 18498 15190 3653 -6642
439f642k631M099N342K744j386n386m662K292R539J0236K096q115j2348q865r94
$$ -6642 -9273 -5174 168 2912 1526 -3860 -8522 -6230 3309 13545 15641 7526 -4822 -13687 -14681
454a4681O227J0018P570J394n475p827k633M625O368R47o185q802m439L292R179
$$ -14681 -8454 1564 9134 10528 5053 -2774 -5407 -782 5586 6533 348 -8454 -12893 -9601 -422
469d22J0716N209l586j1014j0334k493N623P400L290k082m010j572J680M768N255
$$ -422 10294 15503 11917 903 -9431 -11924 -6301 1099 4389 2307 -1703 -3275 -1595 3173 8428
484H428N58n745r536o854P24Q499R764N107j955n712o288k791K183N238K141l112
$$ 8428 8986 3241 -6295 -13149 -12425 -3926 5838 10945 8990 3278 -3010 -5801 -3618 1620 3761 649
500F49o101l202L690Q405P243O89n747q639o677q43M972P732M158j302m402l081
$$ 649 -5452 -8654 -4964 3441 10684 11373 5626 -3013 -9690 -10533 -5561 2171 6329 5027 625 -2456
516b456R97L758K630o31m432n845l254J791O687P784L534l020p048o015j136K971
$$ -2456 -1459 2299 4929 4298 -134 -5979 -9233 -7442 -755 7029 10563 7543 495 -5520 -6656 -3685
532c685M294J908r25l739k131K308N353M314On826o835m223J386N354N877K975
$$ -3685 609 2517 1592 -2147 -4278 -1970 3383 7697 7703 1877 -4958 -9181 -7795 -2441 3436 6411
548F411r09m073l835l32K168K791M83l541l858j272K577N335M585J528l072o663
$$ 6411 5502 1429 -2406 -2738 -570 2221 2704 -837 -4695 -5967 -3390 1945 6530 8058 4986 -1677
564a677m941n98L963N000K066j217k980j634R46K973K748p59m142m707k197K045
$$ -1677 -6618 -7216 -3253 1747 3813 2596 -384 -2018 -1072 1901 4649 3890 -252 -4959 -7156 -5111
580e111N002N299J039j770m293l234o83K069K527J100j378k603j513J991M218
$$ -5111 -109 5190 6229 4459 166 -3068 -3751 -1682 845 1945 567 -2036 -3549 -1558 2660
595B660K794j8l632m805l335L31M048M566K254j471l105k529O13K300J683n04
$$ 2660 5454 5436 1804 -3001 -6336 -6005 -1957 2609 4863 3392 287 -2242 -1629 671 2354 1850
611A850k747k775r31K348L677L384Q46k523m071k943o72K492K826J393p33j666
$$ 1850 -897 -3672 -4603 -2255 1422 4806 5652 3129 -942 -3885 -4557 -2065 761 2154 1421 -245
627b45j416J112J858K332l71l391l480j735J323L776L844J458j836l525j969o1
$$ -245 -1661 -549 1309 3641 3270 -121 -3601 -5336 -4013 -237 3607 5065 3229 -296 -2265 -2326
643b326J637K084m39j453j804m09J506L259K259k97k850l250k260J50K573L473
$$ -2326 -689 1395 956 -497 -2301 -2710 -1204 2055 4314 4017 1167 -2083 -4343 -4193 -1620 1853
659A853J288q90k160j824O92J760J341l50k232k497j051J659L635K578N06k064
$$ 1853 3141 2251 91 -1733 -1041 719 2060 1710 -522 -3019 -4070 -2411 1224 3802 4308 2244
675B244l016k351J16J967J989K24m74j581n53J124J808J337l71k457k348j595
$$ 2244 -772 -3123 -3007 -1040 949 1173 699 -882 -1435 -311 1497 2834 2463 6 -2342 -3937
691c937J118K605K760Q74j230k369j449K98J038J671l40j486j745p7J487K234
$$ -3937 -2819 -214 2546 3420 2190 -179 -1628 -1330 -292 1379 1039 -447 -2192 -2269 -782 1452
707A452J898k08k120k679j349M59J921J632N32l21j260q58M95J210J142o41j822
$$ 1452 3350 3142 1022 -1657 -3006 -2547 -626 1006 1538 1217 -43 -901 -406 804 1946 1305 -517
724e17j853l65P95K638J826P09j650k380j478J75J474J609n1q24j215J9J074J487
$$ -517 -2370 -2735 -1940 698 2524 3233 1583 -797 -2275 -2100 -626 983 932 108 -1107 -1088 -14 1473
742A473R42l91k340j803j128J608J844J390N64r32j247j047L76R09Q63k49j524
$$ 1473 2415 2024 -316 -2119 -3247 -1639 205 1595 2159 1227 -20 -1067 -691 218 1081 832 -692
759f92j261O9Q80K168J451N7j903k136j033O75J105J616J22o67q92l68N98J236
$$ -692 -1953 -1884 -1004 1164 2615 2672 769 -1367 -2400 -1725 -620 996 1118 451 -441 -809 -211 1025
777A025L15m69j384j449L53N86J503J481n5q57j300r15j23Q56Q84K82p26j273
$$ 1025 1340 871 -513 -1962 -1609 -1023 480 1961 1906 1049 -251 -1166 -1289 -433 451 733 7 -1266
795a266NR20J524M52l87j307j327q52R50J276J340O9r33j063q1M42M56P08l50
$$ -1266 -1261 -341 1183 1635 1248 -59 -1386 -2238 -1288 -12 1328 1397 464 -599 -680 -238 218 926 576
814E76r43q00j21P20J474N95k05o71j344r96P79J044M13J49n14p49j1N62Q19L85
$$ 576 -367 -1167 -1288 -568 906 1501 1296 625 -719 -1715 -936 108 521 670 156 -593 -604 -42 777 1162
834A162l12j017j085l98J039J118J019j69p49j080k72K89P53K1j29l07n72j67
$$ 1162 850 -167 -1252 -1650 -611 507 1526 1357 608 -472 -744 -455 298 319 190 -117 -689 -856
852h56P34J069K13l97q28n68n56M00J106L92L5k78p47q7K22M79M99n82o94m08
$$ -856 -122 947 1160 763 -65 -633 -1189 -789 317 709 744 466 -281 -368 -146 333 832 250 -444 -852
872h52l3K94J356L77k66o77n82n06K84P65N57k27n60l79K03J98O56J75o06l56
$$ -852 -885 -591 765 1142 876 199 -383 -889 -605 160 717 490 -70 -449 -246 -48 608 783 177 -179
892a79o11l87N17N73N84K99j59j003j15K72M87J24l28q6l58k14L27Q17Q0L69r34
$$ -179 -790 -1177 -660 -87 497 796 637 -366 -481 -209 278 402 74 -12 -370 -584 -257 560 640 1009 75
913G5n78o0j14M82K91R1K63n74k10K2N26K82j72m93k06j83J74O53K93Ln00l30
$$ 75 -503 -563 -677 -195 96 187 450 -124 -334 -312 214 496 324 -169 -375 -558 -384 269 562 565 65 -265
935b65j37q6O94R4j06k22l19j10J55O60K83k07m35l80k65L20M69K95j02N5l19
$$ -265 -402 -488 206 300 194 -28 -347 -457 -302 358 641 434 -1 -381 -646 -326 143 438 336 391 72
956G2m20k0M61L25l32J15m86K0K27L95k1J78n65l50k11J53L65O50l76J12o17M5
$$ 72 -348 -368 93 418 86 201 -285 -265 -38 357 336 514 -51 -401 -612 -459 -94 556 180 292 -325 -280
978b80M61r8L20k05n54J28l55J06O86L02j69l26j30n82K80M00J76J26k13l99J5
$$ -280 181 83 403 198 -356 -228 -583 -477 209 511 342 16 -114 -696 -416 -16 160 286 73 -326 -311
999c11R8N94j20K28q80l33L24L29K8L12K33k87n02l3M68q5J55k11k7m31r6N24
$$ -311 -213 381 261 489 -391 -724 -400 -71 -43 269 502 215 -287 -320 148 63 218 7 -20 -451 -547 -23
1021b3L6L82j29m15L40n75R9K83N13l38k04q0l5P8K28K90k43l58l6p2j85O35J04
$$ -23 13 395 266 -149 191 -384 -285 -2 511 173 -31 -111 -146 -68 160 450 207 -151 -187 -259 -444 191 295
1044B95L54n02k01m77J98L42P3J5n4l31j91L92M23l62K22k30m22N8J40K64L88
$$ 295 649 147 -54 -531 -333 9 82 97 43 -288 -479 -87 336 -26 196 -34 -456 -398 -258 6 394
1065C94l63n6Lk01K44K31r5j4n8n17L65k61N51m1p1j59m9l75N11K80L4j09l14
$$ 394 31 -25 -22 -223 21 252 157 143 85 -432 -67 -328 223 182 111 -48 -97 -472 39 319 353 244 -70
1088g0k42J70J70J30L4J23m43j82j33K58p0K74o6n9K9J09J21J22L3k03m30q1Q0
$$ -70 -312 -142 28 158 192 315 -128 -310 -443 -185 -255 19 -47 -106 -77 32 153 275 308 105 -325 -406 -326
1111c26L50N8J85j31k02j3oJ63k9K97q7l10N0l63M22P3J04M4m63Q2j19J57L20
$$ -326 24 82 267 136 -66 -79 -85 78 49 346 259 -51 -1 -364 58 131 235 279 -184 -102 -221 -64 256
1134B56j50n6p9J75l99M29J07k78q7Rl1l39N56K32J3q0k81l9n4p2J26M3J43j89
$$ 256 106 50 -29 146 -253 176 283 5 -82 -73 -104 -443 113 345 358 278 -3 -42 -96 -168 -42 1 144 -45
1158d5M1j28K07q1K93m01p7j94KK60K53L26l64r5j83k06K80J90J21k07k01R0M
$$ -45 -4 -132 75 -6 287 -114 -191 -385 -383 -123 130 456 92 -3 -186 -392 -112 78 199 -8 -209 -119 -115
1181a15N7J90k18M85m12k85NK38J31J01k59K16r6J9J70p4L27m58k58R0j54QN46
$$ -115 -58 132 -86 399 -13 -298 -293 -55 76 177 -82 134 38 57 227 153 480 22 -236 -146 -300 -292 254
1204B54K44k37l40k8p4O5K69j14q9k56K73P7q3N33r6j90l49m96P59l31J70L00
$$ 254 498 261 -79 -107 -181 -116 153 39 -50 -306 -33 44 -39 494 398 208 -141 -637 122 -209 -39 261
1226B61j15ok68J0J54J86J53l49l08K7K05L45R9k27l09L4l4J5o7L94L8n71NL06
$$ 261 146 140 -128 -118 36 222 375 26 -282 -255 -50 295 394 167 -142 -108 -142 -127 -194 200 238 -333 -328 -22
1250b2K53j30K28N8l05l93k01L06L51K27k7l73J42k69J13LK24j57o4p2j73N4N89
$$ -22 231 101 329 387 82 -311 -512 -206 145 372 345 -28 114 -155 -42 -39 185 28 -36 -108 -281 -227 362
1273C62k96K97k28k73r5m07P11mJ43ro2k9q7N2J28j32j75r8m33J45O54K68J1k02
$$ 362 66 363 135 -138 -233 -640 71 67 210 201 139 110 23 75 203 71 -104 -202 -635 -490 164 432 443 241
1297B41k63k89m1K71N8J75om60K19m1N16J22l37j24k51l50O0O45M35o34J82l39
$$ 241 -22 -311 -352 -81 -23 152 146 -314 -95 -136 380 502 165 41 -210 -560 -500 145 580 -54 128 -211
1319b11J87J41K7R2j60k35j78P9O1M02K51l8l76j95r1P3J81J62J75m58k22L28
$$ -211 -24 117 144 236 76 -159 -337 -258 -197 205 456 418 42 -153 -244 -171 10 172 347 -111 -333 -5
1341eJ81k6L10j57o49j79n1N61J87OK59j42k48j88J42R4J27k87m2l23L23k1N68
$$ -5 176 150 460 303 -346 -525 -576 -15 172 178 437 295 47 -141 1 95 222 -65 -107 -430 -107 -128 440
1364D40L2j46m79k11j98K90K25J66K09m73K18l85P81r2l14O1n94P9n6J71N93K06
$$ 440 472 326 -153 -364 -562 -272 -47 119 328 -145 73 -312 469 377 63 124 -470 -391 -447 -276 317 523
1386E23K1m59l86K3k59M18r5L03o0k01J61J61K03K07j35p87j42r9M11O34l0k87
$$ 523 544 85 -301 -278 -537 -119 -214 89 29 -172 -11 150 353 560 425 -362 -504 -603 -192 442 412 125
1408A25k2r4k3K27j61K31n61n7l3K57J48N41k6m42j18k32N0r2M78j54j54j47j7
$$ 125 103 9 -14 213 52 283 -278 -335 -368 -111 37 578 552 110 -8 -240 -190 -282 196 42 -112 -259 -276
1431b76L35L37j08J63n91l09j36K13J55N28Q4r3l63r9j0l2J59l5q7j64MK43L91
$$ -276 59 396 288 451 -140 -449 -585 -372 -217 311 395 302 -61 -160 -170 -202 -43 -78 -165 -329 -325 -82 309
1454C09j9J29k48l94l14r9P00j18J65J23p8k15qM84l65N6j54n00K20k7O87L81
$$ 309 290 419 171 -223 -537 -636 64 -54 111 234 156 -59 -67 417 52 108 -46 -546 -326 -353 334 715
1476G15k3l74l50l13L51K2K21j26j87O4m6J15J58J43K32n35n83K3L37R4M75l35
$$ 715 692 318 -32 -345 6 28 249 123 -64 0 -46 69 227 370 602 67 -516 -493 -156 -62 413 78
1498G8j16r5J41k49L18j59j34J08j62M5J97K11J77m3m69J24k00k25N42p9r2k13
$$ 78 -38 -133 8 -241 77 -82 -216 -108 -270 -225 -28 183 360 317 -152 -28 -228 -453 89 10 -82 -295
1520b95N08j53J17K15K55l55o33j56m2K67N48J86l6l88j76L5J69j33J79j57o12
$$ -295 213 60 177 392 647 292 -341 -497 -539 -272 276 462 426 38 -138 -103 66 -67 112 -45 -657
1541f57J24J94M78M15k34J57k66o67l0K95K88J51kj54j01R8mj57K89ll00n90J22
$$ -657 -533 -339 139 554 320 477 211 -456 -486 -191 97 248 246 92 -9 89 85 -72 217 214 -86 -676 -554
1564e54M45L43K47J07k55l37k9j68K56Q9l09O5j98K63K50K49Nj00l68m15K29k83
$$ -554 -109 234 481 588 333 -4 -33 -201 55 144 -165 -100 -298 -35 215 464 469 369 1 -414 -185 -468
1586d68N86K67j17j72j99L77l65J54r6L2k54k79K16J82L95K11j27r6m61j30K34
$$ -468 118 385 268 96 -103 274 -91 63 -33 -1 -255 -534 -318 -136 259 470 343 247 -214 -344 -110
1607a10j14K56J10k51J18LJ4P19n32k35l95k29P6N26K51O4j18J15m19k8L6K40
$$ -110 -224 32 142 -109 9 12 26 745 213 -22 -417 -646 -570 -44 207 271 153 268 -151 -179 -143 97
1629I7N5k72k10m0M98J33L05n3q9n68m1l05L55Q8P9l0J96j85kr6P2K29l14j34
$$ 97 152 -120 -330 -370 128 261 566 513 424 -144 -185 -490 -135 -47 32 2 198 13 11 -85 -13 216 -98 -232
1653b32J02k65K77M25J48M8m15l80M2J8L84k32Jn6k23K50J28L03m1k13k92j49
$$ -232 -130 -395 -118 307 455 503 88 -292 -250 -232 152 -80 -79 -135 -358 -108 20 323 282 69 -223 -372
1675c72k5l1L41L53r4J48k25J29k57M9K02q9k87m52N11O6r7L67J40l98l93K01
$$ -372 -397 -428 -87 266 172 320 95 224 -33 16 218 129 -158 -610 -99 -33 -130 237 377 -21 -414 -213
1697b13j29K11J92J60l82L41k05J84J64k01j07j55k37Q4m4K57kL27J4n07N3J61
$$ -213 -342 -131 61 221 -161 180 -25 159 323 122 15 -140 -377 -293 -337 -80 -82 245 259 -248 -195 -34
1719c4L0O9k79N4k21M22O8R5K51l8n18j97J49k62N03j41K80j16q5Q7p1O9K74m33
$$ -34 -4 65 -214 -160 -381 41 109 204 455 417 -101 -298 -149 -411 92 -49 231 115 30 117 46 115 389 -44
1743d4J15j62l15O5N77n2J11k10k07J24l8K1n0J38n0k19L63j05J78m1J98p77O8
$$ -44 71 -91 -406 -341 236 184 295 85 -122 2 -36 -15 -65 73 23 -196 167 62 240 199 397 -380 -312
1766c12j84K52M60j46J04J80j32j39m05M68p8L0j83jk11L93J44qj86m2k25j98
$$ -312 -496 -244 216 70 174 354 222 83 -322 146 68 98 -85 -86 -297 96 240 232 46 4 -221 -419
1788d19J38R4K29M9j1l17M21m47K69J30j15j38k11JK98Q0J12J17k70k79M0J8j
$$ -419 -281 -187 42 91 80 -237 184 -263 6 136 21 -117 -328 -327 -29 51 163 280 10 -269 -229 -211 -212
1811b12K81k04J69j07j66J39M59K85k20l94l90K27q9L2j43M39j7j77K74l04K21
$$ -212 69 -135 34 -73 -239 -100 359 644 424 30 -360 -133 -222 -190 -333 106 89 -88 186 -118 103
1832A03n2j48k5m8k52M26L66l8j67j12k74j92J31L99p7j20L21j74jl33L94J24
$$ 103 51 -97 -122 -170 -422 4 370 332 165 53 -221 -413 -282 117 40 -80 241 67 66 -267 127 251
1854B51j14j63j84m8o9L93K40k31J9r7n7m1J51J47R1k76j35k52L73K17k02K12
$$ 251 137 -26 -210 -258 -327 66 306 75 94 -3 -60 -101 50 197 288 12 -123 -375 -2 215 13 225
1876B25j18J14l35l96L36M35K8j5m07K01j7O4O1j27j82K63l80K88J18J85j04k56
$$ 225 107 221 -114 -510 -174 261 289 274 -133 68 51 115 176 49 -133 130 -250 38 156 341 237 -19
1898a9K11m77j1J04O4N48m38J7j2j34L94j59j66K04R5n62L44l41N27j43J23j57
$$ -19 192 -285 -296 -192 -128 420 -18 -1 -13 -147 247 88 -78 126 221 -341 3 -338 189 46 169 12
1920A2j05p5N70k36N1r2l64K44qn2J55Qk7J34m23P2j84L35K5P2j12j50j93M86
$$ 12 -93 -168 402 166 217 125 -239 5 -3 -55 100 108 81 215 -208 -136 -320 15 40 112 0 -150 -343 143
1944A43J53j11j57j47l57M98o3R6K75k16J82k77j9o7l1J78J08m17k6m7M65M09
$$ 143 296 185 28 -119 -476 22 -41 55 330 114 296 19 0 -67 -98 80 188 -229 -255 -302 163 572
1966E72k70j63k93J15j41m8PM57m52K61j38Q1l4L10j27k33j19L4J09J26K41j31
$$ 572 302 139 -154 -39 -180 -228 -221 236 -216 45 -93 -12 -46 264 137 -96 -215 -181 -72 54 295 164
1988A64J27l57N2k16K81J2r8n3J76j97R0J74K07j98o7m59j52J45M18k6J36j28
$$ 164 291 -66 -14 -230 51 63 -35 -88 88 -109 -19 155 362 164 97 -362 -514 -369 49 23 159 31
2010C1m2jL5PK43l40j1n6l3o3J42K67p3p1Q8m48J09M17j29l1J34k67J04jK20J64
$$ 31 -11 -12 23 30 273 -67 -78 -134 -167 -230 -88 179 106 35 123 -325 -216 201 72 41 175 -92 12 11 231 395
2036C95k71k20ql41P1J90L86L48j94k21j71k40J58L79j93j64j63J01m3K65J17
$$ 395 124 -96 -104 -445 -374 -184 202 550 356 135 -36 -276 -118 261 68 -96 -259 -158 -201 64 181
2057A81K13l58o0k74J14J25M2L41l94L8m43O47n9L6L4l06l14L59R5P6K24K1j90
$$ 181 394 36 -24 -298 -184 -59 -17 324 -70 -32 -475 172 113 149 183 -123 -437 -78 17 93 317 338 148
2080A48k11j47K67J86p0J79l51k23L0j77N26Ko0L9l96L00j43m7L72mK34m24k52
$$ 148 -63 -210 57 243 173 352 1 -222 -192 -369 157 159 99 138 -258 42 -101 -148 224 220 454 30 -222
2103b22K52K9K94l14k08P2l05L29J15K27J64k52m48N5j32Q9K43j50L6j25l6J55
$$ -222 30 59 353 39 -169 -97 -402 -73 42 269 433 181 -267 -212 -344 -255 -12 -162 -126 -251 -287 -132
2125a32J98J54J14k18p7l15K3M71J13M2l31Q6m21J17K55m5m4K12l47r1J11L47
$$ -132 66 220 334 116 39 -276 -253 218 331 373 42 128 -293 -176 79 34 -10 202 -145 -236 -125 222
2147B22J27m2k11m28pJ34L60J51L2k06n91J10L36R1L66k04m83J17j41l6K40L61
$$ 222 349 307 96 -332 -339 -205 155 306 338 132 -459 -349 -13 78 444 240 -243 -126 -267 -303 -63 298
2169B98J9j05l16l99K80J04J26l0p2j42j06L13N24J1k95k44j45j42J90J0J22K
$$ 298 317 212 -104 -503 -223 -119 7 -23 -95 -237 -343 -30 494 505 210 -34 -179 -321 -131 -121 1 3
2191CQ8m15L66l0K21o1J7j15k10p1J69K12K66j11m73j56J89J6K04J56j49K31k85
$$ 3 91 -324 42 12 233 172 189 74 -136 -207 -38 174 440 329 -144 -300 -111 -95 109 265 116 347 62
2214F2l21O4N20mQk12k64o4L25q2K06n8k24K9j62O6K9M36k12l73J2N3J70o8L88
$$ 62 -259 -195 325 321 329 117 -147 -211 114 32 238 180 -44 -15 -177 -111 -82 354 142 -231 -219 -166 4 -64 324
2239C24j00l29Q3j74p4K03N42l01k33k23J20P0J98J95j63q8l43K12l01M77J80
$$ 324 224 -105 -22 -196 -270 -67 475 174 -59 -282 -162 -92 106 301 138 50 -293 -81 -382 95 275
2260B75j04j51k60m1K56J49j32n2K98l85P6K23j58J26J91q4k53l19P4K73L19l8
$$ 275 171 20 -240 -281 -25 124 -8 -60 238 -147 -71 152 -6 120 311 227 -26 -345 -271 2 321 283
2282B83m10k2l78N33N9j32K47l86K1r5k5O39k69K96l76N1l79K32J85O9J54m89
$$ 283 -127 -149 -527 6 65 -67 180 -206 -185 -280 -305 334 65 361 -15 36 -343 -111 74 143 297 -192
2304a92K20j43J21pM63l67k84k62K15N6N36L8l08j41m4k4lM10j53j15k35M9j64
$$ -192 28 -115 6 -1 462 95 -189 -451 -236 -180 356 394 86 -55 -99 -123 -126 284 131 16 -219 -170 -334
2327c34K39J41K30k67M3k87R1P1J41L77m06j27m28L90L09l13L93j15k58j96K07
$$ -334 -95 46 276 9 52 -235 -144 -73 68 445 39 -88 -516 -126 183 -130 263 148 -110 -306 -99
2348i9O0L05j13K51n16L0RK16K03P0k94o24L80k71K78J38J37J96k87k70j12J41
$$ -99 -39 266 153 404 -112 -82 -73 143 346 416 122 -502 -122 -393 -115 23 160 356 69 -201 -313 -172
2370a72K12L19l6l18k80L36n4q6K98J28l91l65L53j07O04k30k39j29M7o8K1J27
$$ -172 40 359 323 5 -275 61 7 -79 219 347 -44 -409 -56 -163 441 211 -28 -157 -110 -178 -157 -30
2392c0J95J68o08O9Q1L08J22J73l71k2k59j29M74j41O0M0r8l4J6r2L45J2l39M0
$$ -30 165 333 -275 -206 -125 183 305 478 107 85 -174 -303 171 30 90 130 32 -2 14 -78 267 279 -60 -20
2416b0k09r9J26L00J84m9j55o2j83K08J96m07L64l28j9M21l19L10k0m55J05m9
$$ -20 -229 -328 -202 98 282 233 78 16 -167 41 237 -170 194 -134 -153 268 -51 259 239 -216 -111 -160
2438a60q9K43L31L9l59J7q3K37m3o3j88N2k5L90m20L00J88r3N2n36oJ68K8P1R7
$$ -160 -249 -6 325 364 5 22 -61 176 133 70 -118 -66 -91 299 -121 179 367 274 326 -210 -216 -48 -20 51 148
2463A48l57K91o3n5L63j58o1j61N3l33J0N67k25M42j27o6o32M03R2j51k93R65
$$ 148 -209 82 19 -36 327 169 108 -53 0 -333 -323 244 19 461 334 268 -364 39 131 -20 -313 652
2485F52o27m12M28j026J225J21k05l63K43o7q7K16L27m13m0L02j76J09k45j91
$$ 652 25 -387 41 -985 240 361 156 -207 36 -31 -118 98 425 12 -28 274 98 207 -38 -229
2505b29K1k25m52O08O84K00o96L78q04k1J23N87l17l65Q83p32O03k19J30l89J72
$$ -229 -208 -433 -885 -277 407 607 -89 289 -515 -536 -413 174 -143 -508 375 -357 246 27 157 -232 -60
2526f0j67k13O94k66n0N3q9j93j40P50q23M69J00q0J62k15J84r58J217o89M73
$$ -60 -227 -440 254 -12 -62 -9 -98 -291 -431 319 -504 -35 65 -15 147 -68 116 -842 375 -314 159
2547A59K7M59p52K19m67o4J97j4J23J08m19N80K04m82J94J14o6m25L03j34m6j9
$$ 159 186 645 -107 112 -355 -419 -222 -236 -113 -5 -424 156 360 -122 72 186 120 -305 -2 -136 -182 -201
2569b01J99K23l74K09J86k68j80K62l02L08J89l3k40R4l21j46M96k65p6M14l43
$$ -201 -2 221 -153 56 242 -26 -206 56 -246 62 251 218 -22 72 -249 -395 101 -164 -240 174 -169
2590a69l0J01o6M18l15j52P2m6q0L09N4j1L9J84k69J2J33J4k40N2k87L64j59J32
$$ -169 -199 -98 -164 254 -61 -213 -141 -187 -267 42 96 85 124 308 39 51 184 198 -42 10 -277 87 -72 60
2614F0J01P0k80o0qJ65O2j20K0J4J6K52l70L29l1m53J27K5J86m32L58K33j64q9
$$ 60 161 231 -49 -109 -117 48 110 -10 10 24 40 292 -78 251 220 -233 -106 -81 105 -327 31 264 100 11
2638A1O5j08J7J73l9m57L6K40N0N3K05j45j62q2Q7j56K38L8k52J51m2L8J15J71
$$ 11 76 -32 -15 158 119 -338 -302 -62 -12 41 246 101 -61 -143 -56 -212 26 64 -188 -37 -79 -41 74 245
2662B45j53O4J8n08L17q2p7L82j26J88k99qj5p2L34m78j58L15L6P2P1J69M0l03
$$ 245 92 156 174 -334 -17 -99 -176 206 80 268 -31 -39 -54 -126 208 -270 -428 -113 -77 -5 66 235 275 -28
2686b8j13j29K06Lm6J21l3K37j16J70j4l05J40k44K06l55J03L12J39Km9j94Lj04
$$ -28 -141 -270 -64 -61 -107 14 -19 218 102 272 258 -47 93 -151 55 -300 -197 115 254 256 207 13 16 -88
2710h8K6q9J20mk04K14J43l0o2M0j55j61L5j63N69J92q6j60k09K58j92K7j84J82
$$ -88 -62 -151 -31 -35 -239 -25 118 88 26 66 -89 -250 -215 -378 191 383 297 137 -72 186 -6 21 -163 19
2734A9m07M0J63O3K31K93j57j35l95L30m58K63K89j56j34K26O4p8q9l2q0j55O1
$$ 19 -388 -348 -185 -122 109 402 245 110 -285 45 -413 -150 139 -17 -151 75 139 61 -28 -60 -140 -295 -234
2757b34L03k24p3O09j36L2j27k28M7o6p5k10L53m7j07K19L56j56O8m65K16l09
$$ -234 69 -155 -228 381 245 277 150 -78 -31 -97 -172 -382 -29 -76 -183 36 392 236 304 -161 55 -254
2779b54L27N9k30J27J00k7j17L21q6l36R7j72k19j28M93L04j9j94k9j70j37K87
$$ -254 73 132 -98 29 129 102 -15 306 220 -116 -19 -191 -410 -538 -45 259 240 46 17 -153 -290 -3
2801co0J61o1j01J02Q1K8R5k53O7k75j82M25k77M19j7o4J42m06K39j41Q1j55n5
$$ -3 -63 98 37 -64 38 119 147 242 -11 56 -219 -401 24 -253 166 149 85 227 -179 60 -81 0 -155 -210
2825b10k09L43m7J35N38k38R9o64J0j50L41L71j63p2r8N0J35j82J92l8l20n7q8
$$ -210 -419 -76 -123 12 550 312 411 -253 -243 -393 -52 319 156 84 -14 36 171 -11 181 143 -177 -234 -322
2848c22M10k62K31M10l85j87J78m2j76j20J40m8q1K12K06M1J68k79J4m50J74J19
$$ -322 88 -174 57 467 82 -105 73 31 -145 -265 -125 -173 -254 -42 164 205 373 94 108 -342 -168 -49
2870d9p7R9j28N47m38o0%L87j94k21l5J05l03O1N37K7k83J89k65k26Q9k5M04j10
$$ -49 -126 -27 -155 392 -46 -106 -106 281 87 -134 -169 -64 -367 -306 231 258 -25 164 -101 -327 -238 -263 141 31
2894C1L3m2q5K12M4j03k22j61j25K37k8K49j25N22j00l37J48K4JP9k45k24m7P3
$$ 31 64 22 -63 149 193 90 -132 -293 -418 -181 -209 40 -85 437 337 0 148 172 173 252 7 -217 -264 -191
2918a91K95J84pMj91l22q8j2K35J1r4J34m4N3K40J7k5l25j72K05k21J07N06J19
$$ -191 104 288 281 285 94 -228 -316 -328 -93 -82 -176 -42 -86 -33 207 224 199 -126 -298 -93 -314 -207 299 418
2942D18k36pP6k93j8m7O9l4J78m21N02o2K12K0n75K30l83j89L59J91M7K19j53
$$ 418 182 175 251 -42 -60 -107 -38 -72 106 -315 187 125 337 357 -218 12 -371 -560 -201 -10 37 256 103
2965A03k78K66nJ29k04k90J28j33J30j07R11j44k38j62j38l42L13k26L83k15J70
$$ 103 -175 91 86 215 11 -279 -151 -284 -154 -261 650 506 268 106 -32 -374 -61 -287 96 -119 51
2986E1j26N4K93j09M1K0n61p0OL45J67J78m2p5j86k00J42L2n8j67J27O5k8N8L47
$$ 51 -75 -21 272 163 204 224 -337 -407 -401 -56 111 289 247 172 -14 -214 -72 -40 -98 -265 -138 -73 -101 -43 304
3011C04j43k38N6l04P2K49J57l10Q0n5L01P3o8l9k05j70R0l04J30L48K79k2m2
$$ 304 161 -77 -21 -325 -253 -4 153 -157 -77 -132 169 242 174 135 -70 -240 -150 -454 -324 24 303 281 239
3034B39k12n3j20M7J12j68K96k40n9L73k07O33m9o58j05j89L56Q9J53j73j5J09
$$ 239 27 -26 -146 -99 13 -155 141 -99 -158 215 8 641 592 -66 -171 -360 -4 85 238 65 50 159
3056A59k92J76J73Jj48k96l37K84J16M29J04j7j11k79P0k73q1K86K26k0l61M55
$$ 159 -133 43 216 217 69 -227 -564 -280 -164 265 369 352 241 -38 32 -241 -322 -36 190 170 -191 264
3078B64k69O1J48j71j26l32Q4K46K83q7K15k21p6m2k22K7J49Q2j61N5l04L69l4
$$ 264 -5 56 204 33 -93 -425 -341 -95 188 101 316 95 19 -23 -245 -218 -69 13 -148 -93 -397 -28 -62
3101f2R0j55L00k83j16qk8J11L81k64K5j27L2K41k1j42J34m17J06L36K57K9m01
$$ -62 28 -127 173 -110 -226 -234 -262 -151 230 -34 -9 -136 -104 137 116 -26 108 -309 -203 133 390 419 18
3124A8L8j55j07j24L48l55L77m46J89k4O01m3K0j29m43L7j92J87K71J2P5p4p0
$$ 18 56 -99 -206 -330 18 -337 40 -406 -217 -241 360 317 337 208 -235 -198 -390 -203 68 80 155 81 11
3147A1J85j86Q8P1j04k78j1M2K95R2J82pj85n18P1J18J49j23Q8M2k36J24J05J99
$$ 11 196 10 98 169 65 -213 -224 -182 113 205 387 380 195 -323 -252 -134 15 -108 -20 22 -214 -90 15 214
3171B14J38p30P0M4K30k4KL90k92r9J33r9Q7k29K95j50j41j7Q0J73lK06j33k26
$$ 214 352 -378 -308 -264 -34 -58 -56 334 42 -57 76 -23 64 -165 130 -20 -161 -178 -98 75 72 278 145 -81
3195h1l84L21k46K11N2M88l11k08K59j78R7J6j78Oj48J45j5M53p2p7q3k41o1M8
$$ -81 -465 -144 -390 -179 -127 361 50 -158 101 -77 20 36 -142 -136 -284 -139 -154 299 227 150 67 -174 -235 -187
3219a87k4K48m3l20M03q7n4J71N9J0m82p5K74R1K03L88m77Pj73J78j24k64M18
$$ -187 -211 37 -6 -326 77 -10 -64 107 166 176 -306 -381 -107 -16 187 575 98 105 -68 110 -14 -278 140
3242A40m21K94LJ6M2M47m96K29r6k07k84M63r3P2p4m0n3N2K70l44J27j55j08L9
$$ 140 -281 13 16 32 74 521 25 254 158 -49 -333 130 37 109 35 -5 -58 -6 264 -80 47 -108 -216 -177
3266a77Jm8N51k55K76l60j9Q8q9J22o8j06J7p8l4L00K44k50R1l42k96K71J21J0
$$ -177 -176 -224 327 72 348 -12 -31 57 -32 90 22 -84 -67 -145 -179 121 365 115 206 -136 -432 -161 -40 -30
3290c0L13n1o4j69k79L58L6l04j68L77j60M12l5mJ22j38o5k75k25L74r6L95l30
$$ -30 283 232 168 -1 -280 78 114 -190 -358 19 -141 271 236 232 354 216 151 -124 -349 25 -71 324 -6
3313fJ89l2J13k65j7K55j79q6j71J91J71nM10m31j59J51j72j39N6L4J49J65r2
$$ -6 183 151 264 -1 -18 237 58 -28 -199 -8 163 158 568 137 -22 129 -43 -182 -126 -92 57 222 130
3336A30K08j30k5l3k91j80L5q9K70P9K31j32q6j49L72k42J44j67j2J47k05P5K41
$$ 130 338 208 183 150 -141 -321 -286 -375 -105 -26 205 73 -13 -162 210 -32 112 -55 -67 80 -125 -50 191
3359A91Q3j99J17m76n5J42J1J48L34k49J21n8j1l9o4r4J39O7k83K11r6J72J22
$$ 191 274 75 192 -284 -339 -197 -186 -38 296 47 168 110 99 60 -4 -98 41 108 -175 36 -60 112 234
3382B34K18l72m27L03l9J7J67k64q0J36L04K53l80L32n78l23L40p0K11L8m8M66
$$ 234 452 80 -347 -44 -83 -66 101 -163 -243 -107 197 450 70 402 -176 -499 -159 -229 -18 20 -28 438
3404D38o07k8L80k17Q8Nl20N4J14J19K87j09K7j63j1M2l24J1L5j32K81j56kL05
$$ 438 -169 -197 183 -34 54 59 -261 -207 -93 26 313 204 231 68 57 99 -225 -214 -179 -311 -30 -186 -188 117
3428A17nj45J17n15K64j85K69R4J91j97p3k1j28K55l2J94k41j07l5k86L87n3K78
$$ 117 112 -33 84 -431 -167 -352 -83 11 202 5 -68 -89 -217 38 6 200 -41 -148 -183 -469 -82 -135 143
3451A43K12m30M8l58N68l16L78p3m97L88K46p5j82J78k43k92K58K42j38K26k24
$$ 143 355 -75 -27 -385 183 -133 245 172 -325 63 309 234 52 230 -13 -305 -47 195 57 283 59
3472E9L34j26j10j65J24j16O9p1j8j28%M6K54J90l58j25j81K81l55N04M08n08
$$ 59 393 267 157 -8 116 0 69 -2 -20 -148 -148 -102 152 342 -16 -141 -322 -41 -396 108 516 8
3494HP8m5M4r8P4K32j59j19j82J02M1L11M7l16K03l47OL7O1J88n5k46q1M00j02
$$ 8 86 41 85 -13 61 293 134 15 -167 -65 -24 287 334 18 221 -126 -120 -83 -22 166 111 -135 -216 184 82
3519H2M2j89kl8k7J2R0R3J41j86N5k7k31R2KJ25k84P7J89k17K60R1j40j82k2J5
$$ 82 124 -65 -67 -105 -132 -120 -30 63 204 18 73 46 -185 -93 -91 34 -250 -173 16 -201 59 150 10 -172 -194 -179
3545a79J26n27P29k5P7k95j05J76j45R4K72j62k09j79M35k62J99J75j75%k38m
$$ -179 -53 -580 149 124 201 -94 -199 -23 -168 -74 198 36 -173 -352 83 -179 20 195 20 20 -218 -222
3567b22J62J54j76Q8MJ43l33K63J56j74k1p0J67%o6O4J54k11k24L31m26M1L46
$$ -222 -60 94 -82 6 10 153 -180 83 239 65 44 -26 141 141 75 139 293 82 -142 189 -237 -196 150
3590A50k50Q2k19J02L6J17J13j08l4j27M0Q7k41J58K06k38J64J8J56j63j56J83
$$ 150 -100 -18 -237 -135 -99 18 131 23 -11 -138 -98 -11 -252 -94 112 -126 38 56 212 49 -107 76
3612G6j9k59k07L03J89po6J63j42j23J53j90J29O1n1J53j28l81L95l0K11k27J31
$$ 76 57 -202 -409 -106 83 76 10 173 31 -92 61 -129 0 61 10 163 35 -346 49 19 230 3 134
3635A34m74L22j14K22N8k67J71j44K00j07K50n0l87J27j43k22P64k53j11J93l06
$$ 134 -340 -18 -132 90 148 -119 52 -92 108 1 251 201 -186 -59 -202 -424 340 87 -24 169 -137
3656a37J23J08l19M53j6l25l8k3K1K3J95j53R5k60J90k3N0K51j07O6m2o2j67J62
$$ -137 -14 94 -225 228 212 -113 -151 -174 -153 -130 65 -88 7 -253 -63 -86 -36 215 108 174 132 70 -97 65
3680F5J6n8q8P4l12J42N44m34M95m76n2r1K67M6M7o0l3k00N1J62k39K42k80J54
$$ 65 81 23 -65 9 -303 -161 383 -51 444 -32 -84 -175 92 138 185 125 92 -108 -57 105 -134 108 -172 -18
3704a8J46k52K28j72N9LJ61j72j43j48L61J05r6j08l1N7l8J45j23j07K21l72L4
$$ -18 128 -124 104 -68 -9 -6 155 -17 -160 -308 53 158 62 -46 -77 -20 -58 87 -36 -143 78 -294 -260
$$ [...]
8191A38
##END NTUPLES=NMR FID
##END=
