##TITLE=1H_IG-G398-2
 200.13MHz,CDCl3 ,
 8 sc
 
 30.10.2025
##JCAMPDX= 6.0         $$ Bruker NMR JCAMP-DX V2.0
##DATA TYPE= NMR FID
##DATA CLASS= NTUPLES
##ORIGIN= UXNMR, Bruker Analytische Messtechnik GmbH
##OWNER= pz
$$ XWIN-NMR		Version 3.5
$$ Thu Oct 30 16:30:27 2025 Russian Standard Time (UT+4h)  she@DPX200
##.OBSERVE FREQUENCY= 200.1313
##.OBSERVE NUCLEUS= ^1H
##.DELAY= (6, 6)
##.ACQUISITION MODE= SIMULTANEOUS
##.ACQUISITION SCHEME= undefined
##.AVERAGES= 8
##.DIGITISER RES= 18
##SPECTROMETER/DATA SYSTEM= spect
##.PULSE SEQUENCE= zg30
##.SOLVENT NAME= CDCl3
##.SHIFT REFERENCE= (INTERNAL, CDCl3, 0, 14.3821)
##AUDIT TRAIL= $$ (NUMBER, WHEN, WHO, WHERE, WHAT)
$$ ##TITLE= Audit trail, XWIN-NMR		Version 3.5
$$ ##JCAMPDX= 5.01
$$ ##ORIGIN= Bruker BioSpin GmbH
$$ ##OWNER= she
$$ F:/spectra/data/she/nmr/H-C/1/audita.txt
$$ ##AUDIT TRAIL=  $$ (NUMBER, WHEN, WHO, WHERE, WHAT)
(   1,<2025-10-30 16:29:18.40 +0400>,<she>,<DPX200>,
      <created by zg, POWCHK disabled, PULCHK disabled
       configuration hash MD5:
       00 E9 B6 7A A2 85 ED C7 34 08 36 98 17 FE 4E 26
       data hash MD5: 16K
       D2 3C B1 4B F9 65 25 DF 72 8C C4 16 68 08 5A 71>)
$$ ##END=
$$ 
$$ hash MD5
$$ D5 47 B8 5C F1 B7 1C 8A D5 19 8E BC 31 14 DA 2B
##$RELAX= 
##$RELAX= 
##$RELAX= 
##$RELAX= 
##$RELAX= 
##$RELAX= 
$$ Bruker specific parameters
$$ --------------------------
##$DU= <F:/spectra>
##$EXPNO= 1
##$NAME= <H-C>
##$PROCNO= 1
##$TYPE= <nmr>
##$USER= <she>
##$AMP= (0..31)
100 100 100 100 100 100 100 100 100 100 100 100 100 100 100 100 100 100 
100 100 100 100 100 100 100 100 100 100 100 100 100 100 
##$AQSEQ= 0
##$AQ_mod= 1
##$AUNM= <au_zg>
##$AUTOPOS= <>
##$BF1= 200.13
##$BF2= 200.13
##$BF3= 200.13
##$BF4= 200.13
##$BF5= 200.13
##$BF6= 200.13
##$BF7= 200.13
##$BF8= 200.13
##$BYTORDA= 1
##$CFDGTYP= 0
##$CFRGTYP= 5
##$CHEMSTR= <none>
##$CNST= (0..31)
1 1 145 1 1 1 1 1 1 1 1 1 1 1 1 1 1 1 1 1 1 1 1 1 1 1 1 1 1 1 1 1 
##$CPDPRG= <>
##$CPDPRG1= <>
##$CPDPRG2= <>
##$CPDPRG3= <>
##$CPDPRG4= <mlev>
##$CPDPRG5= <mlev>
##$CPDPRG6= <mlev>
##$CPDPRG7= <mlev>
##$CPDPRG8= <mlev>
##$CPDPRGB= <>
##$CPDPRGT= <>
##$D= (0..31)
0 0.7 0 0 0 0 0 0 0 0 0 0.03 0 0 0 0 0 0 0 0 0 0 0 0 0 0 0 0 0 0 0 0 
##$DATE= 1761827357
##$DBL= (0..7)
120 120 120 120 120 120 120 120 
##$DBP= (0..7)
150 150 150 150 150 150 150 150 
##$DBP07= 0
##$DBPNAM0= <>
##$DBPNAM1= <>
##$DBPNAM2= <>
##$DBPNAM3= <>
##$DBPNAM4= <>
##$DBPNAM5= <>
##$DBPNAM6= <>
##$DBPNAM7= <>
##$DBPOAL= (0..7)
0.5 0.5 0.5 0.5 0.5 0.5 0.5 0.5 
##$DBPOFFS= (0..7)
0 0 0 0 0 0 0 0 
##$DE= 6
##$DECBNUC= <off>
##$DECIM= 32
##$DECNUC= <off>
##$DECSTAT= 4
##$DIGMOD= 1
##$DIGTYP= 9
##$DL= (0..7)
0 120 120 120 120 120 120 120 
##$DP= (0..7)
150 150 150 150 150 150 150 150 
##$DP07= 0
##$DPNAME0= <>
##$DPNAME1= <>
##$DPNAME2= <>
##$DPNAME3= <>
##$DPNAME4= <>
##$DPNAME5= <>
##$DPNAME6= <>
##$DPNAME7= <>
##$DPOAL= (0..7)
0.5 0.5 0.5 0.5 0.5 0.5 0.5 0.5 
##$DPOFFS= (0..7)
0 0 0 0 0 0 0 0 
##$DQDMODE= 0
##$DR= 18
##$DS= 0
##$DSLIST= <SSSSSSSSSSSSSSS>
$$ [...]
##$SUBNAM0= <"">
##$SUBNAM1= <"">
##$SUBNAM2= <"">
##$SUBNAM3= <"">
##$SUBNAM4= <"">
##$SUBNAM5= <"">
##$SUBNAM6= <"">
##$SUBNAM7= <"">
##$SUBNAM8= <"">
##$SUBNAM9= <"">
##$SW= 18.0517328524113
##$SWIBOX= (0..15)
0 0 2 0 0 0 0 0 0 0 0 0 0 0 0 0 
##$SW_h= 3612.71676300578
##$TD= 16384
##$TD0= 1
##$TE= 0
##$TE2= 300
##$TE3= 300
##$TEG= 300
##$TL= (0..7)
0 120 120 120 120 120 120 120 
##$TP= (0..7)
150 150 150 150 150 150 150 150 
##$TP07= 0
##$TPNAME0= <>
##$TPNAME1= <>
##$TPNAME2= <>
##$TPNAME3= <>
##$TPNAME4= <>
##$TPNAME5= <>
##$TPNAME6= <>
##$TPNAME7= <>
##$TPOAL= (0..7)
0.5 0.5 0.5 0.5 0.5 0.5 0.5 0.5 
##$TPOFFS= (0..7)
0 0 0 0 0 0 0 0 
##$TUNHIN= 0
##$TUNHOUT= 0
##$TUNXOUT= 0
##$USERA1= <user>
##$USERA2= <user>
##$USERA3= <user>
##$USERA4= <user>
##$USERA5= <user>
##$V9= 5
##$VALIST= <valist>
##$VCLIST= <CCCCCCCCCCCCCCC>
##$VD= 0
##$VDLIST= <DDDDDDDDDDDDDDD>
##$VPLIST= <PPPPPPPPPPPPPPP>
##$VTLIST= <TTTTTTTTTTTTTTT>
##$WBST= 1024
##$WBSW= 4
##$XGAIN= (0..3)
0 0 0 0 
##$XL= 0
##$YL= 0
##$YMAX_a= 19908
##$YMIN_a= -20791
##$ZGOPTNS= <>
##$ZL1= 120
##$ZL2= 120
##$ZL3= 120
##$ZL4= 120
##$ABSF1= 10
##$ABSF2= 0
##$ABSG= 5
##$ABSL= 3
##$ALPHA= 0
##$AQORDER= 0
##$ASSFAC= 0
##$ASSFACI= 0
##$ASSFACX= 0
##$ASSWID= 0
##$AUNMP= <proc_1d>
##$AZFE= 0.1
##$AZFW= 0.1
##$BCFW= 1
##$BC_mod= 2
##$BYTORDP= 1
##$COROFFS= 0
##$CY= -3
##$DATMOD= 1
##$DC= 2
##$DFILT= <>
##$DTYPP= 0
##$F1P= 0
##$F2P= 0
##$FCOR= 0.5
##$FTSIZE= 0
##$FT_mod= 4
##$GAMMA= 1
##$GB= 0.15
##$INTBC= 1
##$INTSCL= 1
##$ISEN= 128
##$LB= 0.25
##$LEV0= 0
##$LPBIN= 0
##$MAXI= 10000
##$MC2= 0
##$MEAN= 0
##$ME_mod= 0
##$MI= 1.114404
##$NCOEF= 0
##$NC_proc= 0
##$NLEV= 6
##$NOISF1= 3.799351
##$NOISF2= 2.8
##$NSP= 1
##$NTH_PI= 0
##$NZP= 0
##$OFFSET= 14.38212
##$PC= 1
##$PHC0= -2639.003
##$PHC1= 38.79236
##$PH_mod= 1
##$PKNL= yes
##$PPARMOD= 0
##$PSCAL= 0
##$PSIGN= 0
##$REVERSE= no
##$SF= 200.129724274929
##$SI= 16384
##$SIGF1= 3
##$SIGF2= 2
##$SINO= 400
##$SIOLD= 16384
##$SREGLST= <1H.CDCl3>
##$SSB= 0
##$STSI= 0
##$STSR= 0
##$SW_p= 3205.1282051282
##$SYMM= 0
##$S_DEV= 0
##$TDeff= 0
##$TDoff= 0
##$TI= <>
##$TILT= no
##$TM1= 0
##$TM2= 0
##$TOPLEV= 0
##$USERP1= <user>
##$USERP2= <user>
##$USERP3= <user>
##$USERP4= <user>
##$USERP5= <user>
##$WDW= 1
##$XDIM= 8192
##$YMAX_p= 0
##$YMIN_p= 0
$$ End of Bruker specific parameters
$$ ---------------------------------
##NTUPLES= NMR FID
##VAR_NAME=  TIME,          FID/REAL,        FID/IMAG
##SYMBOL=    X,             R,               I
##VAR_TYPE=  INDEPENDENT,   DEPENDENT,       DEPENDENT
##VAR_FORM=  AFFN,          ASDF,            ASDF
##VAR_DIM=   8192,          8192,            8192
##UNITS=     SECONDS,       ARBITRARY UNITS, ARBITRARY UNITS
##FACTOR=    0.0002768,     1,               1
##FIRST=     0,             0,               0
##LAST=      2.2672688,     0,               0
##MIN=       0,             -20791,          0
##MAX=       2.2672688,     19908,           0
$$ Real data points
##PAGE= N=1
##DATA TABLE= (X++(R..R)), XYDATA
0@%%%%%%%%%%%%%%%%%%%%%%%%%%%%%%%jLoQrJ1j2J3j4J5j7J9k2K4k6L0l3L7m1
$$ 0 0 0 0 0 0 0 0 0 0 0 0 0 0 0 0 0 0 0 0 0 0 0 0 0 0 0 0 0 0 0 0 -1 2 -4 4 -5 6 -6 7 -7 8 -9 10 -12 12 -14 16 -17 20 -21
50b1M3m6N2n9O6p2P9q8R8j10J23j38J58j84K16k60L26m35O66j257J67R271J1313
$$ -21 22 -24 28 -31 35 -37 42 -46 52 -58 65 -73 85 -99 117 -143 183 -252 414 -843 -676 8595 19908
73A9908k185q579O944n235j6625J595J939o920J81J509L712L041m502K601N731
$$ 19908 17723 9144 16088 10853 -5772 -4177 -2238 -9158 -8977 -7468 -3756 -715 -5217 -2616 3115
88C115o113j347O073j88J01K632J184L682l093m606L318l188q761M91K064k382
$$ 3115 -2998 -4345 1728 1540 1641 4273 5457 9139 6046 1440 4758 1570 -7191 -6700 -4636 -7018
104g018P56M079M612J682k045L759K568p989k571K956m518m299K564K791P04P89
$$ -7018 -6262 -2183 2429 4111 2066 5825 8393 404 -2167 789 -3729 -8028 -5464 -2673 -1969 -1180
120a180L376M361j385j921K468j309m189o46p6r26j215j177J173N96k225k87L015
$$ -1180 2196 6557 5172 3251 5719 4410 221 -425 -501 -1427 -2642 -3819 -2646 -2050 -4275 -4562 -1547
137a547r42r68K745L061J270L59K248K232k108k622R29k694n594j923M29k434
$$ -1547 -2489 -3457 -712 2349 3619 3978 6226 8458 6350 3728 4657 1963 -3631 -5554 -5125 -7559
153g559j297K247L296J060P31M401K148j471P31J109j191j704m44k63j296j335
$$ -7559 -8856 -6609 -3313 -2253 -1522 2879 5027 3556 4287 5396 4205 2501 2057 1794 498 -837
169h37p56N60j336j144P6Q55l25K86J236K014K97j10K122Q98k050m14O31j327
$$ -837 -1593 -1033 -2369 -3513 -3437 -2582 -2907 -2621 -1385 629 926 816 2938 3836 1786 1372 2003 676
187F76j900P2P80o99n18K022J050j083p4J436q48j795N1l35j007o18P60P92M0
$$ 676 -1224 -1152 -372 -1071 -1589 433 1483 400 326 1762 914 -881 -830 -1165 -2172 -2790 -2030 -1238 -1198
206a198M51J551N95L40L65M85m0p98K8p1k81j447j276J07o06j497lP11k68p8J751
$$ -1198 -747 804 1399 1739 2104 2589 2549 1751 1779 1708 1427 -20 -1296 -1189 -1795 -3292 -3295 -2584 -2852 -2930 -1179
227a179J492M48N60J888Q70n11n74M28j417j689p89J8j514j007M55k36n25P11
$$ -1179 313 761 1321 3209 4079 3568 2994 3422 2005 316 -473 -455 -1969 -2976 -2521 -2757 -3282 -2571
245b571J178M96K87J349M84L48k8M08L60l87q49j5M4m48j263q1j04n59o40Q14
$$ -2571 -1393 -897 -610 739 1223 1571 1543 1951 2311 1924 1075 1060 1104 656 -607 -688 -792 -1351 -1991 -1177
265a177M38o29K30M60L50j90L90Q43j27j69O25L60l56p8N74M6j108j61K02r69
$$ -1177 -739 -1368 -1138 -678 -328 -518 -128 715 588 419 1044 1404 1048 970 1544 1590 482 321 523 -446
285d46o94%k23k18l59K57L39R6L29O25O82N54L41M15K97Nl92J34l23q19r63M0
$$ -446 -1140 -1140 -1363 -1581 -1940 -1683 -1344 -1248 -919 -294 388 942 1283 1698 1995 2000 1608 1742 1419 600 -363 -323
307c23n36p55j11L89m06l11P66N21l6P59N74K57O21j00N46rn12j17j10n03m80
$$ -323 -859 -1614 -1725 -1336 -1742 -2053 -1287 -766 -802 -43 531 788 1409 1309 1855 1846 1334 1217 1107 604 124
328A24n64K3p60j45j00j16J64L65j78L75L45L87M14O47J23O3O01l18m47N00l26
$$ 124 -440 -417 -1177 -1322 -1422 -1538 -1374 -1009 -1187 -812 -467 -80 334 981 1104 1167 1768 1450 1003 1503 1177
349A177p84j79m63l67o82j1Q7m51k09O26J23M56L86O49M97L39L24m5K79l18l05
$$ 1177 393 214 -249 -616 -1298 -1309 -1222 -1673 -1882 -1256 -1133 -677 -291 358 855 1194 1518 1473 1752 1434 1129
370A129j36l78o07m43j78m79k91Nj37P2J71M30K56M83M64M32J14J85j38L41P2
$$ 1129 993 615 8 -435 -613 -1092 -1383 -1378 -1515 -1443 -1272 -842 -586 -103 361 793 907 1092 954 1295 1367
391A367m34k7m63o24K22m25j08k39k87P8O7r9J23K95M2K87L55M07q3L7L31L55
$$ 1367 933 906 443 -181 41 -384 -492 -731 -1018 -940 -873 -972 -849 -554 -512 -225 130 537 454 491 822 1177
413A177J01j07j82m46j09n85r7n56j07j04m21K67j92L46O4P05J64L82J80M81L59
$$ 1177 1278 1171 989 543 434 -151 -248 -804 -911 -1015 -1436 -1169 -1361 -1015 -951 -246 -82 300 480 961 1320
434A320K64k81J46k23n67k47o50l88K33o23m19j77K58J46O2M78N10j10P56O53
$$ 1320 1584 1303 1449 1226 659 412 -238 -626 -393 -1016 -1435 -1612 -1354 -1208 -1146 -668 -158 -268 488 1141
454A141O0j8J62m1k90k16j24n18m93j11k37j62j02P6l30J47M89L77j94M44L92
$$ 1141 1201 1183 1345 1304 1014 798 674 156 -337 -448 -685 -847 -949 -873 -1203 -1056 -567 -190 -384 60 452
475D52j45Q6K30L7K09nn0k16k5j02m32m96P4J49l87j22P0k43L6N1K06J11L28L85
$$ 452 307 393 623 660 869 864 814 598 573 471 39 -457 -383 -234 -621 -743 -673 -916 -880 -829 -623 -512 -184 201
499B01M38J20J57L1nL3P8m71l37j30n87q2j45k08j55j61K27K01J56M67M54j8L76
$$ 201 639 759 916 947 942 975 1053 582 245 115 -472 -554 -699 -907 -1062 -1223 -996 -795 -639 -172 282 264 640
522F40M13l06K33q5M39o02m33j95m83j13j9l19l52M03j60J29K35M18J08M58M0
$$ 640 1053 747 980 895 1334 732 299 104 -379 -492 -511 -830 -1182 -779 -939 -810 -575 -157 -49 409 449
543D49L93N7K3k01L9j71ml0m21m83O5n4n26K83J01k92J19m0L48M9L47K3Q9J08
$$ 449 842 899 922 721 760 589 585 555 134 -349 -284 -338 -864 -581 -480 -772 -653 -693 -345 -296 51 74 163 271
567B71L76k93O1K10O5j59j52l08R2m02J79m47l44M9K18rK57j96L8J08M97K35J9
$$ 271 647 354 415 625 690 531 379 71 163 -239 -60 -507 -851 -802 -584 -593 -336 -532 -494 -386 111 346 365
590C65l0L18J04j85J36k05k63j30j51l40j14l43J81l80J91M37j78N1O66L00l02
$$ 365 335 653 757 572 708 503 240 110 -41 -381 -495 -838 -657 -1037 -846 -409 -587 -536 130 430 128
611A28M06L33k32o0O3M6k65k63Q8m93n2k4m37r9J47K17R4j32K83K15J93L0L65
$$ 128 534 867 635 575 638 684 419 156 244 -249 -301 -325 -762 -861 -714 -497 -403 -535 -252 -37 156 186 551
634E51j31K9J62j83n6p2R6n05J05j63n5l00q2N56p11K01Q0r2L35J22K56J58n9
$$ 551 420 449 611 428 372 300 396 -109 -4 -167 -222 -522 -604 -48 -759 -558 -478 -570 -235 -113 143 301 242
657B42K27k8L15N6j45n25L02k80l69l11M49k91l05J42P3k14L38k1N2J91M70Mj89
$$ 242 469 441 756 812 667 142 444 164 -205 -516 -67 -358 -663 -521 -448 -662 -324 -345 -293 -102 368 372 183
680A83M8L72L2k61J75k30j90k10o7n8J17j38n20K3K17K88k95K24K45K32J47N3
$$ 183 231 603 635 374 549 319 129 -81 -148 -206 -89 -227 -747 -724 -507 -219 -514 -290 -45 187 334 387
702C87J02k36J44j5M8j28J4k64L6j87m25k93K22p6J85j0J38R0P3K68n7L44j81
$$ 387 489 253 397 382 430 302 316 52 88 -99 -524 -817 -595 -671 -486 -496 -358 -268 -195 73 16 360 179
725A79L53No5N3m01J74l53K28n3n96R8l94J09J2J40K49J50J09O2J3J44J68J63
$$ 179 532 537 472 525 124 298 -55 173 120 -476 -378 -772 -663 -651 -511 -262 -112 -3 59 72 216 384 547
748E47k40q1J78r2J15m12j18k43J09L14k65j54K46j72k3j04R8L68J56j78L61k46
$$ 547 307 226 404 312 427 15 -103 -346 -237 77 -188 -342 -96 -268 -291 -395 -297 71 227 49 410 164
770A64K42l46mL50j32l09P2N4m29QM4Q7M1j66r0L8qJ48K14l6j52K07J19J42K94
$$ 164 406 60 56 406 274 -35 37 91 -338 -330 -286 -199 -158 -324 -414 -376 -384 -236 -22 -58 -210 -3 116 258 552
795E52l56J26K5J7n75L01q9l38p5k41O42l99K59J13l55J91M14m4Q3q7K38L9j95
$$ 552 196 322 347 364 -211 90 1 -337 -412 -653 -11 -410 -151 -38 -393 -202 212 168 251 164 402 441 246
818B46M02l35k23J2k86j50J76k61K14j14j5j49J36L35k66P36n2p9K26j86k63K26
$$ 246 648 313 90 102 -184 -334 -158 -419 -205 -319 -334 -483 -347 -12 -278 458 406 327 553 367 104 330
840C30J3j89j62p0j78J31j2J70j00k31J77r3KK45k38K01J87j44k7K3J52L50j35
$$ 330 343 154 -8 -78 -256 -125 -137 33 -67 -298 -121 -214 -212 33 -205 -4 183 39 12 35 187 537 402
863D02j10j59k55P7j27M72m44l79L48m06J96M9J10K21J8j79M23k67M44r4l4r9
$$ 402 292 133 -122 -45 -172 300 -144 -523 -175 -581 -385 -336 -226 -5 13 -166 257 -10 434 340 306 207
885B07J66N2j32l33RJ09k78o5J1K05n65M05k92O26k77L21J44p0l5j18L56j02j59
$$ 207 373 425 293 -40 -31 78 -200 -265 -254 -49 -614 -209 -501 125 -152 169 313 243 208 90 446 344 185
908A85M2J30j27l16L6k52K96l60k3n6%L98j92J06j0P5n3K26J53m3J42j80n3p6
$$ 185 227 357 230 -86 -50 -302 -6 -366 -389 -445 -445 -47 -239 -133 -143 -68 -121 105 258 215 357 177 124 48
932D8j00K98k1k27p0j39J3l3m5K98j50k15K19p6L54K29j80p5P2J2K05l15K92l96
$$ 48 -52 246 225 -2 -72 -211 -198 -231 -276 22 -128 -343 -124 -200 154 383 203 128 200 212 417 102 394 -2
956bJ05k8m82L25p7J4j91j1L2J91M8Q9j0K92j62Q3J3l5P4O6j94J61k67M4m4J09
$$ -2 103 75 -407 -82 -159 -145 -336 -347 -315 -124 -76 13 3 295 133 216 229 194 268 334 140 301 34 78 34 143
982A43j29M8j70j95J8L63K3p7k8j90K94J07j65J89j09K42j7j49O2j72p4m56M80
$$ 143 14 62 -108 -303 -285 78 101 24 -4 -194 100 207 42 231 122 364 347 198 260 88 14 -442 38
1005C8l15j4j21K00j53N14l11K78Q6k08K42l5K47r8oj93Q9j65MJ8r1k34K05l71
$$ 38 -277 -291 -412 -212 -365 149 -162 116 202 -6 236 201 448 350 344 151 240 75 79 97 6 -228 -23 -394
1029c94J76q3j22M17L3K66m36L73J72j10k43RJ73k59J09K6J41l44k00r9J94N6
$$ -394 -218 -301 -423 -6 27 293 -143 230 402 292 49 58 231 -28 81 107 248 -96 -296 -395 -201 -145
1051a45j44J89K10n4rK47l18K22P8k99J40l7n9K09j99Q9l3q8J29k83K98l57J92
$$ -145 -289 -100 110 56 47 294 -24 198 276 -23 117 80 21 230 31 120 87 -1 128 -155 143 -214 -22
1074b2J27n20K80k64J51J95p7L16k4j82M42l24j0P9j9M0r9k69J21k34K35j13j15
$$ -22 105 -415 -135 -399 -248 -53 -130 186 162 -20 422 98 88 167 148 188 89 -180 -59 -293 -58 -171 -286
1097b86K66k09j09L72L4j96M32j76J66J70J3l69J70k04J30P2l65j88q0K88k44
$$ -286 -20 -229 -338 34 68 -128 304 128 294 464 477 108 278 74 204 276 -89 -277 -357 -69 -313
1118c13M0l3J18PL14pK45j52o1nqj62J09M5L3l62J27J36J8m06L14k9j7P7k23N4
$$ -313 -273 -306 -188 -181 133 126 371 219 158 153 145 -17 92 137 170 -192 -65 71 89 -317 -3 -32 -49 28 -195 -141
1144a41m6n4L08k82K56P5R0N7j83j94K82oJ82k12l15L2K39j79r8j59q6N00k66
$$ -141 -187 -241 67 -215 41 116 206 263 80 -114 168 162 344 132 -183 -151 88 -91 -189 -348 -434 66 -200
1167b00N2l84M82K22j62Q3K61j21J00q7j18M2k91M5NK2ol88K43l2L28j71K2r8
$$ -200 -148 -532 -50 172 10 93 354 233 333 246 128 170 -121 -76 -71 -49 -55 -443 -200 -232 96 -75 -53 -151
1191a51Q4J08J45j49L53k29K3K76l49m1R4j34j02j48k3j2K04Qj58k9M77l93K00
$$ -151 -67 41 186 37 390 161 184 460 111 70 164 30 -72 -220 -243 -255 -51 -43 -201 -230 247 -146 54
1214E4r0K02K2L5M1L5l07K6K86l39J1Pm4l8J67J8j93%p1L83m96L65r7k49N68o4
$$ 54 -36 166 188 223 264 299 -8 18 304 -35 -24 -17 -61 -99 68 86 -107 -107 -178 205 -291 74 -23 -272 296 232
1240B32l25J24L8q9L27J16j51k27J68l96J78l47K27j07m3J83J1r4K04J15k00J44
$$ 232 -93 31 69 -20 307 423 272 45 213 -183 -5 -352 -125 -232 -275 -92 -81 -175 29 144 -56 88
1262H8p5L55l28M25j12p1k05j36K06n05K74j45oM1p5J18J37L1n0l6M54k52m6r7
$$ 88 13 368 40 465 353 282 77 -59 147 -358 -84 -229 -235 -194 -269 -151 -14 17 -33 -69 385 133 87 -10
1286a0J41J26k81K75l10k02K55j82LL05l57J11J06k46K80k06L37j16J11r2m6j73
$$ -10 131 257 -24 251 -59 -261 -6 -188 -185 120 -237 -126 -20 -266 14 -192 145 29 140 48 2 -171
1308a71K51N4j34j54L58l92K65j6k57J39kj82J97j5R1k67J10K63Qk59L49j04p
$$ -171 80 134 0 -154 204 -188 77 61 -196 -57 -59 -241 -44 -59 32 -235 -125 138 146 -113 236 132 125
1331A25k71M38m61K01O6J18k43j26Jp4J52k58j9J58J84K25j65m6Q1P4R8k97L38
$$ 125 -146 292 -169 32 98 216 -27 -153 -152 -226 -74 -332 -351 -193 -9 216 51 5 86 160 258 -39 299
1354B99k10j18K01k91L8k9K9J41j02j15J39r1n5L19k15Q9j21L61j02k25L96O1
$$ 299 89 -29 172 -119 -81 -110 -81 60 -42 -157 -18 -109 -164 155 -60 29 -92 269 167 -58 338 399
1376C99l15N3J8k47J25o8k08K42j51K15k13K09k71j21K92O0j65K12J18m5l72L14
$$ 399 84 137 155 -92 33 -35 -243 -1 -152 63 -150 59 -212 -333 -41 19 -146 66 184 139 -233 81
1398H1k09K0L35J24m83p6K80l81J42k0o9J49J20J11j96K0K72j78j99K54J2P5p2
$$ 81 -128 -108 227 351 -132 -208 72 -309 -167 -187 -256 -107 13 124 -72 -52 220 42 -157 97 109 184 112
1421A12mn3K16O5n11K54L6k73R8J17n30K65K48k14K46r4j52J60P8J70p2j15J56
$$ 112 108 55 271 336 -175 79 115 -158 -60 57 -473 -208 40 -174 72 -22 -174 -14 64 234 162 47 203
1444B03j97M5j03L3J20J7m59M38Q9l72K57M3jk79M48k43K36k06j73L36k05L4Q0
$$ 203 6 51 -52 -19 101 118 -341 97 186 -186 71 114 113 -166 282 39 275 69 -104 232 27 61 141
1467A41P8k74rJ89m81K44R8k34R6j60L56J1j69J82j00M0M3K8K24m15J17K14n40
$$ 141 219 -55 -64 125 -356 -112 -14 -248 -152 -312 44 55 -114 68 -32 8 51 79 303 -112 5 219 -321
1490c21J85Q4P0N6l16K24k94J87m2J19j1J32k89L21k13q3L15n7K3J7O2k70J06
$$ -321 -136 -52 18 74 -242 -18 -312 -125 -167 -48 -59 73 -216 105 -108 -191 124 67 90 107 169 -101 5
1513EJ91k07J00l88K01j99M75l51K14R0k22J04J21k02N9KL9K70J2r7j35J5k61
$$ 5 196 -11 89 -299 -98 -297 178 -173 41 131 -91 13 134 -68 -9 -7 32 302 314 217 82 97 -164
1536a64Q2L35k60P7k81J59n2J5rK33j62j37L8L00m89J96K59n8N1k31K70Lj56K50
$$ -164 -82 253 -7 70 -211 -52 -104 -89 -98 135 -27 -164 -126 174 -315 -119 140 82 133 -98 172 175 19 269
1560B69m88kL46j92m01L30q9R9n9M27j40m6k04J40n7J61j25o7Q8K14j61l35M27
$$ 269 -219 -221 125 -67 -468 -138 -227 -128 -187 240 100 54 -150 -10 -67 94 -31 -98 -10 204 43 -292 135
1583A35j98Qj75K67l40J73K14m04N29m27K01k7j23J90j44j34N62j35l2j30J02
$$ 135 -63 -55 -230 37 -303 -130 84 -320 209 -218 -17 -44 -167 23 -121 -255 307 172 140 10 112
1604A12K10k70L4J57j00k90J53l41K23Q9J24j68K36k56J46J37K93m37k55L42l
$$ 112 322 52 86 243 143 -147 6 -335 -112 -23 101 -67 169 -87 59 196 489 52 -203 139 136
1625A36j22l24J7M94m20j82K23J3J10l4P6l29J86L20j96J49j22P9K45j17q1N8
$$ 136 14 -310 -293 201 -219 -401 -178 -165 -55 -89 -13 -342 -156 164 -32 117 -5 74 319 202 121 179
1647A79j92p7M0M9K8j7J18k70mK15k48l1K20k82L79q9o6N4j67N9L04n5m74J69
$$ 179 -13 -90 -50 -1 27 10 128 -142 -146 69 -179 -210 10 -272 107 18 -48 6 -161 -102 202 147 -327 -158
1671a58L26k10r3J93j24K13k98K14l83Q5K64jJ2R2k01K68l33K26N2l44j0K87j59
$$ -158 168 -42 -135 58 -66 147 -151 63 -320 -235 29 28 40 132 -69 199 -134 92 144 -200 -210 77 -82
1694h2J50j33J27j90L40k15k2K91m30K39k40j8J92M0O4L6k63J9K26j63m7L18k39
$$ -82 68 -65 62 -128 212 -3 -25 266 -164 75 -165 -183 9 49 113 149 -114 -95 131 -32 -79 239 0
1717@m1J21R8j80j97K07m3k01L28k26L9o3J75k1K91n04K07J19P2j98j00J41o1
$$ 0 -41 80 178 -2 -199 8 -35 -236 92 -134 -95 -158 17 -4 287 -217 -10 109 181 -17 -117 24 -37
1740c7j6J2n3j42J43k11M27k59J67m88N28r7K66j2j90l9l14P91o68K27K46n59
$$ -37 -53 -41 -94 -236 -93 -304 123 -136 31 -457 71 -26 240 228 38 -1 -315 476 -192 35 281 -278
1762b78K97m3N9k50J89k79J73j11N1q3l6M23j08J83M9J0k97K80r5O9J66k78l18
$$ -278 19 -24 35 -215 -26 -305 -132 -243 -192 -275 -311 112 4 187 236 246 -51 229 134 203 369 91 -227
1785b27J60J08Q1l55p6J83k36L79P2m9j29K56J8j14K72m97J25Mj48J92K78k95
$$ -227 -67 41 122 -233 -309 -126 -362 17 89 40 -89 167 185 71 343 -154 -29 -25 -173 19 297 2
1807BQ9j3J09k34J85k88O9j37K11L43o05K47k40J27L76j41j72L57k79L0j05L27
$$ 2 91 78 187 -47 138 -150 -81 -218 -7 336 -269 -22 -262 -135 241 100 -72 285 6 36 -69 258
1829B58k04L5l52J15P0O4J40k42k2Pr9K48j74J5J72P2K5k95L80J05k06p5n0q2
$$ 258 54 89 -263 -148 -78 -14 126 -116 -138 -131 -230 18 -156 -141 31 103 128 -167 213 318 112 37 -13 -95
1853i5R2j55J56p3k24K28k31J77J94j41J84n2K08M5l0l16j21L84j30j04j77rM36
$$ -95 -3 -158 -2 -75 -299 -71 -302 -125 69 -72 112 60 268 313 283 -33 -154 230 100 -4 -181 -190 246
1876B46k57j32L3J34k1l61K85q9R2N5J29k27J33J12L2ql17K84J83n59M11K4k43
$$ 246 -11 -143 -110 24 3 -358 -73 -162 -70 -15 114 -113 20 132 164 156 -161 123 306 -253 158 182 -61
1899f1R9l1j82l3L85m39j9K09K49J6k4j52M11l20j52J96k59K68k93K96k99N6N
$$ -61 38 7 -175 -208 177 -262 -281 -72 177 193 169 17 428 108 -44 152 -107 161 -132 164 -135 -79 -74
1922g4o6k3J74L7k09k4o7R6k2L90l74R3K92k25K34l42K05J84k15m08K93J89n76
$$ -74 -140 -163 11 48 -161 -185 -252 -156 -178 212 -162 -69 223 -2 232 -110 95 279 64 -344 -51 138 -438
1945d38M59k51K78J00o4j01q1J08k52K48oj8J10L3j49K6j46J01K97j59O6k57K16
$$ -438 21 -230 48 148 84 -17 -98 10 -242 6 0 -18 92 125 -24 2 -144 -43 254 95 161 -96 120
1968A20l12J29K22m79M18P3l20r8M34j1j63%n0J62l59L37r6K35k68r0K73j40l83
$$ 120 -192 -63 159 -320 98 171 -149 -247 187 176 13 13 -37 125 -234 103 7 242 -26 -116 157 17 -366
1991c66M79l23K90j79R9nj87L71j27j14J22P6k63j09N45l06J01J5k10k6K01n4
$$ -366 113 -210 80 -99 0 -5 -192 179 52 -62 60 136 -127 -236 309 3 104 119 -91 -117 84 30
2013C0m05K16K91k69K3KJ47O2j20P2J75J2j10k4R6j51k35l9L11n1j78n5O6q9K22
$$ 30 -375 -159 132 -137 -114 -112 35 97 -23 49 224 236 126 102 198 47 -188 -227 84 33 -145 -200 -134 -223 -1
2038aj53J94k4K5j30j97N10j77K56k73Q0n6J08l02K17n6K15l09n1m7O9p2L86m94
$$ -1 -154 40 16 41 -89 -286 224 47 303 30 110 54 162 -140 77 21 236 -73 -124 -171 -102 -174 212 -282
2062b82J90J89l85L50m07L02R7K1j63L94j53n6%j25J29k65J63j15J84k19M4L6
$$ -282 -92 97 -288 62 -345 -43 54 75 -88 306 153 97 97 -28 101 -164 -1 -116 68 -151 -107 -71
2084g1O9j12L19l54K73j21p2M1M5j33L45k88J06j15J47k27K00q6j34J01j00K82
$$ -71 -2 -114 205 -149 124 3 -69 -28 17 -116 229 -59 47 -68 79 -148 52 -34 -168 -67 -167 115
2106A15k77K22J13l27K18l43J52O3J2j08M28j83l11M30l72k7J16L80Rl05k34K79
$$ 115 -162 60 173 -154 64 -279 -127 -64 -52 -160 268 85 -226 204 -168 -195 -79 301 310 5 -229 50
2128E0k7J19j02L9J46l11J13J05M1j96J68M4l48K69j74l9Rj94Q1J45j63J47PQ5
$$ 50 23 142 40 79 225 -86 27 132 173 -23 145 189 -159 110 -64 -103 -94 -288 -207 -62 -225 -78 -71 14
2152A4J02J14m72L52j03n3r0J38L3P1l14K20p7q4M59n78K50j09K08j21j87L95
$$ 14 116 230 -242 110 7 -46 -136 2 35 106 -208 12 -65 -149 310 -268 -18 -127 81 -40 -227 168
2174A68l4l02L61k77K47j06k44L54K0j40K3K6K1j22j77J11J62M0l71K51K6j26
$$ 168 134 -168 193 -84 163 57 -187 167 187 47 70 96 117 -5 -182 -71 91 131 -240 11 37 -89
2196h9K40k14J52J7j40R6Q2k46L12l83J76J26%j95O9j99J24j30K23p5m09M92N8
$$ -89 151 -63 89 106 -34 62 144 -102 210 -173 3 129 129 -66 3 -196 -72 -202 21 -54 -463 29 87
2219H7N8L3k63j74J77n2L22k13P5K5L60l92O3r0k3rl46L66m6J17j66j40J16O8
$$ 87 145 178 -85 -259 -82 -134 188 -25 50 75 435 43 106 16 -7 -16 -362 4 -42 75 -91 -231 -115 -47
2243d7K19m6j96Q7q0M7J00r0K68j13n2j90K80k52N2K29o2j19Q8j90O7q1j02L60
$$ -47 172 126 -70 17 -63 -16 84 -6 262 149 97 -93 187 -65 -13 216 154 35 123 -67 0 -81 -183 177
2267A77k2j85k01K53p5Q2qj08l4L26n1J51r8l7j86j27J20n5N0J60m4J71l69L88
$$ 177 155 -30 -231 22 -53 29 21 -87 -121 205 154 305 207 170 -16 -143 -23 -78 -28 132 88 259 -110 278
2291B78m64Q6L44l90J77O8P0j86R6K09q2m8j94jm2l6j8J1L6O2K77m39M58q8l25
$$ 278 -186 -100 244 -146 31 99 169 -17 79 288 206 158 -36 -37 -79 -115 -133 -122 -86 -24 253 -186 272 184 -141
2316a41L51j37k78L11k84J23J97j45Nj9J61l50NL34l01k2K17Q5l2pk56M7L29m89
$$ -141 210 73 -205 106 -178 -55 142 -3 2 -17 144 -206 -201 133 -168 -190 27 112 80 73 -183 -136 193 -296
2340b96K58j45L04R9n5k30r3J77m2K21k96J44Q0j45k33K49K2L6k31j2J06K3L67
$$ -296 -38 -183 121 220 165 -65 -158 19 -23 198 -98 46 126 -19 -252 -3 19 55 -176 -188 -82 -59 308
2363C08k02J37n4l99M79k38l86J33K09j57J93p1k18K38J40l5r8O1O8lj15J13J0
$$ 308 106 243 189 -210 269 31 -355 -222 -13 -170 23 -48 -266 -28 112 77 -21 40 108 105 -10 103 113
2386A13l32K56J07N4J14k87j84J12J10r5O0j72J65p3K24j86NJ69k3l90L58k73
$$ 113 -219 37 144 198 312 25 -159 -47 63 -32 28 -144 21 -52 172 -14 -9 160 137 -253 105 -168
2408a68J34k2J44j9k64K98k32j06o6K32J00j94J01R6rj50K72j15j88N9kJ13o8
$$ -168 -34 -56 88 69 -195 103 -129 -235 -301 -69 31 -163 -62 34 25 -125 147 32 -156 -97 -99 14 -54
2431e4K13j11j41J06K75k64r4p3n6K30k72J50p5r5K52J66k91N36l67j44K22K12
$$ -54 159 48 -93 13 288 24 -70 -143 -199 31 -241 -91 -166 -261 -9 157 -134 402 35 -109 113 325
2453C25r9l24J30p4L8L36m18j42J55J11o1j09q3L82j61o8J66K%J90k41oJ01j5
$$ 325 226 -98 32 -42 -4 332 -86 -228 -73 38 -23 -132 -215 167 6 -62 104 106 106 296 55 49 150 135
2477A35j90L27j7j57j62r5L23m71P2J75J77l37L50mm06K47k57L34K44k82L3j66
$$ 135 -55 272 255 98 -64 -159 164 -307 -235 -60 117 -220 130 126 -280 -33 -290 44 288 6 39 -127
2499a27j44L17R5q8K57k75m1N4p8J05k48J88P6j01q5L82k55q0Q9j54J42L1r8K67
$$ -127 -271 46 141 53 310 35 -6 48 -30 75 -173 15 91 -10 -95 287 32 -48 41 -113 29 60 -38 229
2523B29j86q3K76l50Q1nK21k84R2j83R0J49j54J00q9jN1N9j20K33j29j53j13L33
$$ 229 43 -40 236 -114 -33 -38 183 -101 -9 -192 -102 47 -107 -7 -96 -97 -46 13 -107 126 -3 -156 -269 64
2547F4L3j69J00j08l48M73L0J13l11p4K36q5l8N7J09q3K98k47J16k39L42l65J33
$$ 64 97 -72 28 -80 -428 45 75 188 -123 -197 39 -46 -84 -27 82 -1 297 50 166 -73 269 -96 37
2570C7J12j84j66j72N20j42o4Kj18RM40j56m10L70O0j75J1Nj47L9K90r5K44l66
$$ 37 149 -35 -201 -373 147 5 -59 -57 -175 -166 274 118 -292 78 138 -37 -26 -21 -168 -129 161 66 310 -56
2594e6j35J81n0K99l35L11l59J17J93l59R7R5JR6m97M15q0p1K11j42J8k7j12M41
$$ -56 -191 -10 -60 239 -96 215 -144 -27 166 -193 -96 -1 0 96 -401 14 -66 -137 74 -68 -50 -77 -189 252
2618B52k68p1K41j55J38P2k30P2k7j21J99l59L05n4n5M6l24L79J21j94o1j9J90
$$ 252 -16 -87 154 -1 137 209 -21 51 24 -97 102 -257 48 -6 -61 -15 -339 40 161 -33 -94 -113 77
2641G7k17N2k99Q3L14Q6j79j64N39k14p5p5J23K05m65J79J69N4k19j36L2p0K67
$$ 77 -140 -88 -387 -304 10 96 -83 -247 292 78 3 -72 51 256 -209 -30 139 193 -26 -162 -130 -200 67
2664F7j03k8j35N90p12J65NL10k35qK05j5j41J03n9J10k65R1O4j51K27j82K29
$$ 67 -36 -64 -199 391 -321 -156 -151 159 -76 -84 121 106 -35 68 9 119 -146 -55 9 -142 85 -97 132
2687A32l14l5J80J83j31l1p5L45j32k77L70k68m9Q1J72K2J19j70k80K29M4k53
$$ 132 -182 -217 -37 146 15 -16 -91 254 122 -155 215 -53 -102 -21 151 173 292 122 -158 71 115 -138
2709a38L01L8l07M7O5Rk36J60JL45j78rj2k12J23l37J09N4J89j22r2k1K02j28
$$ -138 163 201 -106 -59 6 15 -221 -61 -60 285 107 98 86 -126 -3 -340 -231 -177 12 -110 -202 -223 -21 -149
2733a49nMJ11j04m5L75J50j65M0p9l11K07q5l6j50L37q7j18j01n9L37r2r5N1j39
$$ -149 -154 -150 -39 -143 -188 187 337 172 212 133 -178 29 -56 -92 -242 95 8 -110 -211 -270 67 -25 -120 -69 -208
2758b08J99l06K14J4L90o2k87J47j82m6P2K62k01N8l96L15p2M2j71N3l3J01K05
$$ -208 -9 -315 -101 -87 303 241 -46 101 -81 -127 -55 207 6 64 -332 -17 -89 -47 -218 -165 -198 -97 108
2781A08j91J21j38n6Q3J20q9n6L64m06K66k33J0J77j75j02n5N05l23l1J71p5K25
$$ 108 -83 38 -100 -156 -73 47 -42 -98 266 -140 126 -107 -97 80 -95 -197 -252 253 -70 -101 70 -5 220
2804B20k20J89l29J67R7n8p2R2m0L4j04j01O2k30L81j64J7J39p8l52L90K25k60
$$ 220 0 189 -140 27 124 66 -6 86 46 80 -24 -125 -63 -293 88 -76 -59 80 2 -350 40 265 5
2827Ej10K58j31O5PK54l27J17o3O0m08K58O0l29M54n6k29J03o8O8K30L9j52O8
$$ 5 -105 153 22 87 94 348 21 138 75 135 -273 -15 45 -284 170 114 -115 -12 -80 -12 218 257 105 173
2851A73k60L37k62J92l90K16n9L72j52q8j88o4J10k6K2m3PJ48q5m4J25j93OK90
$$ 173 -87 250 -12 180 -210 6 -53 319 167 79 -109 -173 -63 -89 -67 -110 -103 45 -40 -84 41 -152 -146 144
2875A44p8q7J54l69L19n1J22k96L95j14pk03Q9j55j15K27O8j03R3N0k91K18K07
$$ 144 66 -21 133 -236 83 32 154 -142 253 139 132 -71 18 -137 -252 -25 43 -60 33 83 -208 10 217
2898B17m6q1K68k57j14q6m3K12O0l72M42j88j11K17q7J74k94j68L92l30L15j9
$$ 217 171 90 358 101 -13 -99 -142 70 130 -242 200 12 -99 118 31 205 -89 -257 135 -195 120 101
2920A01J07o9J10n3j23k91J78J0Ol7j62l7K94N9N9j01m6j3n1k78K66R3j1k1l28
$$ 101 208 139 249 196 73 -218 -40 -30 -24 -61 -223 -260 34 93 152 51 5 -8 -59 -337 -71 22 11 -10 -338
2945c38L18J42K3l31L32q1j93k8L45l14j18L21k42J03m02M67N7%r0M0J56k50J06
$$ -338 -20 122 145 -186 146 65 -128 -156 189 -125 -243 78 -164 -61 -463 4 61 61 -29 11 167 -83 23
2968B3N1J67k98J93R3l80K66l3j49j71L68m81R4M87J4q0K2k44J06J02l20K68r
$$ 23 74 241 -57 136 229 -151 115 82 -67 -238 130 -351 -257 230 244 164 186 -58 48 150 -170 98 89
2991H9j40OO5p4M7P2o7M7K00q6l99L29J86l41J54k11J61J05N9j89l9p0N7K2k3
$$ 89 -51 -45 20 -54 -7 65 -2 45 245 159 -240 89 275 -66 88 -123 38 143 202 13 -26 -96 -39 -17 -40
3016d0J91K1j54j1np7J07j4k55J81N2k48M52J70l10N9J53l46q9K24q2j97L17q5
$$ -40 151 172 18 7 2 -75 32 18 -237 -56 -4 -252 200 370 60 119 272 -74 -163 61 -21 -218 99 14
3040A4l0J13l15O1K82k71J41k21n3l4L21K9j59J69K04k58K12j59R0k65J40j58
$$ 14 -16 97 -218 -157 125 -146 -5 -226 -279 -313 8 37 -122 47 251 -7 205 46 136 -129 11 -147
3062a47K12j98K68k04N4j9M6J1q5J82k12J23j91L41j57J1j11K70Q9m00j0L18k34
$$ -147 65 -133 135 -69 -15 -34 12 23 -62 120 -92 31 -160 181 24 35 -76 194 283 -117 -127 191 -43
3085d3k40N11l30K44J47l17p9o9J62p1L75j03k29J63j6j32Q1p0L44l82J69O8p7
$$ -43 -283 228 -102 142 289 -28 -107 -176 -14 -85 290 187 -42 121 105 -27 54 -16 328 -54 115 183 106
3108A06o6n8q8o2M31k14%Pl49K03J72k18K78%j92o1K91j16j91R2Lk19K46K59k74
$$ 106 40 -18 -106 -168 263 49 49 56 -293 -90 82 -136 142 142 -50 -111 180 64 -127 -35 -32 -251 -5 254 -20
3133b0j49J50o2P0J47o6j5j60K70q4j96K37k71O1k09M37k29K3J24j45K27k28R4
$$ -20 -169 -19 -81 -11 136 70 55 -105 165 81 -115 122 -149 -88 -297 140 -89 -66 58 -87 140 -88 6
3156FP9j05Km9N1J92k30K0K21k79RL85l04m7q1M85m34j18J02K03k00M4J1j03J61
$$ 6 85 -20 -18 -67 -16 176 -54 -34 187 -92 -83 302 -2 -49 -130 355 -79 -197 -95 108 -92 -48 -37 -140 21
3181B1j6K54j50j11N1L80n48L54k94P0J81l46M06l58L00j85n5J05j28N5J06j36
$$ 21 5 259 109 -2 49 429 -119 235 -59 11 192 -154 252 -106 194 9 -46 59 -69 -14 92 -44
3203d4L7j9n9N2r5k27M19k42J10J27P1m76L47L8j67L49k13R5j46L97m17L46m36
$$ -44 -7 -26 -85 -33 -128 -355 64 -178 -68 59 130 -346 1 39 -128 221 8 103 -43 354 -63 283 -153
3226a53m6K96j84L14l03N40k25n5j28n0m0k6J55o8J71k21M43m61J93K25n97K72
$$ -153 -199 97 -87 227 -76 464 239 184 56 6 -34 -60 95 27 198 -23 420 -41 152 377 -220 52
3248E2J7LMj01l13L78q8j52K92j76J52m49L05J69j16k70L79k53K76o6k43K13R7
$$ 52 69 72 76 -25 -338 40 -48 -200 92 -84 68 -381 -76 93 -23 -293 86 -167 109 43 -200 13 110
3271A10J44k10K64n4l43J25k36K81j28K66j97rL30k88pk58K63K4J9O9p8mk51M21
$$ 110 254 44 308 254 -89 36 -200 81 -47 219 22 13 343 55 48 -210 53 77 96 165 87 83 -168 253
3295B53m9k14J85r6Q6l08k4J41J22j9%L76l54k29K62M8j02k20J44k41L87l58L28
$$ 253 204 -10 175 79 165 -143 -167 -26 96 77 77 453 99 -130 132 180 78 -142 2 -239 148 -210 118
3318A18r5k8M2j55ML45n9l08J78M4nK8l05L27k41J29RM2m3k16J51n6j8J6j3L30
$$ 118 23 -5 37 -118 -114 231 172 -136 42 86 81 109 -196 131 -110 19 28 70 27 -189 -38 -94 -112 -96 -109 221
3344B21k37J30P0k79J10p9L72l43M2j22L69j52q1k03K05J02k25J89n6N3M7j65
$$ 221 -16 114 184 -95 15 -64 308 -35 7 -115 254 102 21 -182 23 125 -100 89 33 86 133 -32
3366c2K06r0k21J79J64k11J84m5l11K18k5J67j22j8j26R7p5j17L24m2j22J62j67
$$ -32 174 84 -137 42 206 -5 179 134 -177 41 16 183 61 43 -83 14 -61 -178 146 104 -18 144 -23
3389b3J58m0J8jk41K57j86K37j79K07m33K72j34q7J90l4n8J00J9j25r5K64j35
$$ -23 135 95 113 112 -129 128 -58 179 0 207 -226 46 -88 -175 15 -19 -77 23 42 -83 -178 86 -49
3412d9r9j4L43l08r5L77k82K59ok98J48j86M66m75J66K63k6l13K37K81m75J16
$$ -49 -148 -162 181 -127 -222 155 -127 132 126 -172 -24 -210 256 -219 -53 210 184 -129 108 389 -86 30
3434C0o6j6p7J67L01k28r8rj23K32M9k28j12J71k7L95k82P5k58Q3O8O8l00L37
$$ 30 -36 -52 -129 38 339 111 13 4 -119 113 162 -66 -178 -7 -34 361 79 154 -104 -21 47 115 -185 152
3458A52o5J64p5k12J62j52J10k41j25M57j73j04j61J93K65j44j77L39l47J33K64
$$ 152 87 251 176 -36 126 -26 84 -157 -282 175 2 -102 -263 -70 195 51 -126 213 -134 -1 263
3479B63j70P2j49Llj17K83Q4n2j66j57j23J87J67j07k38N19k00j24K8J24J96m40
$$ 263 93 165 16 19 16 -101 182 266 214 48 -109 -232 -45 122 15 -223 296 96 -28 0 124 320 -120
3502a20J04p0O6K48j64J55Kl71lK08P0k00K28j05q6j4J96k35N1J06j40K03om1
$$ -120 -16 -86 -20 228 64 219 221 -150 -153 55 125 -75 153 48 -38 -52 144 -91 -40 66 -74 129 123 82
3526H2L0l3L7Lo3q5p4q1j14L39J7kJ8k58L61k25PJ0J61Nq7r2q7p1J52L3jk9N0
$$ 82 112 79 116 119 56 -29 -103 -184 -298 41 58 56 74 -184 177 -48 -41 -31 130 135 48 -44 -131 -202 -50 -17 -18 -47 3
3555Co7J36k69J20q4k4L20o4j76j6L71l06P6J20O0l0j61J36k56pPj43K36j19L0
$$ 3 -64 72 -197 -77 -161 -185 135 71 -105 -121 250 -56 20 140 200 170 9 145 -111 -118 -111 -254 -18 -137 -107
3580a07O5K56k92o7M6J92o4k30o3K95j5J06j82J09j20R8K98m77M26l69J70K19
$$ -107 -42 214 -78 -145 -99 93 29 -201 -264 31 16 122 -60 49 -71 27 325 -152 274 -95 75 294
3602B94r0m79J69pj02L1J79Q1k8m2R5j70P2n3j78n9K66Rq9J01r9P3K65l75J63
$$ 294 204 -275 -106 -113 -215 -184 -5 76 48 6 101 -69 3 -50 -228 -287 -21 -12 -101 0 -99 -26 239 -136 27
3627B7j08K24l5p0Q8p3k25q0M08k92M41j75k47N4K08j40J18L1m2N6l3j64o9Q5
$$ 27 -81 143 108 38 126 53 -172 -252 156 -136 305 130 -117 -63 145 5 123 154 112 168 135 -29 -98 -13
3651a3J86j1j27K67n97L26l02L70n3j78J40j7kR0n5j71L76k67j67L34k86k0J71
$$ -13 173 162 35 302 -295 31 -271 99 46 -132 8 -9 -11 79 24 -147 229 -38 -205 129 -157 -177 -6
3674fm1L25l07l2J28j28J06P2j95j86K76m9P5o0L3K7Q5j60r1P9L93n50J22J44
$$ -6 -47 278 -29 -61 67 -61 45 117 -78 -264 12 -37 38 -22 11 38 123 -37 -128 -49 344 -206 -84 60
3698F0lJ9l14K88j55O5J10rl23L68k76J04l7J65N2j01j14J4R9j18L71j20j64Q3
$$ 60 57 76 -238 50 -105 -40 70 61 -262 106 -170 -66 -103 62 114 13 -101 -87 12 -106 265 145 -19 64
3722F4j3K23n05J42K50l61J32K42j50O3k34J43J16m58N06k65m2MK27j68j59J81
$$ 64 51 274 -231 -89 161 -200 -68 174 24 87 -147 -4 112 -346 160 -105 -147 -143 84 -84 -243 -62
3744f2P1j5l3j22R3j6k9K71j57%K02j21o6p2n1m3o1L21j50J05j37J4k6P8j8l9
$$ -62 9 -6 -39 -161 -68 -84 -113 158 1 1 203 82 16 -56 -107 -150 -211 110 -40 65 -72 -58 -84 -6 -24 -63
3770f3J86n8j62J29m4pj73J80J19j64J5o2M3J02M1Qj08N0K5k0r3J4L53l36P1p8
$$ -63 123 65 -97 32 -12 -19 -192 -12 107 -57 -42 -104 -61 41 82 90 -18 32 57 37 -56 -42 311 -25 46 -32
3796c2J60J98J54l34k13j04K24k82J87P4m48L70k10L90k81J72L6J32j89N0M39
$$ -32 128 326 480 146 -67 -171 53 -229 -42 32 -416 -46 -256 134 -147 25 61 193 4 54 493
3817D93n83k6K10j83j19K74P0K8r0o1j01k41J71J67k93J83p7J33R6lK2o2O1J50
$$ 493 -90 -116 94 -89 -208 66 136 164 74 13 -88 -329 -158 9 -284 -101 -178 -45 51 48 70 8 69 219
3841B19k30j5J87j99L8k38L48j16m6jK2J68k16j92K56j16K32r3n4R3R3r9o8J86
$$ 219 -11 -26 161 -38 0 -238 110 -6 -52 -53 -31 137 -79 -271 -15 -131 101 8 -46 47 140 41 -27 159
3865A59p6j49J94m41J86j05K36k15J67K83n67N71j31j37P0R7k78K39j25j86J18
$$ 159 83 -66 128 -313 -127 -232 4 -211 -44 239 -328 243 112 -25 45 142 -136 103 -22 -208 -90
3886i0J30Q1j22K34m21K89j20k33J45L26k20K9K73l08j27l2L55p2j71R8L6m4K77
$$ -90 40 121 -1 233 -188 101 -19 -252 -107 219 -1 28 301 -7 -134 -166 189 117 -54 44 80 36 313
3909C13k12j84n3R6J46pjm17K61m3O1J17NJ3k00n6J27P5j14l7P6j27R0L29l92
$$ 313 101 -83 -136 -40 106 99 98 -319 -58 -101 -40 77 82 95 -105 -161 -34 41 -73 -110 -34 -161 -71 258 -134
3934a34J0j63L97k46R4K07j99R2l95J22R3j46L99J24r0k02L1Q9j13N0k8j9L42
$$ -134 -124 -287 110 -136 -42 165 -34 58 -337 -215 -122 -268 131 255 165 -37 -6 83 -30 20 -8 -27 315
3957C15j07l88L49l06j11J86K01k88L87l48L7N6Mm52N13k85K37q9jL96n93J30
$$ 315 208 -180 169 -137 -248 -62 139 -149 238 -110 -73 -17 -13 -465 48 -237 0 -89 -90 306 -287 -157
3979a57j14K27j80K86k75K57J12j72J17j94k26N04l09J60j30Q5oj00K96j70K52
$$ -157 -271 -44 -224 62 -213 44 156 -16 101 -93 -319 185 -124 36 -94 -9 -15 -115 181 11 263
4000B63k87J6k79M15o6k31K1L05j86J0J35o0L6k00j59J75J11L6J61k33P5O5m1
$$ 263 -24 -8 -287 128 62 -169 -148 157 -29 -19 116 56 92 -108 -267 -92 19 55 216 -17 58 123 82
4023H2j57J10J09r7N9j11j45K59k33Q0N3J14k5j20l3L23m4k62R5j27K04k22K1
$$ 82 -75 35 144 47 106 -5 -150 109 -124 -44 9 123 98 -22 -55 268 224 -38 57 -70 134 -88 -67
4046f7k24J59q9K56j41j36p3L43j81J2J81m3J96k18moQ5j8Q9m28M04k1K2j94L3
$$ -67 -291 -132 -221 35 -106 -242 -315 28 -153 -141 40 -3 193 -25 -29 -35 50 32 121 -307 97 76 98 -96 -63
4071f3J5K3j0K65p7k72K47k36J1J70M8k42j16Q5K98O2l86Q0M9K3J03k00M46n19
$$ -63 -48 -25 -35 230 153 -119 128 -108 -97 73 121 -121 -237 -152 146 208 -178 -98 -49 -26 77 -123 323 -196
4095a96M6J49j47m1j24M77j21J96j45j04J37r1P5k2j89K93L3k55J87j16j52P0
$$ -196 -150 -1 -148 -189 -313 164 43 239 94 -10 127 36 111 89 -100 193 226 -29 158 42 -110 -40
4117d0k59J58L46n2j03lk32R4M00m46K88j34M4J63K1k00o9Q5J61m21J62k32L46
$$ -40 -299 -141 205 153 50 47 -185 -91 309 -137 151 17 61 224 245 45 -24 61 222 -199 -37 -269 77
4140G7n5J25l01K35QK27o40J83M6L51j60p7j41jJ55K51j19rk2k44O5o0J83N6m29
$$ 77 22 147 -154 81 89 316 -324 -141 -95 256 96 19 -122 -123 32 283 164 155 133 -111 -46 -106 77 133 -296
4165b96J32J95J8j8j15R1r3K63j69M0MK11k09l96K60k3K02o2k82K92j32k1R9m0
$$ -296 -164 31 49 31 -84 7 -86 177 8 48 52 263 54 -342 -82 -105 97 35 -247 45 -87 -108 -9 -49
4189d9Qq8K35j46j64O1nM0J87j31k11J17n3K93j60j14j07K52J18j90K03J9J4n76
$$ -49 -41 -129 106 -40 -204 -143 -148 -108 79 -52 -263 -146 -199 94 -66 -180 -287 -35 83 -107 96 115 129 -447
4213d47N01l8j2J63p1l12L84l34K92K5j0M9k75j12K73k73Q9o4J54P8j45j39K67
$$ -447 54 16 4 167 96 -216 168 -166 126 151 141 190 -85 -197 76 -197 -108 -172 -18 60 -85 -224 43
4236D3j01k09K81K7j75L46l13j51K91K6p0j19K4q4L37K3l17R5J36q0k0J7qP8J58
$$ 43 -58 -267 14 41 -134 212 -101 -252 39 65 -5 -124 -100 -184 153 176 -141 -46 90 10 -10 7 -1 77 235
4261B35j03r9J04k51j94Q4J73q7l3J53K78k04m01K48r8M89n01J16K64k12o2J40
$$ 235 132 33 137 -114 -308 -224 -51 -138 -171 -18 260 56 -345 -97 -195 294 -207 -91 173 -39 -101 39
4283C9J19k30l3L51j91L2J1j07j90J75Q4o7k85P8j3K82j27K51k96l5K85l99J60
$$ 39 158 -72 -105 246 55 87 98 -9 -199 -24 60 -7 -292 -214 -227 55 -72 179 -117 -152 133 -266 -106
4306a06J76k9K9J07k63M3L4o2J94q7P8j54P4j82JP0J35m1o0J1J39J3m1m0m7P6
$$ -106 70 41 70 177 -86 -43 -9 -71 123 36 114 -40 34 -148 -147 -77 58 17 -43 -32 107 120 79 39 -8 68
4332F8j63K72j61Q9l5J46n41N22l14J43kj55J05J88j97K31l29K15J80k62L6m63
$$ 68 -95 177 16 105 70 216 -325 197 -117 26 24 -131 -26 162 -35 196 -133 82 262 0 36 -427
4354d27L91j03K79k14K51p5k48J34J33k03L02l63k2J62J80k42Q5l49J55J43j6
$$ -427 -36 -139 140 -74 177 102 -146 -12 121 -82 220 -143 -165 -3 177 -65 20 -329 -174 -31 -47
4375d7M1R2Pj46L1J32k22pQ7n7R0q6p1Q9P0l1OQ8j59l3J35J30j51J04%N1jk20
$$ -47 -6 86 93 -53 -22 110 -112 -119 -32 -89 1 -85 -156 -67 3 -28 -22 66 -93 -126 9 139 -12 92 92 143 142 -78
4403g8K8lK4M0Q9l33O4J56j57K01J09k37m0K92o3k19J92n4m3K04k40P3p4R3J33
$$ -78 -50 -53 -29 11 100 -233 -169 -13 -170 31 140 -97 -137 155 92 -127 65 11 -32 172 -68 5 -69 24 157
4428A57k21K07j54j35l5QJ70K14m42L63k70K45k32J72Ol00J98r4J32j65L19j49
$$ 157 -64 143 -11 -146 -181 -173 -3 211 -231 132 -138 107 -125 47 53 -247 -49 -143 -11 -176 143 -6
4450fk07j2P5lJ03J79j98n3J39j39k21J89o1L28j89R4j28j7J18k05M00k81O7k14
$$ -6 -213 -225 -150 -153 -50 129 -69 -122 17 -122 -343 -154 -215 113 -76 18 -110 -127 -9 -214 186 -95 -28 -242
4474b42j99L71k8P1K9R6n2Km9Q1j62J90j12k4L3k84J94J75m32L21J32M4j81j5
$$ -242 -441 -70 -98 -27 2 98 46 48 -1 80 -82 108 -4 -28 5 -279 -85 90 -342 -21 111 155 -26 -41
4498d1p7K38r3j97l0j08L39k31J81L0j88J54Pm6K58r3j83M0Q7o4j55N1J49j17
$$ -41 -118 120 27 -170 -200 -308 31 -200 -19 11 -177 -23 -16 -62 196 103 -80 -40 47 -17 -172 -121 28 -89
4522h9r1M38k51j22L02m9j3j26J19j34j3j14j4JJ38j65K0m5J83R4J3j81P4m8k02
$$ -89 -180 258 7 -115 187 138 125 -1 118 -16 -29 -143 -157 -156 -18 -183 -163 -208 -25 69 82 -99 -25 -73 -275
4547b75J07J37l5O7rk0j86K36j93M10l91O62m93r8J28N7p5L8o7J81j08k94L80
$$ -275 -168 -31 -66 1 -8 -28 -214 22 -171 239 -152 510 17 -81 47 104 29 67 0 181 73 -221 159
4570A59j13J75j76J77J5k45J57l5o6KK7j04j45J83r9j25J88J53q8k90K78N16m53
$$ 159 46 221 45 222 237 -8 149 114 48 50 77 -27 -172 11 -88 -213 -25 128 40 -250 28 544 91
4593I1o1j11K9l53M69k13K27J20l85K6M51n03j18L96O8k12j67J46K9J44k71J30
$$ 91 30 -81 -52 -405 64 -149 78 198 -187 -161 290 -213 -331 65 133 -79 -246 -100 -71 73 -198 -68
4615f8k50J31J80l4k21K16J75k13K2J09j33J82j41J3j14J23L04l90J15j27O8l2
$$ -68 -318 -187 -7 -41 -262 -46 129 -84 -62 47 -86 96 -45 -32 -146 -23 281 -109 6 -121 -53 -85
4637h5J15r0N8P8r8J73N7l26O6l3K19j76J25r2j52n5J91L67l78M6r0J55j01k52
$$ -85 30 -60 -2 76 -22 151 208 -118 -52 -85 134 -42 83 -9 -161 -216 -25 342 -36 10 -80 75 -26 -278
4661b78L65N9k88L82k33J29k34K67r4%Op0j79N9L09m18M41l44K78P1m6j97l02
$$ -278 87 146 -142 240 7 136 -98 169 75 75 81 11 -168 -109 200 -218 223 -121 157 228 182 -15 -317
4684c17J01Q0J75j52J3K65l07J31L25j54rk01M4R1J6l75K92kL7J68n05J76K91
$$ -317 -216 -136 39 -113 -100 165 -142 -11 314 160 151 -50 -6 85 101 -274 18 16 53 221 -284 -108 183
4707A83l4m53M51l87O0L66j67j05J31r2j06K08R9k68K23j08N2j95L06k39o5K79
$$ 183 149 -304 147 -240 -180 186 19 -86 45 -47 -153 55 154 -114 109 1 53 -142 164 -75 -140 139
4729A39M9j73l8J82m30N80j00k60j42L59j55L7N2k42q1K32M7J73j63mj09J70l47
$$ 139 188 15 -23 159 -271 309 209 -51 -193 166 11 48 100 -142 -223 9 56 229 66 62 -47 123 -224
4752b24L58j22r4K94j77J71k19K96l91L28l56P8J34O6k44M4K6L51k3k66o1J89
$$ -224 134 12 -82 212 35 206 -13 283 -108 220 -136 -58 76 142 -102 -58 -32 319 296 30 -31 158
4774A58r1j75n5j67L70j90j47L48j78K56k07n9K51j22k57K52j59N3q3l2N34j20
$$ 158 67 -108 -163 -330 40 -150 -297 51 -127 129 -78 -137 114 -8 -265 -13 -172 -119 -202 -234 300 180
4796A80j22j80J69J89K4k7k84j20K63j26R7j00j12K28qn7k56K64k29K36k32J71
$$ 180 58 -122 47 236 260 233 -51 -171 92 -34 63 -37 -149 79 71 14 -242 22 -207 29 -203 -32
4818c2N7J7%J54k61J53q1k51K83m4n6N0M03k07o7r5J90j83j50N1o5K93k68J19
$$ -32 25 42 42 196 -65 88 7 -244 39 -5 -61 -11 392 185 118 23 213 30 -120 -69 -134 159 -109 10
4842A0M2N5P5q9j31K1Q6j51J21n8J67j39J36m08J4J59J08n3p4K72N8k06K9j5j68
$$ 10 52 107 182 93 -38 -17 69 -82 39 -19 148 9 145 -263 -249 -90 18 -35 -109 163 221 15 44 29 -139
4867a39M6N11m60J18l10M74k02P9J59k95K92j14j08j46K40k05j02J76M3j26J71
$$ -139 -93 418 -42 76 -234 240 38 117 276 -19 273 159 51 -95 145 -60 -162 14 57 -69 102
4888A02nk29J09m1K02m20K73l1q7L75l50Q4j85L23j64Nj18K01o6J18k33J50L5
$$ 102 97 -132 -23 -64 138 -282 -9 -40 -127 248 -102 -18 -203 120 -44 -39 -157 44 -22 96 -137 13 48
4911D8p1O7rN6J22j01m41M93l12N1l3P9N9j01K00k21J23L3k02J38m3J61j89M1
$$ 48 -23 44 35 91 213 112 -329 164 -148 -97 -130 -51 8 -93 107 -114 9 42 -160 -22 -65 96 -93 -52
4935e2R7k49M18m11J87j47L13N1Lk03k1J25k8M3k7r2k2J7j07l2K37n3O8N1o42
$$ -52 45 -204 214 -197 -10 -157 156 207 210 7 -14 111 83 126 99 7 -15 2 -105 -137 100 47 115 166 -476
4960d76N65j68K17k74K8L51j46J56k93J46N6k08K28l30O0M8k35J36k55N14P8L7
$$ -476 89 -79 138 -136 -108 243 97 253 -40 106 162 -46 182 -148 -88 -40 -275 -139 -394 120 198 235
4982B35k58J78R2k8j89J47q1j52k26L27j44K0L08k98k6O1J18j35K14k21PL55m86
$$ 235 -23 155 247 219 30 177 96 -56 -282 45 -99 -79 229 -69 -95 -34 84 -51 163 -58 -51 304 -182
5005a82K51q1k2J06r0j86K03k53M28l21M3J95k89K48J66m28J33J6K31j97J78k30
$$ -182 69 -12 -34 72 -18 -204 -1 -254 174 -147 -104 91 -198 50 216 -212 -79 -63 168 -29 149 -81
5027h1J00k41K27j12O0J59j73K01k14J73k12n5J07M1j04%K04L2k87P3K23k67M46
$$ -81 19 -222 5 -107 -47 112 -61 140 -74 99 -113 -168 -61 -20 -124 -124 80 112 -175 -102 121 -146 300
5050C00l69j76K52j47l3M56j5j19j60l1J86k03J45J2j55j17l1M39j70q4J19l46
$$ 300 -69 -245 7 -140 -173 283 268 149 -11 -42 144 -59 86 98 -57 -174 -205 234 64 -20 99 -247
5072b47J83J4Q9K21l5k05PJ15o8O2r4l4K17k22k6L33l88J78j3k48J8K62ml29K79
$$ -247 -64 -50 39 260 225 20 27 142 74 136 42 8 225 3 -23 310 -78 100 87 -161 -143 119 115 -214 65
5097F5k27L56j03j07J17j33L3l1J52j43J49k49J33n4lK26n1k63J77Ml7J07k78
$$ 65 -162 194 91 -16 101 -32 1 -30 122 -21 128 -121 12 -42 -45 181 130 -133 44 48 11 118 -160
5120a60l4J50l1K2m0L27j5k63j44r9K74n9q8M1p3J54oJ44j0J81j92j62M8J10O7
$$ -160 -194 -44 -75 -53 -93 234 219 -44 -188 -287 -13 -72 -160 -119 -192 -38 -44 100 90 271 79 -83 -35 75 142
5145A42j59n1p5K1j8R9O9k57M52k49K1j05K6O7K01k20R4j01J25m4j29J16k21L46
$$ 142 -17 -68 -143 -122 -140 -41 28 -229 223 -26 -5 -110 -84 -17 184 -36 58 -43 82 38 -91 25 -196 150
5169A50j24J48R6m95P8J56J7L8j70L47l02jR6k40L10j34M5J05j23j89M5n5L24
$$ 150 26 174 270 -225 -147 9 26 64 -106 241 -61 -62 34 -206 104 -30 15 120 -3 -192 -147 -202 122
5192A22j32J18l30n7L37jj84n1J25R3o1K95k42J54k13j97J08J43j58O9J29r5m5
$$ 122 -10 108 -222 -279 58 57 -127 -178 -53 40 -21 274 32 186 -27 -224 -116 27 -131 -62 67 -28 -73
5215g3j57K4M6M66l57oR4J28l94K94k06K34R3l45O1K48k87J36J71k91N0J91J19
$$ -73 -230 -206 -160 306 -51 -57 37 165 -229 65 -141 93 186 -159 -98 150 -137 -1 170 -121 -71 120 239
5238B39l06Q9k4J88j18k2j16j9j84J98J28j67K21j71j23M16k62k4rp9K90j30R8
$$ 239 -67 22 -2 186 68 46 -70 -89 -273 -75 53 -114 107 -64 -187 229 -33 -57 -66 -145 145 15 113
5261A13m9k66K92j20K05n9j52L0k2r0k15M63k87N7J51pj55K31k63J39p8J8j49
$$ 113 64 -202 90 -30 175 116 -36 -6 -28 -118 -333 130 -157 -100 51 44 -111 120 -143 -4 -82 -64 -213
5284b13K41m5m1Q3k9OR2l8m9l31M52j5PJ51m37o0J62L29m36L39k53j13M24l40
$$ -213 28 -17 -58 25 -4 2 94 56 7 -324 128 113 120 271 -166 -226 -64 265 -171 168 -85 -198 226 -114
5308a14j14M1J91O0J54m7k21J04j0k2K4QL1k78K59j13J77Q0k88k77M20l03L75
$$ -114 -228 -187 4 64 218 171 -50 54 44 22 46 54 85 -193 66 -47 130 210 -78 -355 65 -238 137
5331A37R9l00J29o5J18l03M26J41l39n0l1q0J11O6r9N11o09J30k3j25j69K34p0
$$ 137 236 -64 65 0 118 -185 241 382 43 -7 -38 -118 -7 59 -40 471 -138 -8 -31 -156 -325 -91 -161
5354a61K53k35P4k5k69K42j24r8K63q6J92K08k92p8p4J72M7J76l81J94k05K00
$$ -161 92 -143 -69 -94 -363 -121 -245 -343 -80 -166 26 234 -58 -136 -210 -38 9 185 -196 -2 -207 -7
5376gJr8m4K15j90J10J20k21OJ14j99JK81N3J5R6m35n0M40k31l33M34k6M2m4o4
$$ -7 -6 -104 -148 67 -123 -13 107 -114 -108 6 -193 -192 89 142 157 253 -182 -232 208 -23 -356 78 52 94 50 -14
5402a4J63j98K13k46j2J10NJ08l58j0M50k43k47K25J15N6K9l06K25n3r5O6K02
$$ -14 149 -49 164 -82 -94 16 21 129 -229 -239 211 -32 -279 -54 61 117 146 -160 65 12 -83 -17 185
5425A85q4J68k86l0qJ05Q8j73J93j57l2J06Q3j41M9j14K29k63l9K99q4k60q0L02
$$ 185 101 269 -17 -47 -55 50 138 -35 158 1 -31 75 158 17 66 -48 181 -82 -121 178 94 -166 -246 56
5449E6j01j41L99m05O9J89j57m1RL37k96N1J67l23N3J01J45k27j9J75P1Pk96q3
$$ 56 -45 -186 213 -192 -123 66 -91 -132 -123 214 -82 -31 136 -187 -134 -33 112 -115 -134 41 112 119 -177 -260
5473b60L51q6m5o4J82k3J48l07q8L46l31L57k43j02M71m68Q1k0J92j14m7J2J51
$$ -260 91 5 -40 -104 78 55 203 -104 -192 154 -177 180 -63 -165 306 -162 -81 -101 91 -23 -70 -58 93
5496I3j73j32K66m8r3J06M22l97n4J60n77L67L17k74O3Qk65M10M0k24k4Q8o6j59
$$ 93 -80 -212 54 6 -87 19 441 44 -10 150 -427 -60 257 -17 46 54 -211 199 239 15 -9 79 13 -146
5520a46K99l17L31J48q6m65K95r2L0j13j32j40N21N2k39J85k32M11j76m5q0J36
$$ -146 153 -164 167 315 229 -236 59 -33 -3 -116 -248 -388 133 185 -54 131 -101 310 134 89 9 145
5542A45m38J02K80m0j1J34k17r6O0k63K14K87M3m76M90l40K57j9P3l47K84j46
$$ 145 -293 -191 89 49 38 172 -45 -141 -81 -344 -130 157 200 -276 214 -126 131 112 185 -162 122 -24
5564b4j04l6J23k5l06M82l16K48k3j62O6P5k10L77j07j41R4k20kk3L4O6k3N31
$$ -24 -128 -164 -41 -66 -372 110 -206 42 19 -143 -77 -2 -212 165 58 -83 11 -209 -211 -234 -200 -134 -157 374
5588C74n58L20K3m8k69qL64l95L81l75M30j3j32J77n30L19k92M08j6l15K40q5
$$ 374 -184 136 159 111 -158 -166 198 -197 184 -191 239 226 94 271 -259 60 -232 176 160 -155 85 0
5610@j70R6M26k60q6L07k83P0l46J69N4j82M9N7J21L58n02K13L4j52P5jj56l00
$$ 0 -170 -74 352 92 6 313 30 100 -246 -77 -23 -205 -156 -99 22 380 -122 91 125 -27 48 47 -109 -409
5634d09M28J7J97o6l68K60j40J30J89k98J92l08L44l21J3K92l63k0M14m24J26
$$ -409 19 36 233 167 -201 59 -81 49 238 -60 132 -176 168 -153 -140 152 -211 -231 183 -241 -115
5655a15J94k5nL36o05K98j64J77j56j29Q8J71J10j76L1n1K45m80M34l3k19J3L15
$$ -115 79 54 49 385 -220 78 -86 91 -65 -194 -106 65 175 -1 30 -21 224 -256 178 145 -74 -61 254
5678B54k76L36k87j30M60l77K17j93M8J26k41p9J19J40%j50qJ46k7j5m4k22m9
$$ 254 -22 314 27 -103 357 -20 197 4 52 178 -63 -142 -23 117 117 -33 -41 105 78 63 19 -203 -252
5701b52Q2L28j90O6k81L12q0J89k41k38J95J39k54J14R2j17J51p9P4O1L8Qj36
$$ -252 -170 158 -32 34 -247 65 -15 174 -67 -305 -110 29 -225 -111 -19 -136 15 -64 10 71 109 117 -19
5724a9N0mMq7N6j67j10k5J36J30J04k01J06J69j43k00l0L08k93M65P8j31k23j0
$$ -19 31 27 31 -56 0 -167 -277 -302 -166 -36 68 -133 -27 142 -1 -201 -231 77 -216 249 327 196 -27 -37
5748c7O5L0q2L19k14jr9N5n9J02J07l43M80k54k38L30j48L18l75K01k74J6mJ9
$$ -37 28 58 -24 295 81 80 -19 36 -23 79 186 -157 323 69 -169 161 13 331 -44 157 -117 -101 -105 -86
5772h6Q1J28Jl10J62pk46K80j01J84M7k01J94j66j20J95Q4j32J10l73K90j55K2
$$ -86 -5 123 124 -186 -24 -31 -277 3 -98 86 133 -68 126 -40 -160 35 119 -13 97 -276 14 -141 -119
5795a19k48J22N35m32M5Q5k33J56l7L0K3L10m90l8J58l4QO1R4K8k11P3N2J26m17
$$ -119 -367 -245 290 -142 -97 -12 -245 -89 -126 -96 -73 237 -253 -291 -133 -167 -159 -98 -4 24 -187 -114 -62 64 -353
5820c53L71j56K7L8R4L2J5j54Q5j55J88P4n4l9j08J60r0K30k75p1K84J51m69M2
$$ -353 18 -138 -111 -73 21 53 68 -86 -1 -156 32 106 52 13 -95 65 -25 205 -70 -141 143 294 -175 -133
5844a33J54k41M80r6o1R7k68K10K18l29k33J13J41J02k24k2J02j1L6K65l27n0
$$ -133 21 -220 260 164 103 200 -68 142 360 31 -202 -89 52 154 -70 -92 10 -1 35 300 -27 -77
5866g7L59j10j70M0K06k77RrP0J6P7Rj05p0j54O2J22j52pJ77M5j13O7j14K6K74
$$ -77 282 172 2 42 248 -29 -20 -29 41 57 134 143 38 -32 -186 -124 -2 -154 -161 16 61 -52 15 -99 -73 201
5892B01l27K50j2l28N1K04l7j12j16L71j2j79K09j9k34MK41L1j43l2n8L8n3k12
$$ 201 -126 124 112 -216 -165 39 2 -110 -226 145 133 -46 163 144 -90 -86 155 186 43 11 -47 -9 -62 -274
5916b74L43k39J57L20l60J34Rl9P5J08j90nj7k10J87J92r5j93j28K70O7j01j72
$$ -274 69 -170 -13 307 -53 81 90 51 126 234 44 39 22 -188 -1 191 96 -97 -225 45 112 11 -161
5939a61L42k28k9J60q2J36n0q8m3P6r4J34k53J46J25J7o5j08J34q3K93m43L35
$$ -161 181 -47 -76 84 2 138 88 0 -43 33 -61 73 -180 -34 91 108 43 -65 69 -14 279 -164 171
5962A71j4p5k71J92j49K8J68n7J0J80j45j98J9L33l24K50P9l04j5J34p8J09j13
$$ 171 157 82 -189 3 -146 -118 50 -7 3 183 38 -160 -141 192 -132 118 197 -107 -122 12 -66 43 -70
5985g0j08J36Q9m9J50k81M9J86M6k85K14l13J44lR1o0K88l17Q7L15n36M55n65
$$ -70 -178 -42 47 -2 148 -133 -84 102 148 -137 77 -236 -92 -95 -4 -64 224 -93 -6 309 -227 228 -337
6008c37M20k85K34m3J27m2n8j26k38L35k31L52Nk58j83L26R0J4p8J22q1m18M09
$$ -337 83 -202 32 -11 116 74 16 -110 -348 -13 -244 108 113 -145 -328 -2 88 102 24 146 65 -353 56
6031E6r3j6n5L1j18J20J74j71q1L52p9j64k55M09k12j01j02J70K68N9k99K15n1
$$ 56 -37 -53 -108 -77 -195 -75 99 -72 -153 199 120 -44 -299 110 -102 -203 -305 -135 133 192 -107 108 57
6054E7j25RP8j16Q5J1n7K2N9N1j92ok7L51n37nK29J20j42M23k57j32j39K05J85
$$ 57 -68 -59 19 -97 -12 -1 -58 -36 23 74 -118 -124 -151 200 -337 -342 -113 7 -135 288 31 -101 -240 -35 150
6079A50j13P3l13J31J03K63k94k29M27q5m50M05n8K20jk45R9K1j04l42L82q0J65
$$ 150 37 110 -203 -72 31 294 0 -229 198 113 -337 68 10 230 229 -16 83 104 0 -342 40 -40 125
6102A25j01j10L38l75o2R9K53n1k58J76l7M44n16L03j81m88N46k06K01j33N8J04
$$ 125 24 -86 252 -123 -185 -86 167 116 -142 34 -3 441 -75 228 47 -441 105 -101 100 -33 25 129
6124A29j41k16L49k66J34j94Q9J34l4l07L97j28J39Mk52L10o6l57J43K52k9O4
$$ 129 -12 -228 121 -145 -11 -205 -116 18 -16 -323 74 -54 85 89 -163 147 81 -276 -133 119 90 154
6146A54j22n7n6o2M4J96k38R3n4J96l4J00k96M13j77P4K1m51M31%k88J03J4J94
$$ 154 32 -25 -81 -143 -99 97 -141 -48 -102 94 60 160 -136 277 100 174 195 -256 175 175 -113 -10 4 198
6170A98m37l0J33J45J10M4k29J1J3J69o7k34p6M69l41J10K0J16j69j97K48r0K64
$$ 198 -239 -269 -136 9 119 163 -66 -55 -42 127 60 -174 -250 219 -122 -12 8 124 -45 -242 6 -84 180
6193A80m6P1k27p5L1k4L3j06K62l2j83J18Kn4K7J97m08J31K0O0J6R4j03J7l39
$$ 180 134 205 -22 -97 -66 -90 -57 -163 99 67 -116 2 4 -50 -23 174 -234 -103 -83 -23 -7 87 -16 1 -338
6218c38q4O05l94K24R6j48NN3K39k08k06L24j37J30p4k07K22j64J38K0o8k29J26
$$ -338 -422 183 -211 13 109 -39 -34 19 258 50 -156 168 31 161 87 -120 102 -62 76 96 28 -201 -75
6241g5J21k5j42L53j12k61J50J53j76k78K76l7j73M63q1l8j89L26m54l8L25j50
$$ -75 46 21 -121 232 120 -141 9 162 -14 -292 -16 -53 -226 237 156 118 -71 255 -199 -237 88 -62
6263f2K12j85q8P8J1P9J05j90L2j60N9q3J36k1r3J22j33L69j06j05m3j2o8J30
$$ -62 150 -35 -123 -45 -34 45 150 -40 -8 -168 -109 -192 -56 -77 -170 -48 -181 188 82 -23 -66 -78 -146 -16
6287a6O8O6j98L07n10K38N2j07K7K07j88j26L40k77k1K07k1k16K16k92L26k75
$$ -16 52 118 -80 227 -283 -45 7 -100 -73 134 -54 -180 160 -117 -138 69 48 -168 48 -244 82 -193
6309a93O7K55o1l0j74J11J74m21m1N43r9J71l72l6M5J07N4j37k41K73j19K14K2
$$ -193 -126 129 68 38 -136 -25 149 -272 -313 230 131 302 -70 -106 -61 46 100 -37 -278 -5 -124 90 112
6332A12j92J64j85Nj68N04k17J6k94J28J71j27L04n3o9j93L09l70L35k47l2R8
$$ 112 -80 84 -101 -96 -264 240 23 39 -255 -127 44 -83 221 168 99 -94 215 -155 180 -67 -99 -1
6354aP5j4J6k2j46P3m0p2J36k2J40K1j55k59N43n89M05l7k59K21M7j61K87l56
$$ -1 74 60 76 54 -92 -19 -59 -131 5 -17 123 144 -11 -270 273 -316 89 52 -207 14 61 -100 187 -169
6378a69L34q6o1m7N3j14j06K47j3n2p1K95l69q2K03J14o5J28r9l34M49k95J0J71
$$ -169 165 79 18 -29 24 -90 -196 51 38 -14 -85 210 -159 -241 -38 76 11 139 40 -294 155 -140 -130 41
6402D1r2J13l16P8K83Q4L4l12K5L71m97L2L65l13J19m41N50k52OkQ9J15j4j21
$$ 41 -51 62 -254 -176 107 191 225 -87 -62 309 -188 -156 209 -104 15 -426 124 -128 -122 -124 -35 80 66 -55
6426e5k5LL8J41J97m11J09j01Q3J03M2j72p5J20m7J89n0k36j50J76Q4j23q1M35
$$ -55 -80 -77 -39 102 299 -112 -3 -104 -21 82 124 -48 -123 -3 -50 139 89 -147 -297 -121 -37 -160 -241 194
6450A94m06K64j61K92k94P6J45Q2m29K95P9j60K6J35r0R3k82rj2l4QK07Q0j18
$$ 194 -212 52 -109 183 -111 -35 110 192 -237 58 137 -23 3 138 48 141 -141 -150 -162 -196 -188 19 99 -19
6474a9Q6j14K81K0k63j4J86m25K95k29J79J36rk03M0L3M4L69n07j0O3J6Q8j72
$$ -19 67 -47 234 254 -9 -23 163 -262 33 -196 -17 119 110 -93 -53 -20 24 393 -114 -124 -61 -45 43 -129
6498a29K6J45m6J82m56J67l3M11k98M0j69K36k60J14J42k09J02J72o1j08M5k14
$$ -129 -103 42 -4 178 -278 -111 -144 267 -31 9 -160 76 -184 -70 72 -137 -35 137 76 -32 13 -201
6520b01O9J69O7j98K82k81J64l44K41k77O70k92k15J76k3j5j67J64j23K93l68
$$ -201 -132 37 104 -94 188 -93 71 -273 -32 -309 361 69 -146 30 7 -8 -175 -11 -134 159 -209
6541b09J43K99m70L09q7N9J52j25K3k37M9J50j46Q7j28Q0j42J44k93M77K47m94
$$ -209 -66 233 -237 72 -15 44 196 71 94 -143 -94 56 -90 -3 -131 -51 -193 -49 -342 135 382 -112
6563a12K67k4o5l7m0J40o5J2j60L13l8k91R2j55J77n2m8L26r5Kj57j69K39j0J
$$ -112 155 131 66 29 -11 129 64 76 -84 229 191 -100 -8 -163 14 -38 -86 240 145 147 -10 -179 60 50 51
6588E1j08K35k42O3r9J72k84LK12O9l10k7J77K4M39l32k58J98q8k6m1J24R5K5
$$ 51 -57 178 -64 -1 -100 72 -212 -209 3 72 -238 -265 -88 -64 375 43 -215 -17 -105 -131 -172 -48 47 72
6612G2j36P1j62J72O5j20Q5j00o4J5J14J19%l37L35j26r8Q0J09j70q3M90k76q4
$$ 72 -64 7 -155 17 82 -38 47 -53 -117 -102 12 131 131 -206 129 3 -95 -15 94 -76 -159 331 55 -29
6636b9J0N1m30L76J86k94J98J87m09j27M28j1k61o7Q9K09j47k7l3J4K2j51K05
$$ -29 -19 32 -398 -22 164 -130 68 255 -154 -281 147 136 -125 -192 -103 106 -41 -68 -101 -87 -65 -216 -11
6659a1n0K16J62l69K80k92p8L72k14J0J25j22j0j2J58j34R3k03K1m3J56k16L60
$$ -11 -61 155 317 -52 228 -64 -142 230 16 26 151 29 19 7 165 31 124 -79 -58 -101 55 -161 199
6682A99j74j40Q0k14L36m05K71k0J07j45J2K29l25L83J49l51J23j33j30J82q7
$$ 199 25 -115 -35 -249 87 -318 -47 -67 40 -105 -93 136 -189 194 343 -8 115 -18 -148 34 -53
6703e3J24j67k44K4M20j4p2J50m9ON5j87Q0j4k18K02j05R2l78L48j67M7J24jj58
$$ -53 71 -96 -340 -316 104 90 18 168 119 125 180 -7 73 59 -159 43 -62 30 -348 0 -167 -120 4 3 -155
6728a55K00O4j80K45l94K54J99k23k78L17l36K75k87N6K02Q4Q1m09J33P3L8N7
$$ -155 45 109 -71 174 -220 34 233 10 -268 49 -287 -12 -299 -243 -41 43 124 -285 -152 -79 -41 16
6750A6O2k19P3o7K35l33K77k28L8L21k30N2m0P8j87J45J65q8O8j95rJ87l16L06
$$ 16 78 -141 -68 -135 100 -233 44 -184 -146 175 -55 -3 -43 35 -152 -7 158 70 138 -57 -66 121 -195 111
6774A11j78J66k65R8N4Q1l12J74J00l67N70k53J04r%k11M47Qj08k38k02N54j59
$$ 111 -67 99 -166 -68 -14 67 -245 -71 29 -338 232 -21 83 74 74 -137 310 318 210 -28 -230 324 165
6797A65l3k67J59j4l9R7j39J88k40q3R2J64k48M10j60k3r2J65q8Pk19M8J99k80
$$ 165 132 -135 24 10 -29 68 -71 117 -123 -206 -114 50 -198 212 52 29 -63 102 14 21 -198 -150 49 -231
6821b31J24qL5o2L07j06K45k23j81K52O6j11o3L4l17J95O6j12M2k26K64k6j92
$$ -231 -107 -115 -80 -142 165 59 304 81 -100 152 218 107 44 78 -239 -44 22 -90 -48 -274 -10 -36 -228
6844b28K80l48L19Qk6m0j72L05j12o9p8J50J67k27K29k36o5R3r8J20R0J06k70
$$ -228 52 -296 23 31 5 -35 -207 98 -14 -83 -161 -11 156 -71 158 -78 -143 -50 -148 -28 62 168 -102
6867a02O7K57j60l23N45j88L67l34j29p3K28M2P8k24jj53KQ1J07q4j11J30j5k80
$$ -102 -35 222 62 -261 284 96 463 129 0 -73 155 197 275 51 50 -103 -101 -20 87 3 -108 22 7 -273
6891b73R0J31J3j18N68n19J33r5K6M9J97j71j72R4J13K20k95Mj56J02k7K7j60
$$ -273 -183 -52 -39 -157 411 -108 25 -70 -44 5 202 31 -141 -47 66 286 -9 -5 -161 -59 -86 -59 -219
6914b19L29M1j70K5P9j23K93k9m66M27k05k34K48J15j65J81No5j79K2K30O0j34
$$ -219 110 151 -19 6 85 -38 255 226 -240 187 -18 -252 -4 111 -54 127 132 67 -112 -90 140 200 66
6937F6J35j61k09kQM23m56L15j27J68j30j59J16J13j91k78M69lk89J95p5q5J01
$$ 66 201 40 -169 -171 -163 260 -196 119 -8 160 30 -129 -13 100 -91 -369 100 97 -192 3 -72 -157 -56
6960e6K5K51l56J56Q3r7P5j11K05l29p3J08j7J17J8M9P3q0O5l39kN8J27O2k6l21
$$ -56 -31 220 -136 20 103 6 81 -30 175 -154 -227 -119 -136 -19 -1 48 121 41 106 -233 -235 -177 -50 12 -14 -335
6986c35K90K4q4J86J5r1K0j00l9K65o4m5m0M0q7J34J19m92K47k2q0Jq4K27O1k77
$$ -335 -45 -21 -105 81 96 5 25 -75 -114 151 87 42 2 42 -45 89 208 -284 -37 -59 -139 -138 -222 5 66 -211
7012b11J67J42l76L68K31l42%K78j30k76K83K9j33n2j9j8j61M36m03R8J62J56
$$ -211 -44 98 -278 90 321 -21 -21 257 127 -149 134 163 30 -22 -41 -59 -220 216 -187 -89 73 229
7034B29m2ok85j83K53m77O06j11Kr5J34o5J54j08j97NJ49Oj24K47J03r1j68p2
$$ 229 187 181 -104 -287 -34 -511 95 -16 -14 -109 25 -40 114 6 -191 -186 -37 -31 -155 92 195 104 -64 -136
7058a36K89j93j53J29Q4Q2k21k6K58o6j76J81J8j90J94k52K15r9K29j90j32j75
$$ -136 153 -40 -193 -64 20 102 -119 -145 113 47 -129 52 70 -120 74 -178 37 -62 167 -23 -155 -330
7080c30K61K14j16J42o3m6k02L22j09r9PJ74k22P4J32p9L1R8k54m8J66P6m4k55
$$ -330 -69 145 29 171 108 62 -140 182 73 -26 -19 155 -67 7 139 60 91 189 -65 -113 53 129 85 -170
7104a70K76J64j46J4k76k13M76L1j93l0K8L6N2j73Q1j71J13J42R6q8P4k69k30
$$ -170 106 270 124 138 -138 -351 125 156 -37 -67 -39 -3 49 -124 -43 -214 -101 41 137 49 123 -146 -376
7127c76L14P5J20P5j16J91l61p4M8N1L26l74m7K58k69p8L59k58J00L3j0j09K79
$$ -376 -62 13 133 208 92 283 -78 -152 -104 -53 273 -101 -148 110 -159 -237 122 -136 -36 -3 -13 -122 157
7150A57j27j53J40P7j13J79k76k9J67K35l16m7K03k56K87O3j4l31k9K40l3j18
$$ 157 30 -123 17 94 -19 160 -116 -145 22 257 -59 -106 97 -159 128 191 177 -154 -183 57 24 -94
7172i4N3l3j17J16q5J57J37l65R8o6K10p2n2O5K5Q9Ko1L37l32j87M6Q3R4K34m82
$$ -94 -41 -74 -191 -75 -160 -3 134 -231 -133 -199 11 -61 -113 -48 -23 66 68 7 344 12 -175 -129 -46 48 282 -200
7198b00K30r9O1k83J17M51k22j89K92k70P5L3r5l1J21n2O2j80M94k37k21j1p0
$$ -200 30 -69 -8 -291 -174 277 55 -134 158 -112 -37 -4 -99 -130 -9 -61 1 -179 315 78 -143 -154 -224
7221b24M46l22j52J19Q1J62N8q8k9l5N8j34K7J07k22J84K81n08qL4J26P3J03k56
$$ -224 222 -100 -252 -133 -52 110 168 80 51 16 74 -60 -33 74 -148 36 317 -191 -199 -165 -39 34 137 -119
7245a19K95k44P1l59kO42m64J98k98M28q9M7Oj64n4J9K20k92J3j25K52p1J5j9
$$ -119 176 -68 3 -356 -358 284 -180 18 -280 148 59 106 112 -52 -106 -87 133 -159 -146 -271 -19 -90 -75 -94
7269i4O1J07j9k57M69l49R3k28P6L5j67L17rm99M26K6q1K51N8o9j43R9l75L08
$$ -94 -33 74 55 -202 267 -82 11 -217 -141 -106 -273 44 35 -464 -38 -12 -93 158 216 147 4 103 -272 36
7293C6J35k90n3K70J34m85M00q9qJ23J02k78k33J13J74K3j81J69J66m82M17k75
$$ 36 171 -119 -172 98 232 -253 147 58 50 173 275 -3 -236 -123 51 74 -107 62 228 -254 163 -112
7315a12K14L4o8l02M11j8M5k46M3k61j61K64J4K57r0O0m4j23q3J7O9J27j13N2
$$ -112 102 136 68 -234 177 159 204 -42 1 -260 -421 -157 -143 114 24 84 40 -83 -166 -149 -80 47 -66 -14
7339a4j09J54P7j25O4J6j69J11N6l65L44k85K77m00L37j25K74p1P0k24J40J39
$$ -14 -123 31 108 -17 47 63 -106 5 61 -304 40 -245 32 -368 -31 -156 118 47 117 -107 33 172
7361A72j65r4K17k92L32k46M0J12L2K7j40j40K88j33j47L85Po3j65j58J83k20
$$ 172 7 -87 130 -162 170 -76 -36 76 108 135 -5 -145 143 10 -137 248 255 192 27 -131 52 -168
7383a68J43J19k44J40K14j74J68j29J1K09m44J27j26J30J52k91J98Q0j53q9j20
$$ -168 -25 94 -150 -10 204 30 198 69 80 289 -155 -28 -154 -24 128 -163 35 115 -38 -127 -247
7404b47N6P8J27j14L9J49k54Q1K96o35M28J22j90J95k56J01J33j22j72m2n6K58
$$ -247 -191 -113 14 -100 -61 88 -166 -85 211 -424 4 126 -64 131 -125 -24 109 -13 -185 -227 -283 -25
7426b5Q5J40j04m2j14J04k9J86j50j72l8m9J64J1K30j46j3k03K69k94k6L70J59
$$ -25 60 200 96 54 -60 44 15 201 51 -121 -159 -208 -44 -33 197 51 38 -165 104 -190 -216 154 313
7449C13j03j99k09K09M5K48l50q9K19o5j49K02m1L66l43N5J4j75j28Q1L27k25
$$ 313 210 11 -198 11 56 304 -46 -135 84 19 -130 72 31 397 54 109 123 -52 -180 -99 228 3
7471CJ73k12K55j95J2k83J73R8L52l59J91l82k0J57j07J99l6pj04NJN2P3m20M77
$$ 3 176 -36 219 24 36 -247 -74 24 376 17 208 -174 -194 -37 -144 55 19 12 -92 -87 -86 -34 39 -381 96
7496I6k94K76j1Q6q7j14n2L3J13p6k0J26M4j30J65j44j23J62R0j67LNOk07Q9L21
$$ 96 -198 78 67 153 66 -48 -100 -67 46 -30 -50 76 120 -10 155 11 -112 50 140 -27 -24 -19 -13 -220 -131 190
7522A90j09j97J17n6J73r4j30q4J27q1J67k74L45L5N4k05Q3J27l17K1J3L96n75
$$ 190 81 -116 1 -55 118 24 -106 -190 -63 -144 23 -251 94 129 183 -22 61 188 -129 -108 -95 301 -274
7545b74Q9J46r6M18l61j34P7M30j78j45J9j91N07p6J0k15R4J13j85n1k38M08m59
$$ -274 -185 -39 -135 283 -78 -212 -135 295 117 -28 -9 -200 307 231 241 26 120 233 48 -3 -241 167 -292
7568b92K86k23O3M22j70j76k0J05P4k16P1r5K33j88K34o3j63j06K46o8J56l7k35
$$ -292 -6 -229 -166 256 86 -90 -110 -5 69 -147 -76 -171 62 -126 108 45 -118 -224 22 -46 110 73 -162
7591a62K03j15J93j32k69K59J6k0k9J45MrM9k13n9PJ29K59j43l25K48K11r7l28
$$ -162 41 -74 119 -13 -282 -23 -7 -27 -56 89 93 84 133 -80 -139 -132 -3 256 113 -212 36 247 150 -178
7615a78j4P0J88q4J58m9l94J77L1M4J13j8o8J57P2j73M2r4j57K53J04k99L75n19
$$ -178 -192 -122 66 -18 140 91 -303 -126 -95 -51 62 44 -24 133 205 32 74 -20 -177 76 180 -119 256 -263
7639b63L53l0j13Q2J5Nl43J37J96j59K67l40K72o0J6L6q8j56L02Q7l01J05J73
$$ -263 90 60 -53 29 44 49 -294 -157 39 -120 147 -193 79 19 35 71 -17 -173 129 216 -85 20 193
7662A93j63n5J0o5o2j07M04qj33o7J01q2J58j6rP9j94J42M3k99J10k9K07j41k05
$$ 193 30 -25 -15 -80 -142 -249 155 147 14 -53 48 -34 124 108 99 178 -16 126 169 -130 -20 -49 158 17 -188
7687a88J01J99k12k43J4L61j8l57K92J53K57p5l46L36j52l61K48p6K1K05k25K64
$$ -188 -87 112 -100 -343 -329 32 14 -343 -51 102 359 284 -62 274 122 -239 9 -67 -46 159 -66 198
7709A98j68J24j94M6J65l75L18j48J02mj04j46K97m2j55L21l90p5K40J64j4m2
$$ 198 30 154 -40 6 171 -204 114 -34 68 64 -40 -186 111 69 -86 235 -155 -230 10 174 160 118
7731A18j47j54J62J63j14l7K49l87j0J07J36r3R3P3l61R3J06J49l89K98N4j95
$$ 118 -29 -183 -21 142 28 -9 240 -147 -157 -50 86 -7 86 159 -202 -109 -3 146 -243 55 109 -86
7753h6J09o7K69j48L4k49J73N3k53L13Q7r2O2l11K44K7j44o1r7K57j49%j15M11
$$ -86 23 -44 225 77 111 -138 35 88 -165 148 235 143 205 -106 138 165 21 -40 -137 120 -29 -29 -144 267
7777B67K6m21j73L76l07J97j57K70l30J36J20R4m75M52J87o4j06k23K16j29K59
$$ 267 293 -128 -301 75 -232 -35 -192 78 -252 -116 4 98 -377 75 262 198 92 -131 85 -44 215
7798B15m03K49j07j00K6J48k62N20m78%J97K9r3N22l68j41J55Q1l35J66K44n72
$$ 215 -188 61 -46 -146 -120 28 -234 286 -192 -192 5 34 -59 463 95 -46 109 190 -145 21 265 -307
7820c07M11M5j31J30k85K96J8m59K58j39J76k02L58o0k25K3J61j14K09k02K4j3
$$ -307 104 149 18 148 -137 159 177 -282 -24 -163 13 -189 169 109 -116 -93 68 -46 163 -39 -15 -28
7842b8K00M8l19J24l03K93J83j18j62J97L3m14L71j15k8R1j61K0J7l8p9r6L74
$$ -28 172 220 -99 25 -278 15 198 80 -82 115 148 -266 105 -10 -38 53 -108 -88 -71 -109 -188 -284 90
7865I0k84J26O3k16K76k0j5m5K43j78JJ14k09J22MQ1m66J37l7K54q4R6N1l9K00
$$ 90 -194 -68 -5 -221 55 35 20 -25 218 40 41 155 -54 68 72 153 -313 -176 -213 41 -43 53 104 65 265
7890B65l69K23j78k60J71L5O3k56J78N8J45k01J23m9K47N0j69NKL7Q3k40P0o7
$$ 265 -104 119 -59 -319 -148 -113 -50 -306 -128 -70 75 -126 -3 -52 195 245 76 81 83 120 203 -37 33 -34
7914c4j77J49J48j31j46L07J5l2k26K65j57O3J04k2k72j31J76N0J6Q7J43l27K18
$$ -34 -211 -62 86 -45 -191 116 131 99 -127 138 -19 44 148 126 -146 -277 -101 -51 -35 52 195 -132 86
7937H6J7n4M1q0p6J51m1nj45R2R3j97j20M6K31P2p8J7j16J3%j79J94K99k09m6
$$ 86 103 49 90 10 -66 85 44 39 -106 -14 79 -118 -238 -192 39 111 33 50 -66 -53 -53 -232 -38 261 52 6
7963Fj46K84k8j42J39k47L74k47J88k55K85j10q0O4J44l6m65L44l7M4J54k77Q3
$$ 6 -140 144 116 -26 113 -134 240 -7 181 -74 211 101 21 85 229 193 -272 72 35 79 233 -44 39
7986C9R5K1j01n7J42jO0m78K25R0O5j7N9l39K24j44qK06m2L2k1j57L9K20p6l08
$$ 39 134 155 54 -3 139 138 198 -280 -55 35 100 83 142 -197 27 -117 -125 81 39 71 50 -107 -68 152 76 -232
8012b32J67M2O7j3r5R0j38M8j65K72j7k9J84j8k5k9j20K15k71k4k5K26l9o9K04
$$ -232 -65 -23 44 31 -64 26 -112 -64 -229 43 26 -3 181 163 138 109 -11 204 -67 -91 -116 110 71 2 206
8037B06k06k12L6L80k40J35P9j25K0J61l73K94k20j01R4J30j8k10M12j73l08K39
$$ 206 0 -212 -176 204 -36 99 178 53 73 234 -139 155 -65 -166 -72 58 40 -170 242 69 -239 0
8059@K80l30K1q2K63j16km6J00l78K52K42l22K71j04j40k7K88Oj72J09L7j37k
$$ 0 280 -50 -29 -111 152 36 34 -12 88 -290 -38 204 -118 153 49 -91 -118 170 176 4 113 150 13 11
8083A1r1n4L68k63J89k65J41k62L26K8l58L28k6k33L85j2k07r6PK02l72L67j31
$$ 11 -80 -134 234 -29 160 -105 36 -226 100 128 -230 98 72 -161 224 212 5 -91 -84 118 -254 113 -18
8106a8J71m03L04j22J63p5MM0K23j85j58N8k11J87K44j41j24m1q6J28O6k66M39
$$ -18 153 -250 54 -68 95 20 24 64 287 102 -56 2 -209 -22 222 81 -43 -84 -170 -42 24 -242 197
8129A97j87K98j10k60J47k70N5K04j50J35Rj69J23r7M61k49J03j76k58R0O1J02
$$ 197 10 308 198 -62 85 -185 -130 74 -76 59 68 -101 22 -75 386 137 240 64 -194 -104 -43 59
8151E9Q8k18Lj18J05K60m24J92p3l05M51N9r8k30J6K21m47J61L96k29K35j00l0
$$ 59 147 -71 -68 -186 -81 179 -245 -53 -126 -431 20 79 -19 -249 -233 -12 -459 -298 98 -131 104 4 -26
8174b6P4l74J47L99j56Kq7q2j03J02J29K04o13M92m93K17K53
$$ -26 48 -326 -179 220 64 66 -21 -103 -206 -104 25 229 -384 108 -385 -168 85
8191H5
$$ Imaginary data points
##PAGE= N=2
##DATA TABLE= (X++(I..I)), XYDATA
0@%%%%%%%%%%%%%%%%%%%%Kj0J6j6J6j6J6j8K5l1L3l6M3n0N3o0O8p7Q7r5J07j21
$$ 0 0 0 0 0 0 0 0 0 0 0 0 0 0 0 0 0 0 0 0 0 2 -8 8 -8 8 -8 8 -10 15 -16 17 -19 24 -26 27 -33 35 -42 45 -50 57 -64
42f4J34j47J63j81J98k19K43k67K93l23L57l92M32m79N31n92O61p41Q40r57J101
$$ -64 70 -77 86 -95 103 -116 127 -140 153 -170 187 -205 227 -252 279 -313 348 -393 447 -510 591
63E91j290J541j899K449l416N646k3144j269J5741j0083J2095R961L364O98J10
$$ 591 -699 842 -1057 1392 -2024 3622 -19522 -20791 -5050 -15133 -3038 6923 10287 10985 11095
78A1095R97O23j2668j025M598p084l027O186j310q14n63j436K801k494m771O318
$$ 11095 12092 12715 47 -978 3620 -3464 -6491 -305 -1615 -2429 -2992 -4428 -1627 -4121 -8892 -2574
94b574K996k924M984M935J01o96k487R33k170p846r09L540n181p47P415K539m29
$$ -2574 422 -2502 2482 7417 7518 6822 4335 5268 3098 -4748 -5657 -2117 -7298 -8045 -630 1909 1480
111A480J930L004N10n359k790K457m534n074L358K386j800J701M038J793K77m34
$$ 1480 3410 6414 6924 1565 -1225 1232 -3302 -8376 -5018 -2632 -4432 -2731 1307 3100 3377 2943
127B943K006L54l308q25J328j521j500l67M07r17k848j167J637j187k142L482
$$ 2943 4949 5303 1995 1170 2498 977 -523 -890 -483 -1400 -4248 -5415 -3778 -4965 -7107 -3625
143c625K686L96K315M323J957j194k73J140k493n695j052j97m139k126K044J347
$$ -3625 -939 -543 1772 6095 8052 6858 6585 7725 5232 -463 -1515 -1712 -5851 -7977 -5933 -4586
159d586q11K102K653J858n54J319J795j72j172N75K27q60r92m15j42j292k069
$$ -4586 -5397 -3295 -642 1216 662 1981 3776 3604 2432 3007 3234 2374 1382 967 825 -467 -2536
176b536M8N49j438n73K158J122l06Q19J929P84j302j67J132j459k086R02O44j506
$$ -2536 -2488 -1939 -3377 -3950 -1792 -670 -976 -157 1772 2556 1254 1087 2219 760 -1326 -424 220 -1286
194a286M04J994K06m67K80J308j118j679M6j58j482r61N06J58R2L10J118N22N93
$$ -1286 -882 1112 1318 851 1131 2439 1321 -358 -312 -470 -1952 -2913 -2407 -2249 -2157 -1847 -729 -207 386
213C86J46J397Q65l70J93J62J70j446p30k32j122j741n33o5p64o80J393J446J00
$$ 386 532 1929 2794 2424 2617 2779 2949 1503 773 541 -581 -2322 -2855 -2920 -3684 -4364 -2971 -1525 -1425
232a425P83K461O19j90J247O85j136q93k84m13j824q63j29k00j059Q5M66J85m
$$ -1425 -642 1819 2438 2248 3495 4180 3044 2151 1867 1454 -370 -1233 -1362 -1562 -2621 -2536 -2070 -1885 -1889
251a889L22J302J71N10P00P07nk89J44K00n27q82J50j69r24l44K43p4p80r6P08
$$ -1889 -1567 -265 -94 416 1116 1823 1818 1529 1673 1873 1346 464 614 445 -479 -823 -580 -654 -1434 -1530 -822
272h22j89m41P30M31o07M47Q20K76k8N19L03P3j15L9n5n69k86o69j92q14l47l32
$$ -822 -1011 -1452 -722 -291 -898 -451 369 645 617 1136 1439 1512 1397 1436 1381 812 526 -143 -335 -1149 -1496 -1828
294a828J56j27J40M95M80l7L88R64M58L39M58J53k68j04n97N5j070m17l89j36
$$ -1828 -1672 -1799 -1659 -1164 -684 -721 -333 631 1089 1428 1886 2039 1771 1667 1070 1125 55 -362 -751 -887
314h87m39p17L52K03j0K35Q87K39K26M23O46K39J5J24J19r8m40l7l80m97o95K0
$$ -887 -1326 -2043 -1691 -1488 -1498 -1263 -376 -137 89 512 1158 1397 1412 1536 1655 1557 1117 1080 700 203 -492 -472
336d72n00l66N5m90K36K08M36K26K48M77L44O73J79K08K59k5n28k45L1k71p26
$$ -472 -972 -1338 -1283 -1773 -1537 -1329 -893 -667 -419 58 402 1075 1254 1462 1721 1696 1168 923 954 683 -43
357d3l71m90m25l36k67O23k46K30M71M71M42L24N18K26M14r8J44j96m51o5n63
$$ -43 -414 -904 -1329 -1665 -1932 -1309 -1555 -1325 -854 -383 59 383 901 1127 1541 1443 1587 1391 940 875 312
378C12n09l46n55j55P4l84J74M38J0J27O40J75N03L91M3K08r9j1N7j03p04J36
$$ 312 -197 -543 -1098 -1253 -1179 -1563 -1389 -951 -941 -814 -174 1 504 895 938 1146 1047 1036 1093 990 286 422
400D22k63j99n86m4j80m08M08J89l06J11J59K76K14N11K51Q2K91K95o9J2k17J08
$$ 422 159 -40 -626 -670 -850 -1258 -850 -661 -967 -856 -697 -421 -207 304 555 637 928 1223 1154 1166 949 1057
422A057l17l41m05n48k74k91Nk61K97k2J19J80M81N63J85O06J83R2P4O7Np82j75
$$ 1057 740 399 -6 -554 -828 -1119 -1114 -1375 -1078 -1100 -981 -801 -320 243 428 1034 1217 1309 1383 1450 1455 673 498
445D98k50o97l72j47L5m41o5L16K55J40L40N33J73J19L64L71j99K59l26j52k32
$$ 498 248 -449 -821 -968 -933 -1374 -1439 -1123 -868 -728 -388 145 318 437 801 1172 973 1232 906 754 522
466E22r3l70l73j87N6m01k30P8K30O3OM65j01K9P24k04L06K65j12J50o2k9k54
$$ 522 429 59 -314 -501 -445 -846 -1076 -998 -768 -705 -699 -234 -335 -306 418 214 520 785 673 823 761 732 478
489D78k02K63m59k04l21K23k72k74p3M6k38L61q4M55O2Q13J78P9K99n6J4l3j13
$$ 478 276 539 80 -124 -445 -222 -494 -768 -841 -795 -1033 -672 -756 -301 -239 574 752 831 1130 1074 1088 1055 942
512I42m68k43k70o70J8m95J82k05j79P83l4j69O31N66j5L2N53L01l30P4J51o85
$$ 942 474 231 -39 -709 -691 -1186 -1004 -1209 -1388 -605 -639 -808 -177 389 374 406 959 1260 930 1004 1155 470
534D70m91kp14o2K15j21l37k58Q79j11l2M38J56J07L89J71r5J04j44K63o28N58
$$ 470 -21 -23 -737 -799 -584 -705 -1042 -1300 -421 -532 -564 -126 30 137 526 697 602 706 562 825 197 755
556G55k50o56q3%l75o9J88k5l61jQ17l85J45K78K53j85K22J46R6O6J06M09p44
$$ 755 505 -151 -234 -234 -609 -678 -490 -515 -876 -877 -60 -445 -300 -22 231 46 268 414 510 576 682 1091 347
579C47m8j32L8l13p3n21J4l75K84K72j50L29K84j97M12L36J27lK33j61j2M2l64
$$ 347 299 167 205 -108 -181 -702 -688 -1063 -779 -507 -657 -328 -44 -241 171 507 634 631 864 703 691 733 369
602C69k37j78j40n5l96j35K82n28Q2L98k4L00M16m6Q6K14M35j54J53j38j91m35
$$ 369 132 -46 -186 -241 -637 -772 -490 -1018 -936 -538 -562 -262 154 108 194 408 843 689 842 704 513 78
624G8L28m07l54r9J26k35k6j71J41J26R2K21J01K31j53O86k50Q8J80l8j80k48
$$ 78 406 -1 -355 -454 -328 -563 -589 -760 -619 -493 -401 -180 -79 152 -1 685 435 523 703 665 485 237
646B37K04l99o0k18k84O2k02J41j27L5L92Q2l02N98M8j85L68R4J38j56K97j01
$$ 237 441 42 -18 -236 -520 -458 -660 -519 -646 -611 -219 -137 -439 159 207 22 390 484 622 466 763 662
668F62j80P5n63Jk91j95rj57R2R5j69K00L10R9r2L61L43k55K30j36J85k75K7J34
$$ 662 482 557 -6 -5 -296 -491 -500 -657 -565 -470 -639 -439 -129 -30 -122 239 582 327 557 421 606 331 358 492
692D92p15M6P3m11J82l31N3J26J79r5j33K37K38K27j34J17M54k29n7o5K62k62
$$ 492 -223 -177 -104 -515 -333 -664 -611 -485 -306 -401 -534 -297 -59 168 34 151 605 376 319 254 516 254
714B54j91L07l03k37q1m02Q6J91j30K30k24K19J99n1O63j41K5k3M01l55q8K03
$$ 254 63 370 67 -170 -251 -653 -567 -376 -506 -276 -500 -281 -82 -133 530 389 414 391 792 437 349 552
736E52k92j18J21m28j50k47K72k03r2K93o7k04J31M69K14J78N4J03j95L2j51p8
$$ 552 260 142 263 -165 -315 -562 -290 -493 -585 -292 -359 -563 -432 37 251 429 483 586 391 423 272 194
758A94J4k41J3q6k60j83L85m7j01J97k49J28J96j40J93L03k47K20j56K39j8p4
$$ 194 208 -33 -20 -106 -366 -549 -164 -211 -312 -115 -364 -236 -40 -180 13 316 69 289 133 372 354 280
780B80m8J9l17K43r5l56j88J68j36j25L24q1L8O2K82j48J29K83l58N60j98J3q2
$$ 280 232 251 -66 177 82 -274 -462 -294 -430 -555 -231 -312 -274 -212 70 -78 51 334 -24 536 338 351 269
803B69K02m25N6P9m89nj76J81Kk93J12K31K18R2j50L88R4J5J87k03k84Q7O9l3
$$ 269 471 46 102 181 -308 -313 -489 -308 -306 -599 -487 -256 -38 54 -96 292 386 401 588 385 101 188 257 224
827B24k62J72m80j00M77m93N40n71M84j86M4J10K95k53K44J26k49J42l12N5N2
$$ 224 -38 134 -346 -446 31 -462 78 -493 -9 -195 -151 -41 254 1 245 371 122 264 -48 7 59
848E9M6m4J7j44j61O2j56J51o6j15O2J18L7L2J14L13j84J59l72K75R7o6L44m03
$$ 59 105 61 78 -66 -227 -165 -321 -170 -236 -351 -289 -171 -134 -102 12 325 141 300 -72 203 300 234 578 175
872A75j13j92l8J03J62m20O7J53j73M8J52n1K58k13L03lO1J6q3M5L2l0p9r1k63
$$ 175 62 -130 -168 -65 97 -323 -256 -103 -276 -228 -76 -127 131 -82 221 218 279 295 212 257 289 259 180 89 -174
897a74o5R8k28J40j78r1K33j60M14KM43j37M2j07OJ15l08p9J69k39j14K01p0j55
$$ -174 -239 -141 -369 -229 -407 -498 -265 -425 -11 -9 434 297 339 232 238 353 45 -34 135 -104 -218 -17 -87 -242
921b42O0O0j49j44L82j52K32J78j19J07R9M0o4J55Ok98R0Q8m51J98k64R3k20K41
$$ -242 -182 -122 -271 -415 -33 -185 47 225 106 213 312 352 288 443 449 151 241 329 -122 76 -188 -95 -315 -74
945g4j23j35k5J04L54p0J23p3n8M2J64l0K2j56J68l40J74j15L9j22k5j67J68J14
$$ -74 -197 -332 -357 -253 101 31 154 81 23 65 229 199 221 65 233 -107 67 -48 -9 -131 -156 -323 -155 -41
969d1k69L07m9l59L92J22n2K34l6P8Q1l47K5m3j52N6j20K0o6Q6j66K0r2K2J26
$$ -41 -310 -3 -52 -411 -19 103 51 285 249 327 408 61 86 43 -109 -53 -173 -153 -219 -133 -299 -279 -371 -349 -223
994b23L41j46j85J44K46k3L3l3K86%j76o8Q3l50J25j77n3k1j37k1J02R0j42K54
$$ -223 118 -28 -213 -69 177 154 187 154 440 440 264 196 279 -71 54 -123 -176 -197 -334 -355 -253 -163 -305 -51
1018e1k29L71K60j81m4M89k44l04M3k03L10l85J95k27K71n9l25J52J57l78K47
$$ -51 -280 91 351 170 126 615 371 67 110 -93 217 -168 27 -200 71 12 -313 -161 -4 -382 -135
1039a35q6K38L35P9j62j27K59l61o8n1K24n47J96l9J66J24k48L19m86J06J80L1
$$ -135 -221 17 352 431 269 142 401 40 -28 -79 145 -402 -206 -245 -79 45 -203 116 -370 -264 -84 -53
1061e3J45k14J83n9J01rJ35m07M08k62o8L77k00N0k42M18n28K53p1j50L24l48
$$ -53 92 -122 61 2 103 94 229 -178 230 -32 -100 277 77 127 -115 303 -225 28 -43 -193 131 -217
1083b17K56l76M72q5m3L57j16j05K27q0R7k61k7l8k1r1j42J75m54J58K42k87K76
$$ -217 39 -337 135 50 7 364 248 143 370 290 387 126 99 61 40 -51 -193 -18 -472 -314 -72 -359 -83
1106h3J81J44k50K32q1J06J2j0J2k52J15J32m43j48L15j88k0L71j45k76J92J16
$$ -83 98 242 -8 224 143 249 261 251 263 11 126 258 -185 -333 -18 -206 -226 145 0 -276 -84 32
1128C2N9k10L93J84k76m74O63l40J44j25j1k58J00L65k47l48M63m8K9j55j27L71
$$ 32 91 -119 274 458 182 -292 371 31 175 50 39 -219 -119 246 -1 -349 114 66 95 -60 -187 184
1150A84k68J13j39J86Q1r2K4J03j2k05K11N7l4n96M40J26k12j9j84K61j76p8J23
$$ 184 -84 29 -110 76 157 65 89 192 180 -25 186 243 209 -387 53 179 -33 -52 -236 25 -151 -229 -106
1173a06J3k23L77k7k32N04J10o3k75k6P8m2ON6l02N8J74m37L61m75M23m3J18K8
$$ -106 -93 -316 61 34 -198 306 416 353 78 52 130 88 94 150 -152 -94 80 -357 4 -471 -48 -91 27 55
1197E5Q5j03L20j88j9K47j33m62L2N64m19q3k8J46Ol15K48P4k10J53K83m11J00
$$ 55 140 37 357 169 150 397 264 -198 -166 398 -21 -104 -132 14 20 -295 -47 27 -183 -30 253 -158 -58
1220e8N6j9P1K67q0j52j77K66k2j96R8q3L06n31J68j7j8J14j0j38P0J07k07L6
$$ -58 -2 -21 50 317 237 85 -92 174 152 -44 54 -29 277 -254 -86 -103 -121 -7 -17 -155 -85 22 -185 -149
1244a49L00m4Q0K6Jm16K28J96R6k71k2j24n3J25k13J06L7l05K95l14N71Q7k19
$$ -149 151 107 187 213 214 -202 26 222 318 47 25 -99 -152 -27 -240 -134 -97 -402 -107 -421 150 237 18
1267A8K60k37J24j29J84l0j55j96J48n9k26Q7j30P1j9P03m94o9J41j38L00J41
$$ 18 278 41 165 36 220 190 35 -161 -13 -72 -298 -211 -341 -270 -289 414 -80 -149 -8 -146 154 295
1289B95l72L69l67p4L67l78K3J52O6o2k79J58j00Q3L9Q8k86L85m95N14j90l4L01
$$ 295 -77 292 -75 -149 218 -160 -137 15 81 19 -260 -102 -202 -119 -80 8 -278 107 -388 126 -64 -98 203
1312B03P2q6j54J65l17K55p0j0l4j8L0k26n8K12k1J84j69O2k94K19L79m49J89
$$ 203 275 189 35 200 -117 138 68 58 24 6 36 -190 -248 -36 -57 127 -42 20 -274 -55 324 -125 64
1335F4L0k6lK97k50l01K45J01n0j68j06J34l86K18P0k38K29L09Rk78J81J03K3
$$ 64 94 68 65 362 112 -189 56 157 107 -61 -167 -33 -419 -201 -131 -369 -140 169 178 -100 81 184 207
1358B07p6K8j61K06k35r5P1n9q1L29o8q6j02N7k85L30J65l31K11O5O7j45J21j21
$$ 207 131 159 -2 204 -31 -126 -55 -114 -195 134 66 -20 -122 -65 -350 -20 145 -186 25 90 157 12 133 12
1382A2m8j1LK84m47K69k03M3K47j15o4l20O0K52Ol7j8o0L21K0l9ol5K6N2j30q3
$$ 12 -36 -47 -44 240 -207 62 -141 -98 149 34 -30 -350 -290 -38 -32 -69 -87 -147 174 194 155 149 114 140 192 62 -21
1409b1k13k5J50k9P7j65J08q2p0J80J69n0K31l56K91j10J21j83P0K35k33j24K0
$$ -21 -234 -259 -109 -138 -61 -226 -118 -200 -270 -90 79 29 260 -96 195 85 206 23 93 328 95 -29 -9
1432ij13J51Q1p9l77J98K28m3k49K83o6j17J18N7j2J32j9j5j09r7K16j64k34R1
$$ -9 -122 29 110 31 -346 -148 80 37 -212 71 5 -112 6 63 51 183 164 149 40 -57 159 -5 -239 -148
1456a48jm4J32j50N7J48K45k48m0n1M60k22j07J70R3j12k90J00l5K35k44q9j1
$$ -148 -149 -193 -61 -211 -154 -6 239 -9 -49 -100 360 138 31 201 294 182 -108 -8 -43 192 -52 -141 -152
1479a52n5J35QJ09k64J33l3j6J39j76L56m62K96J7J07j54K37l97K54l35J56j9
$$ -152 -207 -72 -64 45 -219 -86 -119 -135 4 -172 184 -278 18 35 142 -12 225 -172 82 -253 -97 -116
1501a16N8l74M13J16k62L5J55K5J2o1M5K12j01mm0L31l91J82l73M11k66k24L80
$$ -116 -58 -432 -19 97 -165 -130 25 50 62 1 46 258 157 153 113 444 53 235 -138 273 7 -217 163
1524A63l55L03m67K64J96l00M62k57R8L6N9J29l15M6K18l30K84k80j09J94k5k38
$$ 163 -192 111 -356 -92 104 -196 266 9 107 143 202 331 16 62 280 -50 234 -46 -155 39 14 -224
1546b24J7K86k60r3M11k73j03J47k35K70n2K75k78L95Pr2%l95K34j47j23K42j48
$$ -224 -207 79 -181 -274 137 -136 -239 -92 -327 -57 -109 166 -112 283 290 198 198 -197 37 -110 -233 9 -139
1569a39O1J28l32JK59L0q5J50K03j41l82K43K78j80k53O3L14j02k08L07k18k96
$$ -139 -78 50 -282 -281 -22 8 -77 73 276 135 -247 -4 274 94 -159 -96 218 116 -92 215 -3 -299
1591b99L47J59k10j7j73L50q8J19j06j49O7R0rr6J51j94J45j05R5n3p6rQ4lk4
$$ -299 48 207 -3 -20 -193 157 69 188 82 -67 0 90 81 -15 136 -58 87 -18 77 24 -52 -61 23 20 -4
1616do4J02J02j7j89J40J36k22P8L0j57L17k96L20r2j04j01j01r7J75r1o1L4M12
$$ -4 -68 34 136 119 -70 70 206 -16 62 92 -65 252 -44 276 184 80 -21 -122 -219 -44 -135 -196 -162 250
1640B50k98o7o5M32j63j45Q6K08k20L56m79J51J61k85J23j98K38l01R9J2J78j70
$$ 250 -48 -115 -180 252 89 -56 30 238 18 374 -105 46 207 -78 45 -153 85 -216 -117 -105 73 -97
1662i7lJ03j69J85j70J56L6j07K25L7m3M0j17o4n0k72M34j96N9K56m22M29l46
$$ -97 -100 3 -166 19 -151 5 41 -66 159 196 153 193 76 12 -38 -310 124 -72 -13 243 -179 250 -96
1685i6K5J01l02K0M27p4n5j1k6j19J82M1r3J36j65K21j55K4j84P9k03K17j02J62
$$ -96 -71 30 -272 -252 175 101 46 35 9 -110 72 113 20 156 -9 212 57 81 -103 -24 -227 -10 -112 50
1709E0j97L87k59M5M10n38J82j9K15k26K5M3J7j01J85j55j68r7K9J43j34KN1L
$$ 50 -147 240 -19 26 436 -102 80 61 276 50 75 118 135 34 219 64 -104 -201 -172 -29 -163 -161 -110 -107
1733a07J16J01j94K57n2KP9j93L31j84k15r0J53k95L03j84P8J23l05J3K15j09
$$ -107 9 110 -84 173 121 123 202 9 340 156 -59 -149 4 -291 12 -172 -94 29 -276 -263 -48 -157
1755a57J15K0J57m0r3K38k12L31j1q8l20K19j57m3o3l5p5J86n4J35k48K93l90
$$ -157 -42 -22 135 95 2 240 28 359 348 260 -60 159 2 -41 -104 -139 -214 -28 -82 53 -195 98 -292
1778b92K92L28o09L30M5p7j34Q9J84k75K10k8j33O3J05R8l56n1K42j74l4K59k76
$$ -292 0 328 -281 49 94 17 -117 -28 156 -119 91 63 -70 -7 98 196 -160 -211 31 -143 -177 82 -194
1801a94K49r4J14j09J94j00J15q3O8k7k7k29l6J92l90L63l1N2k31j7k0K95J3l2
$$ -194 55 -39 75 -34 160 60 175 92 160 133 106 -123 -159 33 -357 6 -25 27 -204 -221 -241 54 67 35
1825C5l40N61l18L60l02nJ32k41K74k09L5k12J24j13o8P9P0L06k54K26l06K92
$$ 35 -305 256 -62 298 -4 -9 123 -118 156 -53 -18 -230 -106 -219 -287 -208 -138 168 -86 140 -166 126
1847A26j90J31K6r2K11L6q8j85j67K87k55k1K86j74K62k38j0k40K82j4P2j18m
$$ 126 -64 67 93 1 212 248 160 -25 -192 95 -160 -181 105 -69 193 -45 -55 -295 -13 -27 45 -73 -77
1870g7q6L21j65K04l01J11o2N0J46k80K09M1j56Q4j56k37K49m8J22k87J17J46
$$ -77 -163 158 -7 197 -104 7 -55 -5 141 -139 70 111 -45 39 -117 -354 -105 -153 -31 -318 -201 -55
1892e5J13j61L0K20l77K3n3K17J41k44J94j24k2j17J49j42J89n9L0k24L54q5Q3
$$ -55 58 -103 -73 147 -230 -207 -260 -43 98 -146 48 -76 -98 -215 -66 -208 -19 -78 -48 -272 82 -3 80
1915H0j64j12L68j53j13J40n4K00Q9k81K35l13K32M7m57K19j01R3j48K7J21o0
$$ 80 -84 -196 172 19 -94 46 -8 192 281 0 235 -78 154 201 -256 -37 -138 -45 -193 -166 -45 -105
1937a05R0J38o9N1j97J42r5O0J0k58K03m7pLL52k46j40L03k06N5o4o4K74k05J18
$$ -105 -15 123 54 105 -92 50 -45 15 25 -233 -30 -77 -84 -81 271 25 -115 188 -18 37 -27 -91 183 -22 96
1962I6R7j48j48j56J11R6L0R4o0l78M91l20K42n2k9O3k05J12Q2o5J63j14J06k75
$$ 96 193 45 -103 -259 -148 -52 -22 72 12 -366 125 -195 47 -5 -34 29 -176 -64 18 -47 116 2 108 -167
1986a67K28j28J23q7J82K9j05j23J63k10r8J6kO6J44J33m79K88j23j21Q95n10
$$ -167 61 -67 56 -31 151 180 75 -48 115 -95 -193 -177 -179 -113 31 164 -315 -27 -150 -271 624 114
2008A14J28j62p6j45K01K11j00k33Q6m5j0k08K95J01k81K32j77r6M10MN0k88R5
$$ 114 242 80 4 -141 60 271 171 -62 24 -21 -31 -239 56 157 -124 108 -69 -165 245 249 299 11 106
2031A06M8j56J36o3k17K14j12p3J9k35K81J28k27K18j0K8j34J37K7j73M7K03k04
$$ 106 154 -2 134 71 -146 68 -44 -117 -98 -333 -52 76 -151 67 57 85 -49 88 115 -58 -11 192 -12
2054a2L17k27J96j43l6n0Q5j67p1l8k6K06K4J23l86N00j26Lj68J90k68J11R9J71
$$ -12 305 78 274 131 95 45 130 -37 -108 -146 -172 34 58 181 -205 295 169 172 4 194 -74 37 136 307
2078C07j42q6k04n7L19j41k45K55J7K49j20k84L44j30O9Q4l96L00k46J01L3Q8
$$ 307 165 79 -125 -182 137 -4 -249 6 23 272 152 -132 212 82 151 235 -161 139 -107 -6 27 115
2100A15N5l90K93m46P84m53%k02K43j2J31n17J48L16n8N0j09L96k41k65K09R3
$$ 115 170 -220 73 -373 411 -42 -42 -244 -1 -13 118 -399 -251 65 7 57 -52 344 103 -162 47 140
2122A40p4k41K44j94L57l12J56r0o1J77q9j48O6K48k43J19l2K49k90j17K80J42
$$ 140 66 -175 69 -125 232 -80 76 -14 -75 102 13 -135 -69 179 -64 55 23 272 -18 -135 145 287
2144B87j06j05M3k9j85J57J47l60J49K03l92j61J81L14j61J43j98K20j55J44M37
$$ 287 181 76 119 90 -95 62 209 -151 -2 201 -191 -352 -171 143 -18 125 -73 147 -8 136 573
2165E73n41j20k9J88L6j30K25l35k52M58l4l7o7J86j44Q2K26j80p7J50M8m11L14
$$ 573 32 -88 -117 71 107 -23 202 -133 -385 73 39 2 -65 121 -23 59 285 105 28 178 226 -185 129
2188A29J18J10n17J39J19l1r7K38n4k51L32m67K29O8m5J85k26j33O4k4j0J57K01
$$ 129 247 357 -160 -21 98 67 -30 208 154 -97 235 -232 -3 65 20 205 -21 -154 -90 -114 -124 33 234
2211B34j99N4k7m33M58j08J19l0j15j58L34q3q0p4Q0j18J57K0r0k35L79j7N8k7
$$ 234 35 89 62 -371 87 -21 98 68 -47 -205 129 46 -34 -108 -28 -146 11 31 -59 -294 85 68 126 99
2235I9n9O6J29j67k51K39j14L4k25L12k5p1M7J04J5j26J51l14K27k00j0J64k0
$$ 99 40 106 235 68 -183 56 -58 -24 -249 63 38 -33 14 118 133 7 158 -156 71 -129 -139 25 5
2258EJ73m9j05QP9k50J40Jk8J55k29l0K23l68K01L44k34M7m3j1jO9jn7R4p0j83
$$ 5 178 129 24 32 111 -139 1 2 -26 129 -100 -130 93 -275 -74 270 36 83 40 29 28 97 96 39 133 63 -120
2285a20Q3j0j78K34J47m78J62K51j70P7M6N1K3p4j83K06n1J46k4J18p1q6P7k91
$$ -120 -37 -47 -225 9 156 -322 -160 91 -79 -2 44 95 118 44 -139 67 16 162 138 256 185 99 176 -115
2309a15qJ10j45J95Q0p9K97k83r5J97k77K90J00j22J94l64l4j1J36j20K94n18
$$ -115 -123 -13 -158 37 117 38 335 52 -43 154 -123 167 267 145 339 -25 -59 -70 66 -54 240 -278
2331b78J07K52q4J12l95L79q1l8j04K02K4k8J95j25m8j04P5O1j87J65Lk10K41
$$ -278 -171 81 -3 109 -286 93 12 -26 -130 72 96 68 263 138 90 -14 61 122 -65 100 103 -107 134
2354A34j74q3K12l03L11J80k20j30K42l2k56J93J46k12J91l3k35Nj26J46J13m6
$$ 134 -40 -123 89 -214 97 277 57 -73 169 137 -119 74 220 8 199 166 -69 -64 -190 -44 69 23
2376B3O7q4N0M7j71Q1k37J30K28k8j27L21r9r9rN6j91j76J88L4N6o7J53j65j06
$$ 23 90 6 56 103 -68 13 -224 -94 134 106 -21 300 201 102 93 149 -42 -218 -30 4 60 -7 146 -19 -125
2401a25K20j80O4j39M4L0k30L02k21J60K03q6J2k2J79j92R7l21jK94j57R2J4R5
$$ -125 95 -85 -21 -160 -116 -86 -316 -14 -235 -75 128 42 54 32 211 19 116 -205 -206 88 -69 23 37 132
2425A32o5k57j06J6K36o9K15J89k02r8j80Q0j03J74J48m9j08j94PL02j10P1q7
$$ 132 67 -190 -296 -280 -44 -113 102 291 89 -9 -189 -109 -212 -38 110 61 -47 -241 -234 68 -42 29 -58
2448e8o7m9J34k0r8J03l34N0L51K12k57J79l06J87j25K8J63j55R0J31k86q9L94
$$ -58 -125 -174 -40 -60 -158 -55 -389 -339 12 224 -33 146 -160 27 -98 -70 93 -62 28 159 -127 -216 178
2471A78k17J63K44m08K09j55k3p6M20k27j64K98l24J05q1J61l90K82M35r6k95
$$ 178 -39 124 368 -40 169 14 -9 -85 335 108 -56 242 -82 23 -58 103 -287 -5 430 334 39
2492C9j94J90K44j71j40Lk98L13k8J07J61k42R3k89L54k22J3p8LJ05j71K64J55
$$ 39 -155 35 279 108 -32 -29 -327 -14 -42 65 226 -16 77 -212 142 -80 -67 -145 -142 -37 -208 56 211
2515B11m15K89k59J56J31p0o9r2J61r5M56k25j88L09m07J17N4j4l24L05j93l6
$$ 211 -204 85 -174 -18 113 43 -26 -118 43 -52 404 179 -9 300 -107 10 64 50 -274 31 -162 -198
2537a98K56j63R5kj15L70k0J04l32J37r6o2j92O8J86o5L0k78J80M9j1M3k7j55
$$ -198 58 -105 -10 -12 -127 243 223 327 -5 132 36 -26 -218 -150 36 -29 1 -277 -97 -48 -59 -16 -43 -198
2561a98j0K03k5J35M2J44l78J65J6k66K48M7J24n34M42m00rL68j79j47K37j71
$$ -198 -208 -5 -30 105 147 291 -87 78 94 -172 76 123 247 -287 155 -245 -254 114 -65 -212 25 -146
2583a46N7k3n5L51j52l0J56k79j33M39j04j41J87k70O1j38P1K29k93jJ19J96k02
$$ -146 -89 -112 -167 184 32 2 158 -121 -254 185 81 -60 127 -143 -82 -220 -149 80 -213 -214 -95 101 -101
2606a01K75k66j12L14O0K0l92J68p6K6K86k11n5J67j33J12j1j38j11J68j43J43
$$ -101 174 -92 -204 110 170 190 -202 -34 -110 -84 202 -9 -64 103 -30 82 71 -67 -178 -10 -153 -10
2628a0J27l77M8J23k8M1J18n1J21k48Q1r9O7J73n3l23K79P4k00Q8j26R8o0K14
$$ -10 117 -260 -212 -89 -117 -76 42 -9 112 -136 -55 -154 -87 86 33 -290 -11 63 -137 -49 -175 -77 -137 77
2652G7N3j0j30pK44K63n74K23o9J11n4jl92O7L52M5n5R3r1m12RJ99J63Nr1j47
$$ 77 130 120 -10 -17 227 490 -84 139 70 181 127 126 -266 -199 153 198 143 236 145 -267 -258 -59 104 109 18 -129
2678a29K95j54J7k55K70j52N6M8r7j49K14k45K39J02l13K11k06M78l10K92l26
$$ -129 166 12 29 -226 44 -108 -52 -4 -101 -250 -36 -281 -42 60 -253 -42 -248 230 -80 212 -114
2699a14K07r6J01l23L60K39l45K87m85J72n9J10N0k10NP0J38l0J2m42M85l88k6
$$ -114 93 -3 98 -225 135 374 29 316 -169 3 -56 54 104 -106 -101 -31 107 77 89 -353 132 -256 -282
2722b82J95L56l50k29M22rpQ2l02J9P6k51K52J74k34K91j50L21n05O9k7nN0p0
$$ -282 -87 269 -81 -310 112 103 96 178 -124 -105 -29 -280 -28 146 -88 203 53 374 -131 -62 -89 -94 -44 -114
2746a14K57j85o7J68J1r0J87j70j06k6M44l68j19M94m02Q8k2k4L30k69l1J41l04
$$ -114 143 -42 -109 59 70 -20 167 -3 -109 -135 309 -59 -178 316 -86 2 -20 -44 286 17 -14 127 -177
2769a77L12l25k18L83M8n6R3j05Ml5n9o8J43J17o8o5J6J0J1n2L30k68j9K05j28
$$ -177 135 -190 -408 -25 23 -33 60 -45 -41 -76 -135 -203 -60 57 -11 -76 -60 -50 -39 -91 239 -29 -48 157 29
2794B9k7l02L04j31P3O0o2q5J83J06J07k37p4M9p4m3n5J06K43Jq5j82J91j30J05
$$ 29 2 -300 4 -127 -54 6 -56 -141 42 148 255 18 -56 -7 -81 -124 -179 -73 170 171 86 -96 95 -35 70
2819G0k44k1j21K81l7k2q5P3j32K4K89J44k06J91l27N8L17k13J11j68K8l62L46
$$ 70 -174 -195 -316 -35 -72 -94 -179 -106 -238 -214 75 219 13 204 -123 -65 252 39 150 -18 10 -352 -6
2842fo1K32k55K5j79q9K10N3o6J25L9J0L6j6L9P1n5j89J12j68K56q1K09k16r2
$$ -6 -67 165 -90 -65 -244 -333 -123 -70 -136 -11 28 38 74 58 97 168 113 -76 36 -132 124 43 252 36 -56
2867e6p1J76J4j50N6j22K25k51J88j21J19L4k2r6J38j18J21j32k59J94Q8l0K26
$$ -56 -127 49 63 -87 -31 -153 72 -179 9 -112 7 41 19 -77 61 -57 64 -68 -327 -133 -45 -75 151
2890A51l03J87J26k86J87j18or9J59J34k05l09L74KM4J22n9O8j19kk19R0n8K28
$$ 151 -152 35 161 -125 62 -56 -62 -161 -2 132 -73 -382 -8 -6 38 160 101 169 50 48 -171 -81 -139 89
2914H9k95L43j42P1j42J80j5j23J67qj98N0K05j40O7J55k02j18Q4j58L6J45n4
$$ 89 -206 137 -5 66 -76 104 89 -34 133 125 -73 -23 182 42 109 264 62 -56 28 -130 -94 51 -3
2937ck59O10n59L34k34J70J0r1l7NM09m18J4j11K81J83k5m25K85M2j64J35k47
$$ -3 -262 348 -211 123 -111 59 69 -22 -59 -54 355 -63 -49 -160 121 304 279 -146 139 181 17 152 -95
2960i5J51j43J96j03Q6o0K89l64K43R7j49P1k09PJ5j69K28P2j53q7J43k09O3L49
$$ -95 56 -87 109 6 92 32 321 -43 200 297 148 219 10 17 32 -137 91 163 10 -77 66 -143 -80 269
2984B69k84j43J75p3R6l4J56j92k5K76j42Lj33L6J51j0k38K55o9J04k39N7j82
$$ 269 -15 -158 17 -56 40 6 162 -30 -55 221 79 82 -51 -15 136 126 -112 143 74 178 -61 -4 -186
3007a86M18k17j95J52p9K26K67m92L39k38K47o36M11N1o7J25j05K54l20L4j76
$$ -186 232 15 -180 -28 -107 119 386 -106 233 -5 242 -394 17 68 1 126 21 275 -45 -11 -187
3028a87L3L32M3l7k88n4L14Oj6k03%K46j54P7j40j46j79J61K75j64j8MO3J01j56
$$ -187 -154 178 221 184 -104 -158 156 162 146 -57 -57 189 35 112 -28 -174 -353 -192 83 -81 -99 -95 -32 69 -87
3053h7K28j51N2j33j07J99J5j6j13O4J02J1J47q8k79K89r4l1N2l2j03J2O6J47
$$ -87 141 -10 42 -91 -198 1 16 0 -113 -49 53 64 211 123 -156 133 39 8 60 28 -75 -63 3 150
3077A50J4k49O1j31K1m2J48P7r1m1M16m29j0J17J47k51j24J97J15K2l11M7j42
$$ 150 164 -85 -24 -155 -134 -176 -28 49 -42 -83 333 -96 -106 11 158 -93 -217 -20 95 117 -194 -147 -289
3100b89L85l86K98q1L35j70k26Q3J89k57K66k34J12j3j69K04j3j76j65L90j59
$$ -289 96 -290 8 -73 262 92 -134 -51 138 -119 147 -87 25 12 -157 47 34 -142 -307 83 -76
3121g6J94j00j89J50j75M5N2Q6K13k33J65q4o5J16j00L12o39O10n25j15O03j63
$$ -76 118 18 -171 -21 -196 -151 -99 -13 200 -33 132 48 -17 99 -1 311 -328 282 -243 -358 245 82
3143H2pq9J1R1o5o2Q4k04L93n7l37L6L22J16l99m83N38j71J47Q7p1L7J78l9j52
$$ 82 75 -14 -3 88 23 -39 45 -159 234 177 -160 -124 198 314 -85 -568 -30 -201 -54 33 -38 -1 177 138 -14
3168a4J43k22J44j66j9L16K9j45k43L65j59m08O98l68K38j14nl24M25j63k39j29
$$ -14 129 -93 51 -115 -134 182 211 66 -177 188 29 -379 319 -49 189 75 70 -254 171 8 -231 -360
3190c60L99p6j10L2l2M20p9L1j94j99J50K27l6m12mK81l47K00L09k25p8Q4j61
$$ -360 39 -37 -147 -115 -147 273 194 225 31 -168 -18 209 173 -239 -243 38 -309 -109 200 -25 -103 -19 -180
3213a80J94j38L1R3K86k54J64R3m72L16J2p9k58R0K19r9O7J7K8l10J52K9n2M18
$$ -180 14 -124 -93 0 286 32 196 289 -183 133 145 66 -192 -102 117 18 85 102 130 -180 -28 1 -51 367
3237C67k69m0J65l33J1Q1j35J08j64N2J79j52M91m69q2K96K13l59p1Q8k61N39
$$ 367 98 58 223 -110 -99 -18 -153 -45 -209 -157 22 -130 361 -108 -190 106 319 -40 -111 -23 -284 255
3259B55k92j34N1J92k48L15M4j39j92J80j02K92m50K37j20K21j04K6o2p1LQ8J64
$$ 255 -37 -171 -120 72 -176 139 183 44 -148 32 -70 222 -228 9 -111 110 6 32 -30 -101 -98 -10 154
3282A54l76J34l9K25k94K58j17k9J70n9j21j4J82k42l9K05k8j05K29k07j43J22
$$ 154 -222 -88 -127 98 -196 62 -55 -84 86 27 -94 -108 74 -168 -207 -2 -30 -135 94 -113 -256 -134
3304a34K14j22J53q0K7K25m73K53n0j39N2J42l05J62%l7J70%l24Q6L27J6N5k39
$$ -134 80 -42 111 31 58 283 -190 63 13 -126 -74 68 -237 -75 -75 -112 58 58 -266 -180 147 163 218 -21
3328b1j74J83r6O5N4M0j21k1M1rJ91j71Q2M9n1j4j39K80j27j52J75p4j54N5j22
$$ -21 -195 -12 -108 -43 11 51 -70 -91 -50 -59 132 -39 43 92 41 27 -112 168 41 -111 64 -10 -164 -109 -231
3353b31Q8J51j11J4K90O4p9k08J8p7O3j2J89j53L03l13r5K2M14m71J56J43q4N4
$$ -231 -143 8 -103 -89 201 265 186 -22 -4 -81 -18 -30 159 6 309 -4 -99 -77 337 -134 22 165 81 135
3377A35r5K34k77k25J45o3j20J12J36J05m24N11j43k96N66o02O01l64J7J36k9
$$ 135 40 274 -3 -228 -83 -146 -266 -154 -18 87 -337 174 31 -265 301 -301 300 -64 -47 89 60
3398F0J69j10K24l65j20J34j51J24LQ7r0K2R0k08K14m6J49l19K92j63j12P5j07
$$ 60 229 119 343 -22 -142 -8 -159 -35 -32 55 -35 -13 77 -131 83 37 186 -133 159 -4 -116 -41 -148
3421a48N7j49M01j62j48K53K2n3k31L61m07J09P5J97j26j86J47q0J56ko6K70n38
$$ -148 -91 -240 161 -1 -149 104 126 73 -158 203 -204 -95 -20 177 51 -135 12 -68 88 86 20 290 -248
3444b48L39o3J6mj02J24L5k43m7K74j33k52M0j17L53l3l6O9RK03k82L31J02j46
$$ -248 91 28 44 40 -62 62 97 -146 -193 81 -52 -304 -264 -381 -28 -61 -97 -28 -19 184 -98 233 335 189
3468A89j89K16k01qm42M81Kj70K60j93K50O1l50K12j88Q6K79m16K80k16N8j16
$$ 189 0 216 15 7 -435 46 48 -122 138 -55 195 256 -94 118 -70 16 295 -121 159 -57 1 -115
3490a15j06L16m36M11Ql12L83O5k48r2k6l48N09R5J88j93L3j64j38M29l92J18
$$ -115 -221 95 -341 70 78 -234 149 214 -34 -126 -152 -500 9 104 292 99 132 -32 -170 259 -133 -15
3512a5Q1J32j88J2oP2j99j33K38n7l9K43j81p6L4J16J60j59K2k04p3L66L1o2j49
$$ -15 66 198 10 22 16 88 -111 -244 -6 -63 -102 141 -40 -116 -82 34 194 35 57 -147 -220 146 177 115 -34
3537c4k5l9K22m26M39j20P5j8J44m46K67M8k75L22jK65m98k2L67m46j2p4J78K07
$$ -34 -59 -98 124 -302 137 17 92 74 218 -228 39 87 -188 134 133 398 -100 -122 245 -201 -213 -287 -109 98
3561I8K5k59k39J73J24M5n5q0L0J70k33J78k14M9J22O1L4Q5o3K16k34k4j83k75
$$ 98 123 -136 -375 -202 -78 -33 -88 -168 -138 32 -201 -23 -237 -188 -66 -5 29 114 51 267 33 9 -174 -449
3585d49Q7L07M5r2q4J79j81J26K27o6Op7N0l0j16J02j34RL14Kj45k98M4K6R6j11
$$ -449 -362 -55 -10 -102 -186 -7 -188 -62 165 99 105 28 78 48 -68 34 -100 -91 223 225 80 -218 -174 -148 -52 -163
3611a63J02R3j04J1l2j8R9K47k41l84N46l58J86r3J63k0J14j93p6R1N5J59r6r1
$$ -163 -61 32 -72 -61 -93 -111 -12 235 -6 -390 156 -202 -16 -109 54 34 148 -45 -121 -30 25 184 88 -3
3635cM7k6k08K45r0K44k10j51P6L29m6j12j03l1K2j06P9R8J54o4m40L56k0j43
$$ -3 44 18 -190 55 -35 209 -1 -152 -76 253 207 95 -8 -39 -17 -123 -44 54 208 144 -296 60 40 -103
3659a03J23j3M5k12K94m48M68j28nk08L16p9k52J92L8P1K05j89k70J63m7k41K59
$$ -103 20 7 52 -160 134 -314 154 26 21 -187 129 50 -202 -10 28 99 304 115 -155 8 -39 -280 -21
3682b1J03k23K12O7L90n65K47q1j74J16J08q8j14J16R2o6l75L8J67l2J10k8K12
$$ -21 82 -141 71 138 528 -37 210 129 -45 71 179 91 -23 93 185 119 -256 -218 -51 -83 27 -1 211
3705B11k45O4m3j0J42l30L88k23J18j41K97m66j7m5N17m51J71Q3M7J1k94M96m08
$$ 211 -34 30 -13 -23 119 -211 177 -46 72 -69 228 -238 -255 -300 217 -234 -63 20 67 78 -216 280 -128
3728a28L16L04k00l17o2K27j01j20K13j08k3P2l4o5J47J02j70n1j21K82o4n24
$$ -128 188 492 292 -25 -87 140 39 -81 132 24 1 73 39 -26 121 223 53 2 -119 163 99 -425
3750d25M46r8J4J79J75l71nJ69r2J56l04K42j69J24m8j98K03j66k88N51k30K97
$$ -425 21 -77 -63 116 291 -80 -85 84 -8 148 -156 86 -83 41 -7 -205 -2 -168 -456 95 -135 162
3772A62j60Q4J45k89J55J99l01J51Q1l7q4l17K68M7j04Oj83J32J30J8m1j10Qj43
$$ 162 2 86 231 -58 97 296 -5 146 227 190 106 -211 57 104 0 6 -177 -45 85 103 62 -48 -40 -183
3796a83J46j4n8O8l32O01k01J78K2l88K18M5N6n7n41M32o7k09L82j36K55k09J19
$$ -183 -37 -51 -109 -41 -373 228 27 205 227 -161 57 102 158 101 -440 -8 -75 -284 98 -38 217 8 127
3819A27m06N11k60p0M50m98J05M8j17Q1k65O0J29J66j57o1K01R0j50L9j73K37
$$ 127 -279 232 -28 -98 352 -146 -41 7 -110 -29 -294 -234 -105 61 -96 -157 44 134 -16 23 -150 87
3841H7k21J08K10j62J04k44K46k48q0K83K38j62k20Ml5m4J55J63k98K90j57j0
$$ 87 -134 -26 184 22 126 -118 128 -120 -200 83 321 159 -61 -57 -92 -136 19 182 -116 174 17 7
3863Gp3k39J92J89j54J78L9j37K86m23j11M2L4Q1L4P7r6m2J13j78M79k95J0m2
$$ 7 -66 -305 -113 76 -78 100 139 2 288 -135 -246 -204 -170 -89 -55 22 -74 -116 -3 -181 298 3 13 -29
3887b9k06L09j18r0K73l21J11J17N8j59J69j46j27J01j80K80j54P2K61r2m7J01
$$ -29 -235 74 -44 -134 139 -182 -71 46 104 -55 114 -32 -159 -58 -238 42 -112 -40 221 129 82 183
3909A83l27J12K18k40p6J86j24P6J40p2r6J40J5k6P6k21R9j68p0J62q4K30j46
$$ 183 -144 -32 186 -54 -130 56 -68 8 148 76 -20 120 135 109 185 -36 63 -105 -175 -13 -97 133 -13
3932a3J13l5P6k09K20l97JL85k01K5J57n8l8N9l05R4j25K1L26m8o6j4n8J30K73
$$ -13 100 65 141 -68 152 -245 -244 141 -60 -35 122 64 26 85 -220 -126 -251 -230 96 48 -18 -32 -90 40 313
3957C13l67k4o3K33J62m23nr0L89l9l75J80L69j28k58K62k84K37j32J50l42K62
$$ 313 -54 -78 -141 92 254 -169 -174 -264 125 86 -289 -109 260 132 -126 136 -148 89 -43 107 -235 27
3979B7j26N3j54K64j18J36l65j15O65j20n9K35m40K80l69M86l34j03N40k81L1
$$ 27 -99 -46 -200 64 -54 82 -283 -398 267 147 88 323 -117 163 -206 280 -54 -157 383 102 133
4000A33J36m45q3K61j37N72m33j2J64j73J9K35l83Q8Q8J44j26qj64K13k1M86l97
$$ 133 269 -176 -259 2 -135 437 4 -8 156 -17 2 237 -146 -58 30 174 48 40 -124 89 68 554 157
4023A57q5k10K82l60L91l00P9j4K7k79K3K79m4L28k95j02K6m2K53k14J03J11J11
$$ 157 72 -138 144 -216 175 -125 -46 -60 -33 -312 -289 -10 -54 274 -21 -123 -97 -139 114 -100 3 114 225
4046B25J48l88R4k30K36j0j17ro2J09Nn7J56k10L52l90M01l24L47j23J7m44M64
$$ 225 373 -15 79 -151 85 75 -42 -51 -113 -4 1 -56 100 -110 242 -148 253 -71 276 153 170 -274 190
4069A90j34N2j33r1L75l98M70k01m39K00j76J06K37k90J43j26K09J26l7l50K02
$$ 190 56 108 -25 -116 259 -139 331 130 -309 -109 -285 -179 58 -232 -89 -215 -6 120 83 -267 -65
4090f5J75K8l7k13K40l2j29J78p4j09q5P1K2J42kk05P7K33k91J65k2j66M6J69
$$ -65 110 138 101 -112 128 96 -33 145 71 -38 -123 -52 -30 112 110 -95 -18 215 -76 89 67 -99 -53 116
4114A16j53K3r0o5L01r7J15k01L1k74L11j11n2q3m9P1K97j66n4j62L46j12J57
$$ 116 -37 -14 -104 -169 132 35 150 -51 -20 -294 17 -94 -146 -229 -278 -207 90 -76 -130 -292 54 -58 99
4137I9kL5j17j00L78k96M3N7j70L48j46m8Q5r9k60J10j54K86k96N61l99j07K56
$$ 99 97 132 15 -85 293 -3 40 97 -73 275 129 81 166 67 -193 -83 -237 49 -247 314 -85 -192 64
4160F4j40K23l09K26j08k8L3K9J2J10k7j01m4k18K50L8k10J29%K76m22K43R9J20
$$ 64 -76 147 -162 64 -44 -72 -39 -10 2 112 85 -16 -60 -278 -28 10 -200 -71 -71 205 -217 26 125 245
4184B45j61Kk11K02j9K02r2l71J59M06p31K67K91k33L85j00m5q5j37l2p4K05l
$$ 245 84 86 -125 77 58 260 168 -203 -44 362 -369 -102 189 -44 341 241 196 111 -26 -58 -132 73 70
4207G0J6K92l08m1l5J58j49m0K75j67l67N00j73J7n9J3M6o3j43j1L40m15J39J32
$$ 70 86 378 70 29 -6 152 3 -37 238 71 -296 204 31 48 -11 2 48 -15 -158 -169 171 -244 -105 27
4231B7R7q3R8o7k00K41l10J26LJ14O6j16j04J81j00m9K59j5J22k52p6K35M2m82
$$ 27 124 41 139 72 -128 113 -197 -71 -68 46 112 -4 -108 73 -27 -76 183 168 290 38 -38 197 239 -243
4255b43K31J18j86N3J9j54M7K25N0k34J54j11J88m6o32O51Q4j61j22L94n7k52
$$ -243 -12 106 -80 -27 -8 -162 -115 110 160 -74 80 -31 157 111 -521 130 214 53 -69 325 268 16
4277A6m08K30n0L33m23O1O5o0J35J4J99l2K71o24L97m48K32K87j98k3j70M98l77
$$ 16 -392 -162 -212 121 -302 -241 -176 -236 -101 -87 112 80 351 -273 124 -324 -92 195 -3 -26 -196 302 -75
4300g5L48l50p3L12%k73M40k55L9J3J40j37q1lj23M52k56o6R9j41pk9r8K18m6
$$ -75 273 -77 -150 162 162 -111 329 74 113 126 266 129 48 45 -78 374 118 52 151 10 3 -26 -124 94 48
4325D8R6p7j2j90J97k60K50l58N17k36q0o6K24K81n81L11l24K99j14K07N0n4L2
$$ 48 144 67 55 -135 62 -198 52 -306 211 -25 -105 -171 53 334 -247 64 -260 39 -75 132 182 128 160
4348A60j14j19k9L12j87J57l68K98m18K25L47l42K23l22M20m92P8k03L09j18K25
$$ 160 46 -73 -102 210 23 180 -188 110 -308 -83 264 -78 145 -177 243 -249 -171 -374 -65 -183 42
4369D2R4q9J82j62j58n1J75p7K70n76M45m04M86nk23k53OK04M9P5n5J62k17K34
$$ 42 136 47 229 67 -91 -142 33 -44 226 -350 95 -309 177 172 -51 -304 -298 -94 -45 30 -25 137 -80 154
4393A54l06O1j58K07J12j8k28N39j87o8l12J57j96K74j82K49o5j34L69l30q7j65
$$ 154 -152 -91 -249 -42 70 52 -176 363 176 108 -204 -47 -243 31 -151 98 33 -101 268 -62 -149 -314
4415c14qK25J47N9p5m1J94j21K8j94L11l59J81K65m04l3k5K0J88j60K54j65j16
$$ -314 -322 -97 50 109 34 -7 187 66 94 -100 211 -148 33 298 -106 -139 -164 -144 44 -116 138 -27 -143
4438a43J8J86j72j36L40n6k1p6J24k88J77P3J68k63QL6J27l7p4J8P%k27J00J0
$$ -143 -125 61 -111 -247 93 37 16 -60 64 -224 -47 26 194 -69 -61 -25 102 65 -9 9 16 16 -211 -111 -101
4463a01R2J55m44M50o6R6j71j74p0K13L41m14J84l00M06l72J41q9L21r9q9R5j40
$$ -101 -9 146 -298 152 86 182 11 -163 -233 -20 321 -93 91 -209 197 -175 -34 -123 198 99 10 105 -35
$$ [...]
8191H4
##END NTUPLES=NMR FID
##END=
