##TITLE=1H_IG-G394fr2
 200.13MHz,CDCl3,
 8 sc
 
 1.11.2025
##JCAMPDX= 6.0         $$ Bruker NMR JCAMP-DX V2.0
##DATA TYPE= NMR FID
##DATA CLASS= NTUPLES
##ORIGIN= UXNMR, Bruker Analytische Messtechnik GmbH
##OWNER= pz
$$ XWIN-NMR		Version 3.5
$$ Sat Nov  1 14:22:07 2025 Russian Standard Time (UT+4h)  she@DPX200
##.OBSERVE FREQUENCY= 200.1313
##.OBSERVE NUCLEUS= ^1H
##.DELAY= (6, 6)
##.ACQUISITION MODE= SIMULTANEOUS
##.ACQUISITION SCHEME= undefined
##.AVERAGES= 8
##.DIGITISER RES= 18
##SPECTROMETER/DATA SYSTEM= spect
##.PULSE SEQUENCE= zg30
##.SOLVENT NAME= CDCl3
##.SHIFT REFERENCE= (INTERNAL, CDCl3, 0, 14.3821)
##AUDIT TRAIL= $$ (NUMBER, WHEN, WHO, WHERE, WHAT)
$$ ##TITLE= Audit trail, XWIN-NMR		Version 3.5
$$ ##JCAMPDX= 5.01
$$ ##ORIGIN= Bruker BioSpin GmbH
$$ ##OWNER= she
$$ F:/spectra/data/she/nmr/H-C/1/audita.txt
$$ ##AUDIT TRAIL=  $$ (NUMBER, WHEN, WHO, WHERE, WHAT)
(   1,<2025-11-01 14:20:36.07 +0400>,<she>,<DPX200>,
      <created by zg, POWCHK disabled, PULCHK disabled
       configuration hash MD5:
       00 E9 B6 7A A2 85 ED C7 34 08 36 98 17 FE 4E 26
       data hash MD5: 16K
       2A 80 E4 19 68 F9 4E A5 82 70 D4 94 A8 D5 B1 9F>)
$$ ##END=
$$ 
$$ hash MD5
$$ A9 55 7C D5 56 8C 3A FB 40 80 12 F5 7B 53 C8 91
##$RELAX= 
##$RELAX= 
##$RELAX= 
##$RELAX= 
##$RELAX= 
##$RELAX= 
$$ Bruker specific parameters
$$ --------------------------
##$DU= <F:/spectra>
##$EXPNO= 1
##$NAME= <H-C>
##$PROCNO= 1
##$TYPE= <nmr>
##$USER= <she>
##$AMP= (0..31)
100 100 100 100 100 100 100 100 100 100 100 100 100 100 100 100 100 100 
100 100 100 100 100 100 100 100 100 100 100 100 100 100 
##$AQSEQ= 0
##$AQ_mod= 1
##$AUNM= <au_zg>
##$AUTOPOS= <>
##$BF1= 200.13
##$BF2= 200.13
##$BF3= 200.13
##$BF4= 200.13
##$BF5= 200.13
##$BF6= 200.13
##$BF7= 200.13
##$BF8= 200.13
##$BYTORDA= 1
##$CFDGTYP= 0
##$CFRGTYP= 5
##$CHEMSTR= <none>
##$CNST= (0..31)
1 1 145 1 1 1 1 1 1 1 1 1 1 1 1 1 1 1 1 1 1 1 1 1 1 1 1 1 1 1 1 1 
##$CPDPRG= <>
##$CPDPRG1= <>
##$CPDPRG2= <>
##$CPDPRG3= <>
##$CPDPRG4= <mlev>
##$CPDPRG5= <mlev>
##$CPDPRG6= <mlev>
##$CPDPRG7= <mlev>
##$CPDPRG8= <mlev>
##$CPDPRGB= <>
##$CPDPRGT= <>
##$D= (0..31)
0 0.7 0 0 0 0 0 0 0 0 0 0.03 0 0 0 0 0 0 0 0 0 0 0 0 0 0 0 0 0 0 0 0 
##$DATE= 1761992435
##$DBL= (0..7)
120 120 120 120 120 120 120 120 
##$DBP= (0..7)
150 150 150 150 150 150 150 150 
##$DBP07= 0
##$DBPNAM0= <>
##$DBPNAM1= <>
##$DBPNAM2= <>
##$DBPNAM3= <>
##$DBPNAM4= <>
##$DBPNAM5= <>
##$DBPNAM6= <>
##$DBPNAM7= <>
##$DBPOAL= (0..7)
0.5 0.5 0.5 0.5 0.5 0.5 0.5 0.5 
##$DBPOFFS= (0..7)
0 0 0 0 0 0 0 0 
##$DE= 6
##$DECBNUC= <off>
##$DECIM= 32
##$DECNUC= <off>
##$DECSTAT= 4
##$DIGMOD= 1
##$DIGTYP= 9
##$DL= (0..7)
0 120 120 120 120 120 120 120 
##$DP= (0..7)
150 150 150 150 150 150 150 150 
##$DP07= 0
##$DPNAME0= <>
##$DPNAME1= <>
##$DPNAME2= <>
##$DPNAME3= <>
##$DPNAME4= <>
##$DPNAME5= <>
##$DPNAME6= <>
##$DPNAME7= <>
##$DPOAL= (0..7)
0.5 0.5 0.5 0.5 0.5 0.5 0.5 0.5 
##$DPOFFS= (0..7)
0 0 0 0 0 0 0 0 
##$DQDMODE= 0
##$DR= 18
##$DS= 0
##$DSLIST= <SSSSSSSSSSSSSSS>
$$ [...]
##$SUBNAM0= <"">
##$SUBNAM1= <"">
##$SUBNAM2= <"">
##$SUBNAM3= <"">
##$SUBNAM4= <"">
##$SUBNAM5= <"">
##$SUBNAM6= <"">
##$SUBNAM7= <"">
##$SUBNAM8= <"">
##$SUBNAM9= <"">
##$SW= 18.0517328524113
##$SWIBOX= (0..15)
0 0 2 0 0 0 0 0 0 0 0 0 0 0 0 0 
##$SW_h= 3612.71676300578
##$TD= 16384
##$TD0= 1
##$TE= 0
##$TE2= 300
##$TE3= 300
##$TEG= 300
##$TL= (0..7)
0 120 120 120 120 120 120 120 
##$TP= (0..7)
150 150 150 150 150 150 150 150 
##$TP07= 0
##$TPNAME0= <>
##$TPNAME1= <>
##$TPNAME2= <>
##$TPNAME3= <>
##$TPNAME4= <>
##$TPNAME5= <>
##$TPNAME6= <>
##$TPNAME7= <>
##$TPOAL= (0..7)
0.5 0.5 0.5 0.5 0.5 0.5 0.5 0.5 
##$TPOFFS= (0..7)
0 0 0 0 0 0 0 0 
##$TUNHIN= 0
##$TUNHOUT= 0
##$TUNXOUT= 0
##$USERA1= <user>
##$USERA2= <user>
##$USERA3= <user>
##$USERA4= <user>
##$USERA5= <user>
##$V9= 5
##$VALIST= <valist>
##$VCLIST= <CCCCCCCCCCCCCCC>
##$VD= 0
##$VDLIST= <DDDDDDDDDDDDDDD>
##$VPLIST= <PPPPPPPPPPPPPPP>
##$VTLIST= <TTTTTTTTTTTTTTT>
##$WBST= 1024
##$WBSW= 4
##$XGAIN= (0..3)
0 0 0 0 
##$XL= 0
##$YL= 0
##$YMAX_a= 45929
##$YMIN_a= -44085
##$ZGOPTNS= <>
##$ZL1= 120
##$ZL2= 120
##$ZL3= 120
##$ZL4= 120
##$ABSF1= 10
##$ABSF2= 0
##$ABSG= 5
##$ABSL= 3
##$ALPHA= 0
##$AQORDER= 0
##$ASSFAC= 0
##$ASSFACI= 0
##$ASSFACX= 0
##$ASSWID= 0
##$AUNMP= <proc_1d>
##$AZFE= 0.1
##$AZFW= 0.1
##$BCFW= 1
##$BC_mod= 2
##$BYTORDP= 1
##$COROFFS= 0
##$CY= -3
##$DATMOD= 1
##$DC= 2
##$DFILT= <>
##$DTYPP= 0
##$F1P= 0
##$F2P= 0
##$FCOR= 0.5
##$FTSIZE= 0
##$FT_mod= 4
##$GAMMA= 1
##$GB= 0.15
##$INTBC= 1
##$INTSCL= 1
##$ISEN= 128
##$LB= 0.25
##$LEV0= 0
##$LPBIN= 0
##$MAXI= 10000
##$MC2= 0
##$MEAN= 0
##$ME_mod= 0
##$MI= 1.114404
##$NCOEF= 0
##$NC_proc= 0
##$NLEV= 6
##$NOISF1= 3.799351
##$NOISF2= 2.8
##$NSP= 1
##$NTH_PI= 0
##$NZP= 0
##$OFFSET= 14.38212
##$PC= 1
##$PHC0= -2624.801
##$PHC1= 7.992352
##$PH_mod= 1
##$PKNL= yes
##$PPARMOD= 0
##$PSCAL= 0
##$PSIGN= 0
##$REVERSE= no
##$SF= 200.129724274929
##$SI= 16384
##$SIGF1= 3
##$SIGF2= 2
##$SINO= 400
##$SIOLD= 16384
##$SREGLST= <1H.CDCl3>
##$SSB= 0
##$STSI= 0
##$STSR= 0
##$SW_p= 3205.1282051282
##$SYMM= 0
##$S_DEV= 0
##$TDeff= 0
##$TDoff= 0
##$TI= <>
##$TILT= no
##$TM1= 0
##$TM2= 0
##$TOPLEV= 0
##$USERP1= <user>
##$USERP2= <user>
##$USERP3= <user>
##$USERP4= <user>
##$USERP5= <user>
##$WDW= 1
##$XDIM= 8192
##$YMAX_p= 0
##$YMIN_p= 0
$$ End of Bruker specific parameters
$$ ---------------------------------
##NTUPLES= NMR FID
##VAR_NAME=  TIME,          FID/REAL,        FID/IMAG
##SYMBOL=    X,             R,               I
##VAR_TYPE=  INDEPENDENT,   DEPENDENT,       DEPENDENT
##VAR_FORM=  AFFN,          ASDF,            ASDF
##VAR_DIM=   8192,          8192,            8192
##UNITS=     SECONDS,       ARBITRARY UNITS, ARBITRARY UNITS
##FACTOR=    0.0002768,     1,               1
##FIRST=     0,             0,               0
##LAST=      2.2672688,     0,               0
##MIN=       0,             -44085,          0
##MAX=       2.2672688,     45929,           0
$$ Real data points
##PAGE= N=1
##DATA TABLE= (X++(R..R)), XYDATA
$$ [...]
1583@j61R1l4J30j49J79j96M4Q4J13J50k97J70j77m0m1J69j23K6m1K05j13j09
1606a20L10j60k31K73Lpl1j35J25k4K52k45R1J31k82J85j82K5J76l49L31k71q5
1629b20J95p8J06L3r2j11K52n9j53o7J09k8m0K00J03j24J48m35J89N4L5n2K44
1652B09k38J57k50L5O0Q7Pr9Q7m0j3N6K3j73o1J30K82l29n1J31k53N0n3L71l99
1677b74K30Pk37J09K27q9Q4K66r8k41M0l1j30K91k3j31O2n0r9L4o3N0k3J36j34
1702h7L6L0q1j4M66n27L41k21L2o7Q9K1k35K48j71L3o5K55o7l5J5K7k35J78r2
1727a26J23OJ62k24N0Q5k73L41k94K74j56j2m6J34n5k2o6NJ44q0Q4p8J81k41K07
1752A23j10l8L22j89r9J66j04j45Q4q3J17j02N1J7j41K08m8l6l8J32j10j3K28
$$ y = [0, -161, -70, -104, 26, -123, 56, -140, -96, -12, 101, 251, -46, 124, -53, -93, -134, 35, -88, -62, -103, 102, -11, -120, 190, 30, -201, 72, 75, 68, 37, -98, 27, 3, 255, 10, 101, 232, -50, 135, -47, -22, 154, -195, 136, -135, -220, -25, -103, 3, 36, -56, -167, 85, 26, -127, -194, -85, -113, -153, 47, 150, 26, 174, -261, -72, -18, 17, -35, 209, -29, 128, -122, -87, -27, 60, 67, -32, 55, 15, 2, 58, 81, -92, -153, -23, 259, -70, -121, 10, -243, -193, -246, 125, -274, -44, -37, -274, -165, 62, -27, 57, 323, 225, -16, 24, -7, -137, 154, 131, 0, 62, 12, -87, -53, -116, -66, -89, 47, -87, -51, -21, -102, -116, 350, -177, 164, -57, -25, -92, -3, 18, -217, 31, -140, -107, -172, 83, 16, -19, -4, 23, -212, -34, -126, -3, 3, 165, -59, -9, 76, -197, 144, -150, 124, -32, -44, -90, 44, -11, -33, -99, -94, 50, -30, 54, -24, 157, -84, 123, 13, -25, 297, 108, 9, 175, 71, -74, 10, -73, 44, -58, -7, 10, -131, 77, 29, -7, -45, 87, -23, -36, 192]
1775A92k13K03k39Q2k24K79jj22J0K6q6k5J02J64j76J25M2j26j66J40J4M7Nn5
1799bj94J46k2m5J12Q1n1n4J11j02J5n8Q8Q3j15%qR3l5j77nJ91M8j58N3J46j16
1826B5q1J23k36R0J35k2pq0RJ63k56M1p8L49l8k58K13k11K34J2J19k11J04n1k85
1851a97K98j93M7j22K90J2r0k37M4J92J9R4j9j15j24J05N1J19m05J03J21j31M
1874a34PK58J5l65M2R4n6OK05n1j40P3J82k28R4l9k86M24M1k65q1L58j17l8J65
1899A64k95j8J61k48K43N5k12J87j1P3j05l42J70Q6J90j53N7k28L08M2j72o6r
1922a23P1J89j21k4N3j00J67j87Q7L3j13K67k30k1m2O3J71j66J46k12K43n4k40
1945a43K4K52o3n0j46J85L4j19O9K1j79P6J40n8j7m9J94L1l12l5K46k10J26k02
$$ y = [192, -21, 182, -57, 25, -199, 80, 79, -43, -33, -7, -93, -118, -16, 148, -28, 97, 139, 13, -153, -13, 1, 48, 53, -2, -196, -50, -72, -117, -5, 76, 25, -29, 82, -20, -5, -63, 25, 108, -7, -7, -15, 78, 43, -134, -139, 52, 100, -58, -5, 141, 25, -56, 67, -169, -79, 56, 34, 27, -53, -44, 119, -137, -96, -174, 175, 137, -121, 92, -119, 115, 127, 246, 35, 139, 88, -197, 101, -92, -45, -167, 123, 135, 45, -192, -148, 44, 63, 157, 138, 23, -101, 4, 55, 174, -231, -128, -7, -138, -134, -127, 131, 146, -219, -177, -83, -139, -133, 72, 21, -119, -46, 136, -92, 2, -37, -323, 101, 142, -123, -204, 154, 37, -1, 164, -131, -149, 12, -236, 7, 62, -150, 37, 26, 99, -6, -348, -178, -92, 98, -55, 2, -226, 82, 124, -48, -114, -123, -52, 137, 16, -8, 45, -55, 112, -75, 12, 45, -68, 199, -31, -52, -94, -31, 140, -26, 120, -92, 151, 97, -143, -119, 133, 70, 20, -126, 59, 93, -26, 43, 64, -115, -39, 101, 43, 26, -23, 171, 202, -110, -145, 101, -109, 17, -185]
1969a85K08J6k32L96k32K9lj8k01K83j89po2K69k79L98l0k72J36k5j8o4J62j96
1993a16J07M6j20J43j8J16o3j00J68L8q1O6l25Q4L8j1k6K25j06q2q7J36O9r4J09
2018A16j0J65l34K8r0p6J53J21q7j64K04J6k5j04nQ3N5l1j33K89l37J3Q5J68j97
2043i7J29O7j27OQ6J6o5L8p2R3k5K57k16l7j97r2J56J67l8j29p2L29k78P6N3q9
2069f1M0j41R0J27J68n27M34j14L0P7j59J66k36J57m2J01j30j04K50k04J50J98
2091B70k37j50J39J63j13J22j03P0j49O9j35j4Q1K63l40Q9J0o2nj87J87K07k47
2114g2J48k4j45K62o8j61o5R5n4J28l1P5k11K65j01qnN0j91k3j2J05J7L27j78
2139A23L2k51K61p6k10J84k15K10l7J66k66oL73k45q0O4lJ6J19k35QJ84j01K6
$$ y = [-185, 23, 39, -193, 203, -29, 0, -3, -21, -222, 61, -128, -135, -197, 72, -207, 191, 161, -111, 25, 0, -18, -82, 80, -116, -9, 37, -83, 60, 42, 158, 95, -5, 163, 201, 120, 186, -139, -55, -17, -28, -54, 171, 65, -17, -104, 32, 101, 7, 116, 106, 271, -63, -35, -125, -201, -48, 73, -14, -178, 26, 42, 17, -87, -92, -9, 46, 15, -118, 171, -166, -153, -68, 100, -97, 32, 99, -28, -22, 64, 80, 15, 53, -19, 74, 49, 306, 90, 53, -144, -236, -80, 87, 49, -80, -152, 177, -101, -25, 28, -61, -21, -162, -72, 55, 223, -304, 130, 16, 46, 123, -36, 130, -106, 51, 9, 110, -20, -124, 126, -78, 72, 270, 33, -117, 22, 185, 72, 194, 91, 161, 12, 81, -54, -68, 13, 276, -64, 25, 35, -27, -32, -219, -32, 175, -72, 76, 52, -93, 169, 101, -60, -125, -30, -84, 44, 13, 88, -123, 142, 41, 33, 28, 78, -113, -136, -148, -43, -26, 301, 123, 155, -96, 165, 89, -121, 63, -152, 58, 21, 187, -79, -85, 288, 43, -37, 27, 24, 40, 159, -76, -68, 116, 15, 41]
2163D1J21j27r5j09J61J41J1k48K38j10r1J58o8M5K4q4J39J9k16R7j36K2j24L38
2187A47l33N2K29N7k0%k63R0m2J7j04K49j30l8J39J05Qk50J2P4j19j3L29k54q5
2212a43J27K8l8o0M2J49k21P1J78q5L9R5l58R6N7N0k11K43j5k10K75j96K38j3
2236A38m3J35l52K14k10J07J12n1j75J93j6o4O4K4j85K9J10J8n1J33j13p7J79
2259A19j58p7j28M30j67k1J22j51O9j9l34J86l1R7K18j25J0r9N4J50j76M5L3N
2283E2%j77L03l06N9O9J34k43K0P1j5j45K25m1n8q7J50j7o1j5L0o4K32k79K72
2308A09j34J06k29J22q0L37k18j77N0J62l16R4k5K62o2o2J23q8m6L0o3K57j08
2331D4J19j04k17K03k9j58K1J5J63j3k14J83M4o0M7kk72K67M8rj47O6j8J68j97
$$ y = [41, 162, 35, -60, -169, -8, 133, 144, -104, 134, 24, -67, 91, 23, 68, 92, 8, 147, 166, -50, 47, -89, -67, -191, 147, -186, -134, 95, 152, 132, 132, -131, -41, -83, -66, -170, 79, -51, -89, 50, 155, 163, -87, -75, -1, -120, -133, 196, -58, -143, -16, 12, -26, -86, -44, 105, -116, -45, 133, 48, 87, 182, -176, -80, -23, 27, -184, 59, 44, -166, 109, -87, 151, 138, 95, 230, -122, 92, -118, -11, 101, 50, -125, 68, 52, -12, 52, 76, -109, -80, 30, 48, -3, 130, 17, -60, 119, -39, -116, -244, 186, 19, -2, 120, -31, 38, 19, -315, -129, -160, -63, 155, 30, 40, -59, -5, 145, -31, 14, 47, 52, 52, -125, 178, -128, -69, 0, 134, -109, -89, -18, -33, -178, 47, 6, -52, -139, 11, -6, -67, -82, -52, -116, 116, -163, 109, -25, 81, -148, -26, -106, 231, 13, -164, -114, 48, -268, -174, -199, 63, 1, -61, 62, -26, -72, -42, -105, 152, 44, 163, 59, -158, 45, 16, -142, -121, -106, 57, 44, -170, 13, 57, -3, 44, 42, -230, 37, 85, 76, -71, -5, -23, 145, -52]
2356e2n8J72j40O8L0r0M3L2K04k30k25K24J01j34J91J39j57R6r7k03k0K02k77
2379a81P8r7k9J20N5j0N7o3j9J45j06j17P2J24RJ2j44q7J30J57p3K2M5j34J7J76
2405A59m0j42NJ40k62J41k2K55j33j67r6Q8P5K40m01K80NJ34l92J62j6k15L16
2428A14k3k93K33j85K89j86j9o8K0P2j68J04L21l63j07M21j49N6K3j55M5J02q
2451G6P9j30P5k74L78l52J17J4j28j50N2K18n8j16K60J37j55j33j0M8qJ05j56
2474a11K5M4K49l11J72j20J19j8p5o6j7J02j30J74Nj44QJ42o8M3Q6j28R3j43O6
2499cO8j52K77m57O1L23nj35r9J68j27Q9pP4R6j50k13J04J45m8RPO7k16J22M6
2525D4pk1MN3J25r2k31J18j85Q2k5J11J21j16R3r0M4K2P1r5k32L97j01l99K05
$$ y = [-52, -110, 62, -78, -10, 20, -70, -27, 5, 209, -21, -246, -22, 79, -55, 136, 275, 118, 214, 117, -86, -106, 96, -181, -103, -200, -229, -109, -54, -64, -7, -70, -89, 56, -50, -167, -95, 29, 38, 50, -94, -181, -51, 106, 33, 55, 100, -34, -17, 159, 119, -23, -18, 122, -140, 1, -21, 234, 101, -66, -162, -74, 1, 241, -160, 120, 125, 259, -133, 29, 13, -202, 114, 91, -202, 31, -154, 135, -51, -70, -138, -118, -46, -214, -110, 211, -152, -259, 162, 13, 69, 92, -63, -18, 84, 76, 155, 25, 100, -174, 204, -148, -31, -17, -145, -295, -243, -25, -83, -199, 61, 198, 43, -90, -100, -52, -60, 45, -111, -86, -42, 207, -104, 68, -52, 67, 49, -26, -92, -109, -7, -137, 37, 42, -102, -94, 48, -20, 23, 109, -19, 74, -69, -3, 65, -87, 190, -267, -206, 117, 112, -23, -122, 46, -81, 8, 1, 75, 171, 21, -192, -88, 57, 9, 18, 25, 92, -124, -2, 44, 37, 16, 20, 73, 198, 106, -125, -7, -192, -110, -135, -24, 97, -19, 74, -16, 28, 50, 121, 26, -206, 191, 90, -309, -104]
2550a04R2j24J68J17J38j53j53Qk11O7J33k7J10j89J57j57N3k09M35J32l49N1
2572a5JK87k7k84N6j57J94K44k77k8M0L26l13NJ63k22j02L03k68k6M3L6J16N4
2596A49k01J42j38K1j71J67J66j4k62R2M5K53k23M0P9Pj02j28J92j56J24l2J72
2619B22l4j11j61k7J07J17p6j01J50j09OJ15N7j18R4l01K02k25L61j41p0J09K0
2642H6oj2l60K22J72k0K4l43J45K64l82J68N9r8l9L2L20k35q3j16K52j82J50j09
2666i1Q0K4MK1j09j9J11q6J14j00J03L5j02J60p1o2k10L14o0P0j35j40J08J61
2690A20k32K6K2N2R6N8J44k05o6P1J41k31N6j5K8j15p9J04j28K73q7J12j09J27
2714A63j89l7Q0j5Q0J03r0l4k70K58J12l74K46j37Q0M0r7R8o9P3K5j69J2Nj8M11
$$ y = [-104, -12, -136, 32, 149, 287, 134, -19, -11, -222, -155, -22, -49, 61, -128, 29, -128, -75, -284, 151, 283, -66, -15, -14, 273, 246, -38, 18, -139, 55, 299, 22, -6, 34, 360, 47, 52, 215, -7, -109, 194, -74, -100, -57, -21, 95, 149, -52, 90, -48, -27, -198, -31, 135, 121, -141, -49, -4, 249, 26, 66, 145, 152, 50, -78, 114, -42, 82, 50, 222, 188, 77, -84, -111, -4, 113, 37, -64, 86, -23, -17, 98, 155, 37, 131, -170, 32, -193, 168, 27, -43, 66, 86, 80, 68, -292, -70, 102, 82, 106, -237, -92, 172, -210, -42, 17, -81, -120, -88, 232, -3, -86, -202, 50, -132, 18, -91, -11, 13, 17, 38, -71, -90, 21, -65, 49, -51, 52, 87, -15, 145, 74, 12, -198, 116, 56, 126, -9, -149, -41, 120, -112, -86, -64, -12, 84, 142, 286, 81, 15, 86, 227, -4, 52, 37, 65, -50, -129, -25, -153, 120, 33, 145, 36, 163, -26, -63, 17, 2, 82, 185, 95, 61, -209, 49, 161, -213, 33, -104, -24, 16, -81, 17, -52, 21, 46, -123, -111, -106, -124, 287]
2740B87k82P5j12J1P3j29R4kl9PK95k40r9P6nP2j00Pk1J03j09M1n8Q1o1K10j58
2767A7M7n7o6J80L8p3J36l41J3M5p5K27R3k39L0J6r5rP5J03L3k08NM7j01J89J15
2794A45j23o2J89n5k99L27l4Rr8j16R2N7p1J8J03j59n0j7K51l5l21O30l45j29
2818i3K91r6j79N0l1K51o5q9qlm8O8o2o5J58l20K31J13j69K7J42k88J16j85J4
2843b40K2K55k6q0J36M4j41j69K33j40J90j73J13J6J67k54N1%N3l8o6R6q0P5j13
2868f9J37m2j18P7R9j17J41j39P3j22N3R0Q2j85K99j20j32M8q1J6M2L4m9k07J66
2893b4K30l20J91j89J94L0k01J88j15M6n1j02K2J46j38J15m3n8J56j43q6K86O2
2916A96j86k00J61j3N5m1P1j52J13j72K7Q0p8K54P2j68JJ48j23r6Q6O9k3j91o2
$$ y = [287, 5, 80, -32, -21, 52, -77, 17, 15, -24, -17, 278, 38, -61, 15, 10, 82, -18, -11, -32, 71, -38, 3, -55, 26, -35, 175, 17, 64, 7, -59, 121, 159, 86, 222, -119, -106, -61, -136, 91, 184, -55, -25, -9, -104, -113, -38, 65, 98, -110, -105, -58, -159, 30, 145, 22, -40, 149, 94, -205, 122, 88, 97, -1, -117, -25, 32, -39, -21, 82, -77, -127, -144, 107, 72, -249, 381, 36, -93, 198, 102, -77, -27, -58, 193, 128, 39, 31, 28, -20, 48, -14, -79, 79, -241, -10, 103, -66, -39, 103, -185, -69, -254, -240, -218, 37, 11, -69, 67, 111, -30, -199, 34, -106, 84, -89, 24, 40, 207, -47, 4, 4, 57, 19, -47, 49, -31, 44, -69, 68, 26, -92, -15, 84, -33, 108, -31, 42, -80, -27, 63, 145, -40, 259, 139, 7, 55, -26, -10, 32, 66, 17, -190, -24, 206, -114, 77, -112, 82, 112, -89, 99, -16, 30, -21, -123, -101, 45, -93, 22, -21, -79, 77, -66, -152, 134, 196, 10, -190, -29, -42, 13, -28, 43, -109, 4, -168, -141, -61, -139, 115, 187, 19, 20, 168, 45, -51, 35, 104, 81, -110, -172]
2941a72J97j50K33n4M8k04J94L7j94P9MM9j83K15p7l11K32J10j9j00Q1P0l07K69
2965D7j04j18L19j30J23k00J75j11k02J03m6J08N9r2m1J58o1J66j02q8j88J67
2987e8QM9n3J55r8o6j05R4R2r8J72N4j95j52J36J25k03J62p7l7R6o6N7n7K11j06
3013D0J31j81M1L6j2p2J68k7pM1l0k85J88q4J37K6l7j9p9o1P1J19P6k94p0J22
3039f2n2P2J65q5J22j92o9K74k93J10j61k2L36k68N4K02J3k1j65J4j24J63Q9j27
3063b7p8L6J07k65M89l52J22j2M0R3j04j62R3j37K18j10K09j89J05J3K6j40J94
3086A69l30J43K61k02j0k2l6q3J61j31J89j33L2j11R6K5k1K8l5l2L2K74l75L2
3110g9JkJ78J03M9J2j98j20l6m6n1j5M31l81J83k21K20j34L0O6J42Q0k29Oq6J14
$$ y = [-172, 25, -125, 108, 54, 102, -102, 92, 129, -65, 14, 18, 67, -116, 99, 22, -289, -57, 53, 34, -66, 15, 85, -222, 47, -57, -175, 144, 14, 137, -63, 112, 1, -201, -98, -144, -36, 23, -69, -110, 48, -13, 153, 51, -37, -225, -58, -50, -1, -54, 101, 3, -63, -168, -74, 18, -80, 92, 146, -49, -201, -65, 60, -143, 19, -58, -95, 1, -65, -8, -65, 146, 40, 171, -10, 31, 67, 55, -17, 151, 124, 117, 158, 128, -157, 31, -53, 84, 110, 73, 54, -25, -86, -15, 104, 180, -114, -184, -62, -114, -42, 123, 38, 160, -32, -101, 173, -120, -10, -171, -193, 143, -125, -71, 131, 144, 123, -42, -28, -152, 11, 100, -27, -105, -69, 38, -227, 262, -90, 32, 20, 60, 153, 49, -113, -20, -157, 61, -49, 160, -29, 76, 89, 115, -25, 169, -161, -18, 243, 41, 31, 9, -27, -110, 51, -80, 109, -24, 8, -103, -7, 18, -3, 25, -10, -42, -10, 264, -111, -79, -78, -80, 98, 201, 250, 262, 64, -56, -92, -138, -189, -204, 227, -154, 29, -192, 28, -106, -76, -10, 132, 212, -17, -11, -97, 17]
3136A7j28J13j17J84q2K70p7j14k18O1k7o3K78M0M8j19K5J6L5k51J28j30J65j29
3160g5K45j44M4J42j97J0KJ45k25K70j17j21p0J81l69L81l9L9k03K77p7Nk23K53
3184A34j60l4n7LQ5J56j12J32j79L06Jk22j97O6R1j30R7L4K46j73k14K32r2q3
3208g0P2J15q9R3K05m31J30j93N9J93lj78r0L19O2j29l4k1J90l35R4P6o4q9J19
3233Ak02L49j3j85J45p9j03o8J16K03j39m0J1l7J23J2k43l2L06j95K5J19q6Lo4
3258g3P7J86k78k1j15J06N1J1J35o4L6J17j10M5j4J12l51N7j23J28P2mj44m8R7
3283a15K94j53k11J27R7o2j04J64k0m4N4RO8j67R0R8p8j65K07J3j27K14j81p0
3307f2P0l0j47k6L22K4j56j00J76j16J27j53J46M4k98L3J63P5k11j96L93l21Q1
$$ y = [17, -111, 2, -115, 69, -13, 257, 180, 66, -152, -91, -118, -181, 97, 137, 185, 66, 91, 107, 142, -109, 19, -111, 54, -75, 170, 26, 70, 212, 15, 25, 27, 172, -53, 217, 100, -21, -91, 90, -279, 102, 63, 102, -101, 176, 99, 104, -119, 134, -26, -60, -117, -114, -29, 127, 15, 147, -32, 274, 275, 53, -144, -78, 13, -117, -20, 14, 260, 87, -127, 105, 13, -70, 2, 117, 28, 121, 326, -105, 25, -168, -109, 84, 81, -97, -187, 132, 194, 65, 31, 10, 200, -135, -41, 35, -29, -118, 1, -201, 148, 135, -50, 95, 16, -87, -155, -39, 164, 25, -15, -4, -41, 82, 94, -149, -181, 125, -70, -45, 74, -12, -9, -73, 4, 190, -88, -109, -224, -118, -67, -56, 79, 15, 51, 168, 58, 103, 89, 201, -150, -93, -216, -88, -16, -20, -164, -212, -115, 179, 26, -185, -58, 39, -23, -127, 37, 17, -27, 27, 36, 104, -63, 27, 125, 47, -118, 89, 102, -25, 189, 8, -62, 8, -22, -169, -195, 127, 151, -5, -105, 71, -45, 82, -71, 75, 119, -179, -146, 17, 92, -119, -315, 78, -243, -162]
3330a62M74k29j81R3M0R3j40J54j11k89J30N6R7l3J90j49k05L6J70L3oK6m6j55
3354a14R4J1J49j19J07k1k20J75k2k14N6n5K29j37J64P6j23J86o5l10L23l62J90
3377bn6j24K49K0M5k09O2r9J46J39n9j62J06k6j68L34j04J04r2k68J98k8j85J83
3401DJ25p6P4l10K75j05m5j18L2o0N5N6R2L7j19J84k48mJ51M7J2k9P8k06J87k6
3427F3j12O9K8j2J06k99R6k1j1p3R3J30r3K19Rk77NJ03j13O2j02J02L2k9j00K95
3453A70kj71j22m3J23K33l48L82k83Q2j61J55p6K71k40n3J12m3J24k48K62m28
3475c04J99J13m3J81k51N5OpK28j95J40n2J19k73j08J72K57Q3k29j48PR1Mn4Q3
3500G4p9O9j28J39j96J46o5j9P8J43p0q1p2J57o4n6J96j69K6LM0j04j08Q9K27
$$ y = [-162, 312, 83, -98, -5, 35, 128, -12, 142, 31, -258, -128, -72, 25, -8, 182, 33, -172, -136, 34, 67, 61, 87, 41, -114, -20, -9, 140, 21, 128, 107, -113, 62, 40, -174, -118, -173, 56, -81, 83, 159, 36, 222, 157, -153, 170, -192, -2, -58, -182, 67, 87, 132, -77, -15, -114, 32, 171, 112, -50, 56, 30, -138, 196, 92, 196, 104, -164, 34, 6, -179, 4, 129, 53, 127, -183, 92, -13, -58, -176, -144, -204, -149, -93, -1, 36, -83, 101, -147, -151, 0, 47, 59, 30, 108, -98, 89, 63, -49, 20, 48, 36, 142, -157, -61, -82, -93, -166, -73, 57, -36, 183, 192, -85, -80, 23, -90, -28, -130, -28, 4, -25, -125, 170, 168, -3, -125, -168, -45, 188, -160, 222, -61, 21, -140, 15, -61, 210, -30, -83, 29, -14, 110, -138, 124, -304, -105, 8, -35, 146, -105, -50, -44, -51, 177, -18, 122, 70, 189, -84, -192, -20, 237, 320, 91, -57, -50, 41, 45, -9, 74, -5, 64, -64, 75, -121, 25, -40, -59, 19, 162, 92, 11, -61, 96, 32, -24, 172, 3, 29, 32, 72, -32, -140, -51, 176]
3525A76j13j51n0P4M0J51j92L22l90NN6K94j33K2K26n64K92J42l36Q6k9P7q6m3
3549a24p1J23K6J9p6K2K32j46J3N5j68J07o9J22k36L64k5j79j00J54q2j04j69
3572c12L12j9j5J0k7N6O1j00r6Q3O7p2P5N0q0Q8j74K11K7j80K33r5n0r5L8P5j59
3599h8j0J88M2l66J91J85k71J41l8pl5l6J41N9r5l1J40r4J08j93j40J02J07k8
3623b8OP4Q5J12j45Oj58J8J36j45O3L6n3M7j79J69J03J16l03n0J40l6j42pK23
3648H8k82L95k36qJ45k25L34m13K65L5j13k1Nnn7K54m4m2l5J4k15J89j11K22j2
3673A27j81R7j23k8pK37l8N9j25J19N1k27J98j33J45j48r9O3ml7K04n0R1j47n6
3698a2j2P3k8l5l03K77K1l7j45J34J11j45L33l17L6J92M9k06J58k99K07r4J8r
$$ y = [176, 63, -88, -138, -64, -24, 127, -65, 257, -133, -128, -72, 222, 89, 111, 337, -227, 65, 207, -129, -43, -72, 5, -81, -124, -195, -72, -46, -27, -103, -81, 151, 5, 18, 73, -95, 12, -57, 65, -171, 193, 168, -11, -111, 43, -39, -143, -312, 0, -19, -34, -24, -51, 5, 66, -34, -130, -47, 20, -52, 23, 73, -7, 81, -93, 118, 145, -35, 198, 103, 53, -42, -4, 71, -88, -98, 90, 132, -234, -43, 142, -129, 12, -26, -33, -68, -104, 37, 96, 1, -30, 110, 16, 124, -69, -209, -107, 0, -28, -22, 52, 137, 249, 104, 110, -48, -30, 106, -39, 24, 60, 7, 54, -125, 44, 147, 263, -40, -90, 50, 14, -128, -135, 88, -194, 201, -35, -43, 102, -123, 211, -202, 63, 98, -15, -36, -31, -36, -93, 161, 117, 75, 40, 54, -161, 28, -83, 139, 127, -54, 43, -80, -108, -115, 122, 84, 143, 18, 137, 188, -39, 159, 26, 171, 23, -76, -13, -17, -54, 150, 100, 191, 44, -12, -24, 49, 21, -14, -317, -40, -19, -56, -201, -67, 44, -101, 232, -85, -49, 143, 192, -14, 144, -155, 52, -42, -24, -33]
3722c3K9j87J95K07k81Q0n2N4JJ04k5J3k68%K59j9J08n4j56n1J87k19J41j54j4
3747a35j2K10k23J23RqK87k11j3j33J18J38k46J06j63K46k15J76j38j00L75j53
3769C8OJ17l27k2J53P1O8j05j88L21l70J36J83k0J9%j41P7j85LK64j21j27J21
3793b9K2J3jj10o4RJ09L0Q4k10K65J3k26j21J04K1l3J99J42j05k54K23m6Qk21
3818a78K34l10L99l19J25O4Lr0qO1j2J90j91j77J96jo0J48n2Q8k15J64j74K11
3842I6k7o0j6p7J89J03k07K15k66J92K6j08J5m2K61k95j77N9L0j4R4m4qK5K34
3867A98J34j22j47j51N2J86j62m1J6L3oJ32j61J57k92K1J61O5K4R4j43mk2k61
3891b39j4K56k19M55m89L33k71J11M20k28l68l5K03N0Q7j10J77k16R1j37J81J5
$$ y = [-33, -4, -191, 4, 211, -70, 10, -42, 12, 13, 117, 92, 105, -163, -163, 96, 77, 185, 131, -25, -76, 111, -108, 33, -121, -135, -147, 63, -160, -37, -28, -36, 251, 40, 27, -106, 12, 150, -96, 10, -153, 93, -122, 54, -84, -184, 191, 38, 44, 161, -166, -188, -35, 36, 104, -1, -189, 132, -238, -102, 81, 61, 80, 80, -61, 16, -169, -166, 98, -23, -150, -29, -7, 6, 5, -105, -169, -160, -51, -21, 63, -147, 118, 131, -95, -216, -112, -91, -124, 75, 217, 112, -142, 81, 35, 43, -178, 56, -254, 145, -174, -49, 15, 18, -72, -80, -19, -31, 159, -32, -209, -13, -14, -74, 74, 22, 110, -105, 59, -115, 96, 69, 9, -7, -84, 105, 208, 1, 216, -50, 142, 168, 60, 75, 33, 294, -1, -178, -119, -89, -103, -9, -53, -61, -36, 198, 332, 210, 63, -88, -36, 150, -12, -53, -37, -4, -10, 122, -39, 118, -174, -153, 8, 73, 97, 191, 48, 44, 22, -239, -253, 3, -216, 239, -250, 83, -188, -77, 343, 115, -253, -288, -85, -35, 52, -58, 119, -97, -6, -143, 38, 53]
3913E3K3n1L7p5o8J14P9L4j50L9m6Q5m3MJ60k16N0k27K36J8k04L0l1L15o8j72
3939g4J16j12J63N8o1j38o4K89p3k00J16nJ08j35r0k8M3J14l00L99q9k6k12K10
3963IqQ6J06k29K3K4N6J30j45k8j04R2L1J48k64J39m0l01K75j43J14K46l49O3
3987f9N1L81k84o2Q3j2R3J29l13J47k24oJ24j78N1J60q4j2q0K35j36j87J41J76
4011A24k84J49k77M06j06l5n0P0J61m3j10j29M9J14j95K04Jj30J46j39Q0k63L32
4034G5p7NJ65l07J08J32j45j12kQ8K39j28m5P4l7K05j63r1J43j57lQL4J12o5j65
4060a09O6r9j23L68k11L7J96p1N5N3j47m2J16L0j86O7j50J55o8M9m5J4qJ81L0
4085A58j15j29J83o1k08K88j67Q9Lp6P0Lj56j20K34j04K39k24J29j29J08J80k72
$$ y = [53, 76, 25, 62, -13, -81, 33, 112, 146, -4, 35, -11, 74, 31, 35, 195, -21, 29, -198, 38, 56, -148, -118, -149, 166, 98, -74, 42, -70, 93, 151, 90, -48, -112, 177, 104, -96, 20, 15, 123, -12, -102, -130, -87, 27, -273, 126, 37, 11, -201, 9, 1, 87, 193, -36, -13, 11, 67, 197, 52, 24, -80, 12, 43, 191, -73, 66, 26, -275, 0, -143, -29, 217, -132, -69, -18, 363, 79, 17, 100, 88, 181, 310, -3, 144, -80, -86, 38, -140, -89, 71, -13, -25, -105, 130, -6, -193, -52, 124, -160, -11, -288, 118, 12, -23, -73, -3, 158, 115, 5, -124, -75, 39, -156, 48, 49, -81, 65, -74, 6, -257, 75, -2, 3, 168, -139, -31, 101, -44, -156, -158, -70, 169, 41, -4, 70, 33, 238, 75, -16, 127, -30, -33, -25, 9, 121, 56, -109, -43, -142, -265, 103, -108, -71, 125, 54, 109, 162, 15, -27, 89, 119, -67, 0, -150, 5, -63, -14, -59, -45, -53, 128, 158, 43, -86, 97, 36, -172, 116, -51, 38, 41, -35, 35, 38, -118, -238, -4, -108, 131, -93, 36, -93, 15, 195, -77]
4108g7Q6o6J55M8m8k80m3L82j95P2j26P0o2K8n2J32j02Q6n0p7jL7J64r2K44k80
4134d7J54j02j3n5J56p5m7j5J14m4p3m9J86k45N3P8O9j98K35k3j82J47lQ8l5j39
4160f5j21K00J94k77jQ0J43l54K22j82J5J51Q4j31j1J85j16j06j34L27O0j49J78
4183A92J4k55J19k01K8j80K29K23k4j61j23K3O0j99K07j07o8J50l1L66k01j68
4205a07p5K0K02q9J85j38J17q3o6j08M0K64k21QQ1j53n6P2J4J00n0k1J66J41j66
4230G7Qm7p4P6k67J98J41r8O4j98J66j18NJ07lM2l40L70L2j51k1l5J42r4m7j16
4256a81O0O1J87l41o5J13J18pR9n4j91Q1%L9J87k55ML34k63Q6N2kK2Pk15N7N7
4283a0N4l6L8M2P5j35k02K22k21R4K08j38J58j72Ml3K90k44j32MO4Pj9J32R8j7
$$ y = [-77, 9, -57, 98, 146, 98, -182, -225, 157, -38, 34, -92, -22, -84, -56, -108, 24, -78, 8, -42, -119, -120, -83, 81, -11, 233, -47, 107, 5, -8, -63, 93, 18, -29, -44, 70, 26, -47, -96, 90, -155, -102, -24, 45, -153, 82, 59, -123, 24, 21, 109, 74, -65, -186, 14, 208, -69, -70, 10, 153, -201, 21, -161, -146, 5, 89, -42, -53, 132, 16, -90, -224, 103, 163, 14, 192, 206, -49, 70, -131, -103, -283, -54, 169, 145, -16, -139, -116, -56, -255, -48, -155, -223, -73, -104, 262, 61, -107, -182, -162, 40, -49, 136, -2, 115, 32, -34, -142, -102, 162, -59, -51, 30, -123, -179, -107, -93, 7, -43, -64, 102, 243, 77, 85, 38, -36, 40, -227, -29, 112, 14, 78, -120, 46, -72, -67, 40, 37, 79, -261, 109, 141, -10, -31, -66, 76, -18, -65, -181, -121, -60, 127, -214, -279, -166, -48, -55, 44, -10, -201, -120, -120, -81, 106, -149, -145, 189, -74, 12, 64, 62, 84, 91, -124, -67, -10, 44, 8, 46, 88, 163, 28, -174, 48, -173, -79, 129, -9, 149, -23, -19, -52, 238, -6, -138, -134, -70, -63, -82, 50, 148, 131]
4309A31j25q3L15l22J48j78p6R0K22j74K4R7j84J00l3K32l92K54p6nL2k1M2j09
4333i1J76j17N3j53L9K18q0n6P4j41J95k17J04J31k70K58J7k07J51p0j87K87j75
4356f1K5J05j13k9P2Q3j08m2J47j51J86j30nK23j91rP7j69K6J22J2j60j7Q0n0
4381g7pL62l2m6j17j58j32K99J50j05j42L3k19Q1J01%Q4ql3j82N0K2J42J22j08
4406H0j01l2K8L3o9M9o2K35j47k00K61r9j70J13O4R8q3M6l4J44o2k3j41p6j32
4431b80J31J92k05m8M09j44k79L53k33J32o3pK03m07J3J4K96j45J03j59K95q1
4453I0j07J40l40M54k89K11j75%J1q3J40n9L6J41k98J08km9n6R5l3j0J0j74K34
4478eJ07p0M1n3K7r9J62j19J42k56L2Q3j91k4K56J29j98pJ57J51m93J57K27j12
$$ y = [131, 6, -77, 238, -84, 64, -114, -190, -100, 122, -52, -28, 69, -115, -15, -48, 184, -208, 46, -30, -35, -3, -24, 18, -91, 85, -32, 21, -132, -93, 125, 45, -11, 63, -78, 117, -100, 4, 135, -135, 123, 140, -67, 84, 14, -173, 114, -61, -36, 69, -44, -73, -1, 82, -26, -68, 79, -72, 114, -16, -21, 202, 11, 2, 79, -90, -64, 58, 70, -90, -107, -27, -77, -84, 278, 246, 200, 83, -75, -207, 92, 242, 137, -5, 28, -191, -110, -9, -9, 75, 67, 34, -148, -98, -76, 66, 188, 80, -21, -53, -25, 8, -61, -12, -74, 161, 14, -186, 75, -24, -194, -81, -17, 81, -2, 44, 10, 154, 92, 69, -72, -148, -280, -149, 43, -162, -210, 199, 55, -224, 129, -104, 28, -35, -42, 161, -246, -233, -219, 77, -68, 35, -124, 171, 90, -17, 123, -217, 237, -52, 159, -16, -16, -5, -88, 52, -7, 29, 170, -128, -20, -22, -71, -127, -32, -65, -75, -65, -239, -5, 102, 32, 73, 20, 47, -52, 110, -9, 133, -123, -91, -8, -199, -223, 33, 162, -36, -43, 114, 265, -228, -71, 156, 44]
4502D4p4N2%K2j55J34k05K12J42j79j6OR7K7k35J30P9l7J36k0k09o7O7R6m3Q6
4528I0j63K00j85l4j71K56K27k33J63j56J12P9j70j30K6K37k59J9L02j93J31m14
4550b66L23Q6q4jj18Q3j40j3K74p0O5l5j17m8R8k90J05J19j11O1M2j10N8J95p
4575I9k97L67k54L1jj29K57j08J46j79J12J04k68KJ8J58J45k52m5J53J30l18R7
4598c2j59K58p8j74J44J20Nk36J90j42j16M06l11M3m5J79r9j33J28N7J21m90M26
4621F2j56J86j47L0m5P7J7l5J5J9j4L9m2q9N4J37k03J51p0o1K07j44J61j17l5
4646cj01J80j67K22q9p8O7L7j41J9P1p8Q1j72R6Q6O8k38J95n5K75k85O5q2J02
4671G5j3l0m0j22J67k20l0J90N6q8J43k90L10m4k8L3l0p0K8K8J0L3l8P9j53j8
$$ y = [44, -30, 22, 22, 44, -111, 23, -182, 30, 172, -7, -23, -17, 80, 107, -128, 2, 81, 44, 180, 160, -49, -116, -49, 47, 4, 90, -73, 127, -58, -92, -263, -7, 220, -13, 150, -6, 106, 185, 15, -115, -89, 148, -111, -92, 210, 17, 148, -266, 57, 143, 59, 58, -60, 23, -117, -130, 144, 74, 139, 104, -13, -61, 37, -253, -148, -29, -140, -79, -37, -147, -89, 106, 99, -198, 169, -85, -54, -55, -184, 73, -35, 111, -68, 44, 148, -120, -118, -100, 58, 203, -49, -94, 59, 189, -129, -32, -191, 67, -11, -185, -41, 79, 84, -152, 38, -104, -220, 186, -125, -82, -127, 52, -47, -180, -52, 5, 126, -364, 62, -94, 92, -55, -25, -70, 7, 24, -11, 4, 23, 9, 48, 6, -83, -29, 108, -95, 56, -14, -75, 132, -12, 149, 32, -3, -104, 76, -91, 131, 42, -36, 31, 68, -73, -54, 17, -61, 20, -152, -56, 30, 98, -140, 55, 0, 275, -10, 55, -27, 75, 62, 32, -8, -130, 37, -183, -213, -23, 33, -55, 88, -202, 108, 64, 36, 69, 39, -31, -3, 25, 35, 68, 30, 109, -44, -62]
4697f2Ml7K7l2P6J04j03j04J82n2j39J50R5k2k2O2j24j50J72L5j07K5p5J1J33
4722D7R9k69K19J22q6k16L46j79P6j08k67L65l6k98N1J95M3j77K42m25K84j3j33
4745a18J61m5j72K63L2j41m5P9J0k0R2J8j9j35K15j55j00K06j58k1J14L1l2L2
4769I2J72k98n3On3L48j11j84QQ0j21P3K10k38M8N3m2K38l08J57J38k54J99P6
4793B36k66j7J83k07NK31k82J61k83L41K1o9k10J28j01J60M9j04k10L69j48Om3
4816e0Lj1K62k62J68k02P0L39k21j47J02M5j1J07k87J94p1J09j35r1J00o2J67
4839A16j16r4J38j47K7K12k67K09m9j39J69J33l37L05l19K65l73M09k38j08M82
4860B78j68j6j73K10r3Rj4k40J48o6j47L42j67o8L28j11K9j30J64j72j0r0R7J80
$$ y = [-62, -58, -95, -68, -100, -24, 80, -23, -127, 55, 3, -136, 14, 109, 87, 65, 127, 3, -147, 25, 60, -47, -22, -97, -86, 47, 146, -123, 96, 218, 132, -84, 262, 83, 159, 51, -216, 149, 113, -185, -134, 61, 104, -73, 169, -256, 28, 15, -118, 43, -2, -174, 89, 121, -20, -65, 14, 24, 4, 96, 114, 95, -40, 175, 20, -80, 126, -32, -53, 61, 92, 60, 92, 264, -34, -87, -81, -134, 214, 103, -81, -73, 7, -114, -41, 169, -69, -21, 32, -10, 228, -80, 77, 215, -39, 160, 236, -30, -47, 136, -71, -66, 165, -117, 44, -239, 102, 123, 54, -156, -28, -129, 31, 80, -24, -234, 135, -13, -7, -50, -47, -58, 204, -58, 110, -92, -22, 317, 96, -51, 51, 96, 85, 192, -95, 99, 28, 137, 2, -89, 11, -51, 116, 0, -94, 44, -103, -76, 136, -131, 78, 29, -110, 59, 192, -145, 160, -159, 106, -267, 142, -96, -204, 278, 110, 94, -79, 131, 38, 47, 33, -207, -59, -125, -272, 70, -97, -165, 163, 52, 81, -49, 115, -57, -67, -157, -60, 120]
4884A20j37L8rp5J53k39J65Q3k62K11m5O9oP8l01J8K26J8k90K8K23j0mJ96k33
4909A5j81K24k04J19l2j59K63q1p8R5m7L4j0L5J21j89K10k43R2o0q4R9J97Ok65
4934a23J26n5l1j31L96l66K62n0k1n1L1r1K0OJ02j61J81J03j67kK9m1p9R4J98
4959A79k52LK8KJ21q4J40P1k71R4Q6j08m5m9o7M23j66k36K4r1K22l2J22j15k36
4984b37J23P6J31J22k97p8K04R%l1n1o6K20j18j36O6n0L5J28j4j8K15j61j41J2
5009e7J85j31K6j70L50m00L34k93L30k11J56j03j11K59m08K58R1L7k05K01j84
5030d6J64q1pn3l7J32k9j46J81q1j17J54m0j53R1J1L1N8J21n6j45L0M6K25k42
5055A1j10O8J72j18mj25J22k18M09p2k71N0K33l28J09OR6n9n4N0K1l4J18n18N15
$$ y = [120, -17, 21, 12, -63, 90, -149, 16, 99, -163, 48, 3, 72, 66, 144, -157, -139, 87, 105, -185, -157, 66, 56, 52, 248, 15, -166, 58, -146, -27, -59, -218, 45, -36, -114, -19, -66, -32, -42, -7, 114, -75, 135, -108, -16, -76, -160, -61, 136, 142, -123, 3, -52, -83, -214, 182, -184, 78, 28, 7, -44, -13, -104, -84, -78, 24, -137, 44, 147, -20, -22, 7, -34, -113, -19, 179, -73, -70, -42, -40, 81, -3, 137, 208, -63, 31, 117, 9, -36, -85, -152, 271, 105, -131, -107, -198, 24, -8, 114, -1, -237, -114, -38, 93, 215, -82, -160, 44, 53, 53, 22, -29, -95, 125, 7, -129, -63, -113, -78, 50, 36, 18, 233, 72, -69, -57, 128, -3, 23, -147, 203, -197, 137, -156, 174, -37, 119, 16, -95, 164, -244, 14, 105, 142, -63, 138, -46, 118, 37, 30, -23, -60, 72, 43, -103, 78, -3, -120, 34, -6, -159, -68, -57, -26, 32, 153, 97, -48, -18, 28, 253, 11, -99, -31, 141, 23, 19, -106, 16, -202, 207, 135, -136, -86, 147, -181, -72, -66, 30, -29, -83, -33, -12, -46, 72, -446, 69]
5080F9j71J62J12l11K07Q6l97K52K72k63j45J60m3m4Q2k19J7Q3J23J15k12K55
5102A90j54q3JP2m9k1k06L70J0j20n3j6J19l47Q3J10J71Nr3jJ49k05J46q4j61
5127a67j03K63o0rj1r3K22r3J1R4j81J34J47j93K87m8k65j9J66J9k29L02k54K25
5151A45j71N5O5k19J89j1j94L28k97K08j12j3K36k62K22j38j07l0L1P9n3j18J27
5174d0MP9l9N3k83L18j6k74J8K21p9R5m5N6j8p7J5O3k91N22j45J33k64j27J09
5199a2O4L4K2j61PJ27j04N9m6L6j74J26k2J04nr1J03L8j7k05J22j48N7J43k38
5224a81J32J15j32K23k81K27o9Pj26l3J28j02NL23l36j31K07j8Rl35K14L14n8
5247A02j23J34j65J75j27J12M2k24P7J61j57r8j30J53J97j25J54j47j54p0J48
$$ y = [69, -102, 60, 172, -139, 68, 154, -243, 9, 281, 18, -127, 33, -10, -54, 28, -191, -174, -91, 32, 147, -65, 190, 36, -47, -46, 26, -23, -44, -250, 120, 130, 10, -43, -59, 60, -287, -204, -94, 77, 82, -11, -12, 137, -68, 78, -6, -167, -270, -7, -67, -76, -87, -180, 42, -51, -40, 54, -127, 7, 154, -39, 248, 200, -65, -84, 82, 101, -128, 174, -80, 145, -26, 29, 94, -125, 64, 53, -141, 187, -110, 98, -14, -27, 209, -53, 169, 31, -76, -106, -75, 4, -49, -167, -40, -36, 43, 4, 57, -226, 92, 76, -198, -180, 41, -38, 57, 12, 68, 50, -27, -12, 51, -240, 282, 137, 270, 6, -121, -12, 52, 86, 108, -53, -46, 81, -23, 36, -10, 26, -148, -22, -44, 60, 55, -36, 67, 105, 88, -117, 5, -143, -86, 57, -181, -49, 66, -66, 157, -124, 103, 34, 41, -85, -118, 10, -92, -87, 236, -100, -231, -24, -42, -33, -368, -154, 160, 102, -21, 113, -52, 123, -4, 108, 150, -74, 3, 164, 7, -91, -221, -68, 129, 4, 158, 11, -143, -213, -65]
5268f5J19r1q8K5q7K26j63j6Q6J43o2j9Qn1J24m4k6K44l82j2K26j82M3N6J40l8
5294A14j55K36j06k05P5PR9k02N7j4K42j32k5P6j72J50J37j75r3O7K15j64O1j66
5318g3Pm5J70k8J32k49J55p5q4Q7K48k21P6j67J59k20nj03K13J3l1P0j64m6M1
5343a40K67k36K36k80J22N2lo8K32j35J8j67P4o0J16j29ML06n38M57q9J97l73
5366a37j04J53m5M6J52j60Q4L9r3K01p5l45J47j4L5K6Q4K8q1J27l8k06K68L7j79
5391e0J43J7k12J82op8J20r6Kpm2j67J03P5pK47j74j29J85j68j29K53k41K60n6
5416B5m2K55k16j74P0L5L45l84K29M5j55k16K94K6j92p2J63O7j78K3J66k09l5
5439a30J09J35o0Q1m0k00N0O9Q7j5j59N3K7J9k09K2J97O2j75j58J88J98j39qJ33
$$ y = [-65, 54, -37, -125, -100, -187, 39, -124, -140, -54, 89, 27, 8, 16, -35, 89, 45, 19, 263, -119, -131, 95, -87, -44, 12, 152, 114, -41, 195, 89, -116, -41, -34, 65, -137, -80, -94, 148, 16, -9, 67, -105, 45, 182, 7, -86, -19, 196, 32, 93, -73, -66, -111, 59, 31, 163, -86, 69, -6, -90, -3, 245, 24, 100, -67, 92, -128, -133, -236, -23, -10, -41, 29, -135, -181, -140, 127, -109, 127, -153, -31, 21, 18, -50, 182, 47, 65, -102, -28, -88, 28, -101, -97, 209, -329, 128, 39, 236, -137, -241, -88, -133, -87, 65, -95, -11, 28, -65, 136, 61, -284, -137, -151, -116, -90, -6, 22, -59, 68, 30, -176, 92, 129, -50, 93, 110, -102, 80, 74, -4, 116, 20, 22, 15, -27, -194, -91, -16, -23, 224, 50, -79, 106, -62, -191, 62, -179, 81, 25, -17, 238, 22, -152, -82, -47, 298, -86, 143, 188, 33, -183, 111, 137, -55, -127, 36, 103, -75, -52, 114, -95, -130, -21, 114, 54, 135, 95, -105, -55, 14, 101, 86, -73, -20, 7, 26, -183, -161, 36, 98, -77, -235, -47, 151, 12, 4, 137]
5464A37j67RJ53j20n7J68j62J11j60J32N6o3k26J53o3j11J05N5m1oj3J06j5j17
5488a36k2K10j93J12P5L0j91M0o9J16j8n5J39o7m2K36k43J87q5J02l26K99N1k70
5512a20N8Q1O0O4l1p5l5p9J4J66n1j70J0J83J8j74J98k3k18J25J77k13q3K40j77
5537e5n2J52j05j54L14k93K75j48J93J32k26PR2r0j77K23p5j00P3J36j48J42j20
5560dn8J01J32l21K01j15N2K9R3m5Np8N9K0n0k7j37K21j07q2Q8k3R4r3p1L7K12
5587A33j99K13j84J05m1N1j73J52k05M35m02K90j86j55M7J06m0M6Q2j88J41j07
5609g9J62j29p3J98j08n1O6k7J5j5l2M7O8n2Oj48K48K3l9o8j01K19j82o5L84l12
5635d5J15k61J18k3J51K75m26J8J22J8j84J47k6J48j47R8l6J38O5m04K41j55J38
$$ y = [137, -30, -21, 132, 12, -45, 123, -39, 72, -88, 44, 100, 37, -189, -36, -99, -210, -105, -50, -91, -97, -110, -4, -19, -136, -158, 52, -141, -29, 46, 76, -115, -75, -144, -28, -46, -101, 38, -29, -71, 165, -78, 109, 24, 126, -200, 99, 150, -120, -62, 19, 79, 143, 112, 37, 2, -77, -63, 103, 52, -118, -108, 75, 93, -81, 117, 94, -124, 1, 178, -35, -118, 122, -55, -107, 45, -60, -214, 100, -193, 82, -66, 127, 259, 33, 40, 132, 42, -135, 88, 13, -87, -14, 122, -26, 116, -4, -62, 39, 171, -150, 51, -64, -12, 17, 110, 65, 70, -8, 51, 71, 21, -6, -143, 78, -29, -111, -23, -46, 48, -45, -116, -79, 133, -66, 147, -37, 68, 27, 78, -95, 57, -148, 287, -115, 175, -11, -166, -119, -13, -53, -7, 75, -113, 28, -79, 83, -46, -119, 79, -29, -80, -14, -41, -26, -41, -73, -26, 42, -10, -4, -152, 96, 119, 80, 12, -89, 130, -52, -117, 267, -45, 70, -191, -73, -96, 55, 330, -96, -78, 44, 62, -122, 25, -1, 147, 0, 98, 62, 200, 265, -139, 102, -53, 85]
5658H5k43K13K44k83k63Q0K61J10j74l4K62k98J58p9j94K85k3nn5N6o1nk33K17
5682B1N2n2q6M6j53J72R0k5j34K2J07j76K62k11J29p0K87j95r1J55j66r2m0J48
5706@r0k2o3J30j10K56l08K58Pp8P6J10k25L6J14p3J09j0j79K53k21J80L4k03
5730a9N9j30K37r7j3j2k95J96oJ71l2O5j72N4k07J86P1o1l4l5K40l22K76j6k66
5755a62J86qJ5L7j15Q6o3k4oj7J80k69K00l05K22M7K2j23J02J68k47K86k41K31
5779B02j01q4k32K38n7P3j66p5M17k84J13J65k17r7L6p2KK10j68J54P6q4o5R3
5803G7j39j28L01O7j91l5J35L9L6j59N9j26J62j43R1j77R3q0J10J03k26mK97k4
5827A38p2M3QJ00j97J22n4J03j69N7K4j75J92K7j69J09k68K7J41J72k08M8p1L
$$ y = [85, -158, 55, 299, 16, -247, -167, 94, 204, 30, -4, 258, -40, 118, 39, -155, 130, 107, 102, 47, 103, 42, 37, -196, 21, 73, 21, -65, -19, -172, 0, 90, 65, -69, -47, 60, -116, 146, -65, 64, -6, 281, 86, -5, 150, -16, -108, -148, 0, -90, -112, -175, -45, -155, 101, -207, 51, 58, -20, 56, 166, -59, -23, 91, 18, 127, 117, -62, 191, -30, 150, 184, -19, 40, -90, 147, 50, 37, 25, -270, -74, -80, 91, 59, 124, -48, 6, -201, -15, 56, -5, -39, -74, 166, -156, 120, 104, -162, 24, 16, 31, 68, -47, 39, -24, -48, -54, -71, 109, -160, 40, -265, -43, 4, 26, -97, 5, 173, -74, 212, -29, 202, 101, 17, -215, 23, -34, 39, -127, -202, 215, -69, 44, 209, -8, -105, -69, -141, -139, 71, -97, 57, 133, 49, -16, 77, -62, -190, 111, 178, -13, -48, 87, 126, 162, 3, 62, -64, 98, -45, 46, -131, -38, -118, -8, 95, -131, -135, 162, 138, 66, 109, 117, 217, 20, 142, 88, 191, 22, 79, 103, -72, 120, 147, -22, 87, -181, -154, -13, 159, -49, -1, -72, -69]
5851f9lJ20J49m6m8j75J11j89J98J3m9j5k0M1j85K78l43M21j82m9jJ06n0J00k02
5876h9Q5k5P3J52l98L05n3k32o5K13J01k44J39K2R4k76J43p8N7J25kK1J43l51
5900a40K27j28j24M6K63p3J1j18P0j32R2r4k13L32j11m1J59P3j92R1r0J25k21
5923a88Q2Q8j06K30n4m8j7p5K90j31k3N4j20J97j87P0j33j08L03j76L03k67m8
5946f4J32m2m9l6q9K9k1M01k18J03j15r4N7n7p3J7J19j38K52k04J21q5M5k44J37
5971a16J23j39K37j29P7o5K7J35l41J10L41k64J82r5J6o9%J11k61O1J35j75J99
5994A00p9o0J4j95O2K13l6R9l26J41j6J18o7K15k35J48j36n6J01l0M9L2N5J5m01
6019b75m7P5K02J16l2j8J67l5k49K08j57K84l56M7K22j07j85J96J23k22J5n5K9
$$ y = [-69, -72, 48, 197, 151, 103, -72, 39, -150, 48, 61, 12, -3, -23, 18, -167, 111, -232, 189, 7, -42, -43, 63, 13, 113, -89, -4, -29, 44, 196, -202, 103, 50, -182, -247, -34, 67, -177, -38, -16, 78, -198, -55, -133, -76, 49, 47, 68, 211, -140, 87, -41, -165, -119, 144, 71, 82, -36, 34, -98, -6, -100, -313, 19, -92, -133, 26, 99, -93, -2, -92, 33, -188, -106, -18, -124, 106, 52, 4, -13, -88, 202, 71, 48, 102, -18, 179, -8, 62, -71, -179, 124, -52, 251, -16, -64, 68, 26, -23, -59, -148, -119, -140, 261, 43, 146, 31, -63, -6, -63, -136, -119, 0, -138, 114, -90, 31, -54, -9, -253, -116, 7, -132, 105, -24, 53, -12, 15, 150, -191, -81, 260, -4, 178, 83, 99, 30, 30, 141, -120, -59, 76, -99, 100, 21, -39, -25, -220, -158, 55, 19, 118, -208, -67, -83, 35, -32, 183, -52, 96, -40, -96, 5, -25, 24, 56, 111, 126, -275, -322, -247, -45, 71, 39, 21, 188, 153, -96, 112, -45, 239, -117, -70, 152, 45, -140, 56, 179, -43, -28, -83, -54]
6042e4j8J22j40J30J38j46N6q2j15j34K55J6O6r2N1k9J58k43J31o6j42K69j83
6065e2J91j59j7j04J39J42j31N4m9r0R7M3k88K09O2j32O5N1J23kj90J57m9j73
6089a03R1O3l5j40J42j50J61k16M9J03Q2j77L9J21J73m05J99j20J05j28K6J08
6111a2J09j31l8M6J06P1j3j03J33J6n1Qj18L4k85L4K09l7J6O6k07L26j73N0j69
6136a13j5J37M2P0l19K18l2j71L59k20k5J38k44J36J92l77J72N2p0o9O9J7L24
6159B71k36r9L27j64K0Q6j66J6Pp5j43J31j28J65j30J57K7j05N0j7L7J86j44j71
6183i8K26m6j59J98j50j89K54nk7j04K01Oj64M6O1Pp7l9L8J57l41P7K53j1l74
6208b60RK74Kkj92K77J36k52p9J48o2l9M9m1J14j5j20j47l5K88n1j2j02n6M4J70
$$ y = [-54, -72, 50, -90, 40, 178, 32, 88, 6, -109, -243, 12, 28, 94, 2, 53, 24, 182, -61, 70, 4, -138, 131, -52, 139, -20, -37, -141, -2, 140, 9, 63, 14, -76, 21, 64, -224, -15, 47, -85, -20, 31, 154, 152, -38, 119, 70, -103, -12, 51, 16, -124, 18, -132, 29, -187, -138, -35, 47, -130, -91, 30, 203, -202, -3, -123, -18, -146, -120, -12, 97, -34, -72, -26, 80, 151, 138, 35, 168, 184, 133, 141, 23, 57, -228, -194, 15, -22, -6, 60, -147, 179, 6, 56, -113, -128, 9, 51, 121, -198, 20, -12, -183, 176, -44, -69, 69, -175, -39, 153, -224, -52, 0, -70, -139, -70, -53, 271, 35, -64, 263, 99, 119, 205, 39, 55, 62, -13, -156, -25, -153, 12, -118, 39, 66, -39, 11, -6, 31, 217, 73, -98, 128, 82, -77, 121, -29, -218, 36, 31, 4, -100, 101, 107, -57, -11, 50, 57, -20, -59, -21, 136, -205, -128, 125, 114, -260, -251, 23, 25, 23, -169, 108, 244, -8, -87, 61, -1, -40, 9, -32, 82, 67, -53, -200, -235, 53, 2, -10, -112, -168, -124, 46]
6234D6M9k47J03J8L8n5K3p3J26J58l27nJ46l7K30k54K0M1J48k94L32q0r2j03N3
6259c6j78J32J52q1k8J15o6k2R6m5p1j17K24j24L54k68oj00J59m2j07J76j98J34
6283E3p5K96n7k68J32k13J5j57N17m08lmK57j59j12K40J60k41J58q8m3J83k33
6306e0O8n9k6N6j69K60j05J74p8q1K91k28j66K9J23j50M0Q6k0l7j82L65k23R9
6330A7j2o0o1J73N5k83L71j96l5J31m7j87K41k10P0L8J38L3j31J63l37K97j15
6353E3j99J96k21K20M7j41P0q4M2n6j7J16j37m4L93k38j51M36l57%P5k5n8l8N2
6378f6J31j16J22k81L13k24P7L68n25K18J27l66K19O8o0M2P1k73J91r6J9P5r8
6401f4n3J85J58k68j23J90l5q9o9J69j77J47L49m23Qr6L56j43o3k3J75k94J34
$$ y = [46, 95, -152, -49, -31, 7, -48, -25, -98, 28, 186, -141, -146, 0, -37, 193, -61, -41, 0, 148, -146, 186, 106, 14, -89, -36, -214, -82, 70, -11, -39, 76, 10, -12, 84, 39, -32, -149, 75, -49, 305, 37, 31, -69, 90, 48, -59, 117, -81, 53, -22, 274, 217, -51, 81, -132, -117, -274, 243, -165, -168, -172, 85, -74, -186, 54, 214, -27, 131, 43, 0, 183, -50, 18, -41, -67, -11, -180, 80, -25, 149, 71, -10, 281, 53, -113, -84, 39, -111, -71, 15, -5, -42, -224, 141, -82, 17, 5, -55, -116, 57, 112, -171, 200, 4, -31, 100, 53, -134, 107, -103, -33, 5, 143, 176, 45, 208, -129, 168, 53, -146, 50, -171, 49, 96, -45, 25, -59, -17, -73, -90, 26, -111, -155, 238, 0, -151, 285, -72, -72, 3, -22, -80, -118, -66, 65, -51, 71, -210, 103, -121, -44, 324, -201, 17, 144, -222, -3, 65, 5, 47, 118, -155, 36, -60, -41, 34, -64, -117, 68, 226, -42, -165, 25, -10, -99, -168, 1, -176, -29, 320, -103, -95, -191, 165, 22, -41, -64, 111, -183, -49]
6424d9j9J52J15j98q9m6J31l4j68P6N1J63j07M9j37Q6m6J52M2k23J18j55LK77
6448A44k88p7L96q3k38J23q6L52k93N5O2k15J10j46K79j59K29l96J79M63m16l3
6470c8P6k8o8K0K27m62J97K44k78kM39l58J73p3l9Q3j71j68K28j04J54r3m8J51
6494F2k28L27k67K20L0%m1rk16J39l2qM9K84m08k4P6L31k48P4j98K51j81j1mJ26
6520I4k24J85JL9j79J49N0k56J25lj38J32MJ85p8k17J44j62K67l18P4k9K8J81
6544E4j3l1J35j51M0q9L2j60O9M8J04Pj04K3J24Q0l69K98L8j62J38j54J58j34
6568a9M0L1o7Q3R5l07N6K84l35J94p7l4P8k10L1P5K8k0J1j2J20P0j66k4J89j43
6594b9R5k94K42J56n1j3j99k9J65o2lM1k12J20J02k08K94j6j15j71J16q0J52q8
$$ y = [-49, -68, 84, 199, 1, -88, -134, -3, -37, -205, -129, -78, 85, -22, 27, -110, -24, -70, 82, 124, -99, 19, -136, -133, 144, -144, -221, 175, 92, -146, -23, -109, 243, -50, 5, 67, -148, -38, -184, 95, -64, 165, -231, -52, 411, -5, -38, 38, 10, -58, -38, 189, -273, -76, 168, -110, -112, 327, -31, 142, 69, 30, 113, -58, -226, 2, -102, 52, -41, -89, 62, -166, 161, -106, 114, 144, 144, 103, 94, -122, 17, -15, -23, 26, 310, -98, -122, -46, 285, 37, 111, -87, 164, -17, -28, -32, 94, -130, 55, 56, 95, -84, 65, 115, -141, -16, -19, -157, -25, -21, 164, 86, -131, 13, -149, 118, -200, -126, -155, -127, 54, 41, 10, 145, -6, 34, -55, -23, -183, -114, -66, 38, 45, -59, -36, 88, 168, -201, 97, 135, -27, 111, -43, 115, -19, 21, 52, -15, 68, 163, -144, -88, 196, -139, 55, -22, -56, 22, -188, -157, -82, -54, -74, -63, -75, 45, 115, -51, -75, 114, -29, 66, -228, 14, 170, 119, 106, -93, -122, 43, -19, -22, 19, -193, -73, 29, -179, 115, 99, -16, -187, -71, -151, 1, -87]
6618h7J09J50j85J18k9m1N6J30l95R5Q7O3m5k1J11R0l34M9K20j27j74L50k42L88
6642C36q6k01N4l49K36J69o6j87J47Q2r3J43Oj96K89l78l3K19N7k18J11j06Q3
6665A9K87n19L66k30m5j6J10j50pR2P6p6K7O8P7J8o1J5m6m4R0k70j23N32Mn8j4
6692A22k01O9O0k08J47K9om7J7k36M20j37q0P5M6J1j36J48L2mP6m85K66j78J66
6717c4j17K78k79K22n7L7j13l5J29K3j32L5R0k1K56k41N5l0Q7j55M1K53j76k36
6741a20O6N9K42k11nk55L06J39l28J63l3j46J04L8K7J13l20J62n6k40L11p4K1
6764c7l9Q5j5K3J12k14J93j62P6p0mn8J13j31n8R5O3l8N4j20K9J69j23J53j32
6789c6J48j30j21K35j60O8jp9J82j52O1J71K0l25R9j57J08p2J70K4o5q0J09R1
$$ y = [-87, 22, 172, -13, 105, 76, 35, 91, 221, -174, -79, 8, 71, 26, 5, 116, 206, -128, -79, 141, 14, -160, 190, -52, 336, 250, 49, 103, -246, -10, 159, 93, -94, 53, 135, 42, 185, 191, -5, 284, -94, -127, 92, 149, -69, 42, -64, 19, 306, -213, 153, -77, -122, -138, -28, -178, -185, -93, -17, -93, -66, 2, 79, 97, 36, 51, 5, -39, 51, -219, -342, 190, 194, 136, 122, -79, -10, 50, -158, -11, 18, 12, -35, -18, -254, 166, 29, -51, 24, 70, 81, -55, 93, 125, 121, 197, -288, -22, -200, -34, -151, 127, -152, 70, 13, 50, -63, -98, 31, 54, -78, -43, 47, 26, 282, 41, 96, 66, 153, -2, 39, 292, 116, -120, -54, 5, 247, 36, 31, -224, 82, 221, -107, 56, 23, -123, -19, 19, 46, 159, -161, 1, -55, -295, 16, -58, -37, -76, 9, -6, 17, 129, -85, 108, -54, 22, -48, -52, -110, 3, -128, -186, -91, -28, -66, -12, -132, -103, 66, -57, 96, -36, 112, -18, -139, 96, -64, 4, 3, -76, 106, -46, 15, 186, 206, -119, -20, -177, -69, -141, 29, 53, -12, -92, 17, 108]
6813A08l3j07J25k32J44j35J99K8j62n8jJ73k50K97q9j66r9K13l8J75j18J20l5
6836E9P0j17j85J26P1o7Q5j8o5O4k9J8J71o5j33Q2j70M7rJ25q2N1k2K9j49P0K6
6863a7j80P5J85j15Q8j71k8J09J93j64j24K10M3k00L3J03q2q3J31k6j85J45Q1
6886B1L2l02K07l1K2K39N6J4n93K89o8K23k07J71pq4Q5j7j9j63m7K38j7J26j12
6911E6j34M0M5j21kJ17p0J05j44N1J40q0p6j05L77k33k01J69J99j71m0K49j61
6934A0Qk44K75P1j57j01K82l6r5J00l4l36K04J04q8M2l1Ml5M8q4J12j59P1J47
6959G8j92K42p9k07L73l99Q8J40P2k07qK26j77k6L8K2l4K37k34K78j99j7%N8N5
6984A28l06K12k9J70j22K9J60j60m0M5o6p8R9R5k30K37j42n3J22j72P9J06j4R5
$$ y = [108, 75, -32, 93, -139, 5, -130, 69, 97, -65, -123, -124, 49, -201, 96, 7, -159, -258, -45, -83, 92, -26, 94, 59, 129, 12, -173, -47, 24, -43, 42, 24, -41, 23, -6, 12, 183, 118, -15, 67, -103, -56, -65, 60, -22, 29, 7, 36, -113, -43, -17, -197, -122, 63, -52, 36, -135, -163, -54, 139, -25, -149, 61, 104, -96, -63, 40, -42, -125, 6, -20, -205, -60, 21, 53, -249, -42, -73, -51, 188, 244, 258, -335, -46, -114, 109, -98, 73, 66, -18, 67, 50, 31, -132, -179, 59, 42, 168, 56, -78, -38, 7, -114, -116, 1, -69, 36, -108, -57, 83, 3, -73, -178, 199, -34, -235, -66, 133, -38, -78, 171, 10, 18, -226, 49, 120, -37, -138, 144, 108, 13, 113, 79, -257, -53, 51, -37, 5, -26, -22, -57, -9, -93, 19, -140, -69, 78, -114, 128, 49, -158, 215, -184, -96, 44, 116, -91, -99, 127, -50, -76, -38, -16, -50, 187, -47, 231, 32, 15, 15, 73, 128, -178, 34, 5, 175, 53, 82, 242, 82, 42, 87, 21, -57, 42, 137, -93, 144, 2, -51, 71, -101, -22, 84, 70, 165]
7008A65nk87J5P8j41J98O5j14N9K13k27J5K3rN3j3j50K17n2m9rJ63j63r0j8K09
7034A46k0K1j75r5K49j09mJ25k71J8J39j64J9k5J36p0N5J21r6jJ25j6j01N6j97
7059a34K53J02k83l3j71L16M8j18j28K90o6j31J34k25K19k16lJ09p9J73j61J21
7081A7r4J10J31j16j25j4K9k04M05k57J23j66N6j8J1J32rP9j00J42R7k51L12k93
7105cJ29j68R3P7l55K98n5o7l1J53K3m3Q2k19J40O2q8k00M0K41j66L2j83J94M9
7130C5M9k39J12J0J1J68j59k77J59J31j9L23l18J96j16k04K75p5j53Q0O1l2J7
7153C5M4o5J5J48k11R7J5l1pj7k3J43k84K74j87M8j55oK3N4J11pNp2r7J64p1R9
7181D2J42j92m1J38j70J2K4K0j15K95l41O4J05P2R8j88J00j39L2J51j78l1K02
$$ y = [165, 160, -127, -112, -34, -175, 23, 88, -26, 33, 246, 19, 34, 57, 48, 101, 88, -62, 155, 103, 54, 45, 208, 45, -45, -63, 146, 126, 147, -28, -123, 126, 17, 13, 138, -133, -115, 24, -140, -121, -146, -10, -80, -25, 96, 0, -1, 124, 108, 7, 63, -134, 119, 221, -62, -95, -266, 50, 98, -20, -148, 142, 76, -55, 79, -146, 73, -143, -146, -37, -116, 57, -104, 17, -77, 33, 164, 48, -77, -91, -62, -266, 139, -118, 5, -161, -105, -123, -112, 20, 11, 90, -10, 132, 229, -22, 290, -3, 126, -42, 51, 128, -227, 71, 16, -51, -82, 71, 94, 51, 133, -86, 54, 116, 28, -172, -132, 109, -57, -25, -208, -14, 35, 84, -155, -43, -33, -22, 146, -13, -290, -131, 0, -19, 304, -14, 182, 66, -138, 137, 62, -91, -11, 50, 18, 35, 79, 14, 29, 177, -34, 63, 78, 47, 40, 23, 0, 143, -141, 133, -54, -6, -161, -167, -144, -90, 21, 14, 19, -53, -150, 14, -57, 42, 184, -8, -49, 89, -81, -69, -45, -25, -140, 155, -186, -122, -17, 55, 153, -35, 65, -74, -42, 109, -69, -100, 102]
7204A02l5p0K35l39K5j28J67j48J45K40j68q2P7j9P8m3J91q3k18lQ9j06K45j71
7228a9j5%R9k46M41l2k80l0m4K04j98K84l25R4l7K27r6r7j16M6J99k8m8J70j16
7253C7n9k5J59m7k09P4J54k75rK80j36k2L21l08K53j62Nm5Q2j99jJ40k89LK10
7278f8N8J69j88n3M6k1N4n9N6j75J31L5k8j5J43p1k36K73j30O8J9%j28K7M1j12
7304a64R4J53j41J26K5j5r6P5q9pN3j22J07Qk04J59M5j98K23P1lq3m1K03j07m
7330F8O6p0j93n6K22K1o7j78J47L0o2Oj01J89n5l2L5L5j55J09j04J66k15j5J64
7355d5K84k24j33L6J41k78J74O1j05M2q8j0P6K64j20j88J70N1j93l9J56K2Q6k76
7379a36K11o3J29j8j82P3j00J61j16R3r2J55j00m9Ok6O9J91k78J33Qj45K34j83
$$ y = [102, 67, -3, 232, -107, -82, -210, -43, -191, -46, 194, 26, -56, 21, 2, 80, 37, 228, 145, -73, -76, 13, -93, 152, -19, -34, -34, 65, -181, 260, 228, -52, -82, -126, 78, -120, 164, -161, -67, -104, 123, 27, -70, -186, -140, 59, 31, -17, 153, 37, -22, -47, 112, 65, -144, -70, 84, -191, -200, 80, -56, -78, 243, -65, 188, 26, 31, -14, 68, -131, -132, 8, -281, -278, -68, -10, 159, -29, -82, -36, -57, -3, -62, -6, -181, -50, -15, -43, -58, 85, 14, -222, 51, -79, -11, 8, 8, -120, -93, -52, -164, -70, 83, -58, 68, 93, 78, -18, 57, -32, -39, 14, -108, -1, 7, -197, -38, 7, -191, 32, 103, 100, 17, -24, 179, 72, 68, 134, 64, -129, -185, 37, 58, -9, -187, -40, -10, -72, -66, -167, 22, -33, -65, -30, 5, -150, -41, -145, 21, -194, -209, -45, 239, 15, -118, -82, 59, -219, -45, 16, -89, -47, -135, -145, -69, 195, 75, -113, 57, 108, -85, -124, 32, 54, 140, -136, 75, 12, 141, 123, -59, 14, -86, 75, -41, 52, -40, 115, 15, -34, -28, -54, 15, 206, -72, 61, 69, -76, 158, -25]
7403b5q6J1J28q8R7j69J62J57m37L21k51P6O7l4K22j41J79j65L7o8O5j01q9J79
7427D7ML7P0q9Q7k56J50j70R5k06O6K65J64j92p2j40J74J6qL4p7m0k4P1o4n0K7
7454h1J02o9p0K84j20j79J47j4j94J45K8o5OM10l67J19q4j45Q0j33L52k75J37
7477A4j44j3J47R6k13P8J05j64N8k7M7J50l03R0K29r9P8j59ln4J85n9r6J56j48
7502d9J17j34l8KQ1L7k34L14j23K42k18P5j72J06kj58P8L5J18p1N9p9L5J00j86
7527f5J21k47Q7J06Q0m0r6o5K54j09p6L7P0N9l12J33k02K01O6j49J91k84K76k13
7551a77J57r2J15N6mj55J51q9j29K12L7M5k0J46l09J08j36J33qjj4J20j28lq3
7576f8j27L42k04q5J70m6j00L01r0o3M4j24K54l59J90jk9K0Q4p6K09k59j2J99
$$ y = [-25, -111, -100, 28, -60, 37, -132, 30, 187, -250, 71, -180, -104, -37, -71, 151, 10, 189, 24, 61, -7, 58, -43, -132, 47, 51, 88, 158, 69, 156, -100, 50, -120, -25, -231, -165, 100, 264, 72, 0, -140, 34, 50, 42, 76, -1, -41, -65, 6, -58, -108, -81, 21, -48, -118, 166, 46, -133, 14, 0, -194, -49, -21, -86, -80, 330, -37, 82, -2, -147, -67, -200, 152, -123, 14, -130, -143, 4, 100, -113, -35, 70, -94, -36, -63, -16, 134, -169, -79, 150, 51, 129, -30, -33, -87, 98, 39, -57, 99, -49, 68, -66, -104, -102, -21, 16, -218, 96, -27, 215, -3, 72, -100, 6, 4, -154, -76, -41, 77, 6, 65, -14, 21, 121, -65, 56, -191, -104, 2, 82, 42, -54, -119, 135, 26, -50, -13, 57, 116, -196, -63, -265, -64, 2, -147, 44, -240, 36, -177, -20, -112, 3, 59, 55, -100, 51, -38, -167, 45, 82, 127, 107, 253, -56, 52, -84, 49, 41, 40, 26, 146, 18, 15, -68, -195, 147, -57, -142, 28, -18, -118, 183, 93, 30, 74, -50, 204, -155, 35, 34, 5, 25, 109, 33, 242, -17, -29, 170]
7600A70j98J44J08m8p0k0j79Q0jo7K08j89O3K09j53j80M4p7N8L58k61K0k08Q4
7624a05J84j10M5M4k42J16J57l0j53J07m6J31j34j09R7K9K7j43J86k3J96k05j69
7647a50L60k84j3J53j32O1j50L36k20p8K86l64J60l5P8Lj16M1J55l25L04J05k36
7670f1N5m0N6n2j64K54k60J74L1J41j28J99j17k38K33k09K80k41J86ol5l07N56
7693C07m11J32j24k6J04J36j67K02N5k05q2N0J41l38K04k4J32p2K5j2r8J22R6
7716A47Jj09J13l8j32J42j30O5j36J17n1K0R3j44J04L4l5o9J43p1J2M2n6k6J1
7741D7J60k79J55l50L03R4j56N8j59Q1J10lk06J50K3p7K15k11j1J42n5J4j66R5
7765b6q9J08M9j29K18k44K21q0J4K0l6n1r6K39k02Q6n7j39J54Q1M6j31j13l3L67
$$ y = [170, -28, 116, 224, 176, 106, 86, -93, -13, -14, -81, 127, -62, 1, 210, 57, -123, -79, -156, -98, 260, -1, 19, -189, -105, 79, -31, 14, 58, -184, -68, 89, 59, -94, 13, -33, 98, -36, -145, -48, -19, 8, -135, 51, 28, 224, 19, -150, 210, -74, -87, 66, -66, -5, -155, 181, -39, -117, 169, -195, -35, -70, 8, 11, -105, -64, 91, -234, 70, 175, -61, -6, -46, 10, -42, -206, 48, -212, -38, -7, 134, 6, 205, 88, -150, 83, -126, 154, -87, 99, 93, 58, -249, 307, -104, 28, -96, -122, -18, 118, -49, 153, 208, 3, -79, -29, 112, -226, -22, -46, 86, 14, 39, 27, -71, 51, 147, 148, 39, 152, 114, -18, 124, -6, 59, -77, 40, -11, 9, 102, -42, 62, 96, 61, -8, 135, 64, 76, 118, 62, 36, 47, 207, -72, 83, -267, 36, 130, -26, 32, -127, -46, 64, 61, -145, 5, 28, -49, 166, -45, -56, 86, 31, 45, -121, -26, -115, -7, 42, -87, 131, -113, 108, 28, 42, 62, 26, -25, -121, 118, -84, 2, -55, -194, -40, 41, 87, -44, -157, -190, 177]
7790A77j52r6J79j10J8K02l04Oj1M1l2K45k09J55J7j69J74q0j4j73K49J1l62J35
7814a03J63r2j15J98k57L60k58K39M6n7J8m0p0q9r8R1J24j95J41L6J61l23K43
7837A23o1j00J73R0nq0k18K59k45J59l6L3k75J22K81k57m4N3r9J47Q6p3j17k2
7861a06K06j82R5j27N0J40n9P8j37P6N3j01j01J58k8M8N6Q9jl66Q1J14j61J11
7885a4k6J26l7kK7j68o6L8J85K4j32q6M3J67R0o6p5M3j42j77J58K2R1p1M5l6O7
7912B8R2l61N53m35K1K02j12J0n8m1J72Q6j87o2M8O3j16J31kJ00j48J30j6J0k60
7937a52NK91j53j69L12p4k42J61j50M5M8N5M5j43J49r5J89M4j62k1q1J59j67R5
7961a1j95M06j91q0JJ32j18p3J22J00j40j11J63J12N8k04J51P6k60M6j14L2J02
$$ y = [177, 25, -71, 108, -2, 16, 218, -86, -80, -91, -50, -82, 163, -46, 109, 126, -43, 131, 51, 37, -136, 113, 124, -238, -103, 60, -32, -147, 51, -206, 154, -104, 135, 181, 124, 142, 102, 32, -57, -155, -64, 60, -135, 6, 42, 203, -120, 123, 62, -38, 135, 225, 220, 140, -78, 181, -64, 95, 59, 92, -183, -61, 220, -37, -81, -28, -127, 20, 106, 33, -84, -106, 100, -82, 13, -114, -64, 76, 17, 95, -42, 34, 87, -14, -115, 43, 15, 63, 119, 208, 207, -159, -78, 36, -125, -14, -40, 86, 49, 47, 74, -94, -160, -122, 63, 87, -45, -131, -88, 79, 169, 103, 28, 71, -71, -248, -90, -68, 23, -48, -3, -39, 28, 120, -241, 312, -123, -102, 100, -12, -2, -60, -101, 71, 157, -30, -92, -44, 19, -97, 34, 32, 132, -16, 114, 98, 108, -152, -147, 144, -9, -178, 134, 60, -182, -21, -171, -126, -78, -23, 22, -121, 28, -67, 122, 166, 4, -17, -98, 61, -106, -11, -206, 200, 9, -71, -70, 62, -56, -129, -7, 93, -47, -158, 5, 117, 175, -29, 122, 198, -62, -16, -130, -98, 4]
7984DP7J0r3j15P8J0j85K76J3o1K12k14n8P8Lj29J78J58k26r7M1J34j50J67j12
8009ak4N2k22K06N7k05k4K80j66J33M4j28j10K58o7J04k74R5j50N4L6m6J4L44
8033B60k78P5j9k61K35J56l25K58Kk1j52PJ45k29K48J9q1j54J60Jj90J87j23j81
8057b61K25J20jo5l07N88l15K58k16j18J43j51M8K9J7L3l0L2o1m8J27o8j41K09
8081D7j10k2N7N3q5q5m1K34J14Q0k28lR8p5j30J12j59P5J51j32j06J49J6QJ0R8
8107A26j13J87j16j72J7m1J17r7K3l7r7L06j29Q4j92J26q5l0NK27N8j75%m7M8
8132gl9n1o1J8L21k11K65k07l0j77K58j07k2n1J56M1Rkk7L8P7j10j43o4J21R8
8158I3q0M7r4m7O3J6j36O6J84r6O3j97J08m9%J17M2P6q7j36k7P6r9N0J65j01Q8
$$ y = [4, 81, 91, -2, -117, -39, -29, -214, 62, 75, 14, 226, 12, -46, 32, 35, -94, 84, 242, 16, -81, -40, 94, -56, 111, -1, -25, 27, -195, 11, 68, -137, -161, 119, -47, 86, 130, 2, -108, 150, 83, 187, -87, 8, -142, -88, -52, -98, -84, 260, -18, 57, 38, -223, 12, 168, -157, 101, 103, 82, -70, -63, 82, -147, 101, 120, 39, -115, 45, 46, -144, 43, -80, -261, -36, 84, 83, 18, -289, 299, -16, 242, 26, -92, 51, -100, -52, -23, -6, 27, -3, 29, -32, -80, 47, -21, -162, 47, -63, -85, -28, 25, -60, -145, -186, 48, 162, 242, 14, 11, 109, 34, -96, 16, -143, -68, 83, -49, -155, -6, 10, 18, 28, 126, 13, 200, 84, -88, -71, -112, 5, -92, -69, -106, -203, 103, -26, 58, -134, -8, -93, -123, -118, 109, 167, -8, -8, -55, -7, -46, -97, -158, -140, 181, -30, 235, 28, -2, -179, 79, -28, -50, -101, 55, 96, 105, 103, 76, 114, 191, 81, -62, -126, -5, 93, 13, 60, -34, -81, -18, -2, -138, -72, 112, 16, 79, -118, -10, -59, -59, 58, 100, 176, 89, -47, -74, 2, -97, -47, 118, 17, 105]
8185A05Rj70J91J0j78j8
$$ y = [105, 114, -56, 135, 145, -33, -51]
8191e1
$$ Imaginary data points
##PAGE= N=2
##DATA TABLE= (X++(I..I)), XYDATA
0@%%%%%%%%%%%%%%%%%qJ6j6J6j6J6k4L2l2L8m6M9n7O7p5Q8j01J12j25J41j60J80
39I5j99K22k48K73l02L35l71M10m53M99n49O05o67P34q07Q93r90J097j219J360
59G18j525J722j961K257k637L142l852M928o776J0799l7636L3458L5178q0443
73d2628K7746N7490m6739l1323O5055o785n1205L0031L1040m5769m317L8431j3946
86G081k7100K2935R112k1437k578J6917l20j2774L42J7064m767k0076J4862K0149
100A9410k7112p463L6694j0990l6227L2628K2141m7981L407M9499l3659l5322
112c4975N3054L534n8805K8155M1349n1488j0716N8534j8645m2142M3338J8007
124B9200m8922J0152L9819k9292k0861L5943j978l2592J4167J7697k0613o727
$$ y = [0, 0, 0, 0, 0, 0, 0, 0, 0, 0, 0, 0, 0, 0, 0, 0, 0, 0, -8, 8, -8, 8, -8, 8, -16, 16, -16, 22, -24, 25, -32, 35, -40, 48, -53, 59, -66, 75, -85, 95, -104, 118, -130, 143, -159, 176, -195, 215, -238, 261, -288, 317, -350, 384, -423, 470, -520, 577, -642, 718, -807, 915, -1046, 1211, -1426, 1716, -2136, 2792, -3984, 6815, -30821, 2637, 37815, -42628, -14882, 42608, -4131, -35454, 29601, 22816, -28389, 1642, 32682, -13087, -17404, 21027, 7081, -20019, 2916, 12028, -9409, -11987, 4930, 4610, -8164, -7822, 9242, 4475, -15601, -739, 19410, -7702, -15165, 21529, 10539, -25688, 6940, 29081, -18900, -15493, 34006, 347, -34975, 18079, 21613, -37192, -9037, 32312, -19176, -29892, 28642, 9997, -32145, 11193, 29200, -19722, -9570, 30249, 957, -19904, 16039, 14061, -18531, -4364, 13333, -7280, -14007]
136a4007J7728l01j2112K948J2128k116j2423N703J4402j2925j0485K2438L105
149A4083k6470J0770K3001k6825j3064L5034p615l4710K6835J9671m0151L022
161a6419M0007k4537k4741L8904L082l8389J9365K7950l2317p807L5007j1366
173H739k6693K4181J1297k8252K957K0485j5332j2459J6696L355j3696K917J1233
186E428l656q268O025Q746p710o508J2201L527j5542L351J6032j2698j3110J8981
200F799J560k4461J0566J9669k2367p794K8338p444k3682K1920J3160k6969L336
213g369K5979j6530j5863K4340K027k5138J0722J6923j9923o889K0815n525j6524
226a2955J1623Q379j3947j318J3271k374r898P206P974q112m007J0180J456j1098
$$ y = [-14007, 3721, 3420, -8692, -5744, 6384, 4268, -8155, -2452, 11950, -975, -11460, 10978, 14083, -12387, -1617, 21384, -5441, -18505, 16529, 8914, -25796, 1039, 20710, -19441, -16419, 23588, -949, -25690, 13214, 16296, -22093, -2728, 25222, -7095, -14902, 20105, 8739, -17954, 6227, 17524, -10728, -7771, 12714, -2618, -15077, 1619, 4974, -8722, -5805, 5428, 1772, -6496, -471, 8275, 565, -5943, 6258, 9785, -5757, -2406, 13626, 928, -12182, 6799, 8359, -16102, -5536, 14133, -8234, -16028, 12310, 4866, -18816, 3104, 16264, -10705, -7369, 18610, 2080, -13783, 10557, 12584, -12554, -1832, 15091, -4832, -11721, 9094, 3569, -12955, -1332, 7047, -6900, -8218, 5053, 2679, -7219, -13, 7961, -151, -4158, 6022, 7478, -3620]
240c620K715R642p536r365J1256L094j5839L241J4654j1193r689J8080Q84j8317
254a1993J0064J4109j6127m227J9288m293j6083J3107Q964j8599l45J7158j0459
267E64j2356J4924L218j6204M424J2617r594p066J2641J877j1640M686J0451p759
281G83n580J0198J315j0360K809Q303o518o901P938K369j0847J138J0320o175
295a208q197J1155L128j1913L577J1953q171o907J2717J459j3042M989J0474j0822
309h08n796J3177k402j3160P776P697j2309j787J2661m623r145Q936N908j0576
323d451P07J1142m729p624Q535L656r870Q62Q286n298o575O223K756q406l8Q134
339C310l421o804P039L916q505Q71R292l799o764P789L682r273R47R137n772p264
$$ y = [-3620, -905, 8737, 1201, -8164, 3092, 6186, -9653, -6412, 8242, -2951, -12640, 5440, 6324, -11993, -1929, 12180, -3947, -8174, 11114, 6821, -9262, 3845, 12809, -5790, -6135, 11023, 564, -11792, 3132, 6350, -9854, -5430, 7187, -2407, -9473, 3168, 5045, -6595, -1909, 8542, 783, -4797, 5401, 6716, -3644, -835, 7468, 950, -5951, 1987, 4356, -6491, -5353, 4967, -1208, -9405, 1750, 4878, -7035, -3458, 8495, 324, -6583, 6134, 7593, -5449, -460, 10014, -808, -6604, 6573, 4171, -8989, -1213, 6484, -5825, -7612, 5049, 426, -8719, 217, 6125, -4451, -3744, 7398, 2669, -4955, 3580, 7236, -2634, -1772, 6514, 1216, -5359, 864, 3620, -4786, -4824, 3310, -111, -6915, 124, 4040, -4465, -3594, 5698, 1899, -4865, 2924, 6606, -2667, -1720, 7417, 1645, -5619]
355e619Q521J927j0761K906Q216p572n086R700j03q828N287P106p372k632R145
370D835j254p587N602N189p809j068P222k857o437M040L188o417j573O176r28
385C22n727M566M541n605j320O808j180n792M611M479o180k166P548k247o833
400d175M926M165q445p27Q058m479o001P528J861p804K367O833m388l346P255
415C628N29o827K893M879n157j954N492j039n117J838K785l550k356M146N35m429
431c704J343M741k602k684N029J120n384J684N301l505l490N362M25p060J961
446a463N076n934k386P268j638o070M802L189o222N35O300k990m086N421J883
461C685n021J608M380l889k597L362J43l595Q09K000j598j885J587J330j886n51
$$ y = [-5619, 2902, 4829, -5932, -3026, 5190, -2382, -7468, 2232, 2129, -6699, -1412, 5694, -1678, -4310, 4835, 3581, -4006, 1596, 6785, -1024, -2092, 5130, 2273, -4164, -124, 3064, -3353, -4926, 1250, 322, -5405, -839, 3702, -1903, -3223, 3585, 2405, -3387, 1224, 5703, -477, -2643, 4905, 2658, -4175, 751, 4916, -3529, -4256, 3802, -677, -6678, 850, 2711, -5093, -2726, 4107, -281, -3627, 3628, 4157, -2670, 223, 5102, -55, -2009, 3483, 2444, -2673, -835, 1950, -1600, -3956, 190, 725, -3704, -2361, 2380, -222, -2906, 2123, 3243, -2141, -457, 4844, 1339, -2151, 3211, 3636, -3424, -1463, 3613, -2321, -4707, 2561, 923, -5147, -345, 2844, -3378, -2843, 3457, 467, -3619, 1802, 3685, -1336, 272, 4652, 763, -1834, 1528, 1671, -1924, -1115, 885, -713, -2598, -1011, 319, -1567, -2118]
477b118L253j35l325K163K978l165j211N005p84m892L578K966n631q02N174l329
493b75m581N316J214n722K493M472m619j384N650j290m023L785K531m464N97L907
509C607k579k183K577l49k606M27J318q66n73O23K57m14r92J358J490j616r1K777
527B165j009k680K819J682m266N32M056l400k823N008n49n153L018K834n464J85
543c045N219k967k518M640M95m079K464L223l500n37L843k061k564K534l66k392
559a611J149O36j167K13L27l64L49l69j53J429l14j040J843R98k009N94J944k379
577G6j603L479r64l514K993J471m417Q20L758l320j885M388q66l445L453J707
593B131l674R75L657k735j419L311n42l022K054N67k503N74P36j147k77J138m08
$$ y = [-2118, 1135, 1000, -2325, -162, 2816, -349, -1560, 3445, 2661, -2231, 1347, 4313, -1318, -2120, 3054, -275, -4856, 460, 1674, -4048, -1555, 2917, -1702, -3086, 2564, 1274, -2749, 1036, 3567, -897, -300, 3607, 1028, -1155, 1422, 1073, -1533, -1106, 212, -654, -1227, -604, -347, -761, -1753, -395, 1095, -521, -612, 2165, 1156, -1524, 1295, 2977, -1289, -757, 3299, -101, -2924, 2084, 1535, -3618, -600, 2234, -3230, -3045, 2174, -793, -3311, 1329, 1824, -2255, 209, 3432, -68, -605, 3238, 1177, -1387, 1147, 781, -1611, -462, 174, -993, -780, -453, -817, -468, -837, -990, 439, 125, -915, 928, 1926, -83, 511, 2455, 76, -1527, 1952, 988, -2526, 467, 1938, -2479, -1659, 2099, -1221, -3106, 1282, 416, -3029, 424, 2131, -1543, -568, 3089, 354, -1065, 2246, 1704, -1318, 736, 1303, -1200, -626, 110, -1037, -1314, -176, -584]
610e84Q9L58m26M76O86j168O12J239r51m68J936p48k125J968O11l148Q33K590
628A780k877j112L361j372k373K918Q45l295J625K587k499m78K954r53k453K549
644A207N54k672Q38J757k124n26J451r24j124J137R2n83O23K31k69O61j43k57
662g1J038k43q98J196P1j656P09J201j888o46K106j090j919K540J42k493J576
679c25J345k338L35K792j387j371K158K01k000Q14J636k106m14J777r92j114J099
696A10M9j339N25O48p32J64O20Rm0J83J35J32J6m72O25K84r44L35N35r14q98J411
718D42l90j759J394P89j540K54J866j239r34J963l5j540J268J005j521k47J531
735A307r93j317J519K50j903N74O83r46j25R26j42n89Q87O2l21K09J50J88P0m07
$$ y = [-584, -495, -137, -563, -87, 599, -569, 43, 1282, 331, -137, 1799, 1051, -1074, 894, 1505, -1643, -810, 1780, -1097, -2209, 1152, -220, -2593, 325, 1170, -2125, -500, 2087, -412, -890, 2064, 1111, -1342, 1207, 1761, -911, -73, 1684, -440, -966, 485, -439, -1563, -426, -334, -917, -294, -63, -332, 329, 186, -71, 967, 724, -174, 1022, 1093, -563, 146, 1347, -541, -1187, 919, -171, -2090, 450, 592, -1901, -325, 1020, -1318, -983, 1809, 422, -949, 1209, 1410, -590, 224, 1860, -246, -660, 1117, 125, -989, 110, 159, -1180, -655, -7, -739, -575, 45, 54, 14, 197, 332, 464, 480, 8, 633, 917, -27, 308, 843, -71, -969, 442, 52, -1707, -313, 476, -1064, -810, 1056, -183, -1117, 846, 811, -729, 539, 1544, 23, -224, 1307, 314, -1003, 516, 766, -1137, -563, 120, -826, -951, -25, -167, -756, 131, 193, -128, 81, 231, 419, 489, 82]
755H2M29K01l52m39M55k60j012R31J91j090M6J047p83l41J174j19q97R64P19j233
775b87L37J044p09p77J142j46r59L36M86r75m04J241n24n52O53K5l95P6O50k90
795b8N7L13J69r6k61K90j0j80k83L26p9p29J74N35p57L4N90k30k68K65M12m43
817a99M3R09m67o49J067r6j012O09N83j136J32O90n13o57P08j15m56L93J35m16
837d47K53M96j0m17L34M74l17j41oK54n22l0p4J82l57j76N84l62k46N01r7l26
859d50L60N21n88J65M91j03n42N05L34p53n0L89l07l17N57j24p92L76L97m63k9
880d23M78j09l22L18M86l64KN16k43l30J32K11k72j40J51j28O7k91K18p8l44J72
902b93J39n6O4M41l03k15N75m1l64K80L62k89m62N52k45l73J43L05p42L04L30
$$ y = [82, 511, 712, 360, -79, 376, 116, -896, 35, 226, -864, -818, 229, -554, -895, 279, 160, -737, 227, 946, -287, 50, 1094, 385, -392, 750, 604, -355, -19, 467, -508, -912, 329, -195, -747, -94, -69, -464, -388, 262, -28, 29, 342, 511, 415, 154, 444, 434, 254, -29, 297, 218, -511, -337, 198, -559, -525, 65, -165, -433, -168, 244, -199, -156, 753, 286, -363, 704, 608, -404, 205, 788, -348, -216, 474, -39, -696, 12, -103, -559, -166, -31, -447, -194, 302, 292, -125, 209, 683, 366, 225, 219, 473, -49, -79, -153, 29, -328, -504, 80, -282, -528, -27, -124, -450, -90, 431, -157, 8, 499, 396, -146, 359, 693, -60, -110, 279, -28, -345, 212, 88, -704, -328, 69, -394, -423, 55, -54, -376, -58, 428, 64, 66, 582, 339, 9, 141, 352, 80, -60, 91, -37, 30, -261, -43, -121, -465, -293, -154, -210, -146, 295, -8, -223, 352, 311, -53, 227, 589, 300, -162, 390, 145, -228, -85, 220, -522, -218, 112]
923A12k09l42J46M77m56J14O03l49j09N54l60l05K56K55m59Oj9M5l57lL12r5J7
946a66m0J26Q8j87M34P6j96J7M23q05K40N46l38l21K15J0n28J85K32j06l13N80
968A72j31l43J77K87m42K25M78n23J49K18k19n8J82j3j86j16K10k10k0j5l1n5
990b64J18p5J27J84n1j07K12o2%L43l60o4L08O5p63L70M09p99O7O09l30l15L43
1013c5M6l38K81J52J09l42L33k21j96N95j71k81K93J23l03m6L4j36j55K84j66
1034a40R4j05j26J79K33j51j82J97N05n40l4N32l74j08L63n70J40K13j20k74K76
1055HJ52p15L16L67n05Q4L93R4j31L59Ml58k9K78k45k2j2j0l15K86p4l56L92j02
1079a41p9K51K06j42r2J64j06k03K89k21K17N4ll29K55J56n40L8K17j94N1K74
$$ y = [112, -97, -439, -293, 184, -272, -158, 445, 96, -13, 541, 181, -124, 132, 387, -72, -66, -85, -40, -397, -400, -88, -183, -166, -206, -80, 8, -179, 255, 331, 135, 152, 575, -230, 10, 556, 218, -103, 112, 122, -406, -221, 11, -95, -408, 172, 41, -302, -125, 162, -280, -55, 423, -100, 49, 267, 48, -10, 172, 159, -27, -143, 67, -143, -163, -178, -209, -264, -146, -221, -94, 90, 39, -68, 144, 82, 82, 425, 65, 1, 309, 374, -389, -19, 390, -409, -342, 267, -63, -378, -35, 11, -327, -46, 106, 215, -127, 206, -15, -211, 384, 213, -68, 225, 348, 45, -1, 33, -103, -258, 26, -140, -46, -151, -277, -98, 135, -16, -198, -1, 504, -36, -70, 462, 88, -20, 343, -227, -87, 126, 6, -268, 8, 160, -555, -239, 128, -377, -293, 100, 194, 63, 422, 426, 68, 39, 317, 72, 50, 38, 28, -287, -1, -75, -431, -39, -141, -220, 31, 237, 95, 3, 167, 61, -142, 147, -74, 143, 197, 194, -135, 120, 276, -264, -226, -9, -203, -152, 122]
1101A22n05J0L52J86m00L31K65l04r2K81l76K0L38k86qJ12j12k06K97J04l69L96
1123A56k73j6M7J62q9p6J28N6n1m1K92m59J42L21n22L47m1m14L10J42m05Q8P9
1146a17Q2k89J60J50j70K64Q5l82J16L79k38qR8j7k15K61j56k16M4M54k89j98
1168b02J15R3l82O04j40j44K68K6m05M69j57k46K48Nj46l7K09l82k3K93j05j32
1190a71K89j12k34L57q1m04K64O3K2l4N12k57m41N05l4l28K99qm51J63O1j16j39
1213b75K70K3l23L35M4k5M6J36j91m5L72k88m6L21l13j3Q0j33J24j05O4m03J94
1236a51L20Kl16K87k54K7L16l34N7J16k4j12m0K58j85K0Q1N9k28J35R4n77L36
1259a13J80l59J47q0L04j83N7L48m58J61M9k1J11j18J36k12J5j32k40M89j79p4
$$ y = [122, -383, -373, -21, 165, -235, 96, 361, 57, -35, 246, -130, -110, 228, -58, -66, 46, -66, -272, 25, 129, -240, 156, -117, -133, -86, 76, -13, -89, 39, 95, 44, 3, 295, -164, -22, 299, -223, 124, 83, -331, -21, 121, -284, -196, -117, -35, -324, -164, -14, -184, 80, 165, -217, -101, 278, 40, 32, 130, 113, -102, 159, 3, -213, -169, 285, -4, -202, -87, 6, -376, 228, 88, -56, 212, 238, -167, 302, 145, -101, 147, 152, 6, -31, 178, -204, -227, 66, -39, -171, 118, 6, -228, 129, 48, -356, -92, -29, -7, -41, 471, 214, -227, 278, 244, -84, 215, 207, -244, -81, -20, -136, -275, -5, 18, -305, 30, 74, 49, 95, 231, 40, -5, 367, 79, 33, 354, 41, 28, 108, -25, 99, -6, 58, -345, -151, 169, 171, -145, 142, -112, -85, 231, -103, -46, 70, 46, -66, -106, 152, -33, -13, 68, 127, -101, 34, 128, -449, -113, 67, -292, -145, -225, 79, -104, -47, 301, -157, 4, 53, 32, 143, 25, 161, -51, -36, -168, -408, 81, -98, -172]
1281a72J00J35k29J91P8j58J10N6k14J04M04m51j6J80l36J77j9J36j46J05k18
1302a83K22j39J86n8p7R2j5k10L81O0k11r5J0N4m1M0q0j08K27q0j13L03l39j08
1326b82K08j10N2J77j28J21K12k65l5J08R1O4k90L28l41N7K21j33o6l2J35m00
1348c08Q9R7K22l18J84R9j62K48j85K38j71J74l11P1J4J75j87j08L32k28k34K99
1370C0N1r9l1LJ49Q1k95K92n1j95P6R2J45k25K99q2k62n0L1N4m1O7j53K4r4J71
1396a3J76j70j02J86jj01Q2n4r7K87j37q2P1pk2p9l5K04r0k01P2K37l44J17J52
1421D9j9k16J83J18q6n1l7K10j21k01K26k4j31J24k02M7l4J24j06k4K79q2j5K93
1445C04l20j6J29K7n2l8p6k3n5K27j29M0l6j87K18j53J40k67R9O7Q4J86o2k42
$$ y = [-172, -72, 63, -166, 25, 103, -55, 55, 111, -103, 1, 405, -46, -62, 118, -218, -41, -60, 76, -70, 35, -183, 39, -100, 86, 28, -49, 43, 28, -182, 199, 259, 48, -47, -37, 17, -24, 16, -64, -172, 55, -25, -138, 165, -174, -282, -74, -184, -132, 45, -83, 38, 250, -15, -50, 58, 149, 213, -77, 251, -90, -33, 188, 55, -11, -43, 92, -308, -219, -122, 100, -218, -34, 65, -97, 151, -34, 204, 33, 207, -104, -33, -19, 156, -31, -139, 193, -35, -269, 30, 81, -18, -49, -46, 103, 184, -111, 181, 130, -65, 11, 103, 248, 23, 322, 240, -22, -72, -41, 13, -28, 39, -114, -90, -184, -13, 163, -7, -109, 77, 76, -25, 57, 3, -94, 193, 56, -26, 45, 38, 16, -63, -98, 106, 16, -185, -113, 124, -220, -103, 49, 30, -186, -3, 115, 29, -22, -59, 151, 30, -171, 55, 31, -100, 24, -178, -131, -165, -41, -147, -171, 108, 26, 11, 304, -16, -32, 97, 124, 72, 34, -42, -65, -120, 107, -22, 18, -18, -205, 13, -140, 0, -267, -168, -101, -17, 169, 107, -135]
1469a35L77m1l27J79j86J08R7J45k27Rj02P9k00K51k75R9K66j32J74k51R5m5J70
1492A28j77M4j69M67l35qL1l7K8l5O6n2K18l79K27O8j01m6o3L37j18J17j45j24
1516e8j9P7k0k14K02N8k43q9L28l23J77J84j9k00J77K28j92j89K86k77P5K28k35
1539e8K51j53J01j83j04n9K93j95J09n0K19l17P1K53l30L17j87J05l8o0R7k77
1561a95O4J40J48k32K20O6k12j53J81j99l9J82j32mj11L52l26L46j65J95k3q4
1583A9J57k20Q8O7k75P9m6j3J67pk7Q9l37J98J42k31K98k85M35l62K34l74K73
1606F9p1nJ12k72L17R4j58j22j13J3K69k24K79k12M0J71j36o2r1J60n9j73K22
1629D8J64j21OK3l31L25k27j46K21J79m12L85lO0j00M8m8M1J0m5J77k15JJ48j86
$$ y = [-135, 242, 201, -126, 53, -133, -25, 72, 217, -10, -1, -103, -24, -224, 27, -248, -149, 117, -15, 159, -92, 3, -42, 128, -49, -5, -174, 293, -42, -50, -19, -56, -28, -63, 3, -49, 169, -210, 17, 85, -16, -62, -125, 212, 94, 211, 66, -58, -77, 0, -20, -234, -32, 26, -217, -306, 22, -301, -124, 60, 41, -159, 18, 246, 54, -135, 151, -126, -51, 177, -58, 193, 40, 141, -42, -146, -205, 88, -107, 2, -48, 171, -146, -75, 178, -152, 165, -22, 83, 45, -15, 82, -195, -131, 9, 157, -75, 145, 211, -1, -154, 27, -172, -211, -29, -161, -165, -276, 76, -250, 96, -69, 126, 103, 19, 176, -44, 44, 111, -164, -85, -131, -144, 23, 16, -11, 78, -259, -61, 81, -150, 148, -137, 298, -64, 170, -204, 69, -2, -7, 105, -167, 150, 244, 86, -36, -149, -136, 133, -91, 188, -24, 16, 187, 51, -11, -102, 58, -1, -174, 48, 212, 91, 97, 120, -211, 114, -113, -259, -38, 141, -271, 114, 111, 171, 71, 119, 71, 112, 122, 77, 254, 39, 40, 188, 2]
1654Bo6p3Q9J4m3J72p8Q9q8M8o0j54N6J60Pl2P0j29N3J77o3k41P9R5k55Q2p3K42
1682H0k18K11o8K1R1q7jK3q7QOL11k75J92k52o5j35L94j96M0N0L7l45O2K23k21
1708b01L56j70j28L62p7m47L71QJ77l84O9J8k8q7R9p5m4J77n6K54j02j9M5L8j25
1733C1J09k26J14k34M9L61j95K28k11J15j12k0J67k81J98r6n8P8M8k68J59J22
1755G8kp6J59j05J0N9j39n6K0J30j03l2j6qJ77n3o1K77k42j2J7K05j55n5J72J
1781A90j42L0j75J09O1j10j14J11J21k4R4k47J50l2O5n0j07j39J46P6j79M27k89
1804b8J66l4k02K40k31J9J62l11K18J79l00j4K6K56l13K38M7j0J13q6j32oJ55
1827A52j40k15L24j29K67k64j60K29j30K22k10N2m4o1L4J87l72N1K89k39K75j62
$$ y = [2, -64, -137, -48, -34, -77, 95, 17, 106, 18, 66, 6, -148, -92, 68, 75, 43, 113, -16, 37, 214, 151, -90, -11, 84, -171, -89, -162, 80, -138, 73, 5, 26, 117, 30, 29, 52, -35, -27, -21, 290, 15, 207, -45, -110, -245, 149, -47, -7, 43, 80, -265, -203, 20, -201, 155, -15, -143, 219, 142, -305, 66, 74, 251, -133, -64, -46, -74, -161, -62, -137, -181, -4, -60, 194, 92, 73, 118, 156, 31, 140, -86, 28, -206, -157, 204, 9, 237, 26, 141, 29, 9, 176, -105, 93, -3, -61, 17, 65, -203, -44, 78, 76, 0, 159, 54, 64, 123, -16, -72, -52, 78, -25, -57, -73, -81, 96, 43, -18, 259, 17, 5, 22, 227, 72, 17, 189, 190, 48, 78, -97, 12, 73, -37, -151, -40, 81, 57, 151, -96, 54, 22, 87, 37, -70, -209, -63, 13, -166, 261, -28, 138, 104, -98, 142, -89, -70, 92, -219, -1, 178, -122, -136, -110, 146, -167, 71, 118, 108, 221, 135, 3, -3, 152, 12, -203, 121, -8, 259, -5, -165, 64, -66, 156, -54, -2, -46, -107, -73, 114, -258, -207, 82, -157, 118, -44]
1849d4J18J6l0j38R8R9J92j29k69n5J15J57L8q1k24J92J29j75n3n5J57j12L2L8
1873A6o9J20l0n7R2P8k26Rk8r8J91J35m51K16J59MJ36pq8k62K39j02J07j80M2
1898e4m4N7J15o6R6j42J78j8j04j15J16J30j9k62J35j54jL18j32p9o6Q0j49J59
1922b1p%mp4R7j42p0K61p6K6J8K7j38K29J74k31J30l01J00k67O4J38J46m3N9j82
1948h7R3M3J31j98J46k53K88q1o9k2Q2K27k33j96K8Q7q0J5L6j11K34J4q3J8O8
1973I7k1J53k42k06PL36j32Rj8M7k2l38M27j14q6RQ7k1j07p0J51P9j00L6R6j09
1999e2J19J25j17j15k31J67J58o2JJ42j47P2k01j02J98j39K7K61k33J26j47Q1
2021f9M4L1J49k99Q2Mj4j7J72j48J00p3J13p1q5j45K72j63j7K19J19J23m57K03
$$ y = [-44, 74, 90, 60, -78, 20, 119, 311, 182, -87, -142, -27, 130, 168, 87, -137, 55, 184, 9, -44, -99, 58, -54, -22, 16, -53, 67, 37, -20, 72, 150, -76, -67, -95, -193, -2, 133, -318, -102, 57, 61, 197, 190, 102, -160, 79, -23, 84, -96, -54, -98, -41, 74, 8, 104, -38, 140, 122, 18, -97, 19, 149, 130, -132, 3, -151, -152, 166, 34, -45, -111, -31, -180, -21, -28, -28, -32, -106, -9, -151, -221, 40, -36, -10, 8, 35, -103, 126, 300, 69, 199, -102, -2, -269, -205, -67, 79, 36, 95, -87, 6, 49, 180, -18, 128, -125, 163, 82, 13, -9, 73, 300, 67, -129, -101, -14, -94, -79, -43, -154, 80, 94, 11, 29, 97, 76, 229, -13, -219, -212, 124, -8, 1, -17, 30, 8, -330, 97, -17, -103, -94, -7, -28, -135, -205, -54, 25, -75, -39, 57, -52, 67, 192, 75, -40, -271, -104, 54, -8, -7, 135, -12, 60, -141, -243, -45, -184, -157, 104, -129, -3, -150, -69, -25, 6, 155, -144, -62, -58, -72, -89, 83, -65, 35, -38, 75, 4, -81, -226, 46, -117, -134, 85, 204, 327, -130, 73]
2045G3m1J25M2j55j91K22j18J48J18m87L33k24K74j54J2N5j3n1l4O2mj3J9R3J8
2070A09J7k40J34j91K75L1q7j52M5J81k10k5L69k89KJ41j74K7J01j26J7N1K25
2093B31j67KN0l84J52J35j60J30j83J6K11l4j27K29n5oq2j14K76o8J11Q0p6k69
2117a02J06P1k5j3Pj63P4P9n1j50K78j32R4j96m9L17kq5j83J13P7k51L17m1o1
2142B9L4M8j30J76k93q9R5K8O8K6r2J81O0o4k1j00J11p3J53j32l5J59p5l02K13
2167b5q2O7J89l03m0J94p6j70L07k94J02K24k38R3RJ19k49K95k29J94K7oj73J00
2191C5j28j6J28k3j78K39L3N6j36J67L4j33k36J13Qp3O2R6k7j91L32j01L4L6l0
2216A01j09j15K34k6j7j85L9J94j04J4o4o3K07M9l32K67n7P3n3LL2rl09K22l5
$$ y = [73, 32, 157, 199, 44, -147, 75, -43, 105, 223, -264, 69, -155, 119, -35, -23, 32, 19, -32, -66, -4, -8, -21, -2, 91, 109, 126, -114, 20, -171, 104, 135, 48, -104, -59, 122, -88, -113, 256, -33, -31, 110, -64, -37, 64, -62, -45, 6, 231, 64, 66, 116, -268, -116, 19, -141, -11, -194, -178, 33, -1, -128, 101, 46, 40, -42, -156, 120, 52, 163, 243, 167, -102, 4, 75, 50, 37, 44, -119, -45, 34, -17, -167, 111, -21, 73, -123, -172, 145, 143, 58, -125, -12, 65, -186, 131, 90, 29, 63, 111, -19, 157, -136, -225, -130, -102, -34, -8, -100, 81, 141, 77, 56, -44, 67, -6, 147, 15, -20, 139, 64, -238, -25, -107, -40, 149, -154, -194, 0, -76, -246, 61, -233, -131, 93, -145, -52, -43, 76, -173, 122, -107, 87, 114, 108, -65, 35, -93, -109, 19, -4, -182, 57, 90, 146, 10, 177, 211, 78, -158, -45, -37, -110, -48, 48, 21, -170, 162, 61, 95, 131, 101, -8, -123, 111, 85, 68, -117, -78, 116, 12, 26, -38, -101, 106, 155, -177, 90, 33, 106, 53, 56, 88, 79, -230, -8, -43]
2241d3OMj04R6j85K79J64j91Lj08K4J12k76J25l7K97j10j82L66j61q6O4J17j16
2265E8J8j40K94j60K0k20%P6j13R1j06J08N7K43k36L3j55k0j3K25J3j96P3M7j13
2290a16J6l2Q1q0J15K38k73J24r3K9K2N0q3M8j78J31O7m4m3K00j36o0o6L3L1j47
2316a66L57q4j12j77K45q9j9J0M3j57J03Q4J1J5K09j52j71M69m30o9J51k47R7
2339g9p6L09k93O5R9L0j44K27%j89L2J05j85K08j27K11k63K32j61Q8j19K5J39
2362A34k21m3k3J19J5M6K4J23j98k5J82L7p3j15l5J09O7M5n6O7l0j54Mj00J19
2387A8Q2k15J17n5R1k11J73mk2Q5j06K98r2j40n3O9L9j69J8K05j96K8J8J48nj49
2413b8K34k35N1N1l01R5J48j12K10k12K50j33J41j63o3O3m4O4pl5K03P8l66K53
$$ y = [-43, -37, -33, -137, -41, -226, 53, 217, 26, 29, -79, -55, 57, -219, -94, -131, 166, 56, -126, 240, 79, -7, 57, 174, 58, 76, -64, 230, 70, 90, -130, -130, -54, -167, -76, -182, -74, -17, 226, -10, 23, -132, -152, -165, 60, 73, -123, -50, -3, -116, -100, -132, -51, -131, -16, 222, -51, 73, -20, 9, 31, 81, -2, 46, -132, -1, 66, 22, -21, 179, 43, -17, -83, -50, -19, -166, 191, 107, -5, -182, 63, -26, -45, -35, 8, -149, -46, 38, 49, 64, 273, 121, -50, 419, -11, -80, 71, -176, -79, -155, 154, -139, -74, 25, 55, -89, 138, 138, -51, -19, 86, -99, 109, -18, 193, -70, 162, 1, 89, -30, -5, 134, -87, -130, -153, -34, -19, 27, 51, 174, -24, -49, 133, 170, 97, -18, -53, 56, 123, 168, 112, 179, 149, -5, -1, -101, 18, 100, -115, 2, -53, 38, -173, 0, -4, -26, 59, -47, 251, 159, 19, -34, 35, 74, -95, -77, 128, -68, -40, -22, 126, 121, -28, 206, -29, 22, 73, -228, -133, 15, -97, 113, -99, 151, 18, 159, -4, -67, -4, -48, 16, 9, -26, 177, 255, -111, 142]
2437A42l1o1j72J8j15K90l2K1j4l77L31j08J60k50K16j8k55L10KR2j07o3j19J35
2461ej02o7mL77m0k09J50j35l0J04l9N0P4r6k26N7L57j46nj47K1K42j58L8j67
2486a06J61k25J72JjLP9j75n6K5J50P4j34o7J66M0r1N6rk40L27j18m8K23m32K26
2512AN3l9J01J07j84j13k0K69k87J54J2j58N6M0k6q9R9j6o5K46o6k33K51l05K46
2537C4m3K1K16j23o5J88k36j56K10K0r2j0J18J07m79K80J21O5l18J25k4q1J80
2560E8k24K78j36J23%%k99M41m3l34J24l3J37q0J5J29j06k6q4R2o9n3KP7N2J0
2586E1p2j34J50q0r7J04P8Ok28K69j50k4K01j36N9%r2M9jJ39k10J37P6j05o5m8
2612a23K76k17l3o2R4K17j94O0j4K2Q4k23K5qJ32j93n9L08P9j54L4j37J66k27
$$ y = [142, 111, 50, -122, -104, -219, 71, 39, 60, 46, -331, 0, -108, 52, -198, 18, 0, -255, 55, 57, 149, 42, -21, -140, -5, -107, -174, -178, 199, 159, -50, 100, -35, -65, 39, 0, 50, 124, 28, -198, -141, 216, 70, 65, -82, -61, 181, 23, 61, -106, 55, -170, 2, 3, 2, 5, 84, -91, -147, -122, 28, 102, -32, -99, 67, 107, 16, 72, 63, -177, 150, 32, -16, 207, -225, 1, 54, 15, 116, 223, 39, -74, -94, 175, -112, 42, 54, -104, -48, -8, -34, -123, -24, -40, -105, 141, 75, -158, 93, -212, 34, -9, 12, 228, 105, 40, 228, -8, -164, 46, 66, -26, -36, 82, 189, -290, -10, 111, 176, -142, -17, -41, -122, 58, -166, 112, -24, 99, 99, 99, -200, 241, 198, -136, -12, -45, 92, 12, 27, 156, 50, 24, -60, 32, -37, -90, -88, -11, 41, 51, -21, -155, -5, -85, -182, -78, 0, 6, -222, 47, -103, -127, 74, -62, -3, -3, -95, -46, -47, 92, -118, 19, 95, -10, -75, -123, 153, -64, -97, -159, -65, 152, -42, 18, 4, 26, 110, -113, -88, -96, 36, -157, -216, 92, 171, 17, 51, -86, 80, -147]
2636a47J16lp9Q0k0K9n4K71k86jJ25J33k35q0J90j81j1J04N1L2k4o5J33l52J78
2661i6K92m27K11op8O7J24L7j48j7K60k03M9m3N6j57j2o3M1J08K04l29l7L82k80
2686f5l6k7J67O4n9pJ2qr0M1J4J6M9l47J27J44j80L75k26K24j2j97N0j49K23j08
2712eJ05j74J14j42J40R3q6M5m5j64J50o4J44k05J32K00M3k19j32q4J64K14k42
2735a8o2J95p2j72J62j74J31J1j35K11K70m39J50Jm8L5q6q4L31r5k95R5k3K0K07
2760A16L6j68J58j02j34J41k20O9J12j07J73j48O9P0k15J80j02R7j78L40k68J77
2782I6k46M4M78j87Ml35M7J4J94o1j9j18J16p0OL13j91k37pJ81J65j82k4k05K09
2807a5P4O9j85N3K4j04J55n2M0j12j1J48j32l3RJ17L6R0l23K38Mj31J60N3j47
$$ y = [-147, -31, -34, -113, -33, -53, -24, -78, 193, -93, -94, 31, 164, -71, -151, 39, -142, -153, -49, 2, 34, 10, -55, 78, -274, -96, 196, -231, -20, -26, -104, -37, 87, 124, -24, -41, 219, 16, 65, 22, 78, -79, -91, -154, -113, -5, 199, -130, -167, 215, -65, -101, -128, 39, 103, 44, 37, 49, 41, -49, -8, 6, 22, 71, -276, -149, -5, -185, 190, -36, 188, 176, -21, 29, -120, 103, -5, 100, -74, 40, -102, 38, 131, 45, 90, 45, -119, 31, -33, 111, -94, 38, 238, 281, 62, -70, -154, 10, 224, -18, -80, 115, 43, -129, 33, -141, -10, 1, -134, 77, 347, -92, 58, 59, 11, 46, -40, -124, 207, 112, -183, -88, -111, -91, 116, 152, -16, 142, 40, -94, 47, -173, -104, 8, -99, 74, -74, -5, 65, -150, 30, -72, 25, -153, 187, -81, 96, -150, -106, 372, 185, 189, -146, -99, -85, 109, 48, 29, -89, 27, -43, -37, 276, 85, -152, -159, 22, 187, 5, -19, -224, -15, 59, 128, -57, -4, 20, -84, 71, 19, 59, -53, -64, 84, -48, -81, -72, 45, 81, 171, -152, 86, 90, -41, 119, 172, 25]
2832B5j21OK06m6k76M52m04L22k10K25j38R3k7j60o7N7n6K18k24p2R5J65k65K62
2856F0R3k7l33j7K48%J43k55J07K2M2R2p2l13J18J71k91L31j22oJ88k64J72o1
2880B6l9r7Q7j0k1K12R4j37J3j24l4P9j21N9Rk8K0p8O6M2n6O5O8kl04J41M6J19
2908I5k87L41r4j06O4J15j62K67o7m35K48K83k68K2k68L15L0j85J56j23k6q9Q4
2931i0N5q3K05k58K70P9l1j64Q7k39J49J2p4J81r5J27j4k07J96R6q3k05K5K30
2955A69j23J65l26K76j35J5p7J0q3J50k22J87J78k42OJ20JRq0q7J87j97K41j99
2979e7K48k32Q6Qk82K51J14o8j60q3J86J77j28j16j43J69j05J66mj45L36l69J82
3002C1p6%j34K04p8j19J06J82j13L3q7J44Q8j82J1j19J87j08n9J30j47J35j26
$$ y = [25, -96, -90, 116, 70, -206, 246, -158, 164, -46, 179, 41, 134, 107, -53, -120, -63, -119, 99, -125, -197, -102, 63, -202, 60, 153, 126, -207, -224, 24, 24, 167, -88, 19, 41, 83, 175, 103, -210, -92, 79, -212, 119, -3, -9, 179, -85, 87, 26, -13, -110, -23, -33, -54, 158, 252, 115, 128, 4, -30, 49, -72, -13, -4, -32, -12, -90, -24, 18, -38, 27, 95, 93, -211, -70, -24, 95, -192, 149, 55, -51, 13, 128, -34, 233, 166, -269, -21, 262, -6, 16, -252, 63, 93, -92, 64, -59, -85, -174, -90, -35, -118, 87, -171, 99, 178, 147, -17, 70, -169, -20, -8, -82, 99, 4, 131, 117, -90, 106, 202, 119, -86, -61, 169, 46, 211, -115, 161, 26, 41, -36, -26, -109, 41, -181, 6, 184, -58, -52, 68, 69, 78, -2, -89, 98, -99, 142, -57, 191, -41, 45, 53, -229, 22, 136, 68, -92, -175, 11, 188, 60, -56, -199, -30, -135, 31, 27, -118, 218, -151, 31, -45, -45, -179, 25, -53, -172, -66, 116, 3, 36, -51, 93, 181, -1, 10, -109, 78, -30, -89, 41, -106, 29, -97]
3025i7J87j74l1K53q0Rk39J83j14j3L1J19j19n1N6K42m6j40R5j50J97r9K4j07
3049f4Q3J07k50J72j04K06j54L7R4k55P3N3j35L00r5L5k22J77j06j06J30M2P2
3072I0J11j74j70J43j40J75q6%m8K6N7o6L14l26L75k29j93J79m8op9M5q0K75j12
3097C3J34j16M2j59J68K6j92J7K39k56P6K7j26J73k26J21R7j28K44j03m7j83J89
3120E0m7m8K69j71r9J49j36q5L31k51n3m9K24j94R1J24k60J0K34k7J60k03L0j22
3144g3LR7j85M8J48j40N0q3RM7J59l0j15K9j09R1k4J11l9J8Qj34O0k1L4P6n5O6
3172D6J68l20j10nJ04J6j15K50P9J2l80L80k85J23p2q8J84M0k23J82l5o7L19l60
3196a57J70q0N4N8j87J33J76J7k77k19L70l3k6q8J06k47J49R5j38k2J30j14J0
$$ y = [-97, 90, -84, -115, 138, 58, 67, -172, 11, -103, -116, -85, 34, -85, -136, -80, 162, 116, -24, 71, -79, 118, 19, 43, -64, 19, 126, -124, 48, -56, 150, -4, 33, 127, -128, -55, -2, -137, 163, 68, 103, -119, 58, -48, -154, -24, 18, 90, 201, 27, -143, 0, -140, 35, -51, -51, -99, -73, -16, -82, 232, -94, 281, 52, -141, 38, -10, -16, -95, -50, -130, 145, 33, 167, 51, 93, -66, 102, 128, -64, -47, 192, -64, 12, 39, -87, 86, -140, -19, 78, -50, 194, 91, 44, -139, 50, 3, -45, 224, 53, -46, 103, -33, -118, 213, -38, -91, -140, 84, -110, -19, 105, -155, -145, 89, 62, 222, 19, 49, -73, -70, 27, -158, -110, 38, -102, -52, -135, -126, -79, 80, 50, -65, -36, -145, -54, -78, 33, -6, 12, 20, -114, -54, -75, -41, 35, -20, 46, 214, -106, -216, -221, -117, -101, -216, 34, 113, 125, -255, 125, -160, -37, -109, -197, -13, 27, -196, -14, -49, -116, 203, -157, 13, -67, -13, 45, -142, -9, 167, 184, -93, -312, 58, 25, -1, -89, 17, -230, -81, 14, -124, -146, -16, -130, -120]
3219a20J24q7M9j4J13m6P6j2n8l6P5j21j29R9j8J8K84l91R5R1R2J7Qm17L14m6
3245d0J02P2l10K53l6n1j38rJ29r5J54P6K0oM6j20j87L2K39n2j73J00P5N3J3l03
3271a56O3J69r1RO2j26J4L0j68L25k10J8J24J78k34m3P9o6k2j31J3K52l3m0q0
3296f4Q4l6R0L4o6J34l16J94j47N7J02n0j63K4J44r4J13r3P3p6J53r3j69K23J0
3321F8p2J89k08JK17j58j73J03J11j60J82k7N5l48K05J47l5j99J40J45j20j01
3343c8J32j14L0N7k4n4j00O8l2K81k62j49J51j6J0J39j18k34J95J40j23J68l9
3366F8j17R6K5j87J22j59k3J75o8K39k10J77k69L67mm51L03j52J94j08n3l9Q0
3389FL3O6l8L0j11o8K63j51Pp7K71k58k1L6O0k08J69j46J25K2L6n2m1Q6l0J47
$$ y = [-120, 4, -83, -34, -48, 65, 19, 95, 83, 25, -11, 64, -57, -186, -87, -105, -87, 197, -194, -99, -8, 84, 101, 109, -308, 6, -40, 62, 134, -176, 77, 41, -10, -148, -157, -28, -123, 31, 107, 127, 121, 167, 47, -140, -108, 131, 79, -94, 6, 81, 134, 147, -156, -93, 76, -15, -6, 56, -70, -56, -26, -194, 131, -79, -61, 63, 241, 7, -36, 43, -23, -45, -176, -163, 89, 56, 16, -64, 20, -16, 74, 108, 42, 176, -140, 54, -93, -36, 66, 16, -147, -123, 21, -73, 40, -53, 20, -56, 97, 4, -165, 58, 68, -4, 185, -23, -22, 195, 37, -136, -33, 78, -82, 100, 73, 128, -220, -15, 132, 97, -102, 38, 183, 63, -38, 94, -20, 10, 67, 43, -11, -111, -43, -75, 206, -56, -205, -54, -70, -60, 79, -39, -273, -78, 62, -61, 107, 68, -49, 47, 72, -115, 7, -152, -175, 0, -68, 171, -39, 138, -131, 236, 232, -219, 84, -68, 126, 18, -35, -74, 6, 39, 105, 67, 97, -14, -82, 181, 30, 37, -40, 231, -27, -48, -12, 48, -160, 9, -137, -12, 10, 46, -6, -47, 39, 9, 156]
3415A56j57J42j04k40J48M6k3M4J67j26j84K04j14J9m6j27R2J49j05J33M0j69
3437e5p9J15q0J25k3n8J09j38J09j72J77J70P7k45ml7l7J49j53Q3k4n3R8P8j17
3462A5N4j99L29k60qJ70j03J83k20n3J81p7j25P6j70P5K12j39J52j64j2K93k12
3485bJ04k50N0M8n0m5JJ60l8J82k28Q7j27J19J15l67L6L19k32J83mj24J14R4j99
3510e4m6O8j03o7J97J7q8J29j04j91N90n50K18N0q3Q0k60K06J33j10m2j33R7O
3534d0J64J09k41J33k53m3K79J9j31K8k39L26j02J21l52J9L41K7J9j27l0j46K29
3557A10NL4l17K14k2JP3j12k4K47j19K3q2o3K5q7m3l5K75J25N5n45L2L45o0q9
3583c4N9K9j27O3q0M3K05j45o8J9N5mj88K31j68R2j18K64k50K8J51m1j72J61R1
$$ y = [156, -1, 141, 37, -203, -55, -9, -32, 12, 179, 53, -131, 73, -41, -22, -68, -195, -103, 46, -59, 74, 114, -55, -134, -19, -99, 26, 3, -55, 54, -84, 25, -147, 30, 200, 277, 32, 28, -9, -46, 103, -50, 33, 9, -44, 54, 132, 15, 69, -130, 199, -61, -69, 101, -2, 181, -39, -92, 89, 12, -113, -37, -207, -132, 80, -59, 93, -71, -83, 210, -2, 102, -148, -98, -50, -100, -145, -144, 16, -22, 160, -68, 19, -108, 11, 126, -241, -205, 114, -118, 65, 61, -63, 51, 145, -54, -100, -32, -135, -202, -5, 12, -76, 53, -51, -242, 348, -202, 16, 66, -17, 63, -197, 9, 142, 32, -10, -143, -46, -40, 124, 233, -8, 125, -128, -171, 108, 127, -4, 24, -215, 111, 9, 130, -222, -203, 138, 165, 184, 57, 27, -119, 110, 115, 149, -168, 46, 24, 25, 98, -14, -38, 209, 90, 113, 31, -32, -7, -94, -137, -172, 103, 228, 283, -262, -230, 115, 55, -34, 25, 54, -73, -10, -90, -47, 158, 13, -55, -36, 19, 15, -173, 58, -110, -18, -136, 128, -122, -94, 57, 16, -156, 5, 96]
3608I6o3p9R5k2O0M3mj55j23N6Q0J88l14K37j03P9O5l11N9R3K50q6k81J20J62
3633A42l3k77J75J04j99N4K36q8j11L4J49l22J5m3K8J57Lm9J2O3j87J08j46J87
3657A2J86j69p1J36j00J62k08J72m3j80K00j47Rk6L1n7J26J35j94j70L14j35J48
3680A31k31K51k06n2R3j2r6M5L7P1r0L0j89M00o7j22o2JK78k88K6J64r6l9k43
3705b66L83k43%J64j10J01K55j26j8j89%K2q6K60k30J07J78l54J91J59m13K12
3727ck6l5J05r3j1r8k59L42R8j87K32pm2J08p2o6j1J63j60J71l67K53j7r9J58
3752G7l8k4N3jn8Q2Q2n02J76J55j1J16j59kj6L0q5K38j60j51Q1j72M11J28l19
3777f9J31m1l8n9K2n0p0J28p0K76l6j07l2N9p7J43j95l1J61l1O7k26J35r6L26
$$ y = [96, 33, -46, 49, 27, 87, 130, 126, -29, -152, -96, -16, 172, -142, 95, -8, 71, 136, -175, -116, -23, 227, 141, -140, -20, 142, 109, -168, 7, 111, -88, -34, 202, 114, 3, 37, 186, -136, -121, -164, -136, 21, 24, -25, -13, 50, -137, -29, -175, 12, 198, 29, -42, 94, -6, 156, -52, 120, 77, -103, 97, -50, -41, -67, -36, -93, 33, 168, -26, -196, 118, -17, 131, -100, 151, -55, -107, -14, -26, -122, -77, -40, 31, -59, -29, -218, 182, 115, -7, -69, -68, 210, -78, -52, 112, 16, -23, -266, 117, -126, -126, 38, -72, 29, 284, 158, 140, -49, -49, -27, -113, 147, -83, 24, 202, -152, 39, 198, -215, -3, -29, -64, 41, -52, -63, -161, -420, -78, 20, -167, 65, 58, 16, 124, 52, -14, -25, 138, -22, 149, -218, 35, 18, -81, 77, 39, 15, 68, 67, 9, 91, 173, -329, -153, 2, -9, 107, -52, -54, -70, -40, -125, 113, -47, -198, -117, -289, 122, 250, -69, 62, 21, -17, -76, -54, -104, -174, -46, -116, 160, 124, 17, -15, 44, -33, 110, -85, -116, 45, 14, 81, -145, -10, -106, 220]
3802B20m1j30Rj89N4J54qj76J84L8k92J62o5J49Q5k77L36j19k37J07j25M0J81
3825F0l99K12P5N5J16o9J74l08n4Q2Q0j1j51J21L21j95j36j04K51o8J2K18j45
3848A37k79K78Nj38k0r0J45j42Q7K8J04m7J06j38j16J4J04J10k11O4p7M9P2%l5
3873A0J52l86J46Q8KN6l2R8k47q0K11N6r7l7J19j4k57J33j02n2L58o8M7o1j94
3898a51K15j03J42J08j57J26j12j41rP6L5p8o6L76m67J92j29J19K54k44%M2r7
3921f9lJ04p4R3j08r6J62m2n2J2O5J26j42Q5j66J12o3OJ86j49K4k8Q5p3rK75n25
3948b64L40j43M8m5j94M24R2l76R9k8J0L7p5JK32j17o3RJ20O1j50j41J2J00n7
3973f8R7j5k0j04o2K49j93Q8J06j65N3j9J1j07M91l56L8k53Q4nJ23R0o0J32j36
$$ y = [220, 179, 49, 58, -131, -77, 77, 69, -107, 77, 115, -177, -15, -80, 69, 154, -123, 213, 94, -143, -36, -161, -121, 60, -339, -127, -52, 3, 119, 50, 224, -84, -138, -56, 24, 13, -138, -17, 304, 109, -27, -131, 120, 52, 64, 282, 137, -142, 136, 141, 3, -17, -107, 38, -104, -17, 11, 115, 68, 174, 36, -80, -66, 38, 148, -63, 1, -76, -27, 45, 45, 10, 162, -224, -78, 10, 12, 68, 36, 134, -113, -193, 18, 74, -23, -60, 59, 45, -212, -79, -181, -233, 125, 57, 104, 43, -151, 64, -39, 103, 211, 54, 180, 68, -73, -82, -6, 29, -49, -115, 261, -206, -14, -143, -24, 230, -14, -14, 28, -69, -72, 32, -42, 51, -57, -153, 9, -33, -85, -73, -8, 118, -24, 61, -105, 7, -56, -50, 136, -13, 11, -17, 68, -5, -14, 261, -264, 76, -67, -19, -64, -258, 166, 258, -118, -19, -47, -37, 0, -75, -74, 158, 41, -22, -13, 107, 168, 18, -123, -111, -11, -68, 29, 14, -6, -110, -172, 77, -116, -28, 78, -87, -34, -53, -42, -149, 342, -14, 24, -229, -145, -150, -27, 63, 3, 135, -1]
3998aq3J6K14j61j48L00K6m44L53j70J1P7J36k89K14k42K24p9J03n9K25j73r8
4021d8k43K73J16n7l2L6J42j0J0k70l5K13o4qM2O1o9J3k69J78p6N1K31Q0l29J10
4047D6p6J23j61L7j1j3L3K0O5L3J88l89K22k93K43k62M50k32J9J49k49j26L50
4070A66j32p3J66k20K1%K32k27J70o3j28k3K98l00J77j75L80l55l6L73l77O8m1
4093i9R3k10L62J32l25J53r9j36j9LN1K71m2j89M4j03R9J70m11J51M7j3J77k02
4117i5P6M6M0L8l5l3j49Q5Q8Q8k98J18O8j18M37l27l2J03R1k81N6j15P3j06J49
4142c3l2j39J83M6p8R1l2L3K9L1j12J3j48O8J03Lr0kr2J29o8qK35k47P9ko1M8
4170e3J51j06m2J46n9k51K7J20MK06j09j29J32l05P9K76k30L55n7j28j19J46J51
$$ y = [-1, -84, -68, 146, -15, -163, 137, 163, -281, 72, -98, -87, -10, 126, -163, 51, -191, 33, -46, 57, -2, 223, 50, -48, -291, -18, 98, 41, 9, 45, 187, 177, 187, -83, -118, 95, 31, 23, 65, 126, 57, 70, -199, -21, -97, -46, 185, 265, -64, 46, -30, 93, -68, -31, -42, -55, -22, -2, 63, 96, 284, -105, 117, -176, 67, -195, 255, 23, 42, 191, -58, -184, 166, 34, -39, 127, -93, -72, -72, 160, -67, 103, 40, -88, -111, 187, -113, 64, -111, 269, -86, -122, 251, -126, -58, -99, -6, -216, 146, 278, -47, 106, 7, -129, -148, -145, -94, 177, 135, -54, -10, -113, -14, 156, -255, -104, -57, -70, 107, -95, -19, 27, 67, 105, 70, 37, -112, -27, 61, 149, -149, -31, 37, -81, 356, 29, -3, 100, 191, -90, -34, -149, -76, -182, -33, -65, -204, -21, 25, -53, 38, 6, 39, 68, 99, -13, 0, -148, -80, 23, 26, -64, -66, -158, -29, -97, -105, 130, -117, -38, -40, -101, -53, 98, -8, -50, 96, 37, -214, -187, -67, -63, 143, 34, -95, 37, -268, -189, 87, -143, 212, 155, 27, -92, 54, 205]
4193B05j84o4m3J44K4K2m5lj40J3L6P1l76M54m5j79kj8LJ98M4l60p8M02m5J91
4219B25k69M6J2j29P8M3j59J16J19J61j63p6lj4J1j9M1N6J34k44J76P9l24N5P
4244d1J35p6oJ15k39J92j90KL86l66o2K84q8O8J06j01l4j18J1J3P6l4K23l62J4
4269i2l0NK05k44K07K19m88J96P5O6q5j17O0p4R8K6n4rn0J45k1p7K26P2j47j52
4295d0l6k2J63Q4k27o3J36j60J94o8n5J16j9RJ64k34J6r2j73L90j01r6J38j55
4319a31N9jJ42m9k91J09%L04j71P9j27L7J09k7j96P1N2J3k0n7n9J77J71m6j49
4344aj3J61j36m5R9k06K63j54Nj46J09lr5N0K5L6L3L9J34j2k88K01o9L9jj45k9
4371a49M55n10K19m6j12P0J86qm8r7Mr2L73m96L26J1j10Q0k01J60L5j73L19j66
$$ y = [205, 21, -43, -86, 58, 82, 104, 59, 56, -84, -71, -35, 36, -340, 114, 69, -110, -112, -130, -127, 71, 115, -245, -323, 79, 34, 225, -44, 2, 14, -115, -37, 6, -153, -37, 82, 243, 80, 4, 1, -13, -2, -21, 20, 76, 210, -34, 142, 221, -103, -48, -41, 94, 18, 12, 127, -112, 80, -110, -108, 278, -88, -150, 134, 46, 114, 220, 119, 85, -33, -22, -9, 67, 33, 256, -106, -92, -122, -117, 88, -156, 51, 270, -218, -22, 53, 119, 34, -83, -23, -97, 1, 27, -27, -36, -86, 59, 38, -39, 187, 259, 112, -40, -76, -98, 65, 149, -78, -141, -5, -165, 29, -39, -94, 22, 3, 12, 176, -58, -42, -134, -307, 83, -18, -114, 24, -131, -72, -73, 69, 20, -271, -162, -162, 142, -29, 50, -77, -40, 69, 42, -154, -83, -31, -18, -38, -95, -154, 23, 194, 148, -1, -14, 147, 11, -34, 65, -141, 122, -32, -27, -173, -64, -67, -162, -112, -87, -51, -18, 21, 155, 143, -145, 56, -13, 26, 25, -120, -149, 306, -204, 15, -31, -143, -73, 113, 105, 57, -40, -36, -128, 245, -251, 75, 86, -24, 56, -145, 15, 50, -123, 196, 30]
4395C0n5K24k42K73m85L27j05J66k48Q4K5P7oJ0J21j88J91j26o7K50j38o1M1j33
4419c5P6O0j1R0k35jk4J46mj46J38j0m6k7P2J19j14j57k0J24J25j69J64k35J28
4444Hj32L2K1O9R5j12Mj67K90r3k41L53L8j73k2O6j62J35j14J84M8j78R3K7Q4
4469A53L2l28l1O0P7K00k02L08m16M2J81j76Q8K79k12L4k33R3O1L1m6j59R8n5
4493a21J31r2k7J06o4L7m1k28M40o4j43K06r8k65J07J10K0N4o5R3R5j48M0k4j70
4518a11J11N8q4k0j36J97J27l15K10j06J42O5j29N2lj92J82l2o6O1m6l6l7n4N4
4543a08R7m3J73l4k33K21K2N4m2j77J91l15L22j56M4j34P4J51k13K41j01O3J29
4566B26j52J4k47K14j96o6J90j1O2J67j39j02J24J26k11nPJ58m66J39L76k80L7
$$ y = [30, -25, 199, -43, 230, -255, 72, -33, 133, -115, -31, -6, 71, 65, 75, 196, 8, 199, 73, 6, 256, 118, 57, 98, -35, 41, 101, 90, 180, -55, -56, -80, 66, 62, -84, 54, 44, -2, -29, 43, 162, 48, -109, -129, -5, 120, -49, 115, -120, 8, -124, -92, -71, -2, 93, -19, -15, -182, 108, 15, -226, 127, 165, -8, -30, 36, -126, 9, -105, 79, 127, -51, 42, 69, 153, 185, -143, -174, -114, -37, 163, -39, 269, -147, -105, 76, -100, -12, 267, 55, 89, -144, -51, 10, 41, -5, -164, -66, -121, 10, -82, -109, -3, -67, -30, -71, -299, 141, 77, -66, 140, 42, -223, -116, -6, 14, 68, 3, 96, 191, 43, 83, 59, -111, 0, 58, -26, -46, -182, 15, 142, -173, 37, -69, 73, 138, 9, 61, 58, -134, 48, 16, -50, 11, -35, -71, -108, -162, -108, -11, -54, 119, 85, -148, 73, 95, 149, 107, -70, 121, -194, 128, -28, 16, -118, -44, 107, -106, 135, 34, 97, 226, 74, 88, -159, 55, -141, -207, -17, -28, 34, 201, 62, -40, 84, 210, -1, -6, 1, 159, -307, -168, 208, -72, -35]
4589c5J68j10Q2pj76K13m0j04K0J71j11N4k01L5J79k75K71o6j42J84j41K63j08
4612A24J5k49J36q6j05K29J37l12J74R0j87J11m1nj13n6P9N8J34j48q0O3J35l14
4636b11M22k85J04L9J68r4J46l19J05j07L3Q6k64K42q0J28j92J83J06j97m2M7
4658A8k15J39J94k02J51j89K08j55L2Kq7L2j43J77P8K61k49J0J28j47k6Q3k03
4681a03J23J2j00j38M09j75j16j12L72j46o7j27J28J20p3J81k64L8J5Q7Q9j04
4703D9k5p6kR4p0J79k04J0J71m1q6J44r3M5J8l5J74l15m5K63l13Q4j60K04q1J77
4729F6q1N2o1r4O0L9k6J18k14J71j38L6M2J42j56L4r8LJ71Q1j02j8k57J98m9q9
4755a70N5k8R9J88k68L7J94j75L1r0R7l7ML9r7J80j30J75j97J34J31j04n9m6m7
$$ y = [-35, 133, 23, 105, 98, -78, 135, 95, -9, 11, 182, 71, 125, -76, -41, 138, -137, 134, 68, -74, 110, -31, 232, 124, 139, -110, 26, -60, -165, 64, 201, -111, 63, 153, -34, 77, 36, 31, -82, -138, -59, -1, 133, -15, -95, -32, 103, -211, 211, -74, 30, 69, 237, 143, 289, -30, 75, -32, 1, 87, -177, 65, -15, 113, -79, 104, 210, 13, -29, 18, -197, -58, 136, -66, 85, -104, 104, -51, -19, -17, -104, -72, -215, -38, 40, 301, 52, 62, 190, 43, 17, 100, -103, 20, 32, -68, -206, 203, 28, -88, -200, 172, 26, -41, -168, -40, 80, 7, 188, -76, -38, -23, 64, 153, 49, 24, -52, -54, 40, -30, 149, -55, -45, 126, 85, -1, 143, 50, 95, 113, 78, 252, -63, -108, 155, -158, -74, -234, -30, -111, 66, -15, 37, -24, -118, -58, -19, -45, 73, -141, 30, -108, -72, -30, 112, -44, -10, -108, -105, 66, 147, 45, 27, -230, -32, -81, -170, -115, -143, -44, 144, -124, -87, 107, -68, -37, -127, -30, -67, -63, -24, -121, 59, -71, 104, -93, 41, 172, 68, 9, -37, -84]
4780h4k29K40R8O5q7j49NK51O8l08M1J48J21k41P6pm5M9j16O1j3J6j05K08J8Q8
4806A69n1J9k63Q1O9K4J5o7j32K16k41K41m2k58J76J21j26J84k7l16M42l17J02
4829A9Q1M1J60k24j1J06j74%k37K98M7k35J42k62M20j28j94J58j67K97j22K9k15
4852a71O5O8L3J78q0k3j19J53k3m0qM9L3j92L32j99J4j48R4j36J07MJ45k02m2
4877a08K40k76Q1K5k3j0J59j00J7J37j15j01JQ9K8Q1k59K42o8N4q5o4J02j17N6
4902a4Nj31q5N9L33k50Q4k40L21j84K7L20k46QJ16pj43K21k39J56M7l07K42o2
4926C1j68K34l64L48k48J27J86j36R4K3j40J42k08N9L0k18L41l1R2k65j24R8J28
4949C1r4J37j28N8O9j27L31k81K08l04M0OJ3J87m08L34kk98L06j44J94k10K3J24
$$ y = [-84, -313, -73, 25, 90, 3, -146, -141, 110, 178, -130, -89, 59, 180, -61, 15, 8, -37, 12, -104, -43, -56, -40, -145, 63, 81, 169, 118, 137, -126, -45, 24, 48, 63, -4, -136, 80, -161, 80, 38, -220, -44, 77, -49, 135, 108, -208, 234, -83, 19, 100, 141, 301, 77, 66, 172, -2, -2, -239, 59, 106, -129, 13, -249, 171, 43, -151, 7, -160, 137, 15, 44, -171, -106, -38, -5, 173, 93, 70, -49, 104, 81, 41, 33, 82, 115, -77, 255, 56, 70, -78, 16, -120, -13, -9, 136, -66, -108, 132, -144, -63, -38, -61, -71, 88, -12, 5, 142, 27, -74, -73, 16, 44, 125, -134, 108, 40, 94, 9, -55, 47, -70, -14, -9, -140, -225, -166, 167, -83, 1, -239, 82, -102, -75, 245, -1, 7, 123, 116, -27, 194, -45, 111, 158, -149, 93, 31, -137, 97, -267, 81, -167, -40, 146, 10, 104, 127, -13, 129, -79, -20, 10, -208, 133, 102, 194, -71, -195, -97, 31, -63, 74, -54, 4, 73, -54, 277, -4, 204, -100, -60, -54, -41, 146, -262, 72, 70, -228, 78, -66, 128, -82, -59, 65]
4973F5j50K02or1r8l0j08K49J9j65P8j27J70j47J13kK47j69j21J02LK59j77j44
4997b8r8o3J9J44k90L14P7q3R1o9M6o1Mj39J41P9N4m9q7N1k46K35J3J37k43J86
5023A35P7l80J14n4pJ12K1k51M1L06j97J67j04J37l20J71L16o3k9k90K07j56J61
5046A14k10O2J23N3j0j99L37k03k4L2r0L7m0l6J41L7n2j57lMJ11l18R9Q5M6M2
5072a9QJ84k95J48R8n9k09J05J6J28Ll76K07q4J79J8q2j12J17Q9l2p6K10j5j68
5097a7q7P6M0j51K16J72j63l47L69N9m0j55j7J21k51K00k1l7QK5%Oj77j05K07
5122f9j08P5J7J68k72P9J07j91J53m6J37P2k6j9o8N0o8J81j51N4k93M87k26p2
5146b9J73k10K10j68p1R6k68K96p2J18n0p7J67n0j60q5J76m4M8j0M2p7R5J83l50
$$ y = [65, -85, 117, 111, 20, -78, -108, -216, 33, 52, -113, -35, -162, 8, -139, -26, -28, 219, 50, -71, 31, 34, 293, 116, -28, -126, -189, -170, -26, -316, -2, 75, -8, 83, 14, 60, -1, 3, -136, 5, 84, 138, 89, 2, 53, -193, 42, 55, 192, -51, 135, 212, -168, -54, -108, -115, -3, 18, -233, -192, 114, -83, 84, -20, 117, -203, -32, 284, 221, 192, -98, 109, -47, 114, -96, -34, 89, 142, 132, -67, 270, 67, 43, 75, -15, 22, -18, -54, 87, 124, 72, -85, -88, -84, 27, -291, -192, -107, -61, -19, -11, 173, -122, 26, 124, 65, -144, -39, -23, 105, 108, -268, -61, -145, 34, 52, -30, -142, -25, 64, 32, -44, 166, 151, -17, -104, -28, 12, -139, 77, 249, 86, -261, 108, 167, 127, -28, -45, 76, -175, 25, 4, -33, -25, 0, 0, 6, -171, -276, -69, -177, -102, -85, 83, -189, -110, -3, -194, -41, -87, 50, 122, 96, 77, 9, 59, -9, 172, 21, 75, -218, 269, 43, -29, 144, -66, 144, -24, -95, 1, -267, 29, -43, 75, 25, -52, 115, 65, -95, -180, -4, -48, 0, -10, 32, -45, 50, 233, -117]
5171a17j8M55l59o1J24J24k13J10p3n3R8J28O8j97n2n7J0O4P7J36j30P9n4j30
5195d1j55M01l15L5J11m3R2jj32Q3j0J3L4j19J32M3j89K97k71Q1L2j83K93l40
5219a52o9K45K4Lp2R3j29O8n8Q6r4K39r3L4r6q6J05J52n12L73Ml6l2j06j60M16
5245A47j42j63Q2L6J29k11N0M1K01k27J2J7p8L4m9O9N5P1m6j45K00M5j65O5q5
5270e7J68Pk33j31L27r4p2M45l14p5R1o8m8J2j71K32m5K60q6q1J05k55K59j07
5294F9J5k30K66R4l50O6n0J65r3j41K40O5m6q7k1j24K23j78N2RJ00R0j45O5j44
5319i0K2K5K30j64O7k13K59r9J38k38o2Q6J46p6k03j19K82m4o4K67l9o7n7K56
5343B43k17J15j55j55L40L4j75l0l2n7JQ8k6R4k15J07L81l64n5JJ58qL11l59k
$$ y = [-117, -135, 320, -39, -100, 24, 148, -65, 45, -28, -81, 17, 145, 213, 16, -36, -93, -83, -19, 58, 194, 64, 143, 89, -41, -196, 205, -110, -75, 36, -7, 85, 84, -48, 35, 25, 38, 72, -47, 85, 128, -61, 236, -35, 46, 78, -105, 188, -152, -221, 24, 48, 51, -21, 72, -57, 11, -47, 39, -55, 184, 91, 125, 29, -57, 48, 200, -312, 61, 65, 29, -3, -109, -269, 147, 5, -158, -76, -40, 89, -122, -72, -31, 170, -57, -45, -28, -106, -72, -121, -52, 3, 74, 28, -117, 83, 128, -37, 28, -57, 111, 118, -115, -246, 81, -13, -85, 360, 46, -29, 62, -6, -54, -42, -213, 19, -26, 234, 148, 67, 172, -83, 176, 69, 84, -146, 120, 214, -136, -70, -120, 45, -48, -189, 51, 116, 70, -17, -38, -162, 61, -117, -65, -56, 44, 134, -11, 54, -90, -68, -43, 187, 23, 90, -123, 136, 37, 175, -63, -125, -39, 107, 31, -172, -291, -9, -53, -117, 150, 111, 44, -13, 243, 26, 141, -14, -169, 171, 205, 30, 0, -32, -89, -88, 0, -26, 68, -147, -40, 341, -23, -78, -77, 81, 73, 384, 25, 23]
5368B3Q4k88Q9J05p1l0R9r3R0J99l3j17j6J67j79j09j18L44pO4n1l08J05M1j41
5393a51M1K43j51M9Q3j00K7j95J70P4n9P1k65J90j01L1l0N4j05J79l70N29j64
5416E0n0J20o8j45J61m6M2r2k3M1M17m55o1j6L9K05k78Q5J19M1j09J03j43K55
5440A92j78K16m6j60q7k4LK5j19K82o4j61k28M36k20K28j36J4J30l07M43k15r3
5463f9L00j40m7k63R4K2J32J55j05j8k81M31j30k91J9K79k24K27K07j00l09K71
5485A60k61J47j37J52j33J6J3J65j66P8M2k76J63N6l4n1m2ko7J26Pj90M03q4K5
5510A10j54r1K51N0J6j91J7J01j78j8JJ24j69Q1J27k63K35j31L10l02K56j05k69
5533a92N4K37l24j6K27N5p9L8K16k16l0j0p2J60k04L20q9O3j48o5lj05J40J08
$$ y = [23, 107, -181, -92, 13, -58, -88, 11, -82, 8, 207, 174, 57, 41, 208, 29, -80, -198, 146, 139, 203, 152, -156, -51, -10, -151, -110, 133, -18, 31, 114, 14, 41, -154, 16, 90, 31, 102, -163, 27, -74, -43, -73, -19, -124, 55, -315, 214, 50, 0, 120, 52, -93, 68, 22, 64, -28, -51, -10, 407, -48, -109, -125, -86, 119, -159, -74, 45, 86, -23, 80, -63, 192, 14, 230, 184, 24, -63, -87, -84, -59, -178, 104, 40, -121, -349, 87, -133, 95, -41, -27, 103, -204, 239, 24, -69, 231, 91, 44, -219, -125, -103, 29, 184, 79, 61, -220, 211, 81, -210, -191, 88, -136, 91, 298, 198, -111, 160, -101, 46, -91, 61, -72, -56, -43, 122, -44, 34, 76, -200, -37, 19, -15, -66, -108, -110, -177, -51, -44, -234, 169, 85, 110, -44, -135, 116, 166, 182, -9, 8, 109, -69, -87, -86, 38, -131, -50, 77, -186, 49, -82, 228, -74, 182, 77, -192, -138, 99, -225, -241, -14, 41, -38, 0, 216, 0, -30, -40, -112, 48, -156, 164, 75, 138, -10, -75, -78, -183, -43, 65]
5557F5L7r6j38o4J23J47k4r3O5p7j86R1O9lj08K72n1l2j1N1n1k2J4j60M0N2l0
5584a20J08J63k73NK10o6p3J42j00Q1n2jK8j8J85j87n1O5j04J61J47j22j75J32
5608H5j38p1Q2P9o0L4J4j0J2o8M1R5L4k59NJ25k2Rm7J91M0k21J06q9k05L55j01
5635A6l5J64j95J27j00q8P2m3P3k0K1L1o5jJ40j27J51Ll27J72j9J03QJ60j41r2
5661a2j22K38n7j27L05n4k90J47r1J5K5Q9j6mM1j48O5K2k9r7J65k15L02n6K6j72
5687e0K09j80M9J02o7j05j0Q9j14qK32j11j57J50j59Q4O0q6m6O7l6J18M9j32m7
5712i9J75p5K54k23O2l0j84r6o7J43mk5L02j74N4j01N4K34k27J23P7n5j5j58J13
5737E8p8k17J57J84j47j2P7P7j30j03J90L6Q8j65j8j95j04K03J41J1m9J10n3q0
$$ y = [65, 102, 6, -132, -196, -73, 74, 50, -43, 22, -55, -241, -150, -81, -84, -192, 80, 29, -3, -14, 37, -14, -36, -22, -182, -142, -90, -120, -12, 151, -122, -117, 93, 27, -46, 96, -4, 77, 25, 24, 52, 34, 219, 32, -19, 46, -58, 103, 250, 128, -47, 85, -53, -124, -42, 37, -23, 11, 25, 15, 27, -41, 0, 95, 129, -130, -125, 0, -22, -13, -60, 131, 171, -50, 56, -33, -238, 117, 16, -19, 145, -50, 77, -23, -111, -39, -82, -9, -29, -8, 23, -42, -43, 97, -30, 121, 124, -203, -31, -50, 53, 61, 221, 80, -12, -134, 104, 47, -80, 225, 171, -119, 28, -63, -48, -23, 66, 50, 46, 87, -61, 4, 26, -3, -100, 65, -150, 152, 96, 122, -50, 159, -21, 28, 130, 63, -42, -52, 37, -77, -85, 147, 36, -121, 29, -130, -46, 14, -72, -118, -51, -87, 31, 80, -52, -99, 76, 1, 255, 32, 94, 64, -120, -216, -283, -140, -144, -169, 133, -41, 13, -88, -34, 200, -27, 96, 173, 118, 103, -55, 58, -20, -237, -80, 104, -43, -55, 22, 99, -31, -134, 56, 92, 180, 15, -3, -198, -302, -99, 42, 53, 4, 114, 61, -19]
5761a9Q9j40K09j87LK1K04r5l7L4j33O5J23j41m8p9j40J60O8J49k64L1L4J33O2
5786A02j66JK1l6K29k86J86j98K35l24M43k53k4J29oL5j52L5J37p8Q2j11K5J7
5810D3j86K61M0n8j57j0m7K13p6n7Q8N0P7r9j51J61Q2j96k15K61n8J04j63K19
5834A26m3J24j52q2K5p2K99k66k1M9J38l4k82J10N9J2j97L80j12J16k15M6l7J07
5858G8n3k0N5k7Op0q8J72J1r3j32N5J35L9l1QK16k00j75J12jj65N9K23j03M3j77
5885a23J87k67K67j24j64K61n2J74o7k89k9K04J3J25l7p0l8P5j26J63P3j99J02
5908E9mO3j24J75k79l2p1M3L53k37J32L0k28K44l00K22j61K6q1J36k0P5M5k43
5932a77K85n4J04l00J06l4J84k92K27M1r4K32j30n6Kq1l5P4K9O3l16L13n7j15
$$ y = [-19, 70, -70, 139, -48, -45, -24, 180, 85, 48, 82, -51, 14, 137, -4, -52, -131, -271, -111, -43, 106, -158, -127, -93, 40, 102, -64, -63, -42, -78, 151, -135, 51, -147, 88, -236, 207, -46, -70, 59, 53, 88, -64, -29, 108, 30, 112, 1, 26, 43, -143, 118, 158, 100, -57, -67, -114, 99, 23, -34, 54, 104, 181, 82, -69, 92, 174, -22, -237, 24, -34, 70, -93, 126, 83, 207, 55, -27, -2, -74, 225, -41, -62, -13, 125, 91, -191, -81, -22, -10, -207, 173, 61, 177, -38, 8, -29, 78, 25, 5, 60, 33, 39, -31, -119, 53, 64, -29, -161, -106, 29, 68, 37, 45, 261, 61, -114, -2, -3, -168, -109, 114, 11, 54, -123, 64, -203, 64, -60, -224, 37, -15, 159, 92, -197, -226, -22, -9, 116, 79, 9, -29, 46, -80, 83, 156, -43, 59, 55, 118, -6, 169, -110, -142, -213, -170, 183, -54, 78, 108, -120, 124, -176, 46, -115, -89, -170, -34, -54, 21, 66, -177, 108, 54, 158, -142, -36, -70, 114, -178, 49, 90, -4, 228, 98, 42, 44, -37, -72, 2, 31, 94, -222, 91, 34, -81]
5956h1J25j16j43J07L78l78K20k54K17j86J15o1J08P3j34j41k0J45J19j93J84
5977H4p5k36K83j36N9Mp6P1j4m8P5k0J73o8m0J49m05K96k0PJ23j97M9%k64K47
6003B1l3J28k22J56q8q6K49k92J05K04j18K33j28k4N4m04L15M1n5m7j86L0R9J85
6027A37q0j21J91P4q6l98J01J73L0j27k2KK65r2mr9l5J71j53j45J82M6n2J09j48
6052h1J15J05p2j19N7J8j25J55n8J18j99J14j28l8n8R7mQ8q8K5Q2k1J21M1j88
6077d3j05J5Q4Ok1P9j04K02k77J39n7J26M2j22j2R6j9p7l9R2J07j08J1k9P2Q2
6103A40k98L05k06j53K30M2M7JL5O4p3l4J20k99J50J64j03j26n1K33n4j40Q7j52
6127g1qn5J27K22j09j86K16M3l16K37n5K9j68J94j85J89q3q2J6kMJ16j26r6K10
$$ y = [-81, 44, -72, -215, -108, 270, -108, 112, -142, 75, -111, 4, -57, 51, 124, -10, -151, -171, -26, 93, -100, 84, 9, -227, 56, -80, -21, -17, -93, -22, -36, -84, -9, -29, 144, 76, 36, 185, -220, 76, 56, 63, 186, -11, 38, 38, -226, 21, -12, 116, -106, 50, -38, -124, 125, -167, -62, 142, 24, 257, 129, 105, 159, -245, 70, 111, 56, 9, -177, -147, -48, 137, 57, -64, 127, 201, 115, -283, -182, -9, 21, -106, -128, -126, 139, 47, 43, -56, -91, 80, -73, -218, -36, 10, -42, 67, -81, 34, 139, 67, -52, 5, 23, -102, 53, -5, 113, -86, 28, -100, -138, -196, -99, -103, -15, -103, -78, 4, -17, 104, 145, -43, -148, -133, -49, -43, -64, 15, -89, 113, -164, -25, -82, 44, 86, -36, -48, 48, 29, -48, -87, 5, 112, 4, 15, -14, 58, 140, -158, 147, -59, -212, 18, 60, 107, 108, 143, 207, 134, 100, 220, -79, 71, 235, 132, 6, -45, 188, 134, -6, 81, -71, -79, -134, -7, 215, 106, -80, 136, 179, -137, 100, 45, 74, -94, 100, -85, 104, 21, -61, -45, -47, -43, 73, -53, -149, 61]
6152F1J8j50j68K86K2lM1q1J02L5j66N2j94J60j04O8J8j48J08K7O9j35R1j13K43
6177A39l85L33l10R3J59k50L84k05j03K02%q7o2J85J3j01m2r4J73o9r1J35K15
6200B32m24K11J0J54l20J4M7J09j19L9J44q9n1K5K15l32K67j16j66qJ76PR4o7
6224E2j33K07k11O8j8o1K9j8R8J46o7lNj3k90K40j04K49j67j7o0J91j1l19J83
6249b4K8J80M4m09J61jj9j06J08L2O9j52j33J50P1N0j38J07R4J52k44O4l4l8J09
6274A21k24N3J04j62K3J14J67j36o7m4L6K30j36j74K2l8J86o9K00j1P9l73J75
6297G6Jj8k74K04j9J10p8j49M6J03opK3J35j00K5K6M3j52N5J58k51m0J74j46r2
6323a53PJ48K58j45n5J44k05J25J48l94Q8K08k76N2n4R6O6QK0K5k30K00k04J42
$$ y = [61, 79, -71, -239, 47, 69, 66, 107, 26, 128, 163, -3, 49, -145, 15, -89, -21, -3, -151, -43, -16, 53, -82, 9, -104, 139, -246, 87, -223, -130, 29, -221, 163, -42, -145, 57, 57, -30, -92, 93, 106, 5, -37, -131, 42, -27, -118, 17, 232, -192, 19, 29, 183, -137, -123, -76, 33, -86, -47, 97, 8, -43, -18, 197, -135, 132, 16, -150, -158, 18, 25, 119, 52, -81, 126, -85, -17, -35, -96, -67, -85, 13, 159, 92, 89, 94, 81, -209, 31, -73, 176, 9, -8, -68, 123, 112, -207, -24, 4, 184, 228, -181, -20, -21, -40, -146, -38, -6, 63, -89, -222, -72, -1, 49, -89, 18, 112, 264, 20, 84, 50, 12, 121, -103, -50, 54, -108, -85, 29, 196, 60, -7, -51, -15, 215, 79, -95, -73, -111, 75, 6, 206, 195, 274, -99, 76, 77, 59, -215, -11, -30, 80, 2, -147, -101, 2, -4, -11, 12, 147, 47, 72, 98, 141, -11, 44, 202, -49, -89, 85, -61, -153, -146, 2, 260, 115, 60, 204, -1, 124, 272, -122, -34, 174, -102, -50, -104, -8, 58, 66, 86, 111, -119, 81, -123, 19]
6347A9P2K34l43o1J24j75J14k12J75Q3n4J06j27J5J6J41j06j09o8J97J21q7p0
6370EJ53j52k8J77l22J58J46j39o7J23J94n95M10nJ66l20N7K25r3J8l3j09pP9
6394D1l4j54K70j46j26M9K95j73n3P0j46K81Q7k24j27Q6J6Jj21J43j40q0M81l38
6418d2KR8j07K01j06l2n8p1J01J60k83l0R9J51j0j76J82j71O8J39q2k42P7K74
6442A42k62J56O1o1r2J25k1j88K02j50K1J18l9J95l03J35Lk81J62P8l6J65k01
$$ y = [19, 91, 325, -18, -79, 45, -130, -16, -228, -53, 30, -24, 82, -45, -30, -14, 127, 21, -88, -156, 41, 162, 75, 5, 158, 6, -22, 155, -167, -9, 137, -2, -69, 54, 248, -347, 63, 58, 224, -96, -39, 186, 93, 111, 78, -31, -38, 41, 7, -147, 123, -23, -149, -100, 195, 22, -31, 39, -107, 174, 261, 37, -90, -4, 12, 13, -108, 35, -105, -185, 296, -42, -40, 58, -49, 152, 46, 14, -44, -115, -14, 146, -137, -167, -68, 83, 73, -103, 79, -92, -24, 115, 33, -209, -132, 142, -120, 36, 97, 36, -56, 69, 48, -140, 62, -88, -67, 51, 12, 207, -96, 39, 42, -239, -77, 1, -35, 130, -71]
$$ [...]
8191f4
##END NTUPLES=NMR FID
##END=
