##TITLE=1H_IG-G394fr1
 200.13MHz,CDCl3,
 8 sc
 
 1.11.2025
##JCAMPDX= 6.0         $$ Bruker NMR JCAMP-DX V2.0
##DATA TYPE= NMR FID
##DATA CLASS= NTUPLES
##ORIGIN= UXNMR, Bruker Analytische Messtechnik GmbH
##OWNER= pz
$$ XWIN-NMR		Version 3.5
$$ Sat Nov  1 14:29:29 2025 Russian Standard Time (UT+4h)  she@DPX200
##.OBSERVE FREQUENCY= 200.1313
##.OBSERVE NUCLEUS= ^1H
##.DELAY= (6, 6)
##.ACQUISITION MODE= SIMULTANEOUS
##.ACQUISITION SCHEME= undefined
##.AVERAGES= 8
##.DIGITISER RES= 18
##SPECTROMETER/DATA SYSTEM= spect
##.PULSE SEQUENCE= zg30
##.SOLVENT NAME= CDCl3
##.SHIFT REFERENCE= (INTERNAL, CDCl3, 0, 14.3821)
##AUDIT TRAIL= $$ (NUMBER, WHEN, WHO, WHERE, WHAT)
$$ ##TITLE= Audit trail, XWIN-NMR		Version 3.5
$$ ##JCAMPDX= 5.01
$$ ##ORIGIN= Bruker BioSpin GmbH
$$ ##OWNER= she
$$ F:/spectra/data/she/nmr/H-C/1/audita.txt
$$ ##AUDIT TRAIL=  $$ (NUMBER, WHEN, WHO, WHERE, WHAT)
(   1,<2025-11-01 14:28:03.64 +0400>,<she>,<DPX200>,
      <created by zg, POWCHK disabled, PULCHK disabled
       configuration hash MD5:
       00 E9 B6 7A A2 85 ED C7 34 08 36 98 17 FE 4E 26
       data hash MD5: 16K
       14 17 59 69 52 1E 1B 73 0F 7D 2E B7 CE 8C BA 8B>)
$$ ##END=
$$ 
$$ hash MD5
$$ CE 3F A5 75 50 9F 42 1C F2 16 44 78 9A F3 8C C4
##$RELAX= 
##$RELAX= 
##$RELAX= 
##$RELAX= 
##$RELAX= 
##$RELAX= 
$$ Bruker specific parameters
$$ --------------------------
##$DU= <F:/spectra>
##$EXPNO= 1
##$NAME= <H-C>
##$PROCNO= 1
##$TYPE= <nmr>
##$USER= <she>
##$AMP= (0..31)
100 100 100 100 100 100 100 100 100 100 100 100 100 100 100 100 100 100 
100 100 100 100 100 100 100 100 100 100 100 100 100 100 
##$AQSEQ= 0
##$AQ_mod= 1
##$AUNM= <au_zg>
##$AUTOPOS= <>
##$BF1= 200.13
##$BF2= 200.13
##$BF3= 200.13
##$BF4= 200.13
##$BF5= 200.13
##$BF6= 200.13
##$BF7= 200.13
##$BF8= 200.13
##$BYTORDA= 1
##$CFDGTYP= 0
##$CFRGTYP= 5
##$CHEMSTR= <none>
##$CNST= (0..31)
1 1 145 1 1 1 1 1 1 1 1 1 1 1 1 1 1 1 1 1 1 1 1 1 1 1 1 1 1 1 1 1 
##$CPDPRG= <>
##$CPDPRG1= <>
##$CPDPRG2= <>
##$CPDPRG3= <>
##$CPDPRG4= <mlev>
##$CPDPRG5= <mlev>
##$CPDPRG6= <mlev>
##$CPDPRG7= <mlev>
##$CPDPRG8= <mlev>
##$CPDPRGB= <>
##$CPDPRGT= <>
##$D= (0..31)
0 0.7 0 0 0 0 0 0 0 0 0 0.03 0 0 0 0 0 0 0 0 0 0 0 0 0 0 0 0 0 0 0 0 
##$DATE= 1761992882
##$DBL= (0..7)
120 120 120 120 120 120 120 120 
##$DBP= (0..7)
150 150 150 150 150 150 150 150 
##$DBP07= 0
##$DBPNAM0= <>
##$DBPNAM1= <>
##$DBPNAM2= <>
##$DBPNAM3= <>
##$DBPNAM4= <>
##$DBPNAM5= <>
##$DBPNAM6= <>
##$DBPNAM7= <>
##$DBPOAL= (0..7)
0.5 0.5 0.5 0.5 0.5 0.5 0.5 0.5 
##$DBPOFFS= (0..7)
0 0 0 0 0 0 0 0 
##$DE= 6
##$DECBNUC= <off>
##$DECIM= 32
##$DECNUC= <off>
##$DECSTAT= 4
##$DIGMOD= 1
##$DIGTYP= 9
##$DL= (0..7)
0 120 120 120 120 120 120 120 
##$DP= (0..7)
150 150 150 150 150 150 150 150 
##$DP07= 0
##$DPNAME0= <>
##$DPNAME1= <>
##$DPNAME2= <>
##$DPNAME3= <>
##$DPNAME4= <>
##$DPNAME5= <>
##$DPNAME6= <>
##$DPNAME7= <>
##$DPOAL= (0..7)
0.5 0.5 0.5 0.5 0.5 0.5 0.5 0.5 
##$DPOFFS= (0..7)
0 0 0 0 0 0 0 0 
##$DQDMODE= 0
##$DR= 18
##$DS= 0
##$DSLIST= <SSSSSSSSSSSSSSS>
$$ [...]
##$SUBNAM0= <"">
##$SUBNAM1= <"">
##$SUBNAM2= <"">
##$SUBNAM3= <"">
##$SUBNAM4= <"">
##$SUBNAM5= <"">
##$SUBNAM6= <"">
##$SUBNAM7= <"">
##$SUBNAM8= <"">
##$SUBNAM9= <"">
##$SW= 18.0517328524113
##$SWIBOX= (0..15)
0 0 2 0 0 0 0 0 0 0 0 0 0 0 0 0 
##$SW_h= 3612.71676300578
##$TD= 16384
##$TD0= 1
##$TE= 0
##$TE2= 300
##$TE3= 300
##$TEG= 300
##$TL= (0..7)
0 120 120 120 120 120 120 120 
##$TP= (0..7)
150 150 150 150 150 150 150 150 
##$TP07= 0
##$TPNAME0= <>
##$TPNAME1= <>
##$TPNAME2= <>
##$TPNAME3= <>
##$TPNAME4= <>
##$TPNAME5= <>
##$TPNAME6= <>
##$TPNAME7= <>
##$TPOAL= (0..7)
0.5 0.5 0.5 0.5 0.5 0.5 0.5 0.5 
##$TPOFFS= (0..7)
0 0 0 0 0 0 0 0 
##$TUNHIN= 0
##$TUNHOUT= 0
##$TUNXOUT= 0
##$USERA1= <user>
##$USERA2= <user>
##$USERA3= <user>
##$USERA4= <user>
##$USERA5= <user>
##$V9= 5
##$VALIST= <valist>
##$VCLIST= <CCCCCCCCCCCCCCC>
##$VD= 0
##$VDLIST= <DDDDDDDDDDDDDDD>
##$VPLIST= <PPPPPPPPPPPPPPP>
##$VTLIST= <TTTTTTTTTTTTTTT>
##$WBST= 1024
##$WBSW= 4
##$XGAIN= (0..3)
0 0 0 0 
##$XL= 0
##$YL= 0
##$YMAX_a= 313485
##$YMIN_a= -393641
##$ZGOPTNS= <>
##$ZL1= 120
##$ZL2= 120
##$ZL3= 120
##$ZL4= 120
##$ABSF1= 10
##$ABSF2= 0
##$ABSG= 5
##$ABSL= 3
##$ALPHA= 0
##$AQORDER= 0
##$ASSFAC= 0
##$ASSFACI= 0
##$ASSFACX= 0
##$ASSWID= 0
##$AUNMP= <proc_1d>
##$AZFE= 0.1
##$AZFW= 0.1
##$BCFW= 1
##$BC_mod= 2
##$BYTORDP= 1
##$COROFFS= 0
##$CY= -3
##$DATMOD= 1
##$DC= 2
##$DFILT= <>
##$DTYPP= 0
##$F1P= 0
##$F2P= 0
##$FCOR= 0.5
##$FTSIZE= 0
##$FT_mod= 4
##$GAMMA= 1
##$GB= 0.15
##$INTBC= 1
##$INTSCL= 1
##$ISEN= 128
##$LB= 0.25
##$LEV0= 0
##$LPBIN= 0
##$MAXI= 10000
##$MC2= 0
##$MEAN= 0
##$ME_mod= 0
##$MI= 1.114404
##$NCOEF= 0
##$NC_proc= 0
##$NLEV= 6
##$NOISF1= 3.799351
##$NOISF2= 2.8
##$NSP= 1
##$NTH_PI= 0
##$NZP= 0
##$OFFSET= 14.38212
##$PC= 1
##$PHC0= -2628.939
##$PHC1= 10.19235
##$PH_mod= 1
##$PKNL= yes
##$PPARMOD= 0
##$PSCAL= 0
##$PSIGN= 0
##$REVERSE= no
##$SF= 200.129724274929
##$SI= 16384
##$SIGF1= 3
##$SIGF2= 2
##$SINO= 400
##$SIOLD= 16384
##$SREGLST= <1H.CDCl3>
##$SSB= 0
##$STSI= 0
##$STSR= 0
##$SW_p= 3205.1282051282
##$SYMM= 0
##$S_DEV= 0
##$TDeff= 0
##$TDoff= 0
##$TI= <>
##$TILT= no
##$TM1= 0
##$TM2= 0
##$TOPLEV= 0
##$USERP1= <user>
##$USERP2= <user>
##$USERP3= <user>
##$USERP4= <user>
##$USERP5= <user>
##$WDW= 1
##$XDIM= 8192
##$YMAX_p= 0
##$YMIN_p= 0
$$ End of Bruker specific parameters
$$ ---------------------------------
##NTUPLES= NMR FID
##VAR_NAME=  TIME,          FID/REAL,        FID/IMAG
##SYMBOL=    X,             R,               I
##VAR_TYPE=  INDEPENDENT,   DEPENDENT,       DEPENDENT
##VAR_FORM=  AFFN,          ASDF,            ASDF
##VAR_DIM=   8192,          8192,            8192
##UNITS=     SECONDS,       ARBITRARY UNITS, ARBITRARY UNITS
##FACTOR=    0.0002768,     1,               1
##FIRST=     0,             0,               0
##LAST=      2.2672688,     0,               0
##MIN=       0,             -393641,         0
##MAX=       2.2672688,     313485,          0
$$ Real data points
##PAGE= N=1
##DATA TABLE= (X++(R..R)), XYDATA
$$ [...]
$$ plain form
1880 -321 -1122 -870 -63 591 950 803 -9 -979 -1134 -321 284 922 898 285 -593 -1032 -637 -119 1046 1333
1900 1333 597 -151 -995 -1334 -515 580 866 824 -75 -777 -1078 -464 312 992 939 470 -347 -985 -844 -67
1920 -67 874 1285 542 -634 -1122 -1353 -680 549 1107 1272 321 -218 -767 -461 394 822 870 397 -354 -1344
1940 -1344 -1094 -215 354 914 660 -42 -864 -847 -359 562 1144 1347 584 -751 -1465 -1201 -173 265 997
1959 997 746 -321 -862 -913 -315 953 1274 1028 158 -697 -1044 -372 165 1059 1097 342 -1019 -1507 -1249 -399
1979 -399 697 1269 1208 -10 -516 -903 -383 315 871 685 40 -1025 -1327 -852 -105 918 1247 637 -477
1998 -477 -1029 -1001 -395 1050 1205 981 182 -891 -1345 -1021 89 776 948 434 -467 -971 -708 63 869
2017 869 1147 591 -506 -938 -865 -411 550 1166 799 -143 -1012 -1487 -751 145 1251 1543 918 -81 -799 -1115
$$ packed form
1880c21q01K52Q07O54L59j47q12r70j55Q13O05O38k4o13q78m39L95N18J165K87
1900A333p36p48q44l39Q19J095K86m2q99p02l01O14P76O80n3m69q17o38J41P77
1920f7R41M11p43j176m88k31O73J229N58J65r51n39n49L06Q55M28M8m73p51r90
1940a344K50Q79N69N60k54p02q22J7M88R21N82K03p63j335p14K64J028M38P32
1959I97k51j067n41n1N98J268L21k46q70q55l47O72N37Q94L8p55j361m88K58Q50
1979c99J096N72o1j218n06l87N20O98N56j86o45j065l02M75P47J023L29o10j114
1998d77n52K8O06J445J55k24p99j073m54L24J110O87J72n14r01n04K63P71Q06
2017H69K78n56j097m32P3M54R61O16l67r42q69m75P36Q96J106K92o25r99p18l16
$$ plain form
2037 -1115 -459 383 610 525 -238 -1251 -1208 -396 355 1247 984 284 -667 -1256 -916 9 903 1216 453 -440
2057 -440 -1171 -1488 -727 507 1206 1065 411 -549 -845 -538 347 954 903 237 -789 -1462 -1084 40 859
2076 859 1540 1147 -14 -1068 -1078 -442 500 1352 1199 224 -922 -1367 -1199 -194 682 748 477 -212 -532
2095 -532 -663 281 1027 1344 759 -99 -1171 -1662 -795 121 896 975 572 -291 -1029 -829 108 1031 1293 893
2115 893 240 -758 -1411 -717 76 644 523 -133 -748 -1069 -210 672 1474 1443 1057 -296 -1427 -1228 -475 287
2135 287 929 668 -128 -863 -1138 -555 464 1121 1178 404 -355 -713 -729 -24 639 826 194 -685 -1443 -1144
2155 -1144 -498 517 1241 1345 314 -411 -1055 -964 130 664 1011 271 -478 -1103 -1030 -93 626 1108 896
2174 896 -166 -720 -916 -392 681 839 827 296 -689 -1375 -829 -68 953 1166 887 -237 -651 -789 -401
$$ packed form
2037a115O56Q42K27q5p63j013M3Q12P51Q92k63p00r51n89L40R25Q94L13p63q93
2057d40p31l17P61J234O99j41o54r60k96L07Q85O07n1o66j026o73L78J124Q19
2076H59O81l93j161j054j0O36R42Q52j53r75j146m45J68J005Q76O6k71o89l20
2095e32j31R44P46L17n85q58j072m91Q67R16P75P9m03q63p38K00R37R23K62m00
2115H93o53r98o53O94P93N68j21o56o15l21Q59Q82Q02l1l86j353j131J99P53P62
2135B87O42k61p96p35k75N83J019O57N7p74p59l58j6P05O63J87o32q79p58K99
2155a144O46J015P24J04j031p25o44R1J094N34L47p40p49o25P3R37P19M82k12
2174H96j062n54j96N24J073J58j2n31r85o86N46P61J021K13k79j124m14j38L88
$$ plain form
2193 -401 322 861 449 -208 -905 -1084 -554 491 1142 1055 521 -512 -963 -733 -42 575 933 608 -219 -906
2213 -906 -1052 -409 391 1037 890 270 -420 -718 -511 10 845 752 426 -568 -1036 -1045 -327 752 904 851 232
2234 232 -736 -953 -517 269 892 924 34 -618 -947 -998 -161 535 857 607 -42 -571 -617 -200 529 739 838
2255 838 -87 -546 -1050 -774 161 888 957 392 -223 -868 -860 -195 261 787 914 -51 -761 -1026 -468 283 909
2276 909 984 487 -270 -1011 -575 -34 738 896 134 -166 -854 -1177 -433 278 1000 864 353 -480 -819 -378
2296 -378 188 866 835 199 -472 -818 -994 -289 482 940 777 16 -482 -506 -697 260 683 671 196 -571 -1143
2317 -1143 -870 -208 524 919 450 -222 -705 -559 -88 708 1187 907 217 -781 -1061 -600 -86 406 881 287
2337 287 -303 -523 -671 46 653 1083 749 270 -571 -1041 -449 -4 649 724 24 -598 -998 -897 -48 602
$$ packed form
2193d01P23N39m12o57o97j79N30J045O51q7n34j033m51K30O91O17L58l25q27o87
2213i06j46O43Q00O46j47o20o90k98K07N21Q35r3l26r94m68rP18J079J52n3o19
2234B32r68k17M36P86O23L2q90o52l29n1Q37O96L22k50o49n29m6M17P29K10R9
2255H38r25m59n04K76R35P27O9n65o15o45QO65M56N26J27r65p10k65N58P51O26
2276I09P5m97p57p41M36N41P72J58p62l00o88l23P44P11P22j36n11q33l39M41
2296c78N66O78l1o36o71l46j76P05P71M58j63p61m98k4j91R57M23j2m75p67n72
2317a143K73O62P32L95m69o72m83J46M71P96M79k80o90r98k80M61N14M92M75n94
2337B87n90k20j48P17O07M30l34m79q41m70N92M45O53P5p00o22m00J01Q49O50
$$ plain form
2357 602 807 672 -197 -682 -873 -352 423 558 622 144 -330 -508 -516 218 986 913 324 -319 -861 -712 -212
2378 -212 514 1052 489 -155 -731 -878 -541 2 601 789 225 -489 -598 -547 4 488 923 507 -120 -893
2398 -893 -746 -196 435 837 797 82 -686 -933 -817 -152 719 942 308 -175 -724 -818 -317 392 668 639 165
2419 165 -356 -780 -369 27 573 499 208 -552 -1207 -738 -90 353 935 770 256 -743 -754 -468 -34 854 693
2440 693 303 -322 -709 -666 -31 398 669 414 -293 -758 -804 -61 657 1027 947 -79 -789 -924 -435 236 730
2461 730 889 579 -245 -575 -696 -208 388 701 379 -137 -483 -632 -290 198 798 581 139 -604 -936 -846
2481 -846 88 669 1099 552 -8 -739 -908 -613 170 827 493 61 -207 -812 -477 -59 668 692 390 -300
2501 -300 -662 -726 39 700 881 778 -214 -544 -1071 -606 75 1034 732 473 -189 -780 -821 -321 308 670 528
$$ packed form
2357F02K05j35q69m85j91N21P75J35O4m78m74j78qP34P68p3n89o43n42J49N00
2378b12P26N38n63o44n76j47L37N43N99J88n64p14j09N1N51M84M35m16o27p73
2398h93J47N50O31M02m0p15p68k47J16O65Q71K23o34m83n49r4N01P09K76k9m74
2419A65n21m24M11L96N46p4k91p60o55M69O48M43N82j65n14r99j1K86M34Q88j61
2440F93l90o25l87M3O35M29K71k55p07m65m6P43P18L70q0j026p10j35M89O71M94
2461G30J59l10q24l30j21M88N96L13l22n16l46j49L42M88O00k17m42p43l32R0
2481h46R34N81M30n47n60p31j69K95P83O57l34m32k68o05L35M18P27K4l02o90
2501c00l62o4P65O61J81j03r92l30n27M65O81R59l02k59o62n91m1N00O29L62j42
$$ plain form
2522 528 -30 -337 -630 -270 403 899 474 -14 -447 -720 -592 -3 533 848 682 -172 -808 -808 -503 334 980
2543 980 726 274 -278 -540 -622 245 554 611 283 -282 -855 -720 -200 545 1204 440 -182 -950 -1202 -673 248
2564 248 737 904 382 -369 -648 -605 -232 420 800 301 -100 -634 -663 -144 513 669 468 103 -579 -612 -494
2585 -494 221 674 727 341 -525 -904 -968 -331 292 1151 889 240 -325 -609 -420 -167 467 379 -227 -480 -699
2606 -699 -799 -23 599 981 648 48 -451 -873 -249 337 794 933 140 -521 -967 -972 -297 618 778 361 -100
2627 -100 -382 -512 79 521 691 508 2 -694 -838 -566 -80 620 638 391 -352 -445 -605 46 646 984 650
2648 650 83 -718 -794 -573 -207 268 577 151 -260 -738 -466 -14 808 917 364 -220 -831 -861 -368 415 869
2669 869 685 186 -554 -825 -505 155 969 641 628 -241 -543 -606 -195 441 456 429 -147 -633 -440 -50 550
$$ packed form
2522E28n58l07k93L60O73M96m25m88m33k73J28N89N36L15j66q54o36%L05Q37O46
2543I80k54m52n52k62q2Q67L09N7l28n65n73J35N20P45O59p64o22p68k52N29R21
2564B48M89J67n22p51k79M3L73O52L80m99m01n34k9N19O57J56k01l65o82l3J18
2585d94P15M53N3l86q66l79o4O37O23Q59k62o49n65k84J89K53O34q8o06k53k19
2606f99j00P76O22L82l33o00m99m22O24N86M57J39p93o61m46nO75R15J60m17m61
2627a00k82j30N91M42J70j83n06o96j44K72M86P00J8k47p43r3j60O51O00L38l34
2648F50n67q01p6K21L66M75L09m26m11m78K72M52Q22J09n53n84o11l0M93P83M54
2669H69j84m99p40k71L20O60Q14l28j3q69l02o3M11O36J5k7n76m86J93L90O00
$$ plain form
2690 550 850 821 28 -524 -796 -724 -351 377 650 492 195 -620 -596 -259 190 817 739 -38 -215 -697 -500
2711 -500 114 485 673 150 -371 -855 -779 108 741 884 882 174 -508 -713 -480 24 376 410 35 -490 -595
2732 -595 -189 -65 672 820 491 -85 -665 -623 -165 335 648 217 130 -572 -716 -601 53 658 568 623 1
2753 1 -578 -688 -200 284 611 560 -289 -569 -772 -539 -69 510 498 429 -165 -326 -244 -40 595 604 529 -344 -611
2776 -611 -575 -391 -10 461 515 -21 -339 -463 -685 96 450 657 399 -10 -304 -531 -123 212 562 515 -90
2797 -90 -693 -491 -302 196 225 676 668 -131 -570 -726 -253 306 740 534 -122 -614 -776 -486 149 444 849
2818 849 99 -195 -584 -182 25 661 564 386 -243 -657 -559 -340 188 554 527 -74 -365 -690 -165 188 753
2839 753 713 391 -277 -704 -617 66 196 583 322 89 -504 -591 -265 165 642 667 248 -137 -458 -306 38
$$ packed form
2690E50L00k9p93n52k72P2L73P28K73j58k97q15K4L37M49O27p8p77j77m82J97
2711e00O14L71J88n23n21m84P6Q87O33J43kp08o82k05K33N04L52L4l75n25j05
2732e95M06J24P37J48l29n76n80M2M58N00L13m31q7p02j44J15O54O05r0N5o22
2753An79j10M88M84L27n1q49k80k03K33M70N79j2o9n94j61Q2K04O35Rp5q73k67
2776f11L6J84L81M71N4n36l18j24k22P81L54K07k58m09k94k27M08L35L50m7o05
2797i0o03K02J89M98K9M51qp99m39j56M73N59M34k06o56m92j62K90O35K95M05
2818H49p50k94l89M02K07O36r7j78o29m14R8K19N28L66k7o01k91l25N25L53N65
2839G53m0l22o68m27Q7O83J30L87k61k33n93q7L26M30M77K5m19l85l21J52L44
$$ plain form
2860 38 709 564 435 -120 -452 -523 -401 284 449 551 166 -482 -653 -314 -83 393 510 213 -309 -500 -397
2881 -397 -201 436 682 417 -16 -341 -633 -152 152 355 409 268 -382 -787 -638 -1 551 706 497 39
2901 39 -276 -458 -365 332 421 298 -54 -415 -828 -346 21 852 607 320 -299 -701 -531 -64 385 729 514
2922 514 -76 -238 -722 -399 46 304 500 364 -229 -599 -339 -29 281 566 204 -5 -512 -479 -211 386
2942 386 539 549 365 -398 -686 -583 30 599 267 383 -5 -349 -374 -320 270 442 166 -98 -581 -443 -291
2963 -291 324 605 540 -19 -603 -666 -337 52 285 903 289 -180 -347 -350 -263 198 439 508 61 -320 -401 -316 216
2986 216 354 676 355 -236 -417 -224 -50 317 318 351 -77 -614 -703 -406 90 530 555 340 -156 -398 -409 -117
3008 -117 417 705 202 -228 -637 -186 -187 86 477 281 8 -143 -547 -239 67 386 473 522 -168 -503 -359
$$ packed form
2860C8O71j45j29n55l32p1J22O85J65J02l85o48j71L39K31M76J17k97n22j91J03
2881c97J96O37K46k65m33l25k92M81L04K03N4j41o50m05J49O37N52J55k09m58
2901C9l15j82R3O97Q9j23l52l61m13M82L67Q31k45k87o19m02J70M67M49L44k15
2922E14n90j62m84L23M45K58J96j36n93l70K60L10L10K85l62k09n07L3K68N97
2942C86J53J0j84p63k88J03O13N69l32J16l88l44k5N4N90J72k76k64m83J38J52
2963b91O15K81o5n59n84o3L29L89K33O18o14m69j67lQ7M61K41O9m47l81q1Q5N32
2986B16J38L22l21n91j81J93J74L67JL3m28n37q9K97M96M40K5k15m96k42j1K92
3008a17N34K88n03m30m09M51jK73L91j96k73j51m04L08L06L19Q7M9o90l35J44
$$ plain form
3029 -359 -146 -11 462 281 -92 -379 -450 -442 257 562 718 259 2 -342 -163 59 366 660 431 -65 -478
3050 -478 -409 -216 308 412 224 -16 -369 -367 -248 163 148 558 204 -168 -198 -318 18 17 526 395 15 -662
3072 -662 -414 -423 50 436 520 191 -203 -458 -382 -82 216 343 320 55 -226 -450 -345 136 187 251 80 -329
3094 -329 -525 -38 51 404 504 379 -123 -698 -557 -239 197 535 448 122 -217 -467 -370 128 405 426 245
3115 245 -189 -489 -388 -12 325 392 338 -217 -474 -458 -158 294 521 482 348 -44 -205 -430 -26 306 417
3136 417 261 -155 -404 -340 -125 70 424 107 -59 -24 -442 -212 100 259 346 -48 -258 -336 -392 -234 238 154
3158 154 189 -2 -363 -219 -351 238 401 413 200 -232 -465 -308 -117 277 407 81 -124 -351 -285 -277 275 590
3180 590 348 -106 -329 -333 -401 172 194 620 168 -70 -197 -86 -140 269 228 57 -160 -254 -585 -113 175 365
$$ packed form
3029c59K13J35M73j81l73k87p1QO99L05J56m59k57l44J79K22L07K94k29m96m13
3050d78O9J93N24J04j88k40l53KJ19M11j5M10l54l72l0j20L36jN09j31l80o77
3072f62K48rM73L86Q4l29l94k55P6L00K98J27k3k65k81k24J05M81N1O4j71m09
3094c29j96M87Q9L53J00j25n02n75J41L18M36L38q7l26l39k50R7M98K77K1j81
3115B45m34l00J01L76L37O7n4n55k57J6L00M52K27l9j34l92j61k25M04L32J11
3136D17j56m16k49O4K15J95L54l17j66L5m18K30L12J59Q7l94k10p8n6J58M72q4
3158A54L5j91l61J44j32N89J63J2k13m32k33J57J91L94J30l26k05k27O6QN52L15
3180E90k42m54k23mo8N73K2M26m52k38j27J11n4M09m1j71k17r4l31M72K88J90
$$ plain form
3202 365 727 -126 -316 -528 -422 58 297 566 140 36 -303 -183 -147 202 377 419 90 -97 -357 -210 264
3223 264 312 274 190 18 -117 -410 61 268 224 380 -113 -243 -380 -214 145 498 262 154 -206 -442 -474 -60
3245 -60 209 416 495 -20 -70 -206 -130 288 536 435 113 -82 -417 -219 219 -7 139 257 -197 -257 -457 28
3267 28 298 568 159 -15 -203 -182 -284 30 458 246 -82 -98 -333 -356 104 344 517 166 96 -114 -469 -154
3289 -154 329 391 246 153 -365 -430 -50 76 54 452 194 -139 -225 -248 94 103 431 54 -213 -166 -171 -182 -26 292
3313 292 259 -2 -172 -399 -454 133 269 397 93 -154 -209 -409 -45 171 305 142 35 -172 -306 -266 134
3334 134 484 131 139 -147 -132 -148 -149 -69 193 200 -14 -313 -204 -80 144 149 102 158 -107 -337 24 31 -59 205 65
3359 65 -81 -260 -134 -181 172 336 159 -18 -8 -391 -157 70 31 151 167 -166 -356 -258 -61 110 3 254
$$ packed form
3202C65L62q53j90k12J06M80K39K69m26j04l39J20L6L49J75M2l29j87k60J47M74
3223B64M8l8q4j72j35k93M71K07m4J56m93j30j37J66L59L53k36j08l60k36l2M14
3245f0K69K07P9n15n0j36P6M18K48j01l22j95l35J98M38k26J46J18m54o0k00M85
3267B8K70K70m09j74j88K1j02L14M28k12l28j6k35k3M60K40J73l51p0k10l55L15
3289a54M83O2j45r3n18o5L80J26k2L98k58l33q6k3L42RL28l77k67M7nj1J56L18
3313B92l3k61j70k27n5N87J36J28l04k47n5k00L64K16J34j63j07k07j34M0M00
3334A34L50l53Qk86J5j6jQ0K62Pk14k99J09J24K24Nm7N6k65k30L61Pr0K64j40
3359F5j46j79J26m7L53J64j77j77J0l83K34K27l9J20J6l33j90R8J97J71j07K51
$$ plain form
3381 254 147 -161 -237 -126 5 58 223 -31 -298 -230 -350 95 64 122 67 172 -92 -197 -12 40 297 222 -91
3404 -91 -104 -284 -215 98 83 183 -21 138 -49 -263 77 135 130 75 69 -21 -190 68 108 170 236 112 -76 -120 -183
3429 -183 -184 93 132 75 40 -144 -198 -68 203 119 -92 296 -11 18 76 -72 80 126 -70 7 -36 -91 -197 145
3453 145 218 80 68 -74 -268 -72 122 61 231 73 -113 -167 49 14 -241 112 100 80 -99 -134 92 113 13
3476 13 40 141 -319 0 37 -67 99 80 194 -152 -119 -320 -81 111 -173 71 -163 -20 64 -136 -114 75
3498 75 65 -124 43 10 -44 -46 57 57 -25 -51 -35 -156 -126 -124 -311 24 75 -77 30 -111 -61 -33 151 147 13 19 9
3525 9 -1 24 -86 -19 149 42 -47 -43 29 18 183 145 35 67 -29 -129 136 -41 127 -51 -21 19 32 -96 31
3550 31 92 172 -135 -137 133 -123 -105 -64 70 -33 -105 -86 -69 -162 78 102 15 46 156 -54 164 60 119 10 208
$$ packed form
3381B54j07l08p6J11J31N3J65k54k67O8j20M45l1N8n5J05k64j05J85N2K57p5l13
3404i1j3j80O9L13j5J00k04J59j87k14L40N8nn5or0j69K58M0O2O6j24j88m4o3
3429a83jK77L9n7l5j84n4J30K71q4k11L88l07K9N8j48J52M6j96P7m3n5j06L42
3453A45P3j38j2j42j94J96J94o1J70j58j86n4K16l5k55L53j2k0j79l5K26K1j00
3476A3K7J01m60L19L7j04J66j9J14l46L3k01K39J92k84K44k34J43Q4k00K2J89
3498G5j0j89J67l3n4kJ03%q2k6J6j21L0Kj87L35N1j52J07j41N0K8J84mj34Oj0
3525Ij0K5j10O7J68j07q9MP2j1J65l8j10L2r6j00K65j77J68j78L0M0J3j28J27
3550C1O1Q0l07kK70k56J8M1J34j03p2J9J7r3K40K4q7L1J10k10K18j04N9j09J98
$$ plain form
3575 208 66 -17 1 -101 150 142 -161 -110 -6 -13 -26 -182 42 214 -25 103 110 -15 -161 118 -9 71 274 -215
3599 -215 -19 35 -233 -126 95 92 182 -17 -20 -99 -166 71 109 -107 169 -187 165 -73 -39 151 -30 -19 46 -82
3623 -82 222 38 123 19 35 66 -346 -106 -169 -115 196 236 88 -59 -332 -161 87 187 82 113 13 -2 -181
3646 -181 -78 86 44 -161 -70 -447 -303 2 89 108 47 132 -100 -412 -271 47 -50 239 74 -73 -71 -204 21
3669 21 335 -6 183 -49 -44 -134 -52 -14 -62 181 59 -25 -443 -223 -40 200 241 20 35 -6 -47 -143 -9 -55 52
3694 52 -27 -12 -104 -115 116 9 246 42 -29 -108 -118 -75 148 -200 183 196 -45 45 -251 -29 159 230 152 -116
3718 -116 -182 -253 -53 15 220 166 14 -44 -315 -206 69 284 154 212 59 -98 -16 52 173 214 -37 35 -119
3741 -119 -293 -281 31 263 4 211 -293 -176 -144 124 227 238 295 -40 -137 -214 -209 101 306 60 -40 -18 -240
$$ packed form
3575B08j42q3J8j02K51ql03N1J04pj3j56K24J72k39J28Pj25j46K79j27Q0K03m89
3599b15J96N4k68J07K21lR0j99lp9o7K37L8k16K76l56L52k38L4J90j81J1O5j28
3623h2L04j84Q5j04J6L1m12K40o3N4L11M0j48j47k73J71K48J00j05L1j00j5j79
3646a81J03J64m2k05R1l77J44L05Q7J9o1Q5k32l12J41L18r7K89j65j47Kj33K25
3669B1L14l41J89k32Nr0Q2L8m8K43j22q4m18K20J83K40M1k21J5m1m1r6J34m6J07
3694E2p9J5r2j1K31j07K37k04p1p9j0M3K23l48L83J3k41R0k96K22J88P1p8k68
3718a16o6p1K00O8K05n4j52n8k71J09K75K15j30N8j53j57Q2O8J21M1k51P2j54
3741a19j74J2L12K32k59K07n04J17L2K68J03J1N7l35r7p7NL10K05k46j00K2k22
$$ plain form
3764 -240 -142 97 44 318 136 125 -167 -196 47 -11 216 149 -179 -54 -298 -266 35 149 234 -79 -154 -328 -155
3787 -155 -175 121 181 1 -144 9 189 -21 20 350 102 35 -255 166 -50 12 245 95 -12 -145 -168 15
3809 15 188 31 306 245 -110 -181 -155 -50 198 72 -68 53 -430 -110 -78 222 376 300 194 -259 -168 -104 8
3832 8 349 252 -29 -26 -329 -188 -15 58 171 223 258 -130 -303 223 82 -14 469 124 -124 -305 -275 -189 57 181
3856 181 161 5 -153 -184 -105 62 -48 144 16 -74 -118 -289 32 43 234 185 93 -113 -86 -64 76 37 154 4
3880 4 -271 -309 -69 50 315 83 -67 -56 -162 -74 -270 19 -34 80 73 -151 -161 -159 -106 128 201 41 -46 -404 -309
3905 -309 -90 353 348 173 -50 -181 -137 14 162 119 175 109 -48 -153 -85 93 449 41 -31 -178 -11 -193 34
3928 34 139 88 14 120 -94 -165 -131 187 202 254 -5 -97 -96 -278 -107 45 21 234 -147 -307 -121 -170 231 256
$$ packed form
3764b40R8K39n3K74j82j1k92k9K43n8K27o7l28J25k44L2L01J14Q5l13p5j74J73
3787a55k0K96O0j80j45J53J80k10M1L30k48o7k90M21k16O2K33j50j07j33k3J83
3809A5J73j57K75o1l55p1K6J05K48j26j40J21m83L20L2L00J54p6j06m53R1O4J12
3832HL41r7k81Ll03J41J73P3J13N2L5l88j73N26j41r6M83l45k48j81L0Q6K46J24
3856A81k0j56j58l1P9J67j10J92j28r0m4j71L21J1J91m9r2k06K7K2J40l9J17j50
3880Dk75l8K40J19K65k32j50J1j06Q8j96K89n3J14pk24j0KN3K34P3j60q7l58R5
3905c09K19M43nj75k23j31M4J51J48m3N6o6j57j05O8J78L56m08p2j47J67j82K27
3928C4J05n1p4J06k14p1L4L18J5N2k59r2Jj82J71J52k4K13l81j60J86m9M01K5
$$ plain form
3952 256 97 -17 -241 -213 -214 -83 207 -13 46 164 -117 -69 -149 182 106 117 -183 -261 -116 18 -121 237 180
3975 180 -13 -59 42 -259 -100 198 301 51 -207 -267 -118 -134 1 27 175 -127 -51 -339 -208 50 34 95
3997 95 44 -134 -9 12 50 -32 362 23 94 -177 -247 -189 25 262 80 307 -367 -361 12 111 119 218 54 -41 -50 -152
4023 -152 10 38 77 157 109 -306 -348 -294 -94 203 111 59 119 -157 -61 -42 90 235 76 74 -215 93 108 -112 79
4048 79 199 -59 -75 -106 -216 116 107 234 242 115 94 -81 81 74 44 68 -1 -192 -276 -209 -156 -26 148 66 -110 -127
4074 -127 -144 4 34 97 80 -52 -57 -120 66 64 172 218 -25 -239 40 -140 -68 295 25 21 95 -138 43 46 265
4099 265 121 4 122 95 -246 -12 -161 2 217 -37 -129 -157 -280 120 -141 -33 -20 -59 -3 -50 95 121 280
4122 280 -113 -21 -39 -148 -8 189 68 220 49 25 -140 -103 -67 76 121 217 74 -147 -59 -17 -91 123 87 76
$$ packed form
3952B56j59j14k24K8jJ31K90k20N9J18k81M8q0L31p6J1l00p8J45J34j39L58n7
3975A80j93m6J01l01J59K98J03k50k58o0J49j6J35K6J48l02P6k88J31K58j6O1
3997I5n1j78J25K1L8q2L94l39P1k71p0N8K14K37j82K27o74OL73R9QR9j64r5rj02
4023a52J62K8L9Q0m8m15m2N4K00K97r2n2O0k76R6J9J32J45j59kk89L08J5k20J91
4048G9J20k58j6l1j10L32rJ27Qj27k1j75J62pl0K4o9j91q4O7N3J30J74q2j76j7
4074a27j7J48L0O3j7j32no3J86kJ08M6k43k14K79j80P2L63k70mP4k33J81LK19
4099B65j44j17J18k7l41K34j49J63K15k54r2k8j23M00k61J08J3l9N6m7J45K6J59
4122B80l93R2j8j09J40J97j21J52j71k4j65L7L6J43M5R6j43k21Q8M2p4K14l6j1
$$ plain form
4146 76 58 -216 -85 107 129 300 22 147 61 -82 20 54 227 96 115 94 -106 -167 184 112 171 337 -60
4169 -60 -176 -247 94 -154 -36 -37 22 74 -30 -33 242 -108 94 109 35 -99 124 -105 116 250 52 -7 94 -75
4193 -75 93 -119 98 189 -111 -103 -119 -39 -72 53 56 129 4 46 -251 20 136 104 135 -47 -206 -125 -61 -28 14 161
4219 161 45 -210 -241 -193 -186 -78 359 -92 -40 -135 50 -85 -94 181 -66 51 83 -180 -58 -94 -8 115 98 -66
4243 -66 -184 -86 125 -39 299 86 -101 -93 -11 -83 9 108 61 -211 -64 -177 142 111 186 67 11 5 -1 -62 -10 22
4269 22 40 -3 85 87 -75 -12 -34 150 113 47 -30 8 90 -130 -211 237 -54 101 -152 10 -75 -92 63 -24 -148 -36
4295 -36 0 18 140 -110 -92 59 84 -93 124 134 454 34 -54 12 39 200 8 -80 -63 121 83 3 33 -108 -336
4320 -336 -145 85 -60 -8 -183 -125 22 84 152 381 -83 -229 -6 -117 -67 -20 -13 -117 91 31 -57 291 -20
$$ packed form
4146G6j8k74J31J92K2J71k78J25q6j43J02L4J73j31J9k1k00o1L51p2N9J66l97
4169f0j16p1L41k48J18jN9N2j04lK75l50K02J5p4j34K23k29K21J34j98n9J01j69
4193g5J68k12K17R1l00Qj6Q0l3J25LP3j25M2k97K71J16l2L1j82j59Q1O4L3M2J47
4219A61j16k55l1M8PJ08M37m51N2r5J85j35rK75k47J17L2k63J22l6Q6J23j7j64
4243f6j18R8K11j64L38k13j87QQ2p2R2R9m7k72J47j13L19l1P5j19n6ooo1N2L2
4269B2J8m3Q8Kj62O3k2J84l7o6p7L8Q2k20q1M48k91J55k53J62q5j7J55q7j24J12
4295c6L6J8J22k50J8J51K5j77K17J0L20m20q8O6K7J61j92q8J7J84l8q0L0j41k28
4320c36J91K30j45N2j75N8J47O2O8K29m64j46K23j11N0M7Pj04K08o0q8L48l11
$$ plain form
4343 -20 -95 35 -128 107 -10 6 182 129 108 199 372 -54 -6 6 -30 -87 -64 105 15 85 -6 16 14 -69 97 64
4369 64 120 105 2 -12 95 -103 123 -45 -61 -112 170 256 174 -142 37 -29 -11 16 -100 -65 -36 -38 120 133 -81
4394 -81 39 -73 -69 -64 5 -146 178 133 -92 -196 -127 76 80 -57 -41 82 -9 -147 36 167 -10 75 -56 -71 -243
4419 -243 112 36 158 85 144 368 -2 97 164 -116 38 137 23 327 120 104 11 -264 -86 24 43 -241 -111
4442 -111 -45 223 -49 -66 346 56 29 -99 -127 90 -16 -165 41 133 -73 6 9 61 -95 -154 -76 -87 139 -26
4466 -26 -5 -232 -126 80 121 -296 -161 -48 107 38 72 -266 -198 94 -1 64 29 94 -241 49 21 -18 108 141
4490 141 114 -184 -137 -185 -44 35 135 -65 -138 -132 12 26 87 30 -60 91 -139 37 192 -11 -78 74 -89 -69
4514 -69 40 14 -19 -3 -98 8 1 24 -4 -67 161 209 58 36 -50 -58 -128 30 80 9 77 72 -126 -88 -24 103 110 -180
$$ packed form
4343b0p5J30j63K35j17J6J76n3k1R1J73m26M8J2l6n7K3J69r0P0r1K2kq3J66l3
4369F4N6j5j03j4J07j98K26j68j6n1K82Q6q2l16J79o6J8K7j16L5K9kJ58J3k14
4394h1J20j12MNO9j51L24m5k25j04O9K03Mj37J6J23r1j38J83J31j77Q5j31j5j72
4419b43L55p6J22p3N9K24l70R9O7k80J54R9j14L04k07j6r3k75J78J10J9k84J30
4442a11O6K68k72j7M12k90k7j28k8K17j06j49K06R2k06P9LN2j56n9P8j1K26j65
4466b6K1k27J06K06M1m17J35J13J55o9L4l38O8K92r5O5l5O5l35K90k8l9J26L3
4490A41k7k98M7m8J41P9J00k00p3OJ44J4O1n7r0J51k30J76J55k03o7J52j63K0
4514f9J09k6l3J6r5J06pK3k8o3K28M8j51k2q6qp0J58N0p1O8nj98L8O4J27Pk90
$$ plain form
4542 -180 -241 -62 -17 -191 179 233 152 29 -31 -18 -31 145 76 135 57 -40 111 23 -245 83 -55 168 -25 -122
4566 -122 -116 -50 106 -63 -27 36 -105 -25 -96 -116 63 23 11 55 -5 -15 -19 -84 193 188 -10 -120 -222 -272 133 217 148
4593 148 -82 -25 -11 27 -191 -100 60 -192 69 -49 72 -84 190 -124 112 21 -130 -96 -192 -100 68 9 -128
4616 -128 -31 -79 -186 -6 -151 0 108 -383 -276 -87 -58 -196 387 -3 22 -50 29 -94 -1 -12 -59 -52 -139 -50
4640 -50 103 34 96 153 93 20 27 -108 -143 309 66 193 71 -45 43 -60 -202 109 93 202 172 -181 -76 -1
4664 -1 69 179 -31 -181 -274 -368 -122 -54 81 12 23 -125 -23 -185 196 -137 -77 98 81 -216 -112 69 284
4687 284 68 8 -4 -75 -32 92 -209 100 264 37 50 -92 -38 -110 -88 133 117 46 -47 -378 -102 76 134 197
4711 197 154 -50 -17 29 -163 55 194 -257 -143 -79 -211 1 196 -50 149 156 -100 -116 -137 62 105 -11 174
$$ packed form
4542a80o1J79M5j74L70N4q1j23o0J3j3J76o9N9p8r7J51q8k68L28j38K23j93r7
4566a22OO6J56j69L6O3j41Q0p1k0J79m0j2M4o0j0mo5K77nj98j10j02n0M05Q4o9
4593A48k30N7J4L8k18R1J60k52K61j18J21j56K74l14K36r1j51L4r6R2J68n9j37
4616a28R7m8j07J80j45J51J08m91J07J89K9j38N83l90K5p2P9j23R3j1m7Pq7Q9
4640e0J53o9O2N7o0p3Pj35l5M52k43J27j22j16Q8j03j42L11j6J09l0l53J05P5
4664aP0J10k10j50r3r4K46O8J35o9J1j48J02j62L81l33O0J75j7k97J04J81K15
4687B84k16o0j2p1M3J24l01L09J64k27J3j42N4p2K2K21j6p1r3l31K76J78N8O3
4711A97m3k04L3M6j92K18J39m51J14O4j32K12J95k46J99Pk56j6k1J99M3j16J85
$$ plain form
4734 174 21 -65 37 -46 26 126 55 -110 -126 -355 -59 -56 -6 92 92 -72 17 -189 -32 122 22 68 -191 -187 -127
4759 -127 -230 72 63 208 87 -43 183 9 84 146 84 173 -99 -217 -123 66 44 -9 41 -116 -28 -9 -103 62
4783 62 71 10 0 -61 -342 53 109 295 -40 9 -33 -179 -282 45 127 58 83 86 171 25 -36 -61 75 -47 0 -65
4809 -65 -397 -131 -5 193 272 183 179 25 -186 -126 -83 176 -28 20 23 -252 -42 -124 -106 162 159 13 -149 -169 -156
4834 -156 106 -9 -145 196 -218 -68 -49 36 279 214 105 5 -129 -251 168 60 150 186 18 10 -345 -117
4856 -117 253 35 163 -107 -72 -184 -148 -66 59 147 -21 -62 -77 -49 105 96 88 173 -51 -318 -218 -51 -24 -2 -129
4881 -129 135 -15 -238 -21 -192 36 530 124 163 132 -118 -29 50 114 106 44 -169 -44 -200 52 187 61 59
4904 59 132 -144 -264 44 31 254 -20 68 -201 54 -228 66 161 -175 41 57 -62 15 -26 54 143 -63 136
$$ packed form
4734A74j53q6J02q3P2J00p1j65j6k29K96LN0R8%j64Q9k06J57J54j00M6k59MO0
4759a27j03L02rJ45j21j30K26j74P5O2o2Q9k72j18R4J89k2n3N0j57Q8J9r4J65
4783F2Ro1j0o1k81L95N6J86l35M9m2j46j03L27Q2o9K5LQ5j46o1k5J36j22M7o5
4809f5l32K66J26J98P9q9mj54k11O0M3K59k04M8Lk75K10q2J8K68lj46j62k0J3
4834a56K62j15j36L41m14J50J9Q5K43o5j09j00j34j22M19j08R0L6j68ql55K28
4856a17L70k18J28k70L5j12L6Q2J25Q8j68m1j5K8J54rqQ5k24k67J00J67K7K2j27
4881a29K64j50k23K17j71K28M94m06L9l1k50Q9P9O4qo2k13J25j56K52J35j26k
4904E9P3k76j20L08j3K23k74Q8k69K55k82K94R5l36K16J6j19P7m1Q0Q9k06J99
$$ plain form
4927 136 49 -213 -29 14 181 69 126 -38 7 -94 -79 246 164 137 -64 -183 -50 -2 131 213 -31 5 183
4950 183 -285 -220 120 -130 -12 -30 -50 -91 95 134 7 110 19 -76 59 -84 -238 54 184 256 225 161 -135
4973 -135 -194 -138 177 307 95 -47 -260 -219 -138 -86 143 191 24 22 -51 -338 5 63 127 108 139 -334 -26 146
4997 146 -42 -43 -127 -23 -33 -162 -239 -8 175 49 101 43 -207 -198 -3 36 40 174 92 -108 -69 -132 200 -64 73
5022 73 148 -243 -42 41 295 161 -112 35 104 -192 -145 -41 293 -34 -31 80 -270 -282 -250 54 -170 67 222
5045 222 -100 -218 -237 -92 64 183 -30 -221 -185 8 -142 103 120 116 235 -304 70 -311 28 8 100 34 -178
5068 -178 -149 -345 -134 129 156 243 -62 -22 -269 -221 6 -159 121 88 312 -133 52 -186 124 96 150 -42 -242
5091 -242 -55 -186 126 35 240 136 -115 -151 -280 35 43 288 -5 -133 12 -130 141 100 217 265 33 -40
$$ packed form
4927A36q7k62J84M3J67j12N7j64M5j01J5L25q2k7k01j19J33M8J33Q2k44L6J78
4950A83m68O5L40k50J18j8k0m1J86L9j27J03r1r5J35j43j54K92J30P2l1o4k96
4973a35n9N6L15J30k12j42k13M1Q1N2K29M8j67kp3k87L43N8O4j9L1m73L08J72
4997A46j88jq4J04j0j29p7K31J83j26N2n8k50RJ95L9MJ34q2k00L9o3L32k64J37
5022G3P5l91K01Q3K54j34k73J47O9k96M7J04L34l27LJ11l50j2L2L04k24K37J55
5045B22l22j18j9J45J56J19k13j91L6J93j50K45J7mJ19n39L74l81L39k0R2o6k12
5068a78K9j96K11K63K7Q7l05M0k47M8K27j65K80l3K24m45J85k38L10k8N4j92k00
5091b42J87j31L12r1K05j04k51l6j29L15QK45k93j28J45j42K71m1J17M8k32p3
$$ plain form
5113 -40 -218 272 35 70 196 64 133 -278 -11 -38 97 53 22 -149 -140 -132 -108 -45 257 -88 198 -102 -120 -9
5137 -9 -18 281 67 184 -147 -190 -62 -345 81 61 167 -29 185 -198 -87 -57 52 197 151 -59 -20 -154 82
5160 82 -36 196 170 53 72 -86 -147 -160 -42 224 -11 -251 -224 -506 -6 66 42 346 101 -199 -295 -100 -40
5183 -40 326 232 162 -222 -322 -49 -9 306 90 278 -35 -48 -252 -47 79 431 168 91 -100 -149 -170 150 128
5206 128 126 131 -17 54 -151 -162 -45 23 37 -2 -114 -202 -104 28 61 256 -45 -82 18 28 140 90 154 164 105 -4
5232 -4 19 -71 -58 85 5 150 -52 -116 -103 -64 291 230 129 32 -412 72 -68 55 209 38 57 -158 -92 -79 31
5257 31 221 263 137 -163 -89 -14 -60 236 237 -138 -149 -83 -71 -277 -15 249 88 -22 -56 -262 5 -35 56 221
5281 221 64 34 -10 -96 -110 -64 235 255 -36 -194 -216 -160 143 218 184 -132 -45 -93 -96 -5 201 185 175 136 -119 -286
$$ packed form
5113d0j78M90k37L5J26j32O9m11K67k7J35m4l1j71RQK4O3L02l45K86l00j8J11
5137irK99k14J17l31m3J28k83M26k0J06j96K14l83J11L0J09J45m6k10L9j34K36
5160H2j18K32k6j17J9j58o1j3J18K66k35k40K7k82N00P2k4L04k45l00r6J95O0
5183d0L66r4p0l84j00K73M0L15k16J88l13j3k04K05J26L52k63p7j91m9k1L20k2
5206A28kNj48P1k05j1J17O8J4l9j12q8R8J32L3J95l01l7J00J0J12n0O4J0n9j09
5232dK3r0J3J43q0J45k02o4J3L9L55o1j01r7m44M84j40J23J54j71J9k15O6J3J10
5257C1J90M2j26l00P4P5m6K96Jl75j1O6J2k06K62K64j61j10l4k06K67m0R1J65
5281B21j57l0m4q6j4M6K99K0k91j58k2N6L03P5l4l16Q7m8lR1K06j6j0l9k55j67
$$ plain form
5307 -286 -57 78 427 129 -135 -206 -347 -123 150 185 124 33 58 -195 -288 40 230 200 55 -32 -6 -203 -243
5330 -243 228 107 199 130 -279 -163 -224 7 128 9 68 -101 221 -44 77 194 374 165 72 -44 -181 -4
5352 -4 17 150 145 283 -262 -264 -34 61 -160 186 154 -112 -118 -260 29 161 241 267 138 -206 -231 -108 -276 -2 416
5377 416 109 -110 -269 -332 -54 -61 145 251 -223 -288 -29 10 101 269 213 73 -8 -310 -128 -84 -25 132 129 -64
5401 -64 -284 -270 -74 220 255 44 110 -120 -198 -363 -110 156 308 81 -29 -79 -189 -22 165 241 74 -111
5423 -111 -301 -213 -3 -179 152 103 -43 -160 -227 -238 6 166 267 182 -66 -274 -369 -62 97 249 275 55
5445 55 -44 -184 59 164 274 90 207 45 -328 -254 56 77 241 115 -66 -231 -269 -57 76 90 254 83
5467 83 -95 -343 -96 -67 201 58 175 87 -125 -224 -30 128 247 -38 11 -158 -264 -117 35 246 307 -73
$$ packed form
5307b86K29J35L49k98k64p1j41K24K73L5o1r1K5k53r3L28J90l0j45q7K6j97m0
5330b43M71j21R2o9m09J16o1K31J21j19N9j69L22k65J21J17J80k09r3j16j37J77
5352dK1J33nJ38n45kK30R5k21L46l2k66oj42K89J32Q0K6j29l44k5J23j68K74M18
5377D16l07k19j59o3K78pK06J06m74o5K59L9R1J68n6j40q1l02J82M4N9J57lj93
5401f4k20J4J96K94L5k11O6k30p8j65K53K66J52k27j10n0j10J67J87P6j67j85
5423a11j90Q8K10j76L31m9j46j17o7j1K44J60J01q5k48k08r5L07J59J52K6k20
5445E5r9j40K43J05J10j84J17j62l73P4L10K1J64j26j81j65l8K12J33J4J64j71
5467H3j78k48K47K9K68j43J17q8k12r9J94J58J19k85M9j69j06J47J52K11O1l80
$$ plain form
5489 -73 -237 -217 -75 -58 216 169 264 113 -204 -77 25 -60 -53 129 -101 -196 -35 -17 -43 139 309 -56 -209 -212
5513 -212 -148 -165 157 216 154 241 -124 -415 -268 -107 307 153 203 47 -46 -214 143 63 240 250 1 -55 -270
5536 -270 -131 184 123 229 -60 -305 -302 -366 -60 108 45 19 8 -170 -202 -34 85 358 -32 89 -285 -214 -98
5559 -98 300 75 310 140 -131 -185 -19 16 186 395 284 -34 -230 -291 -53 230 259 316 -180 -64 -237 -22
5581 -22 53 165 76 99 -179 -71 -121 -105 157 213 127 -64 -220 -271 -106 -80 291 105 140 -260 -121 -165 234 229 195
5606 195 120 -12 -223 -468 39 179 310 28 4 95 -149 6 -57 239 314 -40 -142 -209 -286 88 61 208 -12
5629 -12 -313 -271 -203 -224 -55 386 -7 269 -245 -239 -143 33 392 179 25 -89 -134 -157 70 165 159 145 174 -224 -293
5654 -293 -231 24 189 120 53 -151 -102 -202 -50 38 0 80 164 -229 -175 -155 170 295 7 0 -75 -365 -187 138
$$ packed form
5489g3j64K0J42J7K74m7R5j51l17J27J02q5PJ82k30r5J61J8k6J82J70l65j53l
5513b12O4j7L22N9o2Q7l65k91J47J61M14j54N0j56r3j68L57q0J77J0k49n6k15
5536b70J39L15o1J06k89k45Lo4L06J68o3k6j1j78l2J68J19K73l90J21l74P1J16
5559i8L98k25K35j70k71n4J66L5J70K09j11l18j96o1K38K83K9N7m96J16j73K15
5581b2P5J12q9K3k78J08n0J6K62N6q6j91j56n1J65K6L71j86L5m00J39m4L99nl4
5606A95p5j32k11k45N07J40J31k82k4R1k44J55o3K96P5l54j02o7p7L74k7J47k20
5629a2l01M2O8k1J69M41l93K76n14OR6J76L59k13j54j14m5k3K27R5oj4K9l98o9
5654b93O2K55J65o9o7k04M9j00J52Q8l8Q0Q4l93N4K0L25J25k88pp5k90J78L25
$$ plain form
5678 138 138 158 154 -109 -14 -188 -145 123 246 121 -83 -360 -503 -78 197 -38 411 187 44 -104 -77 77 51
5701 51 181 204 -50 -163 -289 -198 324 166 345 -211 -310 -216 -168 -78 192 70 165 -48 -136 -280 -90 21 383
5724 383 103 140 -211 -122 -150 153 139 80 109 -113 -206 -122 -82 103 226 -6 52 -218 -180 -15 106 294 182 25
5748 25 -14 -209 -140 72 100 207 319 -233 -149 -145 -148 -81 239 240 -20 -196 -248 -314 -41 223 75 254 171 -335 -74
5773 -74 29 205 299 124 -49 51 -181 -251 113 310 312 85 -123 -73 -126 131 160 151 99 117 -5 -2 -115 114 133
5798 133 223 -134 -324 -154 -214 -80 82 315 69 -43 -150 -326 38 246 282 -143 -116 -41 -350 -320 -119 97
5820 97 236 95 -182 -90 -83 203 149 142 -17 -48 -216 -205 65 87 383 -2 107 -160 -133 -131 58 140 50 17 -50 -137
5846 -137 -468 93 28 490 270 147 -2 -57 -142 109 322 301 -51 -65 -50 -142 -178 261 244 -104 -93 -283 -233 -172
$$ packed form
5678A38%K0mk63R5j74M3K68J23j25k04k77j43M25K75k35M49k24j43j48K7J54k6
5701E1J30K3k54j13j26R1N22j58J79n56r9R4M8R0K70j22R5k13q8j44J90J11L62
5724C83k80L7l51Q9k8L03j4n9K9k22r3Q4M0J85J23k32N8k70L8J65J21J88j12j57
5748B5l9j95O9K12K8J07J12n52Q4MlO7L20Jk60j76n2o6K73K64j48J79q3n06K61
5773g4J03J76R4j75j73J00k32p0L64J97Kk27k08N0n3K57K9rn2J8j22Lj13K29J9
5798A33R0l57j90J70o0J34J62K33k46j12j07j76L64K08L6m25K7P5l09L0K01K16
5820I7J39j41k77R2PK86n4pj59l1j68J1K70K2K96l85J09k67K7KJ89Q2r0l3o7q7
5846a37l31N61o5M62k20j23j49n5q5K51K13k1l52j4J5r2l6M39j7l48J1j90N0O1
$$ plain form
5870 -172 209 155 276 82 -270 -172 -268 150 180 272 250 -144 -235 -48 -50 0 104 -54 -93 -219 -302 175 125 190 147
5895 147 43 -22 -192 -13 43 -43 103 20 18 -295 -316 205 306 87 221 -29 166 -71 -77 -23 190 194 -120 -203
5919 -203 -176 54 -108 176 277 167 -211 -127 -333 36 -23 294 241 216 -294 -153 -132 283 288 55 219 -19 -181
5942 -181 -187 21 84 275 247 -42 -112 -248 -224 126 143 166 80 -73 -198 -212 40 359 63 153 50 -270 -90 127
5966 127 83 302 117 -113 -322 -211 -48 210 320 266 120 -234 -149 -96 -19 -56 65 -1 -325 -51 -244 -78
5988 -78 193 85 131 134 -82 -11 -222 163 -33 -116 -1 -49 -243 -217 -150 183 123 73 52 57 -30 255 14 103 200 -62
6014 -62 -80 -200 -82 -23 141 192 -109 -131 -262 -233 -3 118 304 44 146 -2 -185 55 159 137 -74 -47 29
6037 29 -201 -10 -133 121 335 199 -44 -32 -81 25 112 70 77 265 -245 -158 0 80 269 23 36 -21 -157 -133
$$ packed form
5870a72L81n4J21j94l52R8r6M18L0R2k2l94r1J87kN0J04j58l9j26q3M77n0O5m3
5895A47j04o5j70J79N6q6J46q3kl13k1N21J01k19J34k50J95k37oN4K13Ml14q3
5919b03K7K30j62K84J01j10l78Q4k06L69n9L17n3k5n10J41K1M15Nk33J64k38j62
5942a81oK08O3J91k8k89p0j36K4L50J7K3q6j53j25j4K52L19k96R0j03l20J80K17
5966A27m4K19j85k30k09J11J63K58J10n4j46l54Q5N3P7l7J21o6l24K74j93J66
5988g8K71j08M6Lk16P1k11L85j96q3J15m8j94K6O7L33o0n0k1Nq7K85k41Q9R7k62
6014f2j8j20J18N9J64N1l01k2j31K9K30J21J86k60J02j48j83K40J04k2k11K7P6
6037B9k30J91j23K54K14j36k43J2m9J06Q7m2PJ88n10Q7J58Q0J89k46J3n7j36K4
$$ plain form
6061 -133 137 223 252 308 -104 -314 -266 -82 91 230 -42 -164 -232 -131 -263 2 11 297 62 69 148 -156 37
6084 37 30 55 166 64 -287 -205 -35 11 127 56 18 -153 -257 -150 168 104 252 190 -164 -141 -151 -152 3 228 73
6109 73 59 -115 45 69 -160 269 100 85 18 -257 -194 196 163 161 7 -59 58 -255 -202 -27 195 72 -25 -47
6133 -47 -150 -199 -137 80 128 104 112 -109 -174 -215 72 124 173 39 -5 -166 -58 64 -24 98 198 10 -112 -136 -102
6158 -102 202 -99 220 26 48 -72 9 50 186 188 -93 -102 -225 11 -73 33 272 29 -138 8 -149 -20 94
6181 94 248 232 45 107 -210 -63 195 130 -71 104 242 -280 -195 -147 156 39 14 107 -27 -92 -8 69 85 213
6205 213 -34 -110 -315 -178 -7 89 33 212 -162 -242 -86 -32 61 231 202 -27 -33 -198 1 -77 -19 -64 16 -340
6229 -340 -125 -226 -56 -66 98 -31 -69 -218 -148 61 77 164 38 -86 61 0 231 123 115 328 -63 80 -29
$$ packed form
6061a33K70Q6K9N6m12k10M8J84J73J39k72j22o8J01j32K65RK86k35PP9l04J93
6084C7pK5J11j02l51Q2J70M6J16p1l8j71j04J07L18o4J48o2l54K3j0jJ55K25j55
6109G3j4j74J60K4k29M29j69j5o7k75O3L90l3kj54o6J17l13N3J75K22j23r7k2
6133d7j03m9O2K17M8k4Qk21o5m1K87N2M9j34m4j61J08J22q8J22J00j88j22k4L4
6158a02L04l01L19j94K2j20Q1M1J36Kk81rj23K36q4J06K39k43j67J46j57J29J14
6181I4J54j6j87O2l17J47K58o5k01J75J38n22Q5M8L03j17k5R3j34o5Q4P7J6J28
6205B13k47p6k05J37J71R6n6J79l74q0J56N4R3J70k9k29oj65J99p8N8m5Q0l56
6229c40K15j01J70j0J64j29l8j49P0K09J6Q7j26j24J47o1K31j08qK13l91J43j09
$$ plain form
6252 -29 -143 -32 245 -40 9 -15 -69 18 -26 177 189 52 -284 190 -314 12 -275 -34 -4 -74 -126 -98 -95 -93 159
6277 159 -41 114 -106 -63 73 -80 -129 8 -5 -142 -63 -56 -103 -67 -122 69 131 107 -306 61 15 72 3 -51 -20
6302 -20 -200 -59 -106 -8 -180 77 5 175 -20 60 18 170 -101 -111 -151 10 -9 -89 69 -116 -64 -15 -169 -142
6326 -142 111 52 171 92 -96 55 39 -153 33 53 -49 -36 -51 -49 199 -163 89 122 112 167 -30 -125 43 177
6350 177 -58 139 214 -143 121 -85 -77 150 106 123 2 -41 -211 62 11 192 238 -14 -163 91 66 66 -81 240
6374 240 -25 208 32 -2 140 -1 32 155 180 -302 175 -239 53 47 -114 90 -192 -42 -107 -22 125 36 -85
6397 -85 -3 -118 -15 39 18 111 69 -92 -42 42 -197 92 -36 232 95 -96 -5 34 -76 62 38 -33 68 10
6421 10 -61 -140 57 -97 116 68 -242 -44 49 78 384 91 106 63 -40 90 -281 -65 -3 -118 154 -15 79
$$ packed form
6252b9j14J11K77k85M9k4n4Q7m4K03J2j37l36M74n04L26k87K41L0p0n2K8LKK52
6277A59k00J55k20M3J36j53m9J37j3j37P9Pm7L6n5J91O2k4m13L67m6N7o9n4L1
6302b0j80J41m7R8j72K57p2J70j95Q0m2J52k71j0m0J61j9q0J58j85N2M9j54K7
6326a42K53n9J19p9j88J51j6j92J86K0j02J3j5KK48l62K52L3j0N5j97r5J68J34
6350A77k35J97P5l57K64k06QK27m4J7j21m3j70K73n1J81M6k52j49K54k5%j47L21
6374B40k65K33j76l4J42j41L3J23K5m82M77m14K92oj61K04k82J50o5Q5J47q9j21
6397h5Q2j15J03N4k1R3m2j61N0Q4k39K89j28K68j37j91R1L9j10J38k4p1J01n8
6421A0p1p9J97j54K13m8l10J98R3K9L06k93J5m3j03J30l71K16O2j15K72j69R4
$$ plain form
6444 79 -128 -40 82 -267 -108 -65 5 17 82 -3 -155 57 -49 -46 29 -51 3 116 -112 -84 76 -109 9 15 -48
6469 -48 -173 -16 -214 -62 136 -184 84 103 -32 -25 78 -98 -136 -11 61 93 -118 22 -5 3 4 75 -67 -161 -212
6494 -212 59 -19 141 -146 -125 -151 48 -120 158 28 -30 183 -80 -81 -116 -143 122 -146 109 53 -131 -85 -197
6517 -197 -26 96 156 -7 60 -162 -52 -95 -103 -35 173 172 82 -182 109 232 87 139 167 -78 160 -34 31 145
6541 145 -23 -22 119 -29 -4 -24 -60 -19 -15 -107 -50 6 134 38 -66 91 51 175 -229 3 -3 77 102 77 -76 105
6567 105 110 14 89 -169 -27 103 174 -70 155 115 99 -27 -13 180 144 39 40 178 85 231 -64 157 -81 70
6591 70 -9 361 -79 13 -115 16 -13 213 291 -24 215 -129 -61 -103 163 -5 157 -97 92 -23 -64 51 121
6614 121 -110 4 -69 -77 226 39 42 2 21 -49 0 -137 70 -113 51 31 30 -75 -53 -56 40 113 146 156 44 25 69
$$ packed form
6444G9k07Q8J22l49J59M3P0J2O5q5j52K12j06LP5q0N4J13k28K8J60j85J18Oo3
6469d8j25J57j98J52J98l20K68J9j35PJ03j76l8J25P2L2k11J40k7QJP1j42r4n1
6494b12K71p8J60k87K1k6J99j68K78j30n8K13k63jl5k7K65k68K55n6j84M6j12
6517a97J71J22O0j63O7k22J10m3qO8K08jr0k64K91J23j45N2K8k45K38j94O5J14
6541A45j68JJ41j48K5k0l6M1Mr2N7N6J28r6j04J57m0J24m04K32oQ0K5k5j53J81
6567A05Nr6P5k58J42J30P1k44K25m0j6j26J4J93l6j05JJ38r3J46k95K21k38J51
6591G0p9L70m40R2j28J31k9K26P8l15K39l44O8m2K66j68J62k54J89j15m1J15P0
6614A21k31J14p3qL03j87Lm0J9p0M9j37K07j83J64k0jj05K2lR6P3L3J0j12j9M4
$$ plain form
6641 69 -55 40 38 -20 50 -87 -198 130 61 134 -149 9 35 146 -58 17 84 17 9 -93 29 16 -252 -11 7
6666 7 154 -64 -228 83 332 71 15 63 24 -1 85 -223 -58 -137 -68 105 -205 172 1 47 40 86 59 -2 8
6691 8 27 91 142 62 -41 77 -101 -129 129 9 22 155 137 -61 -13 160 -72 140 69 113 -49 -33 -15 -13 123
6716 123 72 209 -110 -6 -53 65 -49 -93 -24 -165 -240 86 19 31 13 -80 -11 -129 9 81 177 61 44 -47 -49
6741 -49 224 104 13 44 -103 -58 -35 41 27 152 55 -30 -52 -159 306 74 -110 76 -91 -172 65 -1 52 -1 69
6766 69 175 -43 -216 73 80 -138 -129 115 54 90 194 113 104 67 58 -37 -52 -177 45 -129 -41 -29 -127 85 108 -30
6792 -30 19 212 -194 -20 251 2 -147 142 -8 35 73 -86 -38 -79 -89 -156 122 -112 143 10 -72 49 -21
6815 -21 -117 -67 -71 152 -16 -87 79 -44 53 2 -143 -72 -10 90 -8 62 23 -8 -43 -126 -278 -26 21 -100 175 296
$$ packed form
6641F9j24R5kn8P0j37j11L28o9P3k83J58K6J11k04P5O7o7qj02J22j3k68K41J8
6666GJ47k18j64L11K49k61n6M8l9k5Q6l08J65p9O9J73l10L77j71M6pM6k7o1J0
6691HJ9O4N1q0j03J18j78k8K58j20J3J33j8j98M8J73k32K12p1M4j62J6J8KJ36
6716A23n1J37l19J04m7J18j14m4O9j41p5L26o7J2j8r3O9j18J38P2R6j16j7r1k
6741d9K73j20r1L1j47M5K3P6j4J25r7q5k2j07M65k32j84J86j67q1K37o6N3n3P0
6766F9J06k18j73K89Pk18RK44o1L6J04q1rl7rr5j5j25K22j74Q8J2r8K12K3j38
6792c0M9J93m06J74K71k49j49K89j50M3L8j59M8m1j0o7K78k34K55j33q2J21p0
6815b1r6N0mK23j68p1J66j23R7n1j45P1O2J00r8P0l9l1l5q3j52K52M7j21K75J21
$$ plain form
6841 296 84 -24 28 17 -78 24 28 2 44 121 -190 324 12 151 -93 87 -111 1 -124 -150 175 64 -13
6864 -13 91 195 50 7 -67 60 213 69 8 51 101 107 181 -69 -110 -37 -71 119 -185 34 -103 74 36 -177
6888 -177 -134 -114 -23 -58 210 -150 123 43 -52 33 -36 -66 136 -36 100 -255 85 -28 128 -69 -53 71 -96
6911 -96 -15 -55 -25 -367 19 147 -125 -127 10 89 155 -38 251 -131 18 166 150 47 -3 -55 2 -197 -77 214
6935 214 -133 -65 32 44 47 -46 149 -186 49 -38 -59 -149 -12 -123 18 37 -33 -19 -128 -263 -61 5 -64 179 134
6960 134 -94 46 -6 -31 -71 -48 -36 -43 74 89 -34 233 64 50 -139 176 -96 -39 47 -26 66 -236 -27 -9 34
6985 34 -218 63 113 -83 -183 -97 -235 -235 7 1 70 22 -3 83 -135 -10 -51 13 91 -79 105 -81 10 -115 14
7010 14 105 -87 -52 -9 -112 -6 54 151 256 62 -118 -250 -89 28 124 11 -61 83 95 -13 -116 47 -16
$$ packed form
6841B96k12j08N2j1r5J02Mk6M2P7l11N14l12J39k44J80j98J12j25k6L25j11p7
6864a3J04J04j45m3p4J27J53j44o1M3N0OP4k50m1P3l4J90l04K19j37J77l8k13
6888a77M3K0R1l5K68l60K73q0r5Q5o9l0K02j72J36l55L40j13J56j97J6J24j67
6911i6Q1m0L0l42L86J28k72kJ37P9O6j93K89l82J49J48j6j03n0n2N7j99J20K91
6935B14l47O8R7J2Lr3J95l35K35q7k1r0J37j11J41J9p0J4j09j35K02O6o9K43m5
6960A34k28J40n2k5m0K3J2pJ17J5j23K67j69j4j89L15k72N7Q6p3R2l02K09J8M3
6985C4k52K81N0j96j00Q6j38%K42oO9m8k5Q6k18J25m1O4P8j70J84j86R1j25J29
7010A4R1j92L5M3j03J06O0R7J05j94j80j32J61J17R6j13p2J44J2j08j03J63o3
$$ plain form
7033 -16 10 1 29 -1 -16 139 348 254 -223 -86 -50 33 -38 25 60 98 -5 -207 93 -116 297 72 86 58 165
7058 165 -140 -125 -6 25 -175 35 43 -62 126 -85 218 -113 -36 66 67 2 -111 152 102 262 146 -56 -130
7081 -130 -173 -153 215 140 161 13 12 71 32 -178 -3 45 46 -21 -71 70 17 -98 27 -2 6 38 3 239 -30 -52 282
7108 282 -57 38 -204 -35 274 48 0 103 -76 -56 3 105 239 59 -75 -56 -67 97 93 -87 20 -13 -73
7131 -73 -49 -58 -21 134 3 -227 11 68 95 30 308 258 68 -8 15 -35 85 -87 -54 -62 -75 154 -107 -131 55 119
7157 119 51 -140 135 59 -92 -117 99 195 10 -23 -45 -69 11 19 19 18 84 -28 33 59 -20 70 124 -184 -38 -8 43
7184 43 -10 141 125 7 -133 115 -119 108 114 48 -40 -20 4 -361 180 3 49 -16 -140 -23 -101 1 -12 -33 95
7209 95 57 113 -1 -32 -3 84 -45 104 -127 129 -144 15 111 2 -106 95 102 -87 62 -25 120 124 56 -95
$$ packed form
7033a6K6rK8l0j5J55K09r4m77J37L6Q3p1O3L5L8j03k02L00k09M13k25J4k8J07
7058A65l05J5J19L1k00K10Qj05J88k11L03l31P7J02Jo5j13K63n0J60j16k02p4
7081a30m3K0L68p5K1j48jN9l9k10J75M8Jo7n0J41n3j15J25k9QL2l5K36k69k2L34
7108B82l39R5k42J69L09k26m8J03j79K0N9J02J34j80j34J9j1J64mj80J07l3o0
7131g3K4rL7J55j31k30K38N7K7o5K78n0j90p6K3n0J20j72L3qj3K29k61k4J86O4
7157A19o8j91K75p6j51k5K16R6j85l3k2k4Q0Q%jO6j12O1K6p9R0N4l08J46L0N1
7184D3n3J51j6j18j40K48k34K27Oo6q8K0K4l65N41j77M6o5j24J17p8J02j3k1J28
7209I5l8N6j14l1K9Q7j29J49k31K56k73J59R6j09j08K01Pj89J49q7J45Mo8j51
$$ plain form
7233 -95 -78 29 64 -64 -17 -42 -120 72 -175 -255 -111 274 -175 -187 80 208 -28 33 -68 248 254 -194 9 58
7257 58 -43 -31 268 7 73 30 -46 13 -107 8 158 -209 107 40 -38 -224 14 -31 82 -62 143 -135 5
7280 5 175 128 304 53 124 -5 -83 58 -46 -45 121 204 128 82 -97 -98 74 158 19 -127 -14 -165 -97 237 16
7305 16 42 98 -144 -85 -14 13 2 90 -263 236 -11 -194 20 14 -5 158 -55 24 24 -217 -130 -14 210 135 -108
7330 -108 80 -95 -3 -171 -80 39 -68 118 89 112 1 -142 20 -38 -36 9 55 118 44 160 228 125 -19 121
7354 121 180 -39 -65 56 -13 3 71 -42 -57 91 -35 68 -138 4 18 48 174 22 -45 -178 -195 -57 -35 -72
7378 -72 -68 -100 -16 -128 45 -305 94 -10 -56 -11 -139 98 191 68 151 42 4 24 19 -101 121 17 -128 -52 -105
7403 -105 22 -214 -78 53 82 3 -89 15 -121 -49 206 71 149 44 -25 -25 -117 1 -41 225 267 269 118 180 -161
$$ packed form
7233i5J7J07L5j28M7k5p8J92k47q0J44L85m49j2K67J28k36O1j01L16Om48K03M9
7257E8j01J2K99k61O6m3p6N9j20J15J50l67L16o7p8j86K38m5J13j44K05k78J40
7280EJ70m7J76k51P1j29p8J41j04JJ66Q3p6m6j79jJ72Q4j39j46J13j51O8L34k21
7305A6K6N6k42N9P1K7j1Q8l53M99k47j83K14oj9J63k13P9%k41Q7J16K24p5k43
7330a08J88j75R2j68R1J19j07J86k9K3j11j43J62n8KM5M6O3p4J16O8j03j44J40
7354A21N9k19k6J21o9J6O8j13j5J48j26J03k06J42J4L0J26j52o7j33j7J38K2l7
7378g2Ml2Q4j12J73l50L99j04m6M5j28K37R3j23Q3j09l8K0nj20K22j04j45P6n3
7403a05J27k36J36J31K9p9r2J04j36P2K55j35P8j05o9%r2J18m2K66M2Kj51O2l41
$$ plain form
7428 -161 -82 -140 22 53 -43 27 -28 107 38 121 -36 1 -64 -63 -8 28 -43 159 -240 38 -217 -154 195 78 152 49
7454 49 11 -141 180 -77 -84 109 118 85 -27 1 10 113 -187 -95 -52 -124 110 23 -41 8 207 193 18 -72 6 90 -125
7481 -125 49 236 -82 -23 -27 -79 -63 -39 -129 13 -12 -98 18 91 3 -29 262 100 -123 20 129 -135 -95 34
7505 34 26 210 -262 21 -162 135 -27 98 -39 -139 16 60 35 -75 75 -64 4 -178 -215 -21 56 163 3
7528 3 -65 72 -173 117 -14 -24 -62 115 90 -35 -55 -26 -164 56 -6 -15 -36 38 -144 55 125 -13 100 1 -145
7553 -145 -51 30 93 -10 12 -4 -198 -150 16 -17 137 -27 -194 -256 -14 -213 102 -41 -116 -163 -171 55 -32 -76 -34
7578 -34 -111 106 -59 -141 -7 9 76 92 38 -61 -61 45 161 -75 128 152 63 -132 52 -4 11 33 136 -37 -284
7603 -284 35 -111 161 11 -161 19 79 156 -44 90 -99 3 164 207 -143 -194 -51 127 30 102 197 33
$$ packed form
7428a61P9n8J62L1r6P0n5J35o9Q3j57L7o5JN5L6p1K02l99K78k55O3L49j17P4j03
7454D9l8j52L21k57pJ93Rl3j12K8RJ03l00R2M3p2K34q7o4M9J99j4j75r0P8Q4k15
7481a25J74J87l18N9mn2J6K4r0J42k5q6J16P3q8l2K91j62k23J43J09k64M0J29
7505C4qJ84m72K83j83K97j62J25j37j00J55M4k5j10J50j39O8j82l7J94P7J07j60
7528Co8J37k45K90j31j0l8J77k5j25k0K9j38K20o2rk1P4j82J99P0j38J13r9j46
7553a45R4Q1O3j03K2j6j94M8J66l3J54j64j67o2K42j99L15j43p5m7qK26q7m4M2
7578c4p7K17j65q2J34J6O7J6n4r9%J06J16k36K03K4q9j95J84n6J5K2J03j73k47
7603b84L19j46K72j50j72J80O0P7k00J34j89J02J61M3l50n1J43J78r7P2R5j64
$$ plain form
7625 33 -95 -50 -57 59 226 -3 39 -154 43 50 24 56 14 -19 200 -234 -32 181 83 -75 -38 -4 139 -150 11
7650 11 134 120 133 -145 -20 -127 9 113 18 127 57 -169 -185 -178 -125 63 131 124 -141 -121 -240 -84 -78 202 46
7675 46 -86 -51 -220 121 -17 14 125 102 -207 -104 97 -22 32 -74 2 -100 -72 42 -138 83 31 -27 78
7698 78 -84 162 159 45 1 -26 -163 90 140 -188 -212 76 18 -141 98 -14 -152 -89 43 -82 -63 -65 -158 97
7722 97 2 -27 -143 80 29 -144 81 -74 -312 -57 85 183 -117 4 -69 -85 -91 106 -77 51 -21 98 148 -83
7746 -83 133 46 -122 7 -147 -83 104 100 7 100 -91 -32 -171 -130 63 56 58 1 -8 -214 176 316 58 28 -35 138
7772 138 -73 -359 10 62 159 -74 -58 113 -40 187 -41 87 -144 -133 66 211 -36 88 110 39 190 16
7794 16 151 -68 91 82 126 114 -12 -200 -4 -122 58 49 -186 -126 117 46 -52 -22 151 138 -138 51 40 288
$$ packed form
7625C3j28M5pJ16J67k29M2j93J97Pk6L2m2l3K19m34K02K13r8j58L7L4J43k89J61
7650A1J23j4J3k78J25j07J36J04r5J09p0k26j6PN3J88O8pk65K0j19J56OK80j56
7675D6j32L5j69L41j38L1J11k3l09J03K01j19N4j06P6j02K8J14j80K21n2n8J05
7698G8j62K46lj14m4k7j37K53N0l28k4K88n8j59K39j12j38O3J32j25J9kr3K55
7722I7r5k9j16K23n1j73K25j55k38K55J42R8l00J21p3j6oJ97j83J28p2J19N0k31
7746h3K16q7j68J29j54O4J87mr3R3j91N9j39M1J93pKn7rk06L90J40k58l0o3J73
7772A38k11k86L69N2R7k33J6J71j53K27k28J28k31J1J99J45k47J24K2p1J51j74
7794A6J35k19J59rM4j2j26j88J96j18J80rk35O0K43p1r8L0J73j3k76J89j1K48
$$ plain form
7818 288 6 155 219 173 48 -126 254 140 135 -63 178 -282 -109 -26 79 -134 -182 87 -160 -62 -34 -241 228
7841 228 111 -137 87 155 -23 147 -51 18 28 70 16 25 50 -225 -28 104 62 -97 142 72 72 80 -71 112 -106
7866 -106 167 124 -131 -5 105 -39 -100 -97 32 -198 -169 -101 199 6 -66 -83 185 46 -91 -82 249 15 -13 105
7890 105 -262 -70 -18 -83 24 19 118 -73 61 -18 -30 -6 -144 -135 151 -62 7 64 8 63 -28 93 -92 -188 -49
7915 -49 56 67 142 -145 -9 -146 80 9 46 -74 -61 58 -18 55 -11 149 -56 -255 -91 45 -60 -47 101
7938 101 -105 -20 -51 -16 200 -74 72 205 32 -179 62 -91 2 45 81 110 -47 -7 -290 -30 -31 7 -11 80
7962 80 -215 -67 -14 167 6 55 38 -114 -232 -71 -62 -57 314 238 -106 -241 -115 76 61 52 110 -159 -9 32 -109
7987 -109 21 141 -3 66 -91 -193 175 23 151 20 -136 118 7 -154 -8 53 -99 -100 108 -60 61
$$ packed form
7818B88k82J49O4m6j25j74L80j14nj98K41m60J73Q3J05k13m8K69k47R8K8k07M69
7841B28j17k48K24O8j78J70j98O9J0M2n4RK5k75J97J32m2j59K39p0%Qj51J83k18
7866a06K73m3k55J26J10j44o1LJ29k30K9O8L00j93p2j7K68j39j37RL31k34k8J18
7890A05l67J92N2o5J07nR9j91J34p9j2K4j38RK86k13O9N7n6N5r1J21j85r6J39
7915d9J05J1P5k87J36j37K26p1L7j20J3J19p6P3o6J60k05j99J64J36j05J3J48
7938A01k06Q5l1L5K16k74J46J33j73k11K41j53R3M3L6K9j57M0k83K60jL8j8R1
7962H0k95J48N3J81j61M9j7j52j18J61RNL71p6l44j35J26J91j5rN8k69J50M1j41
7987a09J30J20j44O9j57j02L68j52J28j31j56K54j11j61J46O1j52jK08j68J21
$$ plain form
8008 61 -29 81 151 72 83 84 -188 -121 -70 61 62 162 6 22 119 -107 20 51 210 18 10 -23 -163 203 -160 -88
8034 -88 153 81 -160 -203 25 214 -108 19 -28 34 -20 -89 -108 -7 24 45 94 56 58 -213 42 267 176 21 64
8059 64 -175 -65 -129 -37 86 -55 -1 -21 -114 54 16 -34 165 169 -204 -67 -44 108 90 -47 -96 -70 -63 157 12
8084 12 -43 19 30 -65 83 89 74 166 21 433 -209 -17 11 -103 246 60 135 129 -149 -46 142 160 39 69 -140
8109 -140 -93 -63 44 34 -93 163 123 19 117 15 -221 71 178 -86 10 16 -149 -69 108 -81 -89 71 -102 40
8133 40 27 -110 128 -15 -3 47 -113 11 -44 -38 55 -37 -123 -114 -11 19 95 250 -44 83 80 -175 -28 252 182 -116
8159 -116 -70 134 -34 -267 -14 13 131 238 72 48 59 -103 109 84 -37 -22 146 -107 -58 -62 -151 -6 229
8182 229 188 -32 246 -32 -152 -48 232 63 -141
$$ packed form
8008F1r0J10P0p9J1Jk72O7N1J31JJ00j56J6R7k26J27L1J59j92ql3j40L66l63P2
8034h8K41p2k41m3K28J89l22J27m7O2n4o9j9J01L1K1M9l8Kk71K55K25r1j55M3
8059F4k39J10o4R2J23j41N4k0r3J68l8n0J99Ml73J37K3J52j8j37m9K6PK20j45
8084A2n5O2J1r5J48Oj5R2j45M12o42J92K8j14L49j86P5ok78J03J88J8j21L0k09
8109a40M7L0J07j0j27K56m0j04R8j02k36K92J07k64R6Oj65Q0J77j89qJ60j73J42
8133D0j3j37K38j43J2N0j60J24n5OR3r2q6RJ03L0P6J55k94J27lk55J47K80p0k98
8159a16M6K04j68k33K53K7J18J07j66k4J1j62K12k5j21J5J68k53M9mq9J45K35
8182B29m1k20K78k78j20J04K80j69k04
8191a41
$$ Imaginary data points
##PAGE= N=2
##DATA TABLE= (X++(I..I)), XYDATA
$$ plain form
0 0 0 0 0 0 0 0 0 0 0 -8 8 -8 8 -16 16 -24 24 -32 40 -48 57 -70 81 -97 113 -132 155 -178 205 -235 269 -308
32 -308 348 -396 446 -502 564 -633 706 -788 878 -974 1083 -1197 1326 -1465 1614 -1781 1962
49 1962 -2162 2383 -2624 2890 -3192 3527 -3905 4337 -4830 5405 -6086 6899 -7900 9163
63 9163 -10815 13078 -16378 21672 -31571 56574 -262794 -393641 -28456 -53051 159264 298701
75 298701 122096 -66576 106354 167668 95524 129918 127911 -154668 -308576 -191802 -75172
86 -75172 -24045 131338 175440 -7761 -178692 -150076 -60884 36806 184109 291975 178801
97 178801 -31887 -106077 -92663 -115189 -31247 112020 32513 -167659 -168823 -102269 -109311 45792
109 45792 293896 240461 36959 18141 -22271 -155363 -32897 181195 77763 -94872 -88752
$$ packed form
0@%%%%%%%%%qJ6j6J6k4L2m0M8n6P2q8J05j27J51j78K10k45K87l33L83m40N04n77
32c08O56p44Q42r48J066j197J339j494J666j852K057k280K523k791L079l395L743
49A962m124M545n007N514o082O719p432Q242r167J0235j1491J2985j4799J7063
63I163j9978K3893k9456L8050n3243Q8145l19368j30847L65185k4595K12315J39437
75B98701j76605j88672J72930O1314p2144L4394k007k82579j53908J16774J16630
86g5172N1127J55383M4102j83201j70931K8616Q9192R7690J47303J07866j13174
97A78801k10688p4190J3414k2526Q3942J43267p9507k00172j164O6554p042J55103
109D5792K48104n3435k03502j8818m0412j33092J22466K14092j03432j72635O120
$$ plain form
120 -88752 -175299 -288965 -85724 186178 184916 134838 147979 1547 -160276 -61884 83242
131 83242 62183 43482 43311 -91745 -205853 -110973 38153 85100 99200 96058 -12715 -150866
143 -150866 -130655 13120 95177 120724 148702 61218 -126571 -169796 -64064 -11950 34742
154 34742 144370 109436 -78999 -120696 -36900 -47046 -15389 127636 95651 -79760 -83114
165 -83114 -8796 -27501 50642 204223 134746 -60092 -115813 -138406 -192632 -76537 132193
176 132193 155274 72622 54571 -4999 -102438 -54426 62808 58049 -4273 -24425 -64106 -111954
188 -111954 -45003 95655 139713 81848 28371 -45789 -153702 -149653 -11928 78186 83464 101103
200 101103 70766 -53005 -94885 -3315 34216 9982 45952 25976 -111887 -139847 -26393
$$ packed form
120h8752q6547j13666K03241K71902j262n0078J3141j46432j61823R8392J45126
131H3242k1059j8701j71j35056j14108R4880J49126M6947J4100l142j08773j38151
143a50866K0211J43775Q2057K5547K7978q7484j87789m3225J05732N2114M6692
154C4742J09628l4934j88435m1697Q3796j0146L1657J43025l1985j75411l354
165h3114P4318j8705P8143J53581o9477j94838n5721k2593n4226J16095K08730
176A32193K3081q2652j8051n9570r7439M8012J17234m759o2322k0152l9681m7848
188a11954O6951J40658M4058n7865n3477p4160j07913M049J37725R0114N278J7639
200A01103l0337j23771m1880R1570L7531k4234L5970j9976j37863k7960J13454
$$ plain form
211 -26393 21503 43027 133427 118891 -30576 -83927 -34374 -34612 -8144 93401 82901 -48286
223 -48286 -92117 -63146 -69391 -12496 118193 131699 28116 -30176 -54443 -95769 -63453 49724
235 49724 91390 33005 -9047 -25650 -65412 -48067 55242 101834 44253 -7294 -41307 -102871
247 -102871 -101192 13657 97103 75886 51904 24221 -72762 -118016 -26389 46659 38891 55857
259 55857 50925 -50055 -100668 -24960 32194 35017 70232 64858 -45526 -107278 -49126 -1911
271 -1911 21801 89788 95274 -17715 -92038 -68619 -45811 -10363 78063 108513 22453 -53098
283 -53098 -56406 -53520 -28567 60001 104298 35610 -36151 -54153 -70137 -52043 39971 100463
295 100463 52795 -14271 -41497 -74667 -76003 16438 98072 70878 18995 -9046 -66652 -92788
$$ packed form
211b6393M7896K1524R0400j4536j49467n3351M9553k38K6468J01545j0500j31187
223d8286m3831K8971o245N6895J30689J3506j03583n8292k4267m1326L2316J13177
235D9724M1666n8385m2052j6603l9762J7345J03309M6592n7581n1547l4013o1564
247a02871J679J14849Q3446k1217k3982k7683r6983m5254R1627P3048p768J6966
259E5857m932j00980n0613P5708N7154K823L5215n374j10384o1752N8152M7215
271a911K3712O7987N486j12989p4323K3419K2808L5448Q8426L0450q6060p5551
283e3098l308K886K4953Q8568M4297o8688p1761j8002j5984J8094R2014O0492
295A00463m7668o7066k7226l3170j336R2441Q1634k7194n1883k8041n7606k6136
$$ plain form
307 -92788 -10975 72583 65357 37500 12208 -59770 -104960 -36453 45977 55335 56069 45434 -36803
320 -36803 -96908 -43745 25050 43795 64815 58849 -29002 -102946 -72851 -11990 24983 74465
332 74465 92794 17459 -62004 -56414 -24846 592 52719 74190 4786 -73724 -79334 -50803
344 -50803 -13242 60320 112164 63003 -21305 -51188 -58170 -51899 12175 73965 47023 -13376
356 -13376 -34508 -45032 -43056 20413 84863 60099 -3466 -36809 -72328 -88096 -17358 70572
368 70572 77990 48841 23732 -33377 -79559 -41671 23538 36229 27754 19207 -26433 -66597 -27866
381 -27866 36915 55568 54899 38331 -27920 -89399 -72744 -15393 24004 53658 64793 16793
393 16793 -49484 -52048 -12514 14712 44540 66447 24219 -44968 -60091 -36409 -15630 19215
$$ packed form
307i2788Q1813Q3558p226k7857k5292p1978m5190O8507Q2430R358P34j0635q2237
320c6803o0105N3163O8795J8745K1020n966q7851p3944L0095O0861L6973M9482
332G4465J8329p5335p9463N590L1568K5438N2127K1471o9404p8510n610K8531
344e0803L7561P3562N1844m9161q4308k9883o982O271O4074O1790k6942o0399
356a3376k1132j0524J976O3469O4450k4764o3565l3343l5519j5768P0738Q7930
368G0572P418k9149k5109n7109m6182L7888O5209J2691q475q547m5640m0164L8731
381b7866O4781J8653o69j6568o6251o1479J6655N7351L9397K9654J1135m8000
393A6793o6277k564L9534K7226K9828K1907m2228o9187j5123K3682K0779L4845
$$ plain form
405 19215 52970 25410 -33569 -45391 -24829 -7594 37683 84964 57667 -8431 -38825 -52182
417 -52182 -59717 -18844 38309 38495 4009 -12375 -25520 -35854 -228 52535 56043 28819 7532
430 7532 -25377 -54506 -33231 13133 26626 14140 1061 -25000 -53906 -37884 14899 43977
442 43977 45090 39897 10122 -34621 -35582 4032 27390 32799 34317 1622 -56680 -74060 -45344
455 -45344 -21652 3064 39175 39355 7189 7396 29771 33685 38666 44923 6315 -56999 -82194
468 -82194 -73106 -54493 -9833 47338 62124 37637 17141 -109 -18316 -9603 16616 19541 2606
481 2606 -8981 -16683 -24052 -12067 18761 28713 5434 -18497 -34039 -47996 -34086 15595 53738
494 53738 57573 48144 24077 -18468 -38403 -19071 -3766 -6897 -2874 -9182 -38743 -41091 -3555
$$ packed form
405A9215L3755k7560n8979j1822K0562J7235M5277M7281k7297o6098l0394j3357
417e2182p535M0873N7153J86l4486j6384j3145j0334L5626N2763L508k7224k1287
430G532l2909k9129K1275M6364J3493j2486j3079k6061k8906J6022N2783K9078
442D3977J113n193k9775m4743r61L9614K3358N409J518l2695n8302j7380K8716
455d5344K3692K4716L6111J80l2166K07K2375L914M981O257l8608o3314k5195
468h2194R088J8613M4660N7171J4786k4487k0496j7250j8207Q713K6219K925j6935
481B606j1587p702p369J1985L0828R952k3279k3931j5542j3957J3910M9681L8143
494E3738L835r429k4067m2545j9935J9332J5305l131M023o308k9561k348L7536
$$ plain form
507 -3555 22382 33901 47718 34350 -5971 -21907 -9291 -605 10408 25145 11268 -26812
519 -26812 -43622 -35265 -22609 2608 33758 36426 12310 -8536 -18104 -17907 -966 24792 35319
532 35319 20370 -1994 -15179 -23201 -20119 1572 16408 3057 -17766 -26161 -29419 -18628 17897
545 17897 48575 44356 24968 4505 -24925 -36294 -8343 17026 15508 11118 -2357 -34823 -46133
558 -46133 -20044 6015 19340 30843 24152 -1329 -9460 6212 17940 22896 24097 1192 -38245
571 -38245 -55544 -44058 -20343 11180 38245 40085 18348 -6238 -16962 -11686 3109 19879
583 19879 25663 10385 -12209 -21348 -18324 -8949 7264 16553 443 -25316 -32390 -24859 -6889
596 -6889 28989 57846 48456 21697 -1653 -27440 -37896 -16235 4596 1727 -5683 -12754 -25592
$$ packed form
507c555K5937J1519J3817j3368m0321j5936J2616Q686J1013J4737j3877l8080
519b6812j6810Q357J2656K5217L1150K668k4116k0846r568J97J6941K5758J0527
532C5319j4949k2364j3185q022L082K1691J4836j3351k0823q395l258J0791L6525
545A7897L0678m219j9388k0463k9430j1369K7951K5369j518m390j3475l2466j1310
558d6133K6089K6059J3325J1503o691k5481q131J5672J1728M956J201k2905l9437
571c8245j7299J1486K3715L1523K7065J840k1737k4586j0724N276J4795J6770
583A9879N784j5278k2594r139L024R375J6213R289j6110k5759p074P531J7970
596f889L5878K8857r390k6759k3350k5787j0456K1661K0831k869p410p071j2838
$$ plain form
609 -25592 -21713 8352 33703 36108 28846 9073 -20166 -28979 -11660 5931 14648 15985 299
622 299 -24129 -32848 -19141 4088 24269 31707 21670 -793 -20218 -22551 -8069 9043 19526
635 19526 18309 1640 -18612 -23548 -12244 1051 13457 20295 6751 -15870 -19577 -9252 3264
648 3264 23229 34671 18177 -9377 -24612 -30472 -23895 1099 22391 19342 6236 -4270 -15093
661 -15093 -14192 5664 20210 16545 5340 -8814 -22227 -20074 -589 16852 22053 14229 -2725
674 -2725 -20026 -24499 -12345 7685 20948 20321 8285 -8464 -19942 -17487 -1841 11727 14527
687 14527 10235 -1167 -14890 -14710 29 11059 14968 13792 -474 -19014 -21258 -9451 3210
700 3210 16178 22612 10737 -8656 -17801 -16193 -7961 7810 19389 13028 -833 -9946 -13101 -8169
$$ packed form
609b5592L879L0065K5351K405p262j9773k9239q813J7319J7591Q717J337j5686
622B99k4428q719J3707K3229K0181P438j0037k2463j9425k333J4482J7112J0483
635A9526j217j6669k0252m936J1304J3295J2406O838j3544k2621l707J0325J2516
648C264J9965J1442j6494k7554j5235n860O577K4994K1292l049j3106j0506j0823
661a5093R01J9856J4546l665j1205j4154j3413K153J9485J7441N201p824j6954
674b725j7301m473J2154K0030J3263o27j2036j6749j1478K455J5646J3568K800
687A4527m292j1402j3723J80J4739J1030L909j176j4266j8540k244J1807J2661
700C210J2968O434j1875j9393r145J608Q232J5771J1579o361j3861r113l155M932
$$ plain form
714 -8169 6582 16657 12890 1340 -11160 -18004 -13432 823 14125 16594 8412 -5107 -15538
727 -15538 -15172 -4906 9370 17644 13713 2401 -8655 -15688 -11698 1424 11705 10659 4789 -3194
741 -3194 -12793 -10909 983 10428 12292 9012 -1729 -14223 -15873 -5893 4849 12521 15066 6175
755 6175 -8344 -13928 -9706 -2267 8612 15025 8460 -3545 -10778 -12058 -5244 5518 13498 10815
769 10815 278 -9940 -14043 -9595 1632 12243 13856 6607 -4253 -11691 -10874 -3056 7591 13565
783 13565 8251 -2270 -10089 -12476 -7784 4652 13086 11077 3705 -5258 -12236 -11282 -668 8622
797 8622 9908 6686 -1542 -10329 -11206 -2460 6618 11108 11136 3099 -9011 -13232 -8622 35 7936 11397
813 11397 6221 -4431 -11304 -10115 -2741 6755 13385 10247 850 -8072 -11211 -6406 2634 9538 9798
$$ packed form
714h169J4751J0075l767j1550j2500o844M572J4255J3302K469q182j3519j0431
727a5538L66J0266J4276Q274l931j1312j1056p033L990J3122J0281j046n870p983
741c194r599J884J1892R445J864l280j0741j2494j650R980J0742P672K545q891
755F175j4519n584M222P439J0879O413o565j2005p233j280O814J0762P980k683
769A0815j0537j0218m103M448J1227J0611J613p249j0860p438Q17P818J0647N974
783A3565n314j0521p819k387M692J2436Q434k009p372q963o978R54J0614R290
797H622J286l222q228q787q77Q746R078M490K8q037j2110m221M610Q657P901L461
813A1397n176j0652o873J189P374R496O630l138r397q922l139M805R040O904K60
$$ plain form
828 9798 1984 -7606 -12192 -8898 -903 9040 13170 7818 -1876 -9090 -10322 -5075 4665 10331 8196
843 8196 514 -6707 -10019 -7172 2251 10244 9962 3742 -3893 -11278 -11062 -2355 6668 11414 8764 1394
859 1394 -6902 -10365 -5662 1316 7371 8182 3005 -6248 -10104 -6075 1201 8720 12268 6848 -2835
874 -2835 -10222 -11907 -5648 2983 9619 10111 3604 -4275 -8041 -5556 -131 6499 7132 1289 -5868 -9386
890 -9386 -6700 418 8243 13016 9070 -333 -7647 -10017 -7112 847 7415 6872 1762 -3934 -7509
905 -7509 -6911 -50 6994 8151 5241 -863 -6627 -8169 -1919 4830 7741 7105 710 -7269 -10371 -7220
921 -7220 -416 5194 7757 4279 -1609 -5557 -5663 -19 5981 9978 6748 -296 -6775 -9303 -6926
936 -6926 -720 4747 5276 1946 -3733 -5456 -2843 1681 7748 9563 5365 -2300 -6974 -7963 -4656 1368
$$ packed form
828I798p814r590m586L294P995R943M130n352r694p214j232N247R740N666k135
843H196p682p221l312K847R423P993k82o220p635p385K16Q707R023M746k650p370
859A394q296l463M703O978O055Q11n177r253l856M029P276P519L548n420r683
874b835p387j685O259Q631O636M92o507p879l766K485N425O630O33n843p157l518
890i386K686P118P825M773l946r403p314k370K905P959O568n43n110n696l575
905g509N98O861P044J157k910o104n764j542O250O749K911o36o395p979l102L151
921g220O804N610K563l478n888l948j06N644O000L997l230p044o479k528K377
936f926O206N467N29l330n679j723K613M524O067J815m198p665m674r89L307O024
$$ plain form
952 1368 5615 4857 -794 -5166 -7308 -5219 1507 7630 8926 5681 1652 -3172 -5259 -2213 1499
967 1499 2781 2697 -2482 -7088 -8483 -4359 2613 8034 9191 5123 -1494 -5160 -4739 -486 3678 6859
983 6859 5183 -763 -6381 -8791 -6063 -1105 2891 4217 2342 -2080 -3495 -398 3804 7434 8197
998 8197 3831 -3219 -8289 -8315 -4904 422 6161 5256 664 -2639 -4769 -3128 1331 5942 6130 3517
1014 3517 -817 -4541 -4459 -1917 2111 3761 2455 -1242 -5650 -6595 -3486 2297 6502 7042 3964 -478
1030 -478 -4095 -4157 215 3776 5087 3375 -2219 -6477 -7916 -4457 1814 4621 5633 2716 -1513 -3853
1046 -3853 -1270 1652 5314 5886 2929 -3405 -6817 -6047 -2703 2183 5685 4311 -426 -4074 -5464
1061 -5464 -3043 1650 5709 6487 3780 -462 -4242 -4457 -1563 2011 2774 1834 -1978 -4973 -5130 -2207
$$ packed form
952A368M247p58n651m372k142K089O726O123J296l245m029m824k087L046L712
967A499J282q4n179m606j395M124O972N421J157m068o617l666M21M253M164L181
983F859j676n946n618k410K728M958L996J326j875m422j415L097M202L630P63
998H197m366p050n070k6L411N326N739r05m592l303k130J641M459M611J88k613
1014C517m334l724Q2K542M028J650j306l697m408r45L109N783M205N40l078m442
1030d78l617o2M372L561J311j712n594m258j439L459O271K807J012k917m229k340
1046c853K583K922L662N72k957o334l412P70L344M886L502j374m737l648j390
1061e464K421M693M059P78k707m242l780k15K894L574P63r40l812k995j57K923
$$ plain form
1077 -2207 2790 6141 6114 2209 -2544 -5140 -5007 -452 4552 5209 2834 -1005 -4586 -6138 -2531 2124
1093 2124 4801 4147 1639 -2854 -4061 -1457 2484 4210 4872 1668 -3731 -6035 -4659 -798 3468
1108 3468 5734 4064 -279 -3646 -4444 -2373 1982 5235 4551 283 -2257 -4078 -3540 -801 2915 3914
1124 3914 1987 -2005 -3965 -2986 -564 2913 5041 4418 29 -3110 -4465 -3044 236 4320 4580 1822
1140 1822 -1852 -4369 -4549 -919 3193 4366 2705 -241 -3606 -4227 -1379 2103 4047 3580 727 -3259
1156 -3259 -4522 -2567 770 3592 4934 2579 -924 -3805 -3815 -2039 1531 3820 3036 -100 -2640 -3951
1172 -3951 -2423 1482 3229 3000 1483 -1008 -3616 -2923 340 3109 4419 2388 -1539 -3902 -3956 -2050
1188 -2050 1148 4086 3934 662 -1534 -3751 -3142 750 3641 3291 1931 -1074 -3456 -3430 -803 2275
$$ packed form
1077b207M997L351k7l905m753k596J33M555N004O57k375l839l581j552L607M655
1093B124K677o54k508m493j207K604L941J726O62l204n399k304J376L861M266
1108C468K266j670m343l367p98K071M355L253o84m268k540j821N38K739L716R99
1124C914j927l992j960R79K422L477K128o23m389l139j355J421L280M084K60k758
1140A822l674k517j80L630M112J173j661k946l365o21K848L482J944m67k853l986
1156c259j263J955L337K822J342k355l503k881j0J776L570K289p84l136k540j311
1172c951J528L905J747k29j517k491k608O93L263K769J310k031l927k363n4J906
1188b050L198K938j52l272k196k217O09L892K891l50j360l005k382K6K627L078
$$ plain form
1204 2275 3113 2800 100 -3273 -3874 -1986 1338 3542 4328 1332 -2206 -4046 -2662 -659 1710 3161
1220 3161 2087 -714 -2726 -3428 -1699 2009 3539 3322 732 -2090 -3109 -1408 615 2640 3329 1309
1236 1309 -1926 -4413 -3016 -1086 1229 3394 2915 -144 -1987 -2814 -2054 1043 3344 3186 967 -1814
1252 -1814 -3477 -2975 45 2575 3358 1625 -913 -3074 -3116 -936 1748 3289 3244 640 -2309 -3291 -2118
1269 -2118 401 3065 3288 1333 -1425 -3219 -2773 -572 1944 3125 2517 -330 -2531 -2734 -1885 1329
1285 1329 3077 2346 1171 -1966 -2836 -1556 -644 1357 3204 2030 -1123 -2486 -2639 -1089 1451 3165
1301 3165 2311 118 -1946 -2921 -2106 592 2162 2775 1332 -941 -2747 -3054 -381 2110 3132 1696
1317 1696 -648 -2351 -2707 -1555 1021 2911 2451 698 -2454 -2460 -2481 -185 2223 2662 1359 -446 -2419
$$ packed form
1204B275Q38l13k700l373o01J888L324K204P86k996l538j840J384K003K369J451
1220C161j074k801k012p02J729L708J530k17k590k822j019J701K023K025O89k020
1236A309l235k487J397J930K315K165m79l059j843q27P60L097K301j58k219k781
1252a814j663N02L020K530P83j733k538k161m2K180K684J541m5k604k949r82J173
1269b118K519K664K23j955k758j794M46K201K516J181o08k847k201k03Q49L214
1285A329J748p31j175l137q70J280R12K001J847j174l153j363j53J550K540J714
1301C165q54k193k064r75Q15K698J570O13j443k273j806l07K673K491J022j436
1317A696k344j703l56J152K576J890m60j753l152ok1K296K408M39j303j805j973
$$ plain form
1334 -2419 -2613 -500 2033 2873 2135 209 -1936 -2782 -824 423 2309 2859 1018 -1140 -2501 -2005
1350 -2005 -420 1545 3055 1534 -664 -2515 -2429 -1228 1033 2491 2282 954 -1503 -2679 -2267 -99
1366 -99 1780 2398 1017 -946 -2644 -2370 -626 1618 2714 1999 -33 -1733 -2430 -1350 610 2548
1382 2548 2348 808 -1000 -2526 -2314 -228 1659 1765 1344 117 -1699 -2215 -435 1505 2465 2472 474
1399 474 -2263 -2652 -1113 224 840 1836 988 -788 -1750 -1674 -7 1735 2745 2405 -17 -1874 -2380
1416 -2380 -1750 236 1535 2036 -101 -1615 -2049 -1673 14 2400 1975 1487 -200 -1703 -1853 -391 1282
1433 1282 2028 1635 -383 -1722 -2689 -1798 6 1653 1554 711 -557 -1753 -1573 476 1871 2371 1379
1450 1379 -507 -2171 -2529 -1283 113 1331 1666 752 -1321 -1403 -1498 304 2087 2202 1291 -708 -2025
$$ packed form
1334b419j94K113K533Q40p38j926k145q46J958J247J886N50j841k158j361M96
1350b005J585J965J510j521k198j851Q6J201K261J458k09j328k457j176M12K168
1366i9J879O18j381j963j698K74J744K244J096p15k032j700o97J080J960J938
1382B548k00j540j808j526K12K086J887J06m21j227j816n16J780J940R60Pj998
1399D74k737l89J539J337O16R96q48j776r62P6J667J742J010l40k422j857n06
1416b380O30J986J299N01k137j514m34L76J687K386m25m88j687j503j50J462J673
1433A282P46l93k018j339r67Q91J804J647r9q43j268j196J80K049J395N00r92
1450A379j886j664l58J246J396J218L35r14k073q2r5J802J783J15r11j999j317
$$ plain form
1467 -2025 -1966 -920 529 1855 1295 120 -1711 -1943 -1125 772 1899 2261 797 -803 -1767 -1464 -171
1484 -171 1212 2000 1090 -634 -1934 -1804 -1030 543 1763 1493 132 -1185 -1085 -586 753 1975 1370
1501 1370 976 -864 -1770 -2341 -852 854 1251 873 20 -1021 -1649 -562 879 1503 1701 624 -1166
1518 -1166 -1378 -1268 -237 872 2102 898 -186 -2020 -1461 -361 441 1638 1468 92 -883 -1335 -391
1535 -391 285 1452 1432 456 -989 -1479 -1419 -726 795 1265 825 -668 -688 -1125 -972 729 1833 1446 556
1554 556 -1050 -1653 -1230 -47 1004 1069 819 -261 -1116 -884 -38 858 1442 1084 72 -936 -1338 -630
1572 -630 168 1100 1029 184 -756 -1478 -1259 74 841 1409 1168 971 -883 -1005 290 507 1401 1047 525
1591 525 -1167 -1811 -979 92 990 1004 433 -717 -775 -1055 -187 884 1071 671 -392 -982 -969 -499 448
$$ packed form
1467b025N9J046J449J326n60j175j831k32Q18J897J127L62j464j600r64L03J293
1484a71J383P88r10j724j300J30P74J573J220k70j361j317J00M99J339J222o05
1501A370l94j840r06n71J489J706L97l78q53j041o28J087J441O24J98j077j790
1518a166k12J10J031J109J230j204j084j834N59J100Q02J197j70j376r75m52R44
1535c91O76J167k0r76j445m90O0O93J521M70m40j493k0m37J53J701J104l87q90
1554E56j606o03M23J183J051O5k50j080q55K32Q46Q96N84l58j012j008m02P08
1572f30P98R32p1q45r40p22K19J333P67N68k41j97j854j22J295K17Q94l54n22
1591E25j692o44Q32J071Q98J4n71j150n8k80Q68J071J87m00j063n90J3M70R47
$$ plain form
1610 448 931 1038 206 -501 -635 -590 -60 885 799 583 -251 -827 -924 -186 430 991 868 174 -631 -797 -717
1631 -717 204 1000 813 340 -502 -764 -845 96 654 576 321 -662 -394 -908 18 325 421 345 -41 -690 -470
1652 -470 -334 282 847 786 155 -442 -888 -783 -87 498 685 383 -145 -613 -775 -80 536 774 602 -49
1672 -49 -883 -817 -670 -209 622 791 441 -292 -455 -1223 29 650 379 95 -304 -164 -1121 -977 35 616
1692 616 331 169 -593 -659 -172 435 780 1010 274 -343 -604 -589 -420 10 591 381 -217 -619 -464 -150 460
1713 460 898 817 210 -229 -408 -343 106 565 655 136 -392 -1129 -626 6 549 829 552 194 -373 -467 -135
1734 -135 412 622 471 -222 -728 -738 -687 326 461 799 321 -311 -612 -426 242 536 855 307 -446 -915
1754 -915 -769 -268 152 718 678 54 -132 -506 -230 489 625 649 -65 -220 -919 -632 -35 351 666 254 -175
$$ packed form
1610D48M83J07q32p07j34M5N30R45q6k16q34n76r7P38O16N61j23o94q05j66Q0
1631g17R21P96j87m73q42k62q1R41N58p8k55r83K68n14R26L07R6p6l86o49K20
1652d70J36O16N65o1o31n97m46J05O96N85J87l02n28m68j62O95O16K38j72o51
1672d9q34O6J47M61Q31J69l50p33j63p68J252O21k71k84l99J40r57J44J012N81
1692F16k85j62p62o6M87O07L45K30p36o17k61J5J69M30N81k10n98m02J55L14O10
1713D60M38q1o07m39j79O5M49M59R0n19n28p37N03O32N43K80k77l58n67r4L32
1734a35N47K10j51o93n06j0N1J013J35L38m78o32l01J86O68K94L19n48p53m69
1754i15J46N01M20N66m0o24j86l74K76P19J36K4p14j55o99K87N97L86L15m12m29
$$ plain form
1775 -175 -711 -923 -47 568 901 591 57 -529 -762 -434 -12 484 694 2 -607 -744 -500 120 846 1112
1795 1112 384 -65 -653 -879 -319 161 559 336 -9 -765 -1010 -406 243 929 911 425 -306 -735 -527 -56
1815 -56 300 995 224 -622 -861 -950 -589 443 879 718 263 -284 -851 -635 341 765 848 267 -569 -952 -738
1836 -738 -46 588 816 881 -279 -444 -778 -257 424 992 887 316 -736 -994 -837 -184 585 573 456 -550
1856 -550 -1154 -808 22 820 1241 793 1 -859 -1027 -708 -23 788 966 86 -593 -1132 -794 45 763 1262
1876 1262 538 -407 -901 -1031 -328 677 1107 650 44 -718 -1101 -581 111 887 991 270 -430 -1055 -966 -286
1896 -286 567 997 889 -156 -766 -1015 -374 228 949 922 -82 -698 -1218 -828 100 1087 1153 717 -424 -1077
1916 -1077 -1113 -263 630 1121 970 116 -657 -887 -453 220 1138 675 147 -879 -1358 -771 -36 1146 1453
$$ packed form
1775a75n36k12Q76O15L33l10n34n86k33L28M22M96K10o92o09j37K44O20P26K66
1795A112p28m49n88k26N60M80L98k23l45p56k45O04O49O86j8m86p31m29K08M71
1815e6L56O95p71q46k39q9L61J032M36j61m55n47n67K16R76M24Q3n81q36l83K14
1836g38O92O34K28O5j160j65l34N21O81N68j05n71j052k58J57O53P69j2j17j006
1856e50o04L46Q30P98M21m48p92q60j68L19O85Q11J78q80o79n39L38Q39P18M99
1876A262p24r45m94j30P03J005M30m57o06p62l83N20O92P76J04p21p00o25Q9O80
1896b86Q53M30j08j045o10k49O41O02P21k7j004o16n20L90R28R87O6m36j141o53
1916a077l6Q50Q93M91j51q54p73k30M34O73R18m63n28j026m79N87P35J182L07
$$ plain form
1935 1453 999 -112 -905 -1143 -389 637 917 716 169 -827 -1209 -744 268 933 1038 646 -157 -822 -728
1954 -728 -42 773 1294 602 -218 -1198 -1535 -779 333 1077 1123 182 -848 -1220 -863 -23 925 1347 730 -450
1974 -450 -892 -901 -204 347 719 436 -406 -1185 -1183 -356 524 1556 1480 612 -503 -1053 -914 -373 767 1109 360
1995 360 -303 -1259 -1394 -651 467 935 1172 267 -549 -815 -743 242 921 1302 318 -858 -1508 -1092 -359 805
2015 805 1528 974 149 -647 -1384 -613 372 1051 1308 654 -323 -1157 -1033 -110 619 823 321 -714 -1314 -1058
2035 -1058 -85 1223 1467 1349 217 -960 -1247 -917 -13 777 1002 369 -220 -1138 -1019 -310 734 940
2053 940 862 -110 -779 -1032 -545 275 1173 937 11 -1073 -1330 -989 -65 1207 1586 895 -43 -873 -1405 -716
2073 -716 538 820 693 139 -885 -1071 -432 398 1198 1046 451 -740 -935 -612 101 988 1129 538 -386
$$ packed form
1935A453m54j111p93k38P54J026K80k01n47r96l82M65J012O65J05l92q03o65R4
1954g28O86Q15N21o92q20r80l37P56J112P44M6r41j030l72L57Q40R48M22o17j180
1974d50m42rO97N51L72k83q42p79KQ27Q80J032p6q68j115n50J39N41J140L42p49
1995C60o63r56j35P43J118M68K37r05q16k66P2R85O79L81r84j176o50M16P33J164
2015H05P23n54q25p96p37P71R85O79K57o54r77q34J24R23P29K04n02j035o00K56
2035a058R73J308K44j18j132j177k87L30R04P90K25o33n89r18J19P09J044K06
2053I40p8r72o69k53M87Q20Q98k36r26j084k57L41R24J272L79o91r38q30n32O89
2073g16J254K82j27n54j024j86O39Q30Q00j52n95j191j95L23P13Q87J41n91r24
$$ plain form
2092 -386 -1491 -1608 -894 121 1167 1203 586 -216 -742 -721 331 893 1097 559 -518 -1401 -1184 -248 561
2111 561 1012 800 58 -620 -919 -330 744 1268 1323 131 -970 -1423 -1084 -708 539 1102 591 -36 -533
2130 -533 -651 53 998 1149 1083 45 -913 -1331 -576 -193 492 945 372 -543 -1049 -1031 -191 1073 1426 951
2150 951 230 -820 -1065 -709 197 670 569 51 -772 -910 -517 312 813 1165 809 -297 -748 -1105 -306
2169 -306 462 1253 900 -15 -855 -1154 -691 -41 1022 1284 581 -258 -782 -985 -161 460 616 274 -372 -958
2189 -958 -856 -145 946 1294 1133 281 -727 -1101 -606 -172 640 932 442 -432 -659 -777 -113 673 788
2208 788 766 47 -542 -1095 -744 326 939 834 61 -650 -1096 -843 108 957 1162 770 -73 -820 -817 -544 229
2229 229 772 705 -166 -528 -819 -625 288 818 915 535 -385 -978 -839 -146 705 974 653 -216 -1075 -1216 -663
$$ packed form
2092c86j105j17P14J015J046L6o17q02n26K1J052N62K04n38j077q83K17R36Q09
2111E61M51k12p42o78k99N89J074N24N5j192j101m53L39L76J247N63n11o27m97
2130e33j18P04R45J51o6j038r58m18P55L83O85M53n73r15n06J8Q40J264L53m75
2150I51p21j050k45L56R06M73j01n18q23j38L93Q29N01L52l56j106m51l57P99
2169c06P68P91l53r15q40k99M63O50J063K62p03q39n24k03Q24O21J56l42o46n86
2189i58J02P11J091L48j61q52j008l74M95M34Q12K92m90q74k27j18O64P86J15
2208G88k2p19n89n53L51J070O13j05p73p11m46K53R51Q49K05l92q43p47LK73P73
2229B29N43o7q71l62k91J94R13N30R7l80r20n93J39O93Q51K69l21q69q59j41N53
$$ plain form
2250 -663 418 818 1142 378 -515 -814 -592 -201 592 772 356 -383 -908 -838 -277 476 1034 881 375 -544
2270 -544 -935 -731 21 650 722 338 -509 -773 -1051 -241 728 1010 889 -160 -681 -923 -446 295 694 697 105
2291 105 -523 -1078 -667 -54 764 972 756 -40 -786 -1107 -412 637 717 629 -57 -813 -1030 -661 297 964
2311 964 963 519 -156 -792 -708 -188 410 829 484 -145 -819 -1237 -686 252 754 891 377 -170 -846 -521 272
2332 272 745 944 491 -299 -1033 -939 -613 369 819 835 121 -452 -631 -545 9 902 905 407 -320 -834 -939 -185
2354 -185 408 888 637 -143 -743 -799 -402 383 1049 647 189 -498 -885 -537 -143 479 871 749 -11 -591
2374 -591 -567 -280 407 595 819 46 -604 -879 -236 167 674 796 272 -551 -741 -846 -168 600 1114 722
2394 722 120 -528 -977 -519 93 583 682 195 -408 -673 -942 -248 313 642 485 -170 -729 -682 -345 304 817
$$ packed form
2250f63J081M00L24p64q93k99K22L91P93J80m16p39n25P0N61P53N58j53n06r19
2270e44l91K04P52O29P2l84q47k64k78Q10R69K82j21j049n21k42M77P41L99Ln92
2291A05o28n55M11O13Q18K08k16p96p46l21O95J049Q0q8o86p56k17L69R58O67
2311I64jm44o75o36Q4N20N98M19l45o29o74m18N51R38N02J37n14n47o76L25P93
2332B72M73J99m53p90p34R4L26R82M50J6p14n73j79Q6N54Q93Lm98p27n14j05P54
2354a85N93M80k51p80o00n6L97P85O66m02m58o87l87L48L94O22L92j22p60n80
2374e91K4K87O87J88K24p73o50k75O43M03N07J22n24q23j90j05O78P68N14l92
2394G22o02o48m49M58O12M90R9m87o03k65k69O94N61L29j57o55n59M7L37O49N13
$$ plain form
2415 817 672 34 -539 -1072 -765 158 812 999 658 95 -654 -853 -256 349 557 462 219 -373 -672 -285
2435 -285 127 902 969 86 -396 -731 -647 24 726 954 547 -139 -791 -888 -513 -30 696 758 296 -389 -596
2456 -596 -471 76 443 684 308 -200 -604 -609 -33 297 747 785 33 -658 -967 -657 122 759 955 312 -230
2477 -230 -776 -812 -144 311 627 634 -99 -469 -520 -313 269 741 739 55 -560 -1073 -696 -37 574 863 695 -102
2499 -102 -831 -821 -651 189 641 871 468 -327 -656 -456 271 519 634 318 -262 -700 -618 -120 410 897 380
2520 380 -124 -707 -923 -638 149 691 863 297 -365 -728 -677 -255 421 730 514 -249 -407 -700 -285 305
2540 305 617 678 44 -453 -1015 -627 -67 790 815 471 -184 -980 -907 -408 325 773 720 254 -334 -702 -619 -16
2562 -16 590 670 531 -193 -600 -551 171 495 830 432 -216 -680 -867 -319 67 933 635 256 -184 -832 -518
$$ packed form
2415H17j45o38n73n33L07R23O54J87l41n63p49j99N97O05K08r5k43n92k99L87
2435b85M12P75O7q83m82l35Q4O71P02K28m07o86o52r7L75M83P26O2m62o85k07
2456e96J25N47L67K41l76n08m04nN76L30M50L8p52o91l09L10P79O37J96o43n42
2477b30n46l6O68M55L16Pp33l70n1K07N82M72ko84o15n13L77O59O11K89j68p97
2499a02p29J0J70Q40M52K30m03p95l29K00P27K48J15l16n80m38Q2M98N30M87n17
2520C80n04n83k16K85P87N42J72n66o62l63N1M22O76L09k16p63j58k93M15N90
2540C05L12O1o34m97n62L88N60Q57K5l44o55p96P3M99P33M48n3m66n88l68Q3O03
2562a6O06Q0j39p24m07M9P22L24L35l98o48m64j87N48L86Q66k98l79m40o48L14
$$ plain form
2583 -518 142 506 710 250 111 -357 -631 -464 148 664 425 -276 -816 -701 -376 209 940 1165 648 -188
2603 -188 -833 -930 -658 295 850 600 12 -351 -798 -521 266 601 731 361 -166 -597 -281 197 552 695
2623 695 286 -512 -817 -1039 -428 296 742 927 156 -530 -541 -423 72 603 489 305 -557 -1077 -749 -337
2643 -337 354 567 731 -11 -482 -712 -564 403 847 709 213 -331 -903 -1108 -380 406 767 711 178 -418
2663 -418 -703 -290 252 587 750 269 -341 -769 -471 216 567 662 300 -291 -706 -709 -50 488 928 730 2
2684 2 -501 -802 -560 30 595 649 295 -55 -514 -614 109 166 534 311 -261 -808 -878 -527 74 696 806 208
2706 208 -481 -857 -535 -219 630 915 687 -80 -720 -868 -766 52 437 353 -85 -466 -689 -56 491 984
2726 984 851 196 -327 -948 -745 -377 256 526 461 122 -531 -469 -459 445 799 986 210 -260 -552 -619 -387
$$ packed form
2583e18O60L64K04m60j39m68k74J67O12N16k39p01n40J15L25N85P31K25n17q36
2603a88o45r7K72R53N55k50n88l63m47K77P87L35J30l70n27m31L16M78L55J43
2623F95m09p98l05k22O11P24M46J85p71o86j1J18M95N31j14j84q62n20L28M12
2643c37O91K13J64p42m71k30J48R67M44j38m96n44n72k05P28P86L61n6n33n96
2663d18k85M13N42L35J63m81o10m28K98O87L51R5l62n91m15lO59N38M40j98p28
2684Bn03l01K42N90N65N4l54l50m59j00P23N7L68k23n72n47p0L51O01O22J10n98
2706B08o89l76L22L16Q49K85k28p67o40j48J02Q18L85q4m38l81k23O33N47M93
2726I84j33o55n23o21K03L68O33K70o5l39o53O2J0R04L54J87p76m70k92o7K32
$$ plain form
2747 -387 397 711 460 -162 -751 -515 -308 427 883 675 110 -386 -424 -464 229 625 548 125 -392 -820 -827 -139
2769 -139 359 740 714 162 -387 -519 -340 317 634 504 232 -353 -821 -361 -91 506 730 478 -208 -517
2789 -517 -551 -59 211 709 531 53 -569 -859 -625 146 399 446 240 -395 -582 -622 -161 460 685 653 -69
2810 -69 -460 -679 -369 45 558 608 350 -603 -575 -528 -148 398 628 577 -80 -478 -663 -137 327 653 341 4
2832 4 -351 -757 -634 81 248 669 279 -13 -525 -187 -122 405 609 268 -74 -427 -601 -482 45 767 515
2853 515 275 -393 -558 -629 11 348 641 452 -13 -428 -611 -378 42 485 438 -12 -368 -503 -497 113 623
2874 623 968 207 -253 -599 -580 -410 389 472 451 -57 -413 -424 -163 84 519 552 -60 -171 -320 -366 103 206
2896 206 482 212 -354 -596 -539 -299 163 696 397 286 -356 -558 -386 -8 361 550 297 -66 -376 -521
$$ packed form
2747c87P84L14k51o22n89K36K07P35M56k08n65m96l8m0O93L96p7m23n17m28pO88
2769a39M98L81k6n52n49j32J79O57L17j30k72n85m68M60K70N97K24k52o86l09
2789e17l4M92K70M98j78m78o22k90K34P71K53M7k06o35j87m0M61O21K25l2p22
2810f9l91k19L10M14N13N0k58r53K8M7L80N46K30n1o57l98j85N26M64L26l12l37
2832Dl55m06J23P15J67M21l90k92n12L38O5N27K04l41l42l53j74J19N27P22k52
2853E15k40o68j65p1O40L37K93j89m65m15j83K33M20M43m7m50l56j35OO10N10
2874F23L45p61m60l46J9J70P99Q3k1n08l56j1K61K47M35L3o12j11j49m6M69J03
2896B06K76k70n66k42N7K40M62N33k99j11o42k02J72L78L69J89k53l63l10j45
$$ plain form
2916 -521 -230 222 265 638 205 -380 -389 -152 -166 315 622 90 -331 -646 -769 -60 490 456 527 111 -241 -571
2938 -571 -611 -42 352 596 226 -205 -535 -418 61 309 316 372 -308 -545 -450 -283 375 555 516 205 -327 -418
2960 -418 -387 34 403 513 279 -168 -274 -454 -336 248 153 428 -141 -367 -327 -171 214 467 483 187 -369
2981 -369 -470 -427 -135 407 503 309 36 -381 -719 -377 94 453 313 265 60 -296 -348 -95 261 426 242
3002 242 -340 -508 -417 8 237 457 268 109 -522 -570 -271 161 533 847 177 -171 -461 -328 -276 289 149
3023 149 -71 -396 -392 -364 -146 211 776 653 48 -221 -467 -246 -329 420 553 185 -117 -528 -686 -210 230
3044 230 543 309 119 -346 -437 -207 130 152 500 248 -112 -542 -464 58 426 385 319 14 -103 -380 -168 206
3066 206 635 672 348 -144 -512 -495 -324 256 252 215 60 -186 -305 -63 167 662 395 -38 -276 -374 -395 148
$$ packed form
2916e21K91M52M3L73m33n85rK37j4M81L07n32m21l15j23P09N50l4P1m16l52l30
2938e71m0N69L94K44l70m31l30J17M79K48PN6o80k37R5J67O58J80l9l11n32r1
2960d18L1M21L69J10k34m47j06j80J18N84r5K75n69k26M0J56L85K53J6k96n56
2981c69j01M3K92N42R6j94k73m17l38L42M71L59j40m8k05l56n2K53L56J65j84
3002B42n82j68R1M25K29K20j89j59o31m8K99M32L72L14o70l48k90J33N2N65j40
3023A49k20l25MK8K18L57N65j23o05k69k46K21q3P49J33l68l02m11j58M76M40
3044B30L13k34j90m65r1K30L37K2L48k52l60m30P8N22L68m1o6l05j17k77K12L74
3066B06M29L7l24m92l68J7J71N80ml7j55k46j19K42K30M95k67m33k38r8k1N43
$$ plain form
3088 148 365 468 406 -363 -715 -957 -331 105 372 350 76 -298 -86 -255 132 208 298 -39 -386 -392 -98 -90 301
3111 301 300 32 -442 -571 -457 -100 280 649 415 120 -54 -345 -248 114 279 291 -23 -277 -327 -342 90 312
3133 312 394 368 -40 -632 -369 -155 37 369 318 140 -314 -379 -422 -167 326 496 173 -14 -348 -285 -200 334
3155 334 402 279 81 -515 -438 -50 16 385 493 147 -77 -420 -529 -21 277 295 545 -91 -298 -451 -290
3176 -290 -78 317 478 120 -165 -282 -471 60 278 233 358 38 -521 -251 -282 159 519 274 11 -321 -604
3197 -604 -260 34 364 403 371 1 -260 -346 -44 396 302 477 91 -287 -466 -249 -50 414 482 54 -527 -300
3219 -300 -415 -59 364 592 311 96 -249 -344 -182 44 158 196 -53 -320 -269 -181 -46 572 565 -10 9 -277
3241 -277 -235 126 326 422 518 -123 -388 -313 -194 172 505 343 13 -155 -369 -410 -130 146 302 167 -97 -311
$$ packed form
3088A48K17J03o2p69l52k42O26M36K67k2k74l74K12j69L87P6R0l37l47oK94QL91
3111C01jk68m74j29J14L57L80L69k34k95j74k91R7L62J65J2l14k54n0j5M32K22
3133C12Q2k6m08n92K63K14J92L32n1j78m54o5m3K55M93J70l23j87l34O3Q5N34
3155C34O8j23j98n96P7L88O6L69J08l46k24l43j09N08K98J8K50o36k07j53J61
3176b90K12L95J61l58k85j17j89N31K18m5J25l20n59K70l1M41L60k45k63l32k83
3197f04L44K94L30L9l2l70k61q6L02M40r4J75l86l78j79K17J99M64O8m28n81K27
3219c00j15L56M23K28k81k15l45r5J62K26J14L8k49k67N1Q8J35O18pn75J9k86
3241b77M2L61K00R6R6o41k65P5J19L66L33j62l30j68k14m1K80K76J56j35k64k14
$$ plain form
3263 -311 -290 71 331 315 253 -41 -228 -281 -99 264 541 446 244 -267 -365 -311 -45 184 380 262 -100 -102 -444
3286 -444 -87 -12 269 194 120 -22 -228 -292 190 259 432 238 -189 -301 -398 74 353 394 177 -77 -90 -485 -388
3309 -388 245 402 93 -10 -86 -464 -240 102 399 284 182 -90 -363 -177 -25 90 113 295 -66 -183 -319
3330 -319 -50 182 273 398 325 -213 -337 -306 -199 126 313 252 74 -269 -213 -262 116 115 356 112 -112 -207 -209 28
3354 28 60 45 232 -242 -156 -179 -50 165 413 145 -20 -65 -276 -187 26 191 61 167 -63 -136 -346 -94 131
3377 131 24 191 91 -84 -89 -465 233 120 213 -73 -49 -152 -233 -135 135 248 -66 24 -201 -201 -279 21 55 383
3401 383 -37 -91 -143 -262 139 -47 224 192 -105 -32 -57 -95 155 48 112 36 -69 -303 36 30 31 205 128 89 -90
3426 -90 -138 1 174 230 -134 37 -398 -305 -244 5 214 100 10 -45 -23 -59 86 175 208 -51 134 -203 -86 12
$$ packed form
3263c11K1L61K60j6o2k94j87n3J82L63K77r5k02n11r8N4K66K29J96j18l62kl42
3286d44L57P5K81p5p4j42k06o4M82O9J73j94m27j12r7M72K79M1k17k54j3l95R7
3309c88O33J57l09j03p6l78K24L42K97j15j02k72k73J86J52J15K3J82l61j17j36
3330c19K69K32R1J25p3n38j24L1J07L25J87o1j78l43N6m9L78jK41k44k24r5kK37
3354B8L2j5J87m74Q6k3J29K15K48k68j65m5k11Q9K13J65j30J06k30p3k10K52K25
3377A31j07J67j00j75nl76O98j13R3k86K4j03q1R8K70J13l14R0k25%p8L00L4L28
3401C83m20n4n2j19M01j86K71l2k97P3k5l8K50j07O4p6j05k34L39oJJ74p7l9j79
3426i0m8J39J73N6l64J71m35R3O1K49K09j14r0n5K2l6J45Q9L3k59J85l37J17R8
$$ plain form
3450 12 -21 -53 117 198 -180 250 -137 -110 -45 302 -5 162 -128 -10 -93 103 129 111 8 42 -266 -69 -103 -24
3474 -24 -80 207 61 -20 -21 -184 1 103 25 -31 -205 -235 -66 -95 59 -145 -240 28 -135 -3 -134 -66 -13 59
3498 59 -88 -346 -4 -86 179 -97 50 -83 -70 -92 -277 -55 93 52 -54 60 18 -113 -153 219 64 -120
3520 -120 185 143 -101 94 -157 -117 -74 293 16 -61 -77 -4 107 146 11 -24 -13 -47 -99 51 -54 49 134 222
3544 222 -49 99 106 -46 35 -67 251 -35 133 21 -3 -96 47 10 -59 -133 24 -233 -125 -46 19 -28 217 -36
3568 -36 -40 -236 -26 155 162 230 -50 -126 -213 13 97 79 78 39 -115 -80 -93 -20 179 21 102 89 -202 -177 -21 146
3594 146 256 171 171 -87 42 -46 42 103 -167 -101 -114 51 -78 55 -44 232 172 34 -176 -38 -149 -85 -29 79
3618 79 31 23 -282 -94 -258 -179 123 188 143 20 -274 -93 -36 30 110 -7 25 -148 -34 -208 163 463 57 47
$$ packed form
3450A2l3l2J70Q1l78M30l87K7O5L47l07J67k90J18q3J96K6j8j03L4l08J97l4P9
3474b4n6K87j46q1jj63J85J02p8n6j74l0J69k9J54k04r5K68j63J32j31O8N3P2
3498E9j47k58L42q2K65k76J47j33J3k2j85K22J48m1j06J14m2j31m0L72j55j84
3520a20L05m2k44J95k51M0M3L67k77p7j6P3J11L9j35l5J1l4n2J50j05J03Q5Q8
3544B22k71J48Pj52Q1j02L18k86J68j12k4r3J43l7o9p4J57k57J08P9O5m7K45k53
3568c6mj96K10J81PO8k80p6q7K26Q4j8jl9j54L5j3P3J99j58Q1j3k91K5J56J67
3594A46J10q5%k58J29q8Q8O1k70O6j3J65j29J33r9K76o0j38k10J38j11O4N6J08
3618G9m8ql05J88j64P9L02O5m5j23k94J81N7O6Q0j17L2j73J14j74L71L00m06j0
$$ plain form
3642 47 -127 -27 -31 -52 152 5 -136 -1 -135 -194 85 247 199 -73 -83 -209 73 -133 155 347 35 -144
3664 -144 61 -165 -87 63 45 -151 104 130 -184 -261 -90 215 256 165 -20 -62 -67 -159 -123 208 -146 -50 -177 -144
3688 -144 128 225 198 214 -16 96 -154 -47 -3 190 177 197 -76 -224 -68 -59 169 143 333 48 -29 17 -61 137
3712 137 118 306 134 161 -26 -220 46 98 27 245 -176 112 96 31 53 -57 157 70 -101 -216 -225 -177 -100 137
3736 137 -94 -10 -131 -213 47 86 -105 140 115 -176 -123 -238 -95 167 127 -36 -139 -191 -48 26 144 393 164
3759 164 -103 1 30 -104 74 429 -80 -47 -161 -139 -41 -192 307 426 45 -122 -293 -222 -20 80 185 67
3781 67 59 -47 -173 -369 29 353 233 -2 -72 52 -245 -157 57 180 163 -104 -204 -104 -42 33 162 108 -22
3804 -22 -259 -211 -85 -230 65 249 207 -177 -126 -30 -189 71 365 148 198 73 -81 -192 -209 45 102 128 -50
$$ packed form
3642D7j74J00mk1K04j47j41J35j34n9K79J62m8k72j0j26K82k06K88J92l12j79
3664a44K05k26P8J50j8j96K55K6l14p7J71L05M1r1j85m2nr2L6L31l54R6j27L3
3688a44K72R7k7J6k30J12k50J07M4J93j3K0k73j48J56RK28k6J90k85p7M6p8J98
3712A37j9J88j72K7j87j94K66N2p1K18m21K88j6o5K2j10K14q7j71j15rM8P7K37
3736A37k31Q4j21q2K60L9j91K45k5k91N3j15J43K62m0j63j03n2J43P4J18K49k29
3759A64k67J04K9j34J78L55n09L3j14K2R8j51M99J19l81j67j71P1K02J00J05j18
3781F7qj06j26j96L98L24j20k35p0J24k97Q8K14J23j7k67j00J00O2P5J29n4j30
3804b2k37M8J26j45K95J84m2l84N1R6j59K60K94k17N0j25j54j11j7K54N7K6j78
$$ plain form
3827 -50 -122 -118 17 59 112 260 154 -141 -34 -45 68 144 407 -87 -222 -412 -217 115 -7 67 184 -42 -233
3850 -233 -137 -135 259 147 1 65 -108 -385 -181 129 -112 119 223 16 -270 -237 -65 273 196 249 -135 -50 -326
3873 -326 12 202 260 266 -97 -187 -220 59 86 192 355 122 79 -419 -213 -59 113 53 236 23 0 -358 -210
3896 -210 72 85 162 13 -227 9 -113 -81 170 152 210 87 -205 -264 -276 -76 381 168 115 -132 -246 -80 111
3919 111 224 316 192 -64 -215 -34 21 83 254 181 -14 -330 -142 -23 38 14 84 145 -120 -132 -204 122 295
3942 295 83 -24 -116 -399 -19 228 81 137 146 16 -285 -158 -141 -105 112 116 -90 -41 -259 -326 -22 -16 177 52
3966 52 -39 -150 28 -199 181 254 398 111 -89 -145 -187 68 -49 343 -5 -214 -227 -322 56 102 183 170 162 -246
3990 -246 -118 -30 213 168 194 -43 43 -300 -175 147 134 44 142 120 140 -258 -133 86 334 66 191 -19 -211
$$ packed form
3827e0p2MJ35M2N3J48j06k95J07j1J13P6K63m94j35j90J95L32j22P4J17k26j91
3850b33R6KL94j12j46O4j73k77K04L10k41K31J04k07k86L3J72L38p7N3l84Q5k76
3873c26L38J90N8Ol63r0l3K79K7J06J63k33m3m98K06J54J72o0J83k13k3l58J48
3896b10K82J3P7j49k40K36j22L2K51j8N8j23k92n9j2K00M57k13n3k47j14J66J91
3919A11J13R2j24k56j51J81N5O2J71p3j95l16J88J19O1k4P0O1k65j2p2L26J73
3942B95k12j07r2k83L80K47j47N6Rj30l01J27J7L6K17Mk06M9k18o7L04OJ93j25
3966E2r1j11J78k27L80P3J44k87k00n6m2K55j17L92l48k09j3r5L78M6Q1j3qm08
3990b46J28Q8K43m5K6k37Q6l43J25L22j3r0R8k2K0l98J25K19K48k68J25k10j92
$$ plain form
4013 -211 -61 -32 -87 111 -56 -132 -149 -186 -145 5 214 -97 59 154 -185 -81 23 164 271 376 -40 -226
4035 -226 -159 -7 -127 327 76 37 51 -130 -91 -76 -20 161 8 65 -87 -74 241 14 171 185 -15 -82 -220
4058 -220 -190 -41 278 64 -76 99 -38 76 112 234 150 -106 3 -102 -145 28 23 66 146 -93 -149 -179 -142 -69
4082 -69 236 -27 -22 -162 -196 -70 -68 55 337 -44 -3 -167 -159 77 68 109 -31 -62 -59 -181 -10 -70 200 54 84 121
4108 121 -163 51 193 -165 251 7 29 -164 -100 37 82 249 66 70 -43 -141 -124 -10 81 35 15 90 -172 -118
4132 -118 -204 49 58 115 126 -141 -143 -209 8 166 115 155 -107 100 -105 44 113 -57 171 -58 -1 34 -160 -58
4156 -58 5 -13 -126 -194 -224 -117 -93 76 83 56 66 0 16 25 44 70 135 51 -79 -74 -1 -20 39 -36 81 10 14 -182 -145
4185 -145 52 132 252 -42 -70 -75 -40 61 92 16 83 -24 -60 -218 -112 111 26 34 108 -148 6 82 -84 -56 9
$$ packed form
4013b11J50K9n5J98j67p6j7l7M1J50K09l11J56R5l39J04J04J41J07J05m16j86
4035b26O7J52j20M54k51l9J4j81L9J5N6J81j53N7j52J3L15k27J57J4k00o7j38
4058b20L0J49L19k14j40J75j37J14L6J22q4k56J09j05m3J73nM3Q0k39n6l0L7P3
4082f9L05k63Nj40l4J26KJ23K82l81M1j64QK36rM1j40l1Lj22J71o0K70j46L0L7
4108A21k84K14J42l58M16k44K2j93O4J37M5J67j83Mj13r8J7J14R1m6k0P5k62N4
4132a18q6K53RN7J1k67ko6K17J58n1M0k62K07k05J49O9j70K28k29N7L5j94J02
4156e8O3j8j13o8l0J07K4J69Pk7J0o6J6RJ9K6O5q4j30NP3j9N9p5J17p1Mj96L7
4185a45J97Q0J20k94k8nL5J01L1p6O7j07l6j58J06K23q5QP4k56J54P6j66K8O5
$$ plain form
4210 9 95 -102 28 -101 179 125 -37 -59 -166 -73 -18 -9 114 245 -251 126 90 66 -13 -29 51 153 38 -96 -28
4235 -28 -58 91 209 -171 -39 85 41 -175 61 89 136 54 135 -99 -105 -47 -83 237 19 5 -119 -35 -175 -89 -54
4260 -54 -9 138 -96 4 -187 -37 27 -139 206 139 -102 -182 -127 -151 170 109 74 84 -245 -64 117 71 320 35
4284 35 -19 43 -180 197 74 155 -48 72 -145 -121 -123 -68 68 120 23 79 54 -75 -14 199 105 -225 -248 25 -38
4309 -38 39 -74 141 136 175 -256 36 -196 -37 -83 -134 168 -218 -87 -7 -6 -116 142 16 -11 -47 -18 -99 -117 25
4334 25 -4 175 -35 -46 35 141 -191 89 -38 -21 194 -85 -78 -205 -80 45 33 79 164 42 -146 55 -1 61
4358 61 69 99 87 -259 69 15 4 -98 -78 -168 -4 89 -16 -132 -138 118 -6 90 51 141 -61 -122 -128 104 -71 36
4384 36 -226 15 53 -108 -143 -103 -65 22 -148 54 -44 39 39 -22 55 -77 -27 147 -69 -49 169 -57 41 16 168
$$ packed form
4210IQ6j97J30j29K80n4j62k2j07R3N5RJ23J31m96L77l6k4p9j6Q0J02j15j34O8
4235b8l0J49J18l80J32J24m4k16K36K8M7q2Q1k34oN8l6L20k18j4j24Q4j40Q6L5
4260e4M5J47k34J00j91J50O4j66L45o7k41q0N5k4L21o1l5J0l29J81J81m6K49k85
4284C5n4O2k23L77j23Q1k03J20k17K4kN5J36N2r7N6k5j29O1K13r4l30k3K73o3
4309c8P7j13K15nL9m31K92k32J59m6n1L02l86J31Q0Jj10K58j26k7l6K9q1j8J42
4334B5k9J79k10j1Q1J06l32K80j27J7K15k79Pj27J25J25j2M6Q5j22j88K01n6O2
4358F1QL0j2l46L28n4j1j02K0r0J64R3j05j16oK56j24R6l9R0k02o1oK32j75J07
4384C6k62K41L8j61l5M0L8Q7j70K02r8Q3%o1P7j32N0J74k16K0K18k26R8k5J52
$$ plain form
4409 168 75 -218 -213 70 -44 159 51 -16 -63 -131 -130 69 84 25 -3 -7 129 -8 45 1 79 -164 43 22 112 -169
4435 -169 6 -104 35 -43 -90 -136 61 27 -15 120 11 115 -136 33 -248 -184 -132 196 63 -97 -28 14 -54
4458 -54 169 58 3 -363 126 186 -58 -162 -128 161 -59 -113 8 146 75 -243 -298 -85 -160 -40 139 -151 -111
4481 -111 -47 62 -65 -15 -64 70 -15 -269 -180 144 15 -78 137 51 -33 -73 -93 -136 46 -66 86 9 104 -51
4505 -51 107 -250 23 -22 -50 98 -91 -75 -48 126 -3 198 -76 -88 -4 -250 30 -19 -89 -1 -102 -46 -171 -88
4529 -88 105 -16 119 -97 -28 -115 28 -83 8 72 -78 50 -45 -285 -68 44 -155 31 70 39 -31 32 53 65
4553 65 174 -61 111 -76 168 -207 54 81 128 -22 -113 -332 -139 -30 -35 141 179 -110 -118 -58 -31 37 100 -77
4577 -77 85 149 -33 -17 -175 115 43 -146 -163 -42 -32 28 167 143 -83 -24 -290 -7 -15 -46 82 -50 72 -101
$$ packed form
4409A68r3k93NK83j14K03j08o7m7o8JJ99J5n9k8mJ36j37N3m4P8k43K07k1R0k81
4435a69J75j10J39p8m7m6J97l4m2J35j09J04k51J69k81O4N2L28j33j60O9M2o8
4458e4K23j11n5l66M89O0k44j04L4K89k20n4J21J38p1l18n5K13p5J20J79k90M0
4481a11O4J09j27N0m9J34q5k54Q9L24j29r3K15q6q4m0k0m3J82j12J52p7R5j55
4505e1J58l57K73m5k8J48j89J6K7J74j29K01k74j2Q4k46K80m9p0Q8j01N6j25Q3
4529h8J93j21J35k16O9q7J43j11R1O4j50J28r5k40K17J12j99J86L9l1p0O3K1J2
4553F5J09k35J72j87K44l75K61K7M7j50r1k19J93J09nJ76L8k89qO0K7O8O3j77
4577g7J62O4j82J6j58K90p2j89j7J21J0O0J39k4k26N9k66K83ql1J28j32J22j73
$$ plain form
4601 -101 -179 29 65 42 -163 106 -166 31 -260 -120 351 -152 -100 34 -160 -118 26 32 77 -110 65 -209 -266
4624 -266 -34 164 67 -35 -174 -133 -83 -114 62 143 253 148 -104 -72 -45 -63 114 349 128 -189 -185 -42 -30 -20
4648 -20 -35 316 234 -199 11 -141 -28 -123 -43 40 -13 -79 -87 164 114 44 89 -4 45 -320 -102 -39 177 99 -92 -70
4674 -70 -107 -5 87 -37 58 171 191 7 38 97 141 21 202 -84 -327 70 -133 -13 -66 220 49 -201 -218
4697 -218 86 -96 -33 -17 75 113 -179 -271 -30 -27 123 72 221 -170 -62 -116 -21 407 300 24 278 -70 -226
4720 -226 -220 -48 68 111 20 -44 -148 -241 -36 111 236 111 79 -196 -285 141 159 50 227 -22 -119 -222 -31
4743 -31 52 160 237 -184 -236 -68 -236 137 -34 117 228 2 168 -227 -62 -55 36 -59 -16 -127 -288 -322 -51
4766 -51 61 73 30 -96 -32 7 29 60 70 27 39 68 -221 -107 -6 102 133 143 -99 -96 2 199 -2 -206 84
$$ packed form
4601a01p8K08L6k3k05K69k72J97k91J40M71n03N2J34j94M2J44OM5j87J75k74n7
4624b66K32J98r7j02j39M1N0l1J76Q1J10j05k52L2K7j8J77K35k21l17MJ43J2J0
4648b0j5L51q2m33K10j52J13r5Q0Q3n3o6qK51n0p0M5r3M9l65K18O3K16p8j91K2
4674g0l7J02R2j24R5J13K0j84L1N9M4j20J81k86k43L97k03J20n3K86j71k50j7
4697b18L04j82O3J6R2L8k92r2K41LJ50n1J49l91J08n4R5M28j07k76K54l48j56
4720b26OJ72J16M3r1o4j04r3K05J47J25j25l2k75q9M26J8j09J77k49r7j03J91
4743c1Q3J08P7m21n2J68j68L73j71J51J11k26J66l95J65PR1r5M3j11j61l4K71
4766e1J12J2m3j26O4L9K2L1J0m3J2K9k89J14J01J08L1J0k42LR8J97k01k04K90
$$ plain form
4791 84 -23 -48 -69 -220 18 -52 224 -172 -153 0 -224 7 87 252 99 -156 -151 -392 -216 64 -3 129 164
4814 164 7 -150 -80 109 101 266 96 31 -248 -246 62 -15 28 63 -195 -147 -171 -131 239 238 232 75 -69 -133 -316 -60
4840 -60 -138 -45 47 6 -55 -112 -171 49 155 200 -21 -34 111 -23 133 238 52 224 -58 -293 -68 75 12 78
4864 78 128 138 -118 -242 55 91 129 204 58 61 -79 180 148 145 -15 73 -101 -244 -5 -24 226 101 135 29 -111
4889 -111 -39 -180 -64 225 -3 103 41 -182 14 26 228 135 16 160 -49 -139 -152 -140 101 101 -200 -44 -275
4912 -275 -139 -87 271 86 215 -27 -129 -71 -81 138 54 104 -134 -142 99 -149 -152 22 135 -170 87 -152 -33
4935 -33 176 194 220 120 134 -132 -207 -345 12 133 27 -31 -223 -155 -250 -8 295 209 140 -103 -98 -240 -22 80
4959 80 108 165 33 -129 -80 -7 170 80 63 7 -91 -47 -256 109 189 201 27 142 -64 -249 -48 12 58 118 150
$$ packed form
4791H4j07k5k1j51K38p0K76l96J9J53k24K31Q0J65j53k55Nk41J76K80o7J32L5
4814A64j57j57P0J89qJ65j70o5k79KL08p7M3L5k58M8k4M0L70joj57j44o4j83K56
4840f0p8R3R2m1o1n7n9K20J06M5k21j3J45j34J56J05j86J72k82k35K25J43o3O6
4864G8N0J0k56j24K97L6L8P5j46Lj40K59l2lj60Q8j74j43K39j9K50j25L4j06j40
4889a11P2j41J16K89k28J06o2k23J96J2K02r3j19J44k09r0j3J2K41%l01J56k31
4912b75J36N2L58j85J29k42j02N8j0K19q4N0k38qK41k48lJ74J13l05K57k39J19
4935c3K09J8K6j00J4k66p5j38L57J21j06n8j92O8r5K42L03q6o9k43Nj42K18J02
4959H0K8N7j32j62M9P3J77r0j7n6r8M4k09L65Q0J2j74J15k06j85K01O0M6O0L2
$$ plain form
4984 150 143 103 -15 15 119 243 -69 87 -27 -176 -28 65 39 196 16 -7 -191 -135 33 93 240 -69 69
5007 69 -155 -150 -78 194 81 268 9 -90 144 -51 -19 231 178 214 -32 -94 -87 -217 268 -79 63 136 146 -97
5031 -97 -298 66 114 251 26 -90 -157 -220 -56 208 106 -87 -78 -231 -29 11 177 214 78 -159 -188 -62 4
5054 4 29 64 88 16 -73 -31 -154 34 20 276 112 -84 187 65 122 -6 220 20 -4 -50 -67 161 -171 76
5078 76 307 122 -18 -94 -221 -17 -75 -44 -59 41 -203 -290 119 74 152 50 154 -173 61 -85 99 282 -40
5101 -40 69 -107 -254 -214 -118 6 -1 116 -49 -197 -79 -130 83 57 293 -38 -145 -255 -92 129 143 20 108
5124 108 194 -75 -49 -86 58 101 256 -38 -179 -166 -109 162 147 151 -89 186 -296 -19 -5 -97 188 132 22 5
5148 5 -111 60 -45 17 185 148 -118 -74 3 29 148 -60 143 -74 8 -112 -89 198 327 20 75 -341 -178
$$ packed form
4984A50pm0j18L0J04J24l12J56j14j49J48R3k6J57j80k3j84N6J68O0J47l09J38
5007F9k24NP2K72j13J87k59r9K34j95L2K50n3L6k46o2Pj30M85l47J42P3J0k43
5031i7k01L64M8J37k25j16o7o3J64K64j02j93Rj53K02M0J66L7j36k37k9J26O6
5054DK5L5K4p2q9M2j23J88j4K56j64j96K71j22N7j28K26k00k4m6j7K28l32K47
5078G6K31j85j40p6j27K04n8L1j5J00k44q7M09m5P8j02J04l27K34j46J84J83l22
5101d0J09j76j47M0R6J24pJ17j65j48J18n1K13k6K36l31j07j10J63K21J4j23Q8
5124A08Q6k69K6l7J44M3J55k94j41J3N7K71j5Mk40K75m82K77J4r2K85n6j10j7
5148Ej16J71j05O2J68l7k66M4P7K6J19k08K03k17Q2j20K3K87J29l07N5m16J63
$$ plain form
5171 -178 -139 -101 209 77 61 -267 25 -178 -221 57 294 293 163 -6 -118 -35 -100 61 191 70 53 -276 -51
5194 -51 -198 228 -94 123 183 19 -200 -313 64 -103 62 258 -103 -36 -288 95 -58 278 -41 -203 -284
5215 -284 -207 -124 -123 55 156 41 -213 -25 -160 160 180 206 -173 53 9 -129 -133 109 71 313 58 -101 -120 -98
5239 -98 -172 -60 264 219 -186 77 -90 -66 -3 111 48 157 -320 -454 54 -90 41 -22 75 -83 -135 -170 115
5262 115 118 138 88 -81 -379 -162 -20 120 89 100 125 24 -117 58 171 49 304 262 -209 -195 -243 -96 73
5285 73 419 151 -68 27 -295 31 -194 148 71 110 80 -142 -8 41 111 246 294 119 -33 -178 -117 -38 16 54
5309 54 -248 7 -257 -239 2 189 -21 102 -139 6 -86 -221 258 180 197 15 -228 -1 -136 21 114 47
5331 47 81 -80 -247 -247 74 230 300 121 -229 5 -120 -28 146 33 144 76 -231 -168 -222 -94 140 189 147 -71
$$ packed form
5171a78L9L8L10j32j6l28K92k03m3K78K37jj30j69j12Q3o5J61J30j21j7l29K25
5194e1j47M26l22K17O0j64k19j13L77j67J65J96l61O7k52L83j53L36l19j62q1
5215b84P7Q3JJ78J01j15k54J88j35L20K0K6l79K26m4j38mK42l8K42k55j59j9K2
5239i8p4J12L24m5m05K63j67K4O3J14o3J09m77j34N08j44J31o3R7j58n2l5K85
5262A15LK0n0j69k98K17J42J40l1J1K5j01j41J75J13j22K55m2m71J4m8J47J69
5285G3L46k68k19R5l22L26k25L42p7L9l0k22J34M9P0J35M8j75j52j45O1P9N4L8
5309E4l02K55k64J8K41J87k10J23k41J45r2j35M79p8J7j82k43K27j35J57R3o7
5331D7L4j61j67%L21J56P0j79l50K34j25R2J74j13J11o8l07O3n4J28K34M9m2k18
$$ plain form
5355 -71 -147 -415 -26 -8 253 289 240 -120 -284 -183 -30 190 152 172 28 -99 -78 20 232 244 168 -270 -281 -220
5379 -220 -89 201 239 373 -95 -52 -179 -360 122 192 260 65 105 -342 -155 -154 -47 51 84 129 -101 -389 -283
5402 -283 293 200 62 -71 -116 -359 -133 -169 180 77 129 122 -218 -195 -205 100 188 289 1 -140 -474 -217 -48
5425 -48 233 209 159 -72 -407 -326 129 -16 157 24 -2 -107 44 -233 226 258 266 154 -130 -280 -158 -111 167
5448 167 228 -56 -28 -106 -285 61 238 331 37 104 -149 -268 -115 -2 201 168 70 -325 -84 -324 -32 240
$$ packed form
5355g1p6k68L89J8K61L6m9l60j64J01J53K20l8K0j44j27K1R8K12J2p6m38j1O1
5379b20J31K90L8J34m68M3j27j81M82P0O8j95M0m47J87JJ07R8L3M5k30k88J06
5402b83N76r3j38j33m5k43K26l6L49j03N2pl40K3j0L05Q8J01k88j41l34K57J69
5425d8K81k4n0k31l35Q1M55j45J73j33k6j05J51k77M59L2Qj12k84j50J22M7K78
5448A67O1k84K8p8j79L46J77R3k94O7k53j19J53J13K03l3r8l95K41k40K92K72
$$ [...]
8191a09
##END NTUPLES=NMR FID
##END=
