##TITLE=1H_IG-G393-2
 200.13MHz,CDCl3,
 8 sc
 
 1.11.2025
##JCAMPDX= 6.0         $$ Bruker NMR JCAMP-DX V2.0
##DATA TYPE= NMR FID
##DATA CLASS= NTUPLES
##ORIGIN= UXNMR, Bruker Analytische Messtechnik GmbH
##OWNER= pz
$$ XWIN-NMR		Version 3.5
$$ Sat Nov  1 14:13:45 2025 Russian Standard Time (UT+4h)  she@DPX200
##.OBSERVE FREQUENCY= 200.1313
##.OBSERVE NUCLEUS= ^1H
##.DELAY= (6, 6)
##.ACQUISITION MODE= SIMULTANEOUS
##.ACQUISITION SCHEME= undefined
##.AVERAGES= 8
##.DIGITISER RES= 18
##SPECTROMETER/DATA SYSTEM= spect
##.PULSE SEQUENCE= zg30
##.SOLVENT NAME= CDCl3
##.SHIFT REFERENCE= (INTERNAL, CDCl3, 0, 14.3821)
##AUDIT TRAIL= $$ (NUMBER, WHEN, WHO, WHERE, WHAT)
$$ ##TITLE= Audit trail, XWIN-NMR		Version 3.5
$$ ##JCAMPDX= 5.01
$$ ##ORIGIN= Bruker BioSpin GmbH
$$ ##OWNER= she
$$ F:/spectra/data/she/nmr/H-C/1/audita.txt
$$ ##AUDIT TRAIL=  $$ (NUMBER, WHEN, WHO, WHERE, WHAT)
(   1,<2025-11-01 14:11:42.28 +0400>,<she>,<DPX200>,
      <created by zg, POWCHK disabled, PULCHK disabled
       configuration hash MD5:
       00 E9 B6 7A A2 85 ED C7 34 08 36 98 17 FE 4E 26
       data hash MD5: 16K
       EC 15 36 7C AD 66 58 93 CA 13 CE 7A B9 57 EC BB>)
$$ ##END=
$$ 
$$ hash MD5
$$ 71 DE 0C B6 31 29 8E C9 5F 84 53 91 02 AE F4 D1
##$RELAX= 
##$RELAX= 
##$RELAX= 
##$RELAX= 
##$RELAX= 
##$RELAX= 
$$ Bruker specific parameters
$$ --------------------------
##$DU= <F:/spectra>
##$EXPNO= 1
##$NAME= <H-C>
##$PROCNO= 1
##$TYPE= <nmr>
##$USER= <she>
##$AMP= (0..31)
100 100 100 100 100 100 100 100 100 100 100 100 100 100 100 100 100 100 
100 100 100 100 100 100 100 100 100 100 100 100 100 100 
##$AQSEQ= 0
##$AQ_mod= 1
##$AUNM= <au_zg>
##$AUTOPOS= <>
##$BF1= 200.13
##$BF2= 200.13
##$BF3= 200.13
##$BF4= 200.13
##$BF5= 200.13
##$BF6= 200.13
##$BF7= 200.13
##$BF8= 200.13
##$BYTORDA= 1
##$CFDGTYP= 0
##$CFRGTYP= 5
##$CHEMSTR= <none>
##$CNST= (0..31)
1 1 145 1 1 1 1 1 1 1 1 1 1 1 1 1 1 1 1 1 1 1 1 1 1 1 1 1 1 1 1 1 
##$CPDPRG= <>
##$CPDPRG1= <>
##$CPDPRG2= <>
##$CPDPRG3= <>
##$CPDPRG4= <mlev>
##$CPDPRG5= <mlev>
##$CPDPRG6= <mlev>
##$CPDPRG7= <mlev>
##$CPDPRG8= <mlev>
##$CPDPRGB= <>
##$CPDPRGT= <>
##$D= (0..31)
0 0.7 0 0 0 0 0 0 0 0 0 0.03 0 0 0 0 0 0 0 0 0 0 0 0 0 0 0 0 0 0 0 0 
##$DATE= 1761991901
##$DBL= (0..7)
120 120 120 120 120 120 120 120 
##$DBP= (0..7)
150 150 150 150 150 150 150 150 
##$DBP07= 0
##$DBPNAM0= <>
##$DBPNAM1= <>
##$DBPNAM2= <>
##$DBPNAM3= <>
##$DBPNAM4= <>
##$DBPNAM5= <>
##$DBPNAM6= <>
##$DBPNAM7= <>
##$DBPOAL= (0..7)
0.5 0.5 0.5 0.5 0.5 0.5 0.5 0.5 
##$DBPOFFS= (0..7)
0 0 0 0 0 0 0 0 
##$DE= 6
##$DECBNUC= <off>
##$DECIM= 32
##$DECNUC= <off>
##$DECSTAT= 4
##$DIGMOD= 1
##$DIGTYP= 9
##$DL= (0..7)
0 120 120 120 120 120 120 120 
##$DP= (0..7)
150 150 150 150 150 150 150 150 
##$DP07= 0
##$DPNAME0= <>
##$DPNAME1= <>
##$DPNAME2= <>
##$DPNAME3= <>
##$DPNAME4= <>
##$DPNAME5= <>
##$DPNAME6= <>
##$DPNAME7= <>
##$DPOAL= (0..7)
0.5 0.5 0.5 0.5 0.5 0.5 0.5 0.5 
##$DPOFFS= (0..7)
0 0 0 0 0 0 0 0 
##$DQDMODE= 0
##$DR= 18
##$DS= 0
##$DSLIST= <SSSSSSSSSSSSSSS>
$$ [...]
##$SUBNAM0= <"">
##$SUBNAM1= <"">
##$SUBNAM2= <"">
##$SUBNAM3= <"">
##$SUBNAM4= <"">
##$SUBNAM5= <"">
##$SUBNAM6= <"">
##$SUBNAM7= <"">
##$SUBNAM8= <"">
##$SUBNAM9= <"">
##$SW= 18.0517328524113
##$SWIBOX= (0..15)
0 0 2 0 0 0 0 0 0 0 0 0 0 0 0 0 
##$SW_h= 3612.71676300578
##$TD= 16384
##$TD0= 1
##$TE= 0
##$TE2= 300
##$TE3= 300
##$TEG= 300
##$TL= (0..7)
0 120 120 120 120 120 120 120 
##$TP= (0..7)
150 150 150 150 150 150 150 150 
##$TP07= 0
##$TPNAME0= <>
##$TPNAME1= <>
##$TPNAME2= <>
##$TPNAME3= <>
##$TPNAME4= <>
##$TPNAME5= <>
##$TPNAME6= <>
##$TPNAME7= <>
##$TPOAL= (0..7)
0.5 0.5 0.5 0.5 0.5 0.5 0.5 0.5 
##$TPOFFS= (0..7)
0 0 0 0 0 0 0 0 
##$TUNHIN= 0
##$TUNHOUT= 0
##$TUNXOUT= 0
##$USERA1= <user>
##$USERA2= <user>
##$USERA3= <user>
##$USERA4= <user>
##$USERA5= <user>
##$V9= 5
##$VALIST= <valist>
##$VCLIST= <CCCCCCCCCCCCCCC>
##$VD= 0
##$VDLIST= <DDDDDDDDDDDDDDD>
##$VPLIST= <PPPPPPPPPPPPPPP>
##$VTLIST= <TTTTTTTTTTTTTTT>
##$WBST= 1024
##$WBSW= 4
##$XGAIN= (0..3)
0 0 0 0 
##$XL= 0
##$YL= 0
##$YMAX_a= 773043
##$YMIN_a= -1052428
##$ZGOPTNS= <>
##$ZL1= 120
##$ZL2= 120
##$ZL3= 120
##$ZL4= 120
##$ABSF1= 10
##$ABSF2= 0
##$ABSG= 5
##$ABSL= 3
##$ALPHA= 0
##$AQORDER= 0
##$ASSFAC= 0
##$ASSFACI= 0
##$ASSFACX= 0
##$ASSWID= 0
##$AUNMP= <proc_1d>
##$AZFE= 0.1
##$AZFW= 0.1
##$BCFW= 1
##$BC_mod= 2
##$BYTORDP= 1
##$COROFFS= 0
##$CY= -3
##$DATMOD= 1
##$DC= 2
##$DFILT= <>
##$DTYPP= 0
##$F1P= 0
##$F2P= 0
##$FCOR= 0.5
##$FTSIZE= 0
##$FT_mod= 4
##$GAMMA= 1
##$GB= 0.15
##$INTBC= 1
##$INTSCL= 1
##$ISEN= 128
##$LB= 0.25
##$LEV0= 0
##$LPBIN= 0
##$MAXI= 10000
##$MC2= 0
##$MEAN= 0
##$ME_mod= 0
##$MI= 1.114404
##$NCOEF= 0
##$NC_proc= 0
##$NLEV= 6
##$NOISF1= 3.799351
##$NOISF2= 2.8
##$NSP= 1
##$NTH_PI= 0
##$NZP= 0
##$OFFSET= 14.38212
##$PC= 1
##$PHC0= -2622.702
##$PHC1= 3.792352
##$PH_mod= 1
##$PKNL= yes
##$PPARMOD= 0
##$PSCAL= 0
##$PSIGN= 0
##$REVERSE= no
##$SF= 200.129724274929
##$SI= 16384
##$SIGF1= 3
##$SIGF2= 2
##$SINO= 400
##$SIOLD= 16384
##$SREGLST= <1H.CDCl3>
##$SSB= 0
##$STSI= 0
##$STSR= 0
##$SW_p= 3205.1282051282
##$SYMM= 0
##$S_DEV= 0
##$TDeff= 0
##$TDoff= 0
##$TI= <>
##$TILT= no
##$TM1= 0
##$TM2= 0
##$TOPLEV= 0
##$USERP1= <user>
##$USERP2= <user>
##$USERP3= <user>
##$USERP4= <user>
##$USERP5= <user>
##$WDW= 1
##$XDIM= 8192
##$YMAX_p= 0
##$YMIN_p= 0
$$ End of Bruker specific parameters
$$ ---------------------------------
##NTUPLES= NMR FID
##VAR_NAME=  TIME,          FID/REAL,        FID/IMAG
##SYMBOL=    X,             R,               I
##VAR_TYPE=  INDEPENDENT,   DEPENDENT,       DEPENDENT
##VAR_FORM=  AFFN,          ASDF,            ASDF
##VAR_DIM=   8192,          8192,            8192
##UNITS=     SECONDS,       ARBITRARY UNITS, ARBITRARY UNITS
##FACTOR=    0.0002768,     1,               1
##FIRST=     0,             0,               0
##LAST=      2.2672688,     0,               0
##MIN=       0,             -1052428,        0
##MAX=       2.2672688,     773043,          0
$$ Real data points
##PAGE= N=1
##DATA TABLE= (X++(R..R)), XYDATA
0 0 0 0 0 0 0 0 0 0 0 0 0 -8 0 -5 8 -8 8 -8 16 -16 21 -24 32 -37 40 -48 54 -66 77 -85 101 -111 127 -146 162
35 162 -183 208 -230 258 -288 319 -358 393 -438 486 -536 589 -651 717 -791 872 -958 1059
53 1059 -1168 1291 -1428 1584 -1766 1974 -2222 2519 -2884 3342 -3942 4762 -5957 7869 -11428
68 -11428 20353 -92732 -71453 259002 552498 773043 758257 517435 87812 -323254 -573440
79 -573440 -572995 -385000 -115268 70446 103259 7704 -97843 -122039 -13542 172492 326118
90 326118 337713 204217 5660 -132470 -132112 -7061 125644 139685 -12750 -249976 -422364
101 -422364 -403358 -179514 130225 339760 337313 155003 -60107 -148618 -37007 192786 356909
112 356909 309677 49488 -291337 -518127 -491351 -234005 82928 275188 259595 87538
122 87538 -84543 -105673 44385 239738 316304 185652 -102489 -369830 -428352 -226482 114650
133 114650 380790 401713 159583 -186555 -408609 -369662 -110140 191144 337764 247744
143 247744 7966 -192676 -208079 -34421 190745 291592 180342 -77391 -302006 -332460
153 -332460 -142699 139515 319765 266508 3642 -293973 -420712 -283508 42447 362675
163 362675 484239 340630 40786 -218443 -292650 -172496 20073 118079 40737 -143807
173 -143807 -276367 -232302 -4768 277409 430022 346395 76127 -214351 -354512 -271589
183 -271589 -38403 177619 235888 114798 -86159 -220246 -191437 -20344 172689 253490
193 253490 167285 -27810 -203273 -244648 -126569 69325 210514 206212 67151 -108045 -197596
204 -197596 -139380 22960 169196 191157 67828 -123328 -251835 -222582 -44192 172897
214 172897 294797 249764 65902 -142526 -250011 -204792 -56688 89248 142363 80771 -32810
225 -32810 -99147 -60658 58885 173226 189424 72041 -121443 -273044 -283752 -138324 84426
236 84426 255719 276159 142968 -47929 -174170 -162121 -36254 102960 148224 63617 -88376
247 -88376 -195811 -177116 -36816 135072 222609 166340 5773 -148791 -194119 -101101 67357
258 67357 191768 182874 44901 -131030 -228501 -179492 -12875 161052 225922 142626 -30341
269 -30341 -177249 -198316 -80836 88971 190177 154318 7968 -145688 -195115 -102541 66543
280 66543 192994 188676 54369 -119866 -215480 -166181 -7907 150410 205258 122674 -39433
291 -39433 -170318 -181664 -70703 84471 178665 150250 18460 -123758 -177819 -108081 36875
302 36875 158295 171561 64665 -89773 -185015 -155901 -21673 128394 193252 128069 -21364
313 -21364 -151551 -176127 -82262 63741 160785 141051 21300 -112831 -168466 -107514 31199
324 31199 154525 178492 86963 -59381 -167423 -169067 -64822 75824 159110 133158 20547
335 20547 -100511 -147444 -86585 39075 139064 139982 37538 -101992 -181845 -141434 -1990
346 -1990 146576 205891 137466 -13942 -148551 -178799 -90776 47527 135790 113864 -2145
357 -2145 -126834 -165302 -82127 72795 199231 212328 99107 -72112 -194039 -193266 -80371
368 -80371 62346 138262 99484 -19173 -122235 -125353 -17678 129902 212442 161063 -2946
379 -2946 -177932 -249947 -171401 7802 173919 222953 130953 -30140 -150176 -153570 -51653
390 -51653 71246 119688 56757 -67007 -153420 -127179 8097 169584 247479 181732 5389
401 5389 -175333 -251668 -181903 -18361 129373 166854 81422 -55280 -139496 -108558 16567
412 16567 144536 180096 94156 -54401 -164214 -159885 -45330 96856 165502 112822 -23124
423 -23124 -148095 -176083 -88562 52654 150321 141072 37766 -85620 -142231 -92510 29360
434 29360 140392 168209 95642 -30634 -131440 -147510 -80020 16074 72224 53791 -19424
445 -19424 -86027 -88041 -13065 94032 163955 148029 51916 -66937 -135573 -117235 -32453 56328
457 56328 87518 40677 -50706 -122118 -123533 -51325 52138 128469 138395 85611 11369 -37268
469 -37268 -39360 -8422 17495 5162 -47421 -107113 -127971 -83260 16221 121914 174751 142530
481 142530 42248 -70971 -136088 -121395 -43595 44521 89468 71574 13361 -39083 -48616 -13824
493 -13824 32256 47659 14226 -49214 -97791 -90329 -20920 73869 137894 128987 49186 -56487
505 -56487 -126014 -118944 -43928 48233 97861 76587 3311 -65492 -77944 -23818 58023 105632
517 105632 78086 -14510 -114424 -154312 -107048 -472 99854 134436 90674 10155 -43022
528 -43022 -31563 30722 87411 81208 -4019 -125133 -207654 -195272 -85699 64310 174049
539 174049 189620 117692 15010 -50685 -46033 6751 50691 37492 -34305 -117865 -149486 -97386
551 -97386 11947 111044 135346 69746 -39766 -116261 -104788 -10336 106585 169192 137302
562 137302 32478 -79369 -132114 -105416 -31889 28128 31852 -16612 -72547 -83581 -29121 63584
574 63584 137059 143365 76934 -21956 -91404 -92284 -30652 44976 77751 41641 -41395 -116132 -130610
587 -130610 -72378 24274 100935 114783 66225 -4568 -46049 -32735 19343 65176 64378 11568
599 11568 -61338 -106145 -92142 -28280 43529 77288 53584 -8356 -64056 -72622 -26308 46256
611 46256 99187 98675 44857 -28594 -76732 -73679 -27441 26645 50519 27887 -22976 -64273 -65637
624 -65637 -24527 32009 66131 55816 11485 -32891 -43294 -9557 46070 83757 72996 13802
636 13802 -63175 -114710 -111779 -58323 13506 64066 70669 40377 2054 -14466 365 32242
648 32242 50946 34219 -13171 -63937 -84351 -58341 402 54924 69818 36357 -22263 -66094
660 -66094 -64541 -16717 45529 81848 69329 17876 -38512 -62958 -42462 3442 40559 41607
672 41607 6052 -40732 -64456 -46474 2310 50303 67075 41782 -7218 -45826 -47545 -11490
684 -11490 36466 61882 44130 -7850 -60556 -79681 -51725 6052 56680 68950 37841 -12383
696 -12383 -46321 -41732 -5708 34374 47004 22305 -22418 -54493 -49993 -10579 38369 63719
708 63719 47217 344 -47274 -64201 -40273 8739 50586 58143 28804 -17178 -48622 -45832
720 -45832 -11970 28103 46321 30443 -8086 -41257 -45489 -16893 24628 50080 41465 4505
732 4505 -36010 -51686 -31375 11019 46550 51219 21300 -23359 -53155 -49535 -15129 27058 49261
745 49261 38799 4312 -29708 -40168 -20681 14143 39214 36148 5933 -30922 -48903 -34652
757 -34652 3111 39471 49884 26744 -14382 -45319 -44919 -12868 28439 51306 39911 2225
769 2225 -36882 -50774 -31369 7030 37647 40335 14209 -21137 -40089 -28704 5617 38916
781 38916 47223 23712 -17185 -48918 -50610 -20344 21119 47206 41041 8208 -27744 -41337 -23574
794 -23574 12540 40702 39531 8627 -31162 -51783 -38525 781 39068 52131 30974 -8862
806 -8862 -39694 -41522 -14220 21436 40332 28971 -4169 -35049 -42535 -20018 16733 42771 40256
819 40256 11087 -25933 -45629 -34991 -1465 32765 44791 27616 -6515 -33533 -35561 -12398
831 -12398 18501 34333 23024 -7594 -35993 -41398 -18850 18042 44381 43926 17271 -16917 -36278
844 -36278 -29954 -4017 21121 28011 11912 -15646 -33223 -28201 -2666 26910 40647 29437 -280
857 -280 -29090 -38773 -24405 4009 27352 30919 13879 -10770 -25025 -19550 895 21466 26371
870 26371 11567 -13549 -31564 -29913 -9322 17117 32519 26706 4821 -18678 -28731 -18617
882 -18617 3536 23440 27785 14293 -7576 -23130 -23499 -9001 9628 18574 12406 -4854 -20298
895 -20298 -22098 -7420 15537 31505 29233 10285 -14506 -29261 -24719 -4683 16245 24056 13344
908 13344 -8267 -25986 -27421 -11187 11329 26576 24553 8094 -10316 -17817 -8983 9229 23618
921 23618 22294 4742 -19219 -34855 -31996 -12516 11261 24354 19630 2203 -14106 -15790 -1167
934 -1167 21060 34591 28623 4757 -22732 -37873 -31995 -10763 10921 19160 10055 -7214 -18057
947 -18057 -12855 6196 25958 32246 19863 -4343 -24409 -28173 -12983 9932 25503 22072 1917
960 1917 -22089 -34553 -27237 -5133 17243 27116 19570 2707 -10081 -8806 5160 20241 23089
973 23089 9286 -15062 -34621 -36357 -19029 7002 25746 26287 10586 -9252 -19191 -12642 5379
986 5379 21905 24715 11555 -8747 -22811 -22018 -7697 9603 18179 11329 -5151 -19812 -21587
999 -21587 -8996 10348 23851 22291 7184 -10626 -18853 -12584 4226 19537 21667 8658 -11481
1012 -11481 -25990 -25981 -11956 6865 18511 16671 4258 -8179 -12017 -4658 9181 18499 16226 3125
1026 3125 -12368 -20539 -16415 -2310 12340 17103 9249 -6104 -18879 -19845 -7984 9488 21777
1039 21777 21418 9087 -6320 -15137 -11861 202 10296 12255 2886 -10413 -18285 -14838 -1406
1052 -1406 12665 18613 12325 -2179 -14819 -16963 -7277 8440 19412 19001 6878 -8916 -18747
1065 -18747 -16698 -5071 7791 13441 8432 -3397 -12816 -12646 -2788 10490 17748 13784 797 -12278
1079 -12278 -16741 -9538 4532 15340 15721 4609 -10108 -19208 -15955 -3053 10977 17281 12066
1092 12066 -467 -11481 -13501 -5173 7215 15449 13385 2339 -9918 -15905 -11244 489 10882
1105 10882 12458 4199 -8111 -15891 -12701 -606 13618 20338 14572 1075 -12264 -16526 -10315
1118 -10315 2137 11169 11345 2576 -8486 -13923 -9417 1024 11315 13920 7427 -4081 -12242 -11456
1132 -11456 -2487 9277 14748 10933 -569 -12466 -16671 -10855 1636 12336 14324 6609 -4998
1145 -4998 -12433 -10784 -1123 9239 13504 8086 -2652 -11917 -12645 -4854 6303 13112 10724 837
1159 837 -9736 -13799 -8445 2239 12094 13634 6415 -4905 -13087 -12574 -3845 6857 12727 10126
1173 10126 759 -8666 -11851 -6350 3615 11364 11085 2603 -7638 -13483 -9953 547 10433 13195
1187 13195 6904 -3968 -12214 -12048 -3800 7375 13226 10739 950 -8771 -12584 -7855 1886 9639
1201 9639 10545 3554 -6003 -11688 -9373 -172 9220 12695 8110 -2144 -10394 -11903 -4966 5337 11579
1216 11579 9818 998 -8794 -12970 -8787 1297 10192 12241 6261 -3615 -10045 -9135 -1590 7377 11120
1231 11120 7331 -1816 -9787 -11421 -5777 3337 10110 9552 2489 -6238 -10781 -7684 1344 9644 12148
1246 12148 7049 -2403 -10222 -10833 -4390 4361 9893 7846 -205 -8342 -10550 -5608 3313 10426 10479
1261 10479 3825 -4985 -10298 -8624 -928 7116 10232 6345 -1812 -8886 -10140 -4996 3881 9440 8770
1276 8770 2362 -6019 -10029 -7068 798 8211 10091 4942 -3820 -9824 -9373 -2537 6066 10542 7726
1291 7726 -208 -8016 -10207 -5232 2814 9187 8800 2451 -5552 -9944 -7546 212 7710 10056 5733
1306 5733 -2194 -8663 -9219 -3656 4298 9539 7833 1100 -6355 -9726 -6077 1596 8582 9474 3948
1321 3948 -4440 -9628 -8601 -1412 6775 10322 7127 -981 -8050 -9591 -4379 3449 8494 7583 1127
1336 1127 -6452 -9777 -6244 1281 8574 10299 5270 -3013 -8855 -8653 -2546 5360 8990 6784 -801
1351 -801 -7764 -10032 -5082 2630 8831 8757 2735 -4923 -9109 -6387 840 8112 10101 5642 -2195 -8737
1367 -8737 -9355 -4276 3288 7450 5886 -164 -6634 -8530 -4428 3346 9576 10270 4858 -2801 -8325
1382 -8325 -7648 -2044 4826 7494 4085 -3005 -8994 -9329 -3628 4459 9613 8886 2828 -4672 -7659 -4900
1398 -4900 1780 7375 7812 2722 -4797 -9409 -8417 -2434 4610 8005 5931 -306 -6161 -7476 -2889
1413 -2889 4205 9241 8912 2837 -4502 -8826 -7501 -1317 4599 6737 3123 -3570 -8229 -7504 -1643
1428 -1643 6055 10083 8262 1478 -5580 -7918 -4908 1788 6381 6194 1233 -5251 -8835 -7010 -612
1443 -612 5928 8185 5213 -1303 -6498 -6928 -2212 4583 8618 7440 1352 -5251 -8239 -5825 136
1458 136 5555 6231 2124 -4574 -8254 -6864 -738 6427 9555 6977 623 -4985 -6377 -2986 2881
1473 2881 6300 4889 -525 -6725 -9236 -6528 245 6529 8435 4890 -1241 -5642 -5485 -603 4992
1488 4992 8094 5432 -911 -6689 -8539 -4829 1454 6284 5779 956 -4938 -7538 -4821 1242 7451
1503 7451 9008 5032 -1372 -6383 -6911 -2566 2871 6115 4198 -1220 -6421 -8108 -4594 1788 7095
1518 7095 7608 3843 -2076 -5684 -4870 86 5365 6748 3461 -2814 -8214 -8330 -3455 3169 7212 6518
1534 6518 1070 -4331 -6470 -3854 2000 6697 7099 2874 -3098 -6471 -6020 -964 4167 5938 3334
1549 3334 -2074 -6767 -6926 -2850 3539 7587 7309 2366 -3650 -6444 -4709 767 5232 6248 2422
1564 2422 -3425 -7204 -6427 -1478 4111 6805 4800 -158 -4742 -5508 -2331 3176 6511 5840 735 -5104
1580 -5104 -7415 -5171 271 5475 6798 3756 -1602 -5897 -5901 -1846 3516 6259 4505 -446 -5104 -6231
1596 -6231 -2952 2485 6184 5829 1716 -4038 -6543 -4843 253 5127 6560 3804 -1960 -6386 -6302 -2078
1612 -2078 3156 6183 5285 600 -4130 -5924 -3670 987 5140 5322 1758 -3200 -5989 -4711 -95
1627 -95 4740 6618 3660 -1370 -5686 -6290 -2479 2683 6310 5235 819 -4451 -6047 -3870 836 5257
1643 5257 5678 2308 -2476 -5214 -4562 -540 3733 5239 2917 -1724 -5505 -5508 -2009 3195 6725 6058
1659 6058 1949 -3313 -5829 -4437 -287 3871 4687 1748 -2870 -5677 -5180 -860 4098 6365 4813
1674 4813 397 -3404 -4349 -1693 2578 5071 3873 -331 -5469 -7091 -5317 -280 4520 6095 3977
1689 3977 -387 -3456 -3339 -193 3788 5200 3138 -1315 -5463 -6839 -4282 584 4492 4710 1869
1704 1869 -1853 -4013 -2292 1300 5117 5656 2858 -2315 -6000 -6310 -2822 1625 4590 3937 517 -2710
1720 -2710 -3842 -1831 1866 4571 4526 1466 -2889 -5250 -4567 -644 3048 4541 3025 -1084 -4477 -4703
1736 -4703 -1645 2643 5231 4573 705 -2971 -4782 -3410 310 3430 3833 1527 -2202 -4145 -3413 -115
1752 -115 3474 5094 3531 -539 -3793 -4796 -2566 713 3519 3460 588 -2634 -4086 -2479 1117 4592
1768 4592 5276 2913 -1359 -4537 -4732 -2052 1514 3514 2411 -556 -3643 -3989 -1611 2500 5064 4945
1784 4945 1363 -2264 -4684 -3595 -667 2645 3518 1656 -1660 -4104 -3777 -860 2832 4709 3693
1799 3693 521 -2857 -4191 -2803 885 3611 3431 1347 -2220 -4209 -3239 -143 3040 4416 2699
1814 2699 -891 -3502 -3985 -1416 1837 3971 3071 200 -3075 -3994 -2435 1019 3458 3663 1607 -1675
1830 -1675 -3862 -3268 -399 2667 3888 2272 -704 -3370 -3772 -1879 1362 3675 3223 733 -2299 -3224
1846 -3224 -1841 885 3361 3460 1089 -2173 -4162 -3764 -825 1945 3838 2657 583 -1955 -2955 -1377
1862 -1377 1114 2820 2556 378 -2273 -3617 -2606 211 2700 3276 1565 -1145 -2990 -2925 -734 2143
1878 2143 3733 3098 324 -2461 -2893 -1824 708 2758 2521 521 -2090 -3263 -2516 -299 2279 3126
1894 3126 1830 -355 -2207 -2162 -254 1964 3152 2218 -354 -2944 -3827 -2602 -33 2492 3172 1641
1910 1641 -812 -2229 -2322 -59 1955 2892 1716 -449 -2051 -2683 -1189 1216 2508 2142 -343 -2408
1926 -2408 -3072 -2001 765 2840 3020 1811 -849 -2297 -2171 -585 1499 2274 1442 -382 -2417 -2961
1942 -2961 -1498 820 2175 2172 555 -1227 -1834 -1204 818 2349 2704 1193 -1407 -3108 -3038 -1365 1006
1959 1006 2348 2098 358 -1325 -1912 -954 603 2203 2007 764 -1075 -2050 -1538 -52 1624 1985 1018
1976 1018 -1024 -2525 -2078 -889 1440 2595 2331 395 -1446 -2281 -1427 123 1554 1923 796 -1007
1992 -1007 -1930 -1600 -287 1222 1692 1005 -335 -1651 -1611 -395 1339 2067 1983 354 -1604 -2272 -1785 193
2010 193 1745 2356 1451 -307 -1810 -1765 -685 702 1439 1184 -93 -855 -1468 -680 862 1729 1486 173
2028 173 -1282 -2108 -1428 96 1573 2076 1233 -345 -1537 -1590 -562 975 1623 1228 183 -1105 -1213
2045 -1213 -859 -74 1091 1229 429 -837 -1127 -990 474 1643 1761 992 -528 -1818 -1847 -857 639 1603
2063 1603 1521 591 -593 -1073 -706 84 990 1177 455 -737 -1226 -882 -92 757 1245 618 -406 -1151 -1102
2082 -1102 -133 897 1567 1672 105 -960 -1514 -1424 -68 496 1137 703 -331 -730 -968 -77 794 1091
2100 1091 632 -198 -819 -933 -405 488 1105 868 -151 -707 -1250 -858 8 824 1307 855 -42 -626 -992
2119 -992 -279 462 705 532 -83 -530 -795 -259 371 1067 900 272 -744 -998 -740 -62 610 853 451 -385
2139 -385 -848 -502 -44 552 978 935 -92 -532 -812 -653 -25 186 371 -241 -537 -594 -212 456 1220 1089
2159 1089 576 -74 -463 -891 -473 -218 242 82 -263 -601 -698 92 515 660 985 259 -73 -217 -81 156
2179 156 324 227 -209 -478 -795 -719 -121 509 931 519 210 -113 -123 62 243 133 270 -237 -588 -561 -359
2200 -359 -50 8 311 143 -94 -387 26 481 619 211 211 -163 -353 -525 -126 -158 191 87 -93 -323 -187
2221 -187 19 426 391 412 -144 -232 -504 -118 113 187 184 -234 -211 -344 -228 136 435 420 224 -72 -258 -248 -130
2244 -130 125 289 135 -350 -457 -358 15 293 453 576 -121 -372 -341 -109 488 351 447 -37 -358 -299 -444
2265 -444 -215 500 424 27 -431 -367 -294 -1 486 350 204 -115 -766 -344 112 318 426 613 -140 -586 -486
2286 -486 -321 149 379 575 152 -258 -386 -403 -77 348 534 176 -125 -600 -681 -138 286 471 407 -245 -496
2307 -496 -695 -177 325 815 828 128 -212 -639 -601 6 592 569 271 -382 -820 -642 -242 503 749 620 67
2328 67 -513 -515 -100 371 584 524 204 -600 -889 -747 71 540 698 482 -262 -747 -747 -187 645 892 534 -44
2350 -44 -880 -1059 -554 142 667 610 171 -417 -1010 -411 299 821 843 390 -371 -876 -935 -125 652 1119 975
2371 975 71 -654 -877 -541 104 747 788 240 -408 -896 -579 24 946 1090 480 -383 -1192 -893 -491 577
2391 577 1187 677 71 -720 -956 -490 434 655 1225 418 -564 -866 -723 -173 737 898 534 -460 -1145 -789
2411 -789 -444 629 1120 1006 -77 -873 -1355 -850 345 1263 1257 685 -412 -1241 -1234 -279 525 896 681 -262
2431 -262 -1104 -1009 -433 576 1155 995 -20 -863 -1430 -927 411 1125 1461 645 -511 -1340 -1544 -537 612
2450 612 1228 857 52 -874 -1409 -509 566 948 1101 208 -766 -1282 -702 230 1395 1232 929 -495 -1733
2469 -1733 -1450 -459 910 1515 1375 218 -752 -1295 -929 179 1005 912 149 -724 -1152 -709 259 1288 1208
2488 1208 462 -620 -1517 -1258 -495 842 1821 1306 311 -1281 -1837 -860 152 1142 1325 556 -405 -1273
2506 -1273 -1076 55 1081 1536 650 -468 -1305 -1324 -294 1105 1670 1196 -24 -1392 -1557 -981 265
2523 265 1523 1739 765 -256 -1303 -1301 -454 750 1374 699 -312 -1260 -1166 62 1234 1505 1415 352 -1404
2542 -1404 -1875 -1278 318 1323 1475 595 -754 -1650 -1821 -453 982 1890 1646 566 -802 -1300 -442
2559 -442 616 872 1003 -247 -1452 -1762 -1142 360 1789 1818 1127 -364 -1611 -1535 -313 1035 1719 1549
2577 1549 -31 -1490 -1923 -1162 81 1073 1126 313 -550 -1046 -489 854 1755 1686 669 -1111 -2205 -2068
2595 -2068 -788 726 1882 1577 285 -962 -1777 -937 255 1480 1639 716 -682 -1643 -1455 -209 1030
2612 1030 1422 750 -368 -1645 -1366 -99 1104 1768 1333 -6 -1856 -2019 -1264 221 1513 1839 1076
2629 1076 -323 -1305 -1238 -35 902 1541 532 -637 -1739 -1853 -838 555 1638 1381 47 -993 -1447
2646 -1447 -805 1083 2364 2292 1004 -785 -2309 -2471 -1107 270 1292 921 -222 -857 -1081 -76 1379
2663 1379 1976 1740 200 -1306 -1854 -1280 95 982 1283 272 -1248 -2034 -1728 -219 1593 2248 2065
2680 2065 636 -709 -1175 -821 357 1240 945 -423 -1732 -2175 -1400 414 1678 2137 1102 -233 -1528
2697 -1528 -1353 -94 1114 1692 1356 -33 -1650 -2144 -1376 266 1379 1448 337 -769 -1428 -957 221
2714 221 1724 1888 818 -377 -1508 -1561 -553 937 1371 951 -714 -1660 -2265 -1069 567 1781 2199
2731 2199 885 -406 -1290 -991 103 1077 1598 803 -902 -1709 -1910 -921 829 1826 1374 -53 -981 -1676
2749 -1676 -731 786 2182 2130 933 -833 -2259 -1900 -712 823 1353 825 -400 -1560 -1343 -235 1524
2766 1524 2330 1870 247 -1204 -1704 -1174 -82 1106 1338 512 -1083 -1779 -1439 86 1562 2159 1435
2783 1435 158 -1178 -1592 -886 781 1509 1160 -118 -1653 -2023 -1177 271 1446 1636 983 -502 -1426
2800 -1426 -1206 150 1307 1768 867 -449 -1834 -2110 -755 670 1689 1489 476 -977 -1585 -695 274
2817 274 1696 1675 722 -958 -1854 -1574 -581 1134 1483 1163 -231 -1492 -1437 -574 789 1882 1445 460
2835 460 -1137 -1793 -1376 -158 1483 1735 676 -700 -1713 -1790 -434 1289 2138 1426 119 -1115 -1436
2852 -1436 -620 672 1868 1290 55 -1343 -1925 -1287 299 1337 1787 875 -723 -1500 -1413 -57 1263
2869 1263 1884 1321 128 -1269 -1751 -1124 272 1133 1110 318 -916 -1463 -1088 697 1937 1843 774 -761
2887 -761 -1771 -1751 -521 885 1653 1148 -432 -1519 -1732 -1064 388 1608 2011 782 -546 -1451 -1071
2904 -1071 -35 1065 1136 413 -1033 -1722 -1468 -323 1317 1931 1539 115 -1414 -1635 -1207 272 1595
2921 1595 1706 581 -857 -1798 -1391 -348 1051 1588 1096 -411 -1427 -1385 -265 1106 1603 1199 -222
2938 -222 -1727 -2062 -1303 291 1747 1767 918 -648 -1494 -1399 -239 941 1798 1092 -329 -1305 -1610 -500
2956 -500 821 1597 1166 -262 -1608 -1556 -894 733 1791 2095 754 -1035 -2002 -1890 -465 960 1860
2973 1860 1184 -269 -1242 -1533 -634 796 1385 1053 11 -1147 -1581 -634 728 1757 1795 543 -1186
2990 -1186 -2196 -1569 -353 1315 1884 1265 -393 -1455 -1729 -647 838 1456 1280 197 -867 -1231 -787
3007 -787 550 1611 1355 266 -1326 -1737 -1587 -158 1070 1853 1137 -152 -1329 -1701 -358 942 1775
3024 1775 1421 346 -981 -1413 -858 -17 1101 1100 236 -831 -1667 -978 169 1559 2233 1262 -214 -1457
3042 -1457 -1500 -917 256 1349 1042 190 -1264 -1943 -1398 -66 1213 1639 1064 4 -892 -575 135 1272
3060 1272 1478 498 -692 -1977 -1896 -906 671 1774 1674 486 -533 -1617 -1137 283 1253 1520 1066
3077 1066 -332 -1254 -1229 -431 473 955 628 -486 -1464 -1281 -299 1071 2052 1597 577 -918 -1742 -1298
3095 -1298 -100 1167 1510 820 -446 -1588 -1314 -512 762 1542 990 73 -896 -1135 -421 597 1399 1025
3113 1025 527 -1172 -1580 -959 -34 1407 1710 981 -518 -1428 -1611 -609 657 1519 1337 381 -769 -1189
3131 -1189 -612 278 1005 1131 431 -938 -1477 -1079 214 1497 1691 1013 -379 -1541 -1653 -613 938
3148 938 1619 1440 443 -906 -1491 -918 -30 928 996 306 -796 -1470 -1121 19 1359 1663 865 -150 -1447
3167 -1447 -1509 -523 878 1703 1544 509 -838 -1558 -1183 40 1212 1241 465 -667 -1415 -1033 0 1252
3185 1252 1518 1084 21 -1262 -1457 -574 709 1234 966 -139 -1290 -1609 -1278 133 1272 1727 723
3202 723 -431 -1160 -1024 -149 1006 1302 843 -262 -1400 -1572 -588 502 1300 786 -119 -788 -1348 -707
3220 -707 679 1510 1454 904 -362 -1514 -1356 -500 557 1079 638 -186 -931 -1309 -377 727 1366 1418 465
3239 465 -801 -1324 -711 55 1046 1062 383 -861 -1535 -1289 -208 895 1423 1151 232 -895 -1001 -397 534
3258 534 1194 912 -60 -828 -1440 -1019 -277 1128 1226 639 -259 -1127 -1049 -251 848 1302 1123 -128 -952 -1066
3278 -1066 -832 115 846 869 341 -924 -1019 -781 -57 831 1297 692 -176 -875 -1069 -202 543 1173 907 10
3298 10 -1068 -1297 -732 346 1126 904 621 -324 -1097 -765 -4 895 1060 625 -496 -1039 -1027 -378 510 1052
3318 1052 922 145 -420 -993 -398 171 1144 1040 411 -577 -1236 -1058 -261 719 917 437 -168 -849 -1075 -441
3338 -441 509 1238 1009 259 -500 -1107 -708 -22 685 850 255 -419 -877 -687 0 621 1000 760 64 -792
3358 -792 -994 -578 214 1055 874 338 -361 -1112 -763 -158 937 1290 433 -294 -899 -962 -385 586 960 690
3378 690 -201 -782 -1059 -539 354 1031 865 386 -603 -953 -716 24 844 839 584 -280 -561 -641 -98 468 1108
3399 1108 716 260 -561 -785 -519 321 633 874 -117 -617 -921 -792 191 568 849 527 -155 -583 -858 -272
3419 -272 231 706 724 -248 -526 -986 -477 36 930 750 209 -430 -621 -528 41 778 663 513 -319 -825 -976
3440 -976 -479 479 702 829 179 -779 -610 -436 132 647 679 363 -209 -573 -528 110 439 881 125 -319 -882
3461 -882 -669 -194 176 845 570 287 -574 -778 -483 -18 452 522 480 -220 -431 -518 -112 217 483 326 -118
3482 -118 -463 -618 -210 568 599 569 240 -385 -591 -444 -33 370 562 148 -168 -317 -657 -226 153 645 376
3503 376 48 -457 -392 -10 146 617 375 227 -624 -578 -342 -267 281 488 223 -209 -540 -480 -255 233 567
3524 567 404 -21 -516 -509 -297 60 148 496 48 -505 -546 -153 20 672 639 300 -52 -505 -484 -54 229 301
3546 301 470 -129 -259 -668 -361 108 502 393 381 7 -300 -400 55 364 536 271 -35 -452 -472 -300 88
3567 88 340 422 182 -99 -432 -89 132 367 511 326 20 -390 -82 5 91 357 171 -195 -467 -607 -264
3588 -264 156 469 365 -12 -280 -400 -141 263 499 348 110 -168 -487 -347 -106 253 417 389 -280 -171
3608 -171 -402 45 201 520 343 13 -336 -497 -315 99 454 340 93 -368 -256 -234 -80 241 631 129
3628 129 -11 -319 -524 -174 106 447 187 8 -346 -640 -159 113 111 372 135 146 -311 -385 -132 259 134
3649 134 207 -171 -318 -264 -219 60 136 181 74 -138 -368 -133 -55 265 404 66 -240 -243 -596 -279 355 230 379
3672 379 32 -196 -61 -241 139 217 304 70 -352 55 -195 -82 130 259 205 -11 -418 -50 -28 -20 278 9
3694 9 14 -399 -151 48 -36 128 16 -70 10 -236 -139 -307 275 503 336 19 -80 -116 -206 48 124 134 227 -100 -183
3719 -183 -210 -8 320 173 204 -57 -165 -201 40 180 322 148 -151 -36 -227 20 142 202 -70 -56 -357 -94
3741 -94 -220 -95 154 385 -75 -59 -160 18 123 89 -3 100 189 -42 -130 -77 -50 28 117 -241 -65 -78 -117 35
3765 35 120 105 -7 -57 -265 50 -55 242 214 255 -48 -82 -216 150 136 231 344 81 -123 -154 -79 -179 202 84
3789 84 122 -114 -77 -230 1 115 25 152 185 -105 -91 4 66 264 256 172 60 -145 -145 -120 -75 47 125 9 -318
3814 -318 -143 52 74 226 293 39 35 -186 -205 -48 141 -52 -31 19 60 -184 -165 -282 -4 271 -146 -178 -94 -113
3838 -113 91 58 -33 64 -103 -103 -141 255 246 326 146 -28 -45 42 28 -193 -10 29 -34 83 -142 63 140 12 156
3863 156 -173 -308 -52 95 -2 87 5 174 100 -44 -69 -50 28 152 -113 66 254 -53 -40 -5 -52 224 -15
3886 -15 -126 -91 -39 -146 -9 177 91 63 68 305 -300 -95 101 74 249 -64 66 -93 88 -32 59 -78 -2
3909 -2 39 -249 43 62 -43 112 43 -265 21 -213 199 49 181 59 -52 -226 66 18 -213 158 -49 105
3931 105 -33 84 113 -32 -103 221 190 -157 -26 -116 -76 -54 236 -24 152 -287 87 123 -22 -165 -185 55 -197
3954 -197 2 -123 9 75 175 -9 -141 7 61 -206 73 -167 113 8 -109 -11 -10 -29 -17 150 79 -10 -77
3977 -77 66 120 -125 -106 -69 32 -1 88 99 -107 83 1 -124 -64 57 28 -56 -160 -15 6 111 53 69 128 -197
4002 -197 175 168 -271 -215 41 125 133 172 177 -22 -124 -117 272 93 182 -21 122 154 -163 -202 131 -12 -68 -54 -137 -204
4028 -204 -190 -25 118 7 98 292 -125 24 -56 77 203 152 244 -178 1 -141 148 40 -54 -42 -208 -38
4050 -38 -91 -85 -22 227 -164 36 -51 -85 4 168 204 18 -52 -42 -57 -106 152 163 103 44 27 -38 -67 145 -33 71
4076 71 50 -28 -67 -134 101 66 34 -23 -115 -114 19 -143 126 59 196 -29 -245 -15 120 83 109 73 62 -130 -248
4101 -248 40 -41 23 -16 -27 -236 -85 64 -53 110 -57 -49 -175 -193 81 144 -4 108 211 -104 -15 -111 -9
4124 -9 44 171 248 33 20 -160 -75 37 33 -13 141 99 -74 79 -85 28 2 19 -209 -175 -168 -239 -7 170 69
4149 69 9 -139 -116 -177 -136 -127 301 185 -211 39 -172 17 146 223 136 175 -27 -80 -85 177 90 82 176 130 -119 -145
4175 -145 112 51 199 102 101 -160 -156 -71 145 201 170 0 -94 -146 15 107 -64 156 143 -45 -278 -131 39 125 18
4200 18 17 -145 -86 -115 -225 -82 176 126 65 -128 -127 -193 156 271 435 20 -183 -187 -232 64 21 254 271 50 -178
4225 -178 -205 168 260 211 161 -139 -261 -219 -356 -23 208 95 167 29 -9 -159 -99 -52 174 -21 192 -280 -191
4248 -191 86 -79 36 301 7 -48 -74 -278 69 255 411 187 -149 -29 -225 -18 118 142 294 43 -76
4269 -76 -134 -115 25 62 148 -74 -66 -470 -184 117 -83 285 52 -381 -266 -174 -280 182 280 122 -51 -316 -51
4292 -51 -63 54 62 103 225 -153 13 -154 88 203 294 253 -39 -219 -262 -141 56 317 255 22 -265 -362 -170
4315 -170 -56 301 317 -47 -197 -113 -101 113 167 335 92 84 -125 -385 -268 203 240 12 126 -143 -134 -327 331
4338 331 173 140 -131 -78 -178 117 -194 179 160 310 131 -293 -186 -220 151 349 468 -63 -63 -453 -303 31
4360 31 213 150 326 55 -71 -380 -149 25 213 263 110 -259 -405 -342 -42 258 293 73 -144 -118 -271 -25
4382 -25 184 495 182 -58 -474 -87 -282 134 263 101 228 -258 -265 -305 134 128 325 154 -99 -183 -484 -89
4404 -89 224 387 184 13 -157 -340 -426 27 286 403 -87 -302 -418 -304 -112 84 528 145 -185 -158 -428
4425 -428 -92 119 295 246 -26 -359 -249 -272 -67 534 610 91 -66 -363 -451 55 348 558 311 -215 -253 -416
4447 -416 -166 129 338 418 -54 -261 -373 -354 159 270 287 32 9 -232 -279 17 68 324 190 -233 -421 -410
4469 -410 -210 378 464 214 230 -160 -419 -215 -181 444 290 -2 -138 -241 -436 -116 145 439 299 -56 -316
4490 -316 -466 -101 3 442 298 117 -92 -452 -214 -24 461 435 295 -91 -301 -342 -115 165 382 406 322
4511 322 -128 -457 -273 221 188 312 180 -349 -367 -426 59 223 533 222 -52 -403 -307 -162 16 302 279 -113
4533 -113 -360 -488 -426 175 443 310 69 35 -478 -379 -33 395 321 272 70 -359 -250 -201 155 116 163 247 -511
4556 -511 -316 -312 50 249 359 394 -101 -246 -276 79 332 319 241 -208 -324 -314 -260 65 486 496 326 -300 -457
4579 -457 -397 -62 201 319 170 45 -416 -387 -284 96 588 276 104 -220 -502 -71 46 236 425 133 -212
4600 -212 -548 -346 56 71 409 383 -3 -419 -320 -118 425 473 247 117 -255 -215 -285 48 446 567 183 -170
4622 -170 -550 -294 -208 499 365 334 -218 -339 -340 -263 212 530 316 -111 -226 -453 -405 86 342 610 163 -222
4644 -222 -272 -254 0 109 644 276 79 -523 -592 -106 117 85 468 140 -34 -410 -387 170 511 485 140 -140
4666 -140 -370 -302 9 246 459 224 -37 -415 -273 -267 61 437 445 325 -150 -178 -539 -89 -59 496 353 -141
4688 -141 -488 -314 -106 113 441 425 194 -178 -470 -312 -23 368 551 12 -495 -369 -519 -42 262 549
4708 549 434 157 -232 -520 -286 183 241 420 65 -203 -573 -186 81 275 618 235 -258 -294 -291 71 289
4729 289 368 535 -111 -450 -439 -148 88 405 376 139 -119 -661 -472 59 416 439 -69 -136 -487 -589 -122 168
4751 168 393 363 72 -405 -446 -279 151 400 300 -40 -168 -533 -323 -210 494 567 291 -95 -240 -462 71
4772 71 382 578 289 -109 -515 -653 -395 -125 481 609 209 -266 -661 -214 -83 335 479 352 -67 -522
4792 -522 -590 14 13 420 276 -7 -415 -600 -503 -25 538 694 431 -273 -574 -511 -209 256 613 159 -62 -356
4814 -356 -485 -33 299 581 606 102 -322 -534 -326 153 409 514 304 -49 -490 -366 -160 241 409 470 70
4835 70 -349 -488 -430 183 474 485 141 -240 -568 -481 -132 482 689 234 -125 -588 -536 -285 144 586 497 56
4857 56 -382 -362 -81 21 464 389 228 -220 -394 -434 -131 409 644 314 113 -346 -547 -1 305 442 407 -24
4879 -24 -388 -405 -431 -90 511 623 423 -60 -361 -518 -209 383 402 296 -85 -417 -469 -164 299 590 596 31
4901 31 -339 -485 -468 -144 303 540 245 -462 -382 -608 -311 124 401 452 92 -302 -419 -220 245 599 620 335
4923 335 -392 -441 -623 -227 380 678 302 -63 -361 -485 -150 366 762 597 -51 -347 -535 -399 99 529
4943 529 315 336 -235 -524 -404 -82 535 525 397 -199 -588 -593 -201 424 453 487 21 -416 -724 -613 44 244
4965 244 445 95 -94 -432 -624 -117 233 784 322 -62 -534 -779 -349 -86 664 548 139 -656 -639 -623 -90
4986 -90 309 552 196 -164 -398 -563 -100 364 440 420 -88 -633 -548 -479 222 484 487 248 -294 -629 -356 -109
5008 -109 584 531 328 -389 -497 -506 -216 87 406 310 179 -334 -499 -303 124 386 478 81 -266 -507 -362 -88
5030 -88 404 548 625 -132 -512 -370 -312 330 303 387 11 -241 -332 -170 -29 298 452 135 -131 -411 -429 -108
5052 -108 332 772 332 -174 -488 -625 -285 -27 301 392 18 -192 -683 -131 -194 456 314 234 -259 -496 -391
5073 -391 -172 61 587 415 36 -529 -606 -215 250 812 491 167 -231 -442 -529 12 332 560 120 71 -556
5094 -556 -510 -111 159 566 319 -39 -606 -666 -233 190 409 467 70 -270 -468 -525 -67 316 696 553 -173
5115 -173 -493 -508 -220 379 566 464 -98 -298 -560 -481 223 599 637 206 -244 -612 -271 -87 409 542 491
5136 491 -5 -421 -675 -382 154 754 528 82 -309 -601 -162 180 535 562 -66 -220 -504 -552 -114 585 784
5157 784 237 -119 -480 -477 -247 325 661 621 -99 -425 -544 -360 -110 577 641 66 -178 -621 -341 -46 265
5178 265 517 482 -163 -355 -825 -419 225 713 550 35 -327 -576 -462 201 440 498 381 -91 -575 -473 50
5199 50 272 777 275 -165 -367 -842 -129 124 617 437 63 -235 -725 -471 -154 655 631 251 -28 -423 -675
5220 -675 -113 344 556 647 112 -343 -623 -401 18 448 375 206 -281 -561 -358 -278 337 715 266 -189 -634
5241 -634 -583 -215 240 498 472 -41 -454 -582 -369 -115 439 503 94 3 -375 -397 -4 341 676 375 -21 -596
5263 -596 -427 -199 286 484 626 303 -243 -680 -205 138 509 336 307 -350 -575 -588 -87 199 743 432 13
5284 13 -375 -773 -240 59 575 680 75 -361 -453 -303 192 243 704 338 -338 -645 -724 -170 166 693 411
5305 411 -198 -370 -665 -204 126 504 420 -59 -348 -603 -486 -113 410 675 550 -148 -338 -528 -143 206
5325 206 481 578 4 -283 -779 -228 100 356 666 62 -230 -653 -518 27 357 617 300 -24 -583 -436
5345 -436 -405 286 267 418 -29 -272 -589 -406 181 383 473 397 -55 -615 -628 -288 412 577 609 -88 -525 -449
5367 -449 -314 168 513 481 99 -278 -751 -466 143 284 947 260 -164 -404 -562 -312 479 568 151 -182 -521
5388 -521 -586 -296 107 665 564 96 -448 -672 -480 -97 412 700 314 -207 -557 -400 34 351 441 565 -55
5409 -55 -438 -556 -307 264 477 480 168 -393 -461 -431 -3 259 619 202 -176 -453 -521 -155 195 669 233 -93
5431 -93 -553 -577 -438 136 455 492 178 -231 -512 -264 165 630 769 235 -173 -402 -401 -181 244 510 271 82
5453 82 -404 -562 -285 215 731 689 248 -14 -692 -384 49 388 402 238 -153 -526 -570 -178 278 674 471
5474 471 102 -383 -540 -394 3 321 535 263 -196 -561 -337 -139 327 675 125 -57 -553 -645 -357 142
5494 142 447 498 135 -414 -640 -223 102 276 515 334 -73 -539 -461 -147 158 671 391 -73 -220 -528 -262
5515 -262 45 342 380 105 -246 -526 -360 185 552 590 333 -5 -436 -345 -242 264 518 365 32 -293 -474
5536 -474 -410 62 445 453 215 -349 -581 -603 55 328 316 419 -193 -525 -459 -253 215 592 606 -158 -439 -414 -185
5559 -185 172 554 560 156 10 -402 -564 -85 160 450 444 33 -356 -490 -181 30 397 550 44 -389 -622
5580 -622 -388 165 367 460 139 -192 -494 -421 -92 407 224 461 -178 -398 -465 -196 164 455 324 100 -160
5601 -160 -518 -417 -105 535 448 335 -253 -396 -610 94 146 421 252 -10 -389 -343 -424 84 418 388 145 -285
5623 -285 -504 -300 60 257 483 307 -55 -354 -399 -55 178 382 327 188 -178 -318 -105 56 491 271 250
5644 250 -252 -389 -495 -191 383 364 7 111 -294 -282 -41 366 473 402 175 -222 -568 -436 104 263 249
5665 249 54 -125 -322 -291 -32 263 218 367 -22 -275 -469 -321 261 496 224 172 -43 -496 -299 23 373
5686 373 461 269 -232 -454 -446 -9 -41 88 167 9 -283 -259 -295 111 226 205 264 -307 -493 -345 36 399 423
5709 423 127 -70 -356 -447 19 129 338 200 221 -163 -325 -211 89 455 358 230 -235 -426 -494 -67 481
5730 481 323 189 1 -400 -299 -53 265 664 292 219 -225 -266 -137 -51 279 451 -103 -191 -418 -263 -113
5751 -113 197 323 31 -137 -296 -358 -256 38 218 241 116 -1 -246 154 -185 325 54 173 63 -306 -171
5772 -171 -196 150 181 234 79 -164 -375 -201 147 191 361 20 -335 -578 -78 -92 123 301 146 -65 -261 -290
5794 -290 73 281 376 167 -72 -200 -172 -295 55 281 245 324 -66 -319 -249 -63 51 304 397 -76 -365 -403
5816 -403 -475 56 303 291 -77 -262 -345 -353 36 89 224 217 -177 -242 -346 93 289 297 257 -42 -318 -486 -260 170
5840 170 367 196 -114 -156 -172 -291 124 264 160 260 -228 -234 -58 -57 68 196 311 163 -312 -333 -51 68
5862 68 452 277 82 -207 -414 -335 35 133 373 122 -182 -302 -226 -81 46 179 160 112 -527 -284 -331 247
5884 247 260 385 77 -25 -193 -292 -47 -86 223 165 -7 -231 -46 -69 -98 141 449 299 -192 -256 -85 -144 183
5907 183 423 169 -37 -335 -175 -12 154 366 165 -103 3 -329 -109 88 81 314 156 -11 -216 -299 -60
5928 -60 228 188 240 29 -228 -435 -86 109 254 139 132 100 -376 -134 140 232 324 121 -165 -125 -109 -159 -143 285
5952 285 113 14 -157 -136 30 -89 303 309 -34 -248 -321 -568 -34 207 232 6 9 -270 -76 -246 196 388 143
5975 143 -87 24 -245 -143 -18 182 339 271 -32 -219 -453 -161 180 306 89 -317 -121 -33 -122 136 254
5996 254 213 -44 14 -47 15 -68 211 238 285 -337 -345 -26 -17 77 296 -14 -282 16 -431 -71 -64 365 230 61 -179
6021 -179 -123 -135 -93 -71 266 250 59 -58 -324 -30 -35 60 100 81 -223 -165 -161 -62 151 -2 212 -70 -138 -156 -98 -33
6047 -33 151 47 98 -190 -138 -102 -44 154 174 -46 -94 24 -4 -12 8 306 93 -44 -186 -166 -68 59 251 150
6071 150 -69 -171 -17 -127 69 143 -61 120 -197 -171 4 -7 125 66 44 -46 -206 -200 -169 121 185 100 183 -183
6095 -183 -22 -41 123 203 72 37 11 -25 -67 13 -146 309 -36 118 -321 -181 -21 38 100 -31 -93 -132 -94 -202
6119 -202 -136 157 327 108 -164 -143 -86 -83 153 6 44 199 30 -76 -121 130 108 194 12 -198 -190 -142 192 -18
6143 -18 145 198 -156 -285 -186 -134 -59 70 -4 54 -121 -240 35 241 98 -62 60 -142 -68 -232 -118 -72 10
6166 10 13 -33 -357 -194 -6 -6 42 139 58 -107 -101 34 -72 -34 72 -16 -124 -56 44 -36 161 135 179 71 5 -242
6192 -242 -9 103 341 58 308 113 -11 -119 54 -27 -14 281 -41 -11 -156 -109 -221 -39 364 -77 -124 6
6214 6 -183 -8 -200 202 117 -287 -117 114 -72 -18 192 -57 197 -75 -276 -105 28 86 138 -91 190 -256
6236 -256 -30 -116 114 86 92 67 -33 -25 69 -84 57 79 50 -45 -179 -66 30 152 20 218 91 4 12 -169 141
6261 141 156 191 127 -54 -2 -173 -31 -60 107 -87 125 -50 -220 -119 211 226 44 -53 -152 -17 24 -1 246
6284 246 -28 337 -186 -321 -297 96 11 13 92 -48 -77 -92 -52 303 127 -34 -60 -148 -173 -47 114 174 215 -170
6308 -170 59 -245 -220 -120 166 18 270 -269 -113 -137 -29 151 191 183 -138 45 -194 132 -152 91 21 161
6330 161 -159 -39 90 -42 -6 200 189 33 -21 -167 114 177 14 -17 6 -90 -138 -156 -67 80 252 86 137 -108
6354 -108 -163 -117 187 -30 126 -66 81 -79 -84 100 117 38 146 -69 -109 37 -82 171 101 145 64 -181 107
6377 107 -58 -92 144 49 -76 -233 12 -107 101 183 306 151 -199 -126 -34 67 -25 203 201 -20 39 28 -65 22
6401 22 175 70 14 -22 -193 -9 -221 -49 125 7 67 -285 -209 -49 2 138 40 -90 -32 54 79 -73 140
6424 140 -22 220 121 -170 -57 -70 107 134 23 110 -282 77 -237 149 61 13 -96 -140 -110 -6 129 -48 96
6447 96 42 -34 -36 -104 -188 70 -54 -93 -122 -97 -241 -45 8 19 56 193 -167 -23 -167 -69 67 133 52 108 78 -132
6473 -132 -211 11 206 -54 -44 -121 112 -138 -36 -31 144 -229 -55 36 -73 -98 -22 152 100 106 -29 12 -78 -39 -184
6498 -184 120 168 -216 121 -105 -96 1 20 12 124 -144 -219 62 24 103 192 33 -153 -10 161 36 294 -28 183
6522 183 172 21 9 70 253 -90 227 28 -95 -87 -28 -251 66 113 174 48 18 -89 -192 134 86 159 138 -287
6546 -287 -47 147 210 106 50 28 86 21 -340 -150 -93 293 0 80 -303 -175 66 -3 29 104 -27 -170 -173 -199
6570 -199 98 180 -45 -114 -279 -352 -229 -35 123 -15 22 -125 -186 -33 70 60 189 66 -92 -147 18 -24 -78
6593 -78 48 270 44 -8 -17 -232 171 178 35 224 87 -45 -181 -8 -107 96 41 74 -62 84 -171 -59 125
6616 125 -43 -13 61 -219 -277 -5 306 220 -58 92 -2 -81 110 5 27 19 -131 -282 -63 -212 188 291 2
6639 2 97 -191 -16 22 63 -17 -127 241 76 -100 -250 46 184 120 135 245 -116 -27 -268 -223 93 137 78 -126
6663 -126 -298 -145 -103 -182 186 7 70 49 -155 26 56 320 -201 25 -139 -124 -76 87 117 183 285 -5 -72
6686 -72 -331 -48 200 158 218 151 -201 -119 -232 42 282 70 -58 -17 -14 83 -49 131 188 215 -87 39 -169 43
6710 43 -17 -12 -9 290 207 -308 18 -86 174 159 339 -25 -47 -227 -245 -38 257 114 391 109 -24 -90 106 39
6734 39 -185 66 5 8 -222 -114 105 32 196 158 -178 -294 -110 -299 72 119 -18 -172 -99 -100 53 59 243 111
6758 111 -112 -98 -272 23 -86 176 -18 165 -12 189 -10 -218 170 231 223 42 -205 104 177 145 223 206 180
6781 180 -233 -124 -407 226 201 160 229 18 -227 120 155 -18 219 200 -88 97 -21 21 -84 172 11 -319
6803 -319 -203 -85 -222 0 23 41 162 -9 -138 201 169 144 156 141 20 -129 -249 -227 -23 52 123 -241 56
6826 56 -159 -134 -77 -24 120 -44 -95 -27 -38 -28 137 274 -40 -112 -330 -53 93 189 165 -7 71 -252 -50 -46 258
6851 258 135 126 186 50 -99 -160 135 -69 -20 51 87 18 -150 18 30 16 -125 225 -45 -286 -64 100 109 101 95
6876 95 -116 -114 -15 -22 100 131 34 29 1 -231 -42 122 193 117 202 16 -1 -29 -107 1 159 163 -200 -122 -132 -233 10
6903 10 171 245 23 -287 -190 -84 11 176 156 126 -279 -244 -192 13 -3 35 -33 118 62 -140 -130 140 315 87
6927 87 -11 -13 -264 -44 25 143 263 42 54 62 -105 -269 -25 184 -3 -129 -16 -84 14 -114 86 85 41 -60
6951 -60 -195 -152 -121 20 158 111 -13 -239 -209 -164 73 80 92 -110 -20 -199 -172 8 242 133 126 -87 39 -32 -105
6976 -105 -88 112 86 42 -98 -167 -77 34 143 118 83 -209 -58 -64 113 11 120 227 181 -8 -12 16 72 81 20 -154
7002 -154 40 10 167 -86 106 172 49 -127 -223 139 -46 210 187 135 -55 -172 -365 -115 183 9 -126 98
7024 98 -154 -430 -184 -46 272 326 -22 -18 -106 -11 120 202 215 98 -82 53 -109 30 54 112 -128 -28 -240
7047 -240 -98 -135 -56 49 -91 143 -106 38 82 118 223 5 62 111 -23 90 -239 -39 -5 84 84 7 98 -28
7071 -28 81 176 144 62 66 -60 -90 -149 284 -45 77 -79 -152 -6 16 23 7 97 -153 98 -61 -134 123 -5 178
7096 178 -64 46 -106 -190 71 216 195 91 -17 31 -119 -114 -137 -33 125 39 17 -210 -18 -136 -90 59 -6
7119 -6 -122 -29 60 164 278 74 -71 27 -8 -83 -91 182 -100 71 139 -186 -94 -113 -56 160 158 134 198 93 104 12
7145 12 87 -98 198 -210 -43 -39 -17 -83 59 138 21 -154 215 -161 87 270 42 80 -45 -83 -151 -177 102 150
7169 150 -108 215 -69 -148 -23 66 214 133 201 41 -198 -81 -3 212 184 64 -69 -274 147 -56 80 22
7191 22 -35 119 -115 -129 -275 117 184 122 119 65 -87 -134 73 170 153 229 -57 -86 139 -79 109 0 -8 85 -187
7216 -187 -35 -258 127 0 216 130 -115 58 -53 46 33 47 184 47 -169 50 -14 -149 65 180 80 -76
7238 -76 -291 -19 1 -130 248 71 127 -183 -86 -229 271 100 140 -108 -15 254 -80 158 -21 145 68 82 -63
7261 -63 -32 -130 -43 -39 16 -44 -165 -5 -134 165 131 -35 -16 -108 -187 -103 116 115 167 138 41 206 156 -19 21 157 -29
7288 -29 20 -24 42 -117 115 33 107 75 -46 -1 -60 265 22 342 75 40 209 -82 -27 101 -87 207 -163 -73
7312 -73 -195 -339 -117 216 144 -61 -233 -98 89 93 -85 6 -99 36 -90 -131 -181 -77 122 156 -136 -14 -71
7335 -71 -224 -2 27 267 21 -2 -100 74 51 -62 62 32 95 -1 168 147 91 177 15 198 -216 -178 86 52
7359 52 115 111 106 142 -1 42 -14 -35 -40 264 -183 23 -105 10 67 118 44 -86 -271 -28 152 -9 36 30 72 41 44
7386 44 -57 -13 -174 -58 137 97 -31 47 -217 144 76 73 -71 -151 -87 -85 22 -10 -52 1 109 66 60 -117 29 -87
7412 -87 46 21 -26 -87 125 -25 240 -19 156 1 73 -178 -4 106 11 7 -92 47 43 124 -92 111 43 15 -111
7437 -111 -41 136 -35 16 -2 176 -72 -92 -85 7 73 185 41 -21 -120 -169 -11 -161 -62 60 17 -167 0 -238
7461 -238 -292 85 -196 105 -60 -191 -119 67 -91 -12 62 -28 30 -127 40 -295 -15 96 -96 -264 -63 147
7483 147 -3 115 -107 45 -72 49 28 170 -190 -90 -6 151 32 -39 54 191 130 -35 -38 -27 39 -214 136
7506 136 26 61 186 -48 -11 -232 -121 38 67 12 203 44 7 18 -156 -22 79 -64 76 -51 -12 -73 69
7529 69 163 60 -72 64 -27 115 -124 -107 214 -135 -227 144 14 -156 61 -15 28 99 -27 -17 34 226 188 -117
7553 -117 -28 25 -106 -53 -16 -17 -28 163 99 -150 -97 -96 -93 48 15 44 -32 -84 -99 -63 -21 130 157 8 -38 52 -28 96
7581 96 -15 130 97 241 77 -34 270 118 82 -96 93 -263 7 81 -82 -8 36 15 164 -15 23 -36 133
7604 133 13 43 -136 -87 68 -72 -34 140 6 84 45 -102 27 -161 106 87 -85 -75 -92 -187 54 -290 33
7627 33 6 24 -27 8 27 -62 -117 -226 74 79 -155 -98 64 66 -9 47 77 -112 -107 121 75 87 93 -107 -113 -27 -72 182 115
7656 115 -4 -224 -83 58 -47 30 140 -63 -60 36 -145 -106 -103 -12 65 -50 13 -125 -59 127 113 -1 120 180
7680 180 2 57 4 -112 85 -30 123 -157 -34 -44 60 -164 94 -19 -28 -40 34 130 307 79 159 79 -124
7703 -124 -111 -32 7 -20 29 -18 -6 53 -67 49 49 150 224 127 47 -114 62 -42 78 -67 39 -216 27 -96
7727 -96 -146 236 208 122 -34 -240 -44 -103 -44 42 183 -3 -228 -101 -171 171 250 33 121 -101 -59 -133 -39 69
7751 69 257 -9 -163 55 -265 -171 73 31 151 -86 159 -55 -70 -185 -14 138 11 0 -57 -27 -162 47
7773 47 15 46 81 -99 4 112 -97 125 217 -144 -33 -1 -45 -178 133 102 -46 -66 -11 -77 -120 142 246 -23
7797 -23 -179 -190 -40 -11 -102 48 -155 176 10 -117 67 -6 161 26 -22 -34 -133 -60 -132 -42 -40 171 -51 -69 -76
7822 -76 -190 139 -71 128 161 148 -102 76 11 359 288 -55 -331 -179 -92 -302 87 -51 64 -8 -153 -185 -67
7845 -67 -85 79 183 119 6 -173 -23 -19 -147 32 2 164 77 -21 -54 151 150 76 296 -325 28 37 -110 295 173
7870 173 82 -8 -89 -169 -36 -118 24 258 -188 -288 -103 -34 -43 190 217 48 -199 -146 -60 -210 -100 223 -74 157
7894 157 11 -183 4 -28 181 268 11 -207 50 -96 96 210 80 -114 -176 -146 -17 -16 -51 37 38 29 -175 -143
7918 -143 5 52 190 166 -29 39 -175 -179 -33 -101 125 109 -145 -104 26 -35 94 69 -62 237 -83 -87 -121 210
7942 210 92 -32 -43 -135 -217 198 121 185 232 131 124 -148 -70 -58 43 -39 -27 -132 -138 -104 68 -273 222 218 -33 -82
7968 -82 -100 -193 90 341 364 114 -50 -14 -155 -197 240 41 70 65 -108 -19 124 -11 336 188 83 -101 -22 45
7992 45 12 164 62 179 -84 -233 -214 25 47 184 259 47 -74 -164 165 -186 27 35 -142 -39 -173 -299 70
8015 70 -69 37 192 -14 -148 -407 74 91 139 114 -31 67 -244 76 -131 168 227 19 49 -7 -112 -24 -70
8038 -70 16 -10 -136 -91 -87 -136 17 167 178 -57 -113 -229 -145 -8 -127 -7 20 -88 -196 -231 183 197 78 173 -28
8063 -28 56 -300 -67 68 115 59 201 -293 1 -230 78 -87 387 313 -118 35 -204 60 254 148 136 63
8085 63 -150 -298 -199 -25 -42 66 80 -140 -118 -101 96 38 9 183 -24 -264 -286 -128 -114 77 33 -171 -44 8
8109 8 106 40 122 16 200 -79 -136 -15 -27 161 115 182 83 54 -184 90 73 193 218 125 -115 -73 -41 70 222
8134 222 -43 -142 -123 -192 -69 140 184 355 171 -154 -229 -182 -234 137 -34 221 5 -109 -166 -153 7 -22 118
8157 118 55 56 -85 -97 -40 -194 258 61 125 -251 -300 -180 18 222 196 50 60 -117 -11 1 327 86 -89
8180 -89 30 -114 -147 -6 -162 198 106 42 -121 -252 104
8191A04
$$ Imaginary data points
##PAGE= N=2
##DATA TABLE= (X++(I..I)), XYDATA
0 0 0 0 0 0 0 0 8 0 8 -8 8 -16 16 -24 24 -32 40 -55 64 -72 95 -110 128 -153 178 -210 245 -280 325 -373 425
31 425 -486 550 -623 704 -792 890 -996 1114 -1241 1382 -1533 1704 -1884 2084 -2305 2541
47 2541 -2803 3088 -3402 3748 -4129 4551 -5024 5554 -6150 6832 -7613 8525 -9602 10896
61 10896 -12494 14517 -17172 20830 -26218 34978 -51678 95258 -466685 -1052428 -378551
72 -378551 117965 510542 464741 291977 87718 141053 298036 460061 370805 64891 -372785
83 -372785 -632672 -596787 -260369 123226 350191 261402 -32668 -326994 -376196 -150566 230858
94 230858 513361 536312 279509 -69534 -296212 -269228 -59620 157666 196389 14338 -274200
105 -274200 -454097 -395226 -120845 205808 399119 356208 145444 -59678 -111448 5105
115 5105 188153 275747 161020 -116235 -391028 -500262 -376650 -79342 228409 377620
125 377620 312597 109839 -92101 -174339 -103706 42330 137928 113069 -8711 -134656 -165031
136 -165031 -64641 100985 208520 173574 4508 -201733 -314560 -254331 -50046 179359
146 179359 302276 256198 79600 -114190 -208023 -152866 2815 152275 202829 127340 -24060
157 -24060 -154419 -184928 -114138 -7255 54841 26492 -67351 -137403 -97614 59582 254444
168 254444 368543 308876 80454 -200700 -379593 -366705 -183156 54288 202076 185993
178 185993 51765 -81657 -110712 -12999 136655 218010 153625 -26865 -209398 -275313 -173690
189 -173690 34871 214719 248389 116092 -90083 -229692 -205552 -33099 167578 252140
199 252140 155776 -58323 -243567 -268738 -107377 137393 299789 270111 70114 -166231
209 -166231 -285548 -214369 -14179 165704 201000 79669 -98760 -193873 -123125 69878 244652
220 244652 268221 108402 -145713 -335156 -333966 -138319 130745 312594 306368 131371 -89119
231 -89119 -210258 -168680 -17998 117283 131342 10683 -153035 -228348 -143343 59133 250737
242 250737 303490 175274 -55237 -239834 -262818 -119526 85771 213527 179815 13415
252 13415 -164420 -228002 -135152 50891 205896 226108 99893 -83251 -199489 -174448 -31141
263 -31141 130885 196547 118059 -48384 -186164 -199870 -75044 107735 223299 190364 29974
274 29974 -150890 -233488 -162350 14862 177372 216125 110217 -63251 -186600 -176775 -42779
285 -42779 118259 193090 131859 -21500 -162632 -192946 -90103 75907 191311 178156 44460
296 44460 -122406 -209010 -155095 4228 161012 210360 118942 -52590 -187610 -192007 -63754
307 -63754 106498 201099 154143 -3370 -160327 -204441 -103151 72672 202295 195550 54419
318 54419 -124871 -218938 -166402 -7216 149452 198856 109625 -50958 -167494 -160483 -37032
329 -37032 116129 191045 131727 -23337 -168448 -204524 -106387 62894 192448 195437 72191
340 72191 -91617 -187389 -154473 -20735 117044 160994 82682 -57950 -156433 -139296 -13299
351 -13299 136093 205206 142887 -11650 -157870 -205223 -128182 15313 126130 134638 46316
362 46316 -66882 -118767 -68066 52811 157874 169239 71472 -79920 -193607 -199548 -96376
373 -96376 48285 146392 145106 59462 -43912 -91132 -54212 29218 89743 75915 -8406 -105582
385 -105582 -143309 -85650 37393 150862 183696 111620 -25035 -147215 -187368 -130078 -17681
396 -17681 82142 115889 77350 7331 -37281 -24890 31264 84802 85703 18888 -82027 -153880
408 -153880 -147020 -59653 59685 139380 130030 39871 -68421 -123109 -87874 13769 112338 139556
420 139556 76345 -34805 -120057 -123381 -44152 62042 119579 88747 -10670 -111352 -145521
431 -145521 -87371 25078 116444 128102 55953 -45834 -101487 -66491 37447 135890 153158
442 153158 64248 -82775 -197286 -204507 -98475 51768 151025 141348 40080 -72730 -111805
453 -111805 -47504 72593 159407 147041 37824 -97461 -168891 -132246 -20294 83311 102627
464 102627 24641 -93435 -158923 -113146 26704 178316 245969 183361 25525 -133237 -202882
475 -202882 -155360 -36469 68451 90901 29996 -53490 -84876 -32382 70067 144811 127672
486 127672 17618 -117428 -187348 -141558 -4108 139598 198580 138390 561 -124901 -163345
497 -163345 -99900 11654 91400 88876 15884 -65529 -89680 -35712 59106 126218 111660 19804
509 19804 -91972 -151630 -118928 -14053 95232 140810 98923 4196 -76671 -90630 -33962
520 -33962 45041 82359 45494 -44641 -128618 -147075 -81159 34019 133594 166518 124166 41923
532 41923 -27629 -50959 -33811 -10175 -14583 -55878 -108576 -129866 -91040 1881 107352 172815
544 172815 163882 87679 -12827 -84220 -94107 -48769 12668 45555 29565 -21272 -68935 -78857
556 -78857 -44267 10605 47745 44371 8385 -27323 -27921 15944 79323 119527 102135 27679 -67955
569 -67955 -135272 -139621 -82972 -1382 56052 61412 21974 -26138 -43404 -13223 46700 95279
581 95279 97298 48115 -23086 -73086 -72416 -29393 19658 35017 1456 -57584 -96385 -79579 -8744
594 -8744 77489 127122 109923 38093 -41748 -80328 -56685 6432 61359 67587 19348 -50904
606 -50904 -96036 -85477 -27055 40100 71279 49373 -6469 -52215 -51372 -748 65140 99602
618 99602 74674 1674 -73365 -101863 -66433 7435 69087 76003 22618 -53772 -100763 -86287
630 -86287 -18675 59118 99167 82207 26879 -23976 -36792 -8101 32031 44813 10879 -53794
642 -53794 -106912 -109882 -53100 34441 103184 115105 66344 -8994 -62406 -63591 -18352 37528
654 37528 61814 37177 -18394 -65128 -70214 -30659 25483 58573 45411 -3095 -50300 -61035
666 -61035 -24977 35770 80055 77573 29390 -33886 -73420 -65252 -18261 33905 56201 34923
678 34923 -14046 -56771 -62471 -26863 27303 65540 64224 24970 -23920 -50068 -37295 2452
690 2452 38190 42243 9318 -38063 -65735 -51808 -1722 52905 76558 53584 -1062 -52287
702 -52287 -67546 -38916 11818 50936 52404 17981 -26337 -50045 -36655 2714 39984 48340
714 48340 20869 -22924 -52637 -46712 -7426 39221 62111 44020 -3162 -48744 -62506 -35459
726 -35459 14036 52750 54453 19179 -28129 -55237 -43380 -2150 39517 53059 30042 -12442
738 -12442 -43697 -42624 -9987 29639 47786 30629 -10365 -47494 -54407 -25060 21537 55016
750 55016 53795 18706 -26437 -51845 -41468 -3613 34614 47378 26075 -13905 -44501 -43915 -13245
763 -13245 26259 46830 34695 -1086 -35064 -43164 -19625 18784 44974 40227 7916 -31327
775 -31327 -50920 -38384 -2681 32386 45093 28594 -4260 -30035 -32363 -10341 18831 34529
787 34529 24348 -4966 -33938 -42594 -23501 11478 39693 43251 20086 -14037 -36378 -32986 -7461
800 -7461 21118 32625 19077 -9679 -32624 -32744 -9966 21553 40648 33709 5692 -25273 -39397
813 -39397 -28216 -34 26425 33924 18516 -8692 -29165 -28682 -8783 17101 30697 22134 -3091
826 -3091 -27361 -33599 -15804 14640 38164 38246 14733 -17842 -38358 -34090 -9477 17584 28921
839 28921 17043 -8093 -27340 -25916 -3087 25858 40857 31010 1613 -29384 -42270 -29344
851 -29344 96 26748 32891 16588 -10207 -27945 -24050 -1256 23897 32632 17507 -12070 -36443
864 -36443 -37413 -13383 20599 42207 37497 9427 -22934 -37967 -26964 1247 26244 30603 11598
877 11598 -16056 -32867 -26354 -1152 25025 34117 19439 -8450 -30266 -30064 -8164 21706 38775
890 38775 30650 1923 -28780 -41721 -29154 -49 25379 31090 14264 -11435 -27074 -20655 3302
903 3302 27564 34800 18913 -9001 -30644 -31309 -11096 14505 28125 19651 -4917 -28693 -34818
916 -34818 -18944 8982 31700 34950 18808 -4734 -20121 -17307 -699 16987 21445 8298 -15116
929 -15116 -33454 -34412 -17013 8164 26102 26252 11513 -5985 -13280 -4213 13469 26371 22748
942 22748 2804 -22252 -37402 -32832 -12033 11937 24328 19716 2965 -12918 -16789 -6207 10802
955 10802 22359 20565 6478 -10014 -17359 -12046 2191 14234 13948 238 -18907 -31227 -27321
968 -27321 -7778 16746 32513 31176 15675 -3614 -14899 -12144 -344 9652 9051 -2377 -16978
981 -16978 -24439 -18245 -1068 16161 23001 15531 -372 -14127 -15694 -4466 12082 22410 19071
994 19071 3277 -15131 -24277 -18647 -2490 13129 17881 8661 -7938 -19880 -18677 -4120 13835
1007 13835 23870 19431 4174 -10958 -15924 -7446 6693 15928 12345 -2913 -19814 -26428 -18128
1020 -18128 747 18772 24996 16130 -1085 -15104 -16704 -5243 10365 19577 15717 1235 -14124
1033 -14124 -19980 -13263 1386 12589 12974 1969 -12575 -19240 -12011 5167 21112 25688 15122
1046 15122 -3986 -19181 -21309 -9850 6762 17152 14300 1151 -13256 -18853 -12079 2124 13842
1059 13842 15552 6496 -6559 -13631 -9963 2560 15088 18846 10038 -5818 -19051 -20954 -10784
1072 -10784 5392 17009 16163 4568 -9376 -16614 -11530 1866 14309 17568 9076 -4495 -14104
1085 -14104 -13463 -3163 8892 14282 8512 -3958 -14985 -16594 -7528 6496 16082 15394 4848 -8205
1099 -8205 -15178 -10947 1490 13647 17296 9906 -4067 -15593 -17584 -9016 3916 12214 10622 1462
1113 1462 -8931 -11894 -5042 6809 15909 14935 4568 -9040 -16974 -13847 -2768 9570 14855 9281
1127 9281 -2328 -12941 -14781 -6893 5313 13919 13577 4516 -6776 -11995 -8502 1312 10435 12147
1141 12147 4410 -7308 -14558 -12755 -2497 9888 15714 10860 -932 -11930 -14547 -7315 4772
1154 4772 13517 13090 4010 -7503 -13680 -10650 -590 9111 12414 6870 -3151 -10844 -10588 -3106 7119
1169 7119 12448 9163 -529 -10256 -13367 -7954 3165 12193 13348 5765 -5379 -12616 -11071 -2106
1183 -2106 7923 12397 8278 -1863 -10393 -11825 -4990 4812 11345 9860 1230 -7668 -11600 -6980
1197 -6980 2269 10847 12189 5116 -4969 -11890 -11421 -3595 6145 11360 8890 198 -8410 -11248 -5756
1212 -5756 3616 11046 11021 4022 -5450 -11361 -9098 -912 7423 10367 5481 -3781 -10989 -10863 -3716 5932
1228 5932 12298 10073 1875 -6871 -10666 -6957 1701 9451 10267 4253 -5024 -11258 -10395 -2508 6348
1243 6348 10722 7428 -690 -8430 -10086 -3944 5270 11762 10266 2000 -7623 -12341 -8885 -88 8517
1258 8517 10716 5505 -3525 -9929 -9390 -2280 6434 10982 8324 97 -7994 -10442 -5805 2761 9390
1273 9390 9456 2992 -5692 -10755 -8547 -689 8011 11020 6882 -1914 -9516 -10231 -3737 5076 10246 8629
1289 8629 637 -7605 -10886 -6521 2728 9618 10173 3940 -4684 -10369 -8956 -1168 6472 10125 6519
1304 6519 -1475 -8270 -9477 -4098 3887 9618 8494 1957 -6110 -10060 -7189 797 7888 10073 5152
1319 5152 -3287 -9244 -9032 -2529 5320 9452 6922 -282 -7448 -9162 -4441 3350 9461 9057 2735
1334 2735 -5339 -9759 -7935 -940 6028 8706 5255 -2086 -7897 -8288 -2513 5065 9723 8131 1005
1349 1005 -6361 -9417 -5993 1342 7640 8669 3581 -4307 -9449 -8405 -1858 5767 9314 6296 -820
1364 -820 -6724 -7646 -2664 4524 9325 8082 1433 -6317 -10470 -8115 -1027 5657 7785 4013 -2637
1379 -2637 -7132 -6452 -642 6665 10583 7974 341 -6880 -9566 -5803 1090 6666 6611 1122 -5681 -9340
1395 -9340 -6345 994 7772 10317 6244 -1127 -7069 -7338 -2111 4307 7709 6049 -564 -7147 -9532
1410 -9532 -6315 1097 6859 7887 3506 -2839 -6867 -5770 -6 6932 9592 6092 -1020 -8107 -9538
1425 -9538 -5262 1668 6696 6130 828 -5314 -7735 -4328 2686 8465 9390 4368 -2822 -8008 -7633 -2325
1441 -2325 4322 7458 4875 -1487 -7393 -8208 -4438 2449 7428 7546 2479 -3800 -7206 -4908 1309
1456 1309 7436 8812 4845 -2467 -7997 -8543 -3628 2649 6445 4764 -802 -6132 -7530 -3259 3883
1471 3883 9041 9114 4110 -2777 -7180 -6390 -1427 4191 5883 2733 -3281 -7877 -7856 -2324 4372 8351
1487 8351 7429 1721 -4379 -6919 -3798 2153 7198 7291 2654 -4424 -8614 -7756 -1849 4206 6710 4350
1503 4350 -1308 -5942 -6054 -1393 4836 8511 7156 1711 -4728 -7547 -5439 -331 4692 5852 1979
1518 1979 -3781 -7550 -6428 -1164 5362 8512 6801 900 -4856 -6350 -3575 1945 5849 5398 482
1533 482 -5282 -8278 -5497 473 6005 7259 3975 -2316 -6298 -5788 -995 4964 7624 5813 224
1548 224 -5346 -7297 -4339 821 5097 5280 1364 -4013 -6564 -4995 680 6110 7775 4769 -1225
1563 -1225 -5860 -6462 -2284 3429 6364 4609 -237 -5740 -7393 -4221 1912 6569 7080 3071 -2741
1578 -2741 -6024 -5022 -792 4318 5966 3369 -2055 -5811 -5967 -1817 3561 6756 5748 347 -4875
1593 -4875 -7119 -4401 1134 5698 6491 3040 -2535 -6340 -5513 -878 4265 6421 4137 -906 -5377
1608 -5377 -5902 -2555 2698 5941 4884 424 -4340 -6227 -3914 1136 5549 6460 2952 -2297 -6251
1623 -6251 -5830 -1810 3202 5841 4540 -263 -4453 -5441 -2870 2143 5391 5068 1003 -3913 -6098 -4225
1639 -4225 553 5014 5960 2856 -2431 -5684 -5379 -1071 3803 6387 4932 235 -4425 -6071 -3995
1654 -3995 494 4080 4563 1775 -2679 -4955 -3797 790 5007 6298 3544 -1265 -5423 -5951 -2544
1669 -2544 2063 4765 3800 -435 -4510 -5978 -3150 2125 6001 6696 3465 -1513 -4430 -4293 -1203 2591
1685 2591 3652 1334 -2820 -5966 -5798 -1857 3346 6403 6089 2383 -2289 -4497 -3095 772 3955
1700 3955 4205 1092 -3692 -6707 -5624 -1613 3076 6017 4618 805 -2796 -3586 -1265 2225 4567
1715 4567 3640 -382 -4436 -6107 -4174 358 4581 5551 3215 -1035 -4292 -4025 -926 2981 5087 3654
1731 3654 -167 -4328 -5164 -2897 1356 4265 4154 1096 -2626 -4564 -3058 847 4604 5333 2482 -1802
1747 -1802 -5017 -5014 -1704 2210 4540 3666 344 -2896 -4059 -1761 1991 4360 4180 1054 -2950 -5306
1763 -5306 -4493 -1170 2703 4243 3019 -559 -3307 -3487 -797 2951 4943 3722 -150 -4085 -5496
1778 -5496 -3872 198 3424 3895 1821 -1597 -3338 -2370 739 3785 4848 2683 -1082 -4191 -4447 -2041
1794 -2041 1327 3641 3143 464 -2521 -3901 -2312 760 3676 4417 2011 -1558 -3872 -3705 -1113 2201
1810 2201 4008 2785 -303 -3245 -3800 -1764 1599 3761 3404 861 -2303 -3829 -2941 298 2914 3605
1826 3605 1884 -1351 -3509 -3324 -1078 1851 3710 2815 -3 -2749 -3498 -2240 898 3218 2929 770
1842 770 -2224 -4019 -3043 -121 2942 4117 2678 -264 -2563 -3188 -1181 1506 2737 2177 -569 -2923
1858 -2923 -3807 -1924 1121 3547 3870 1715 -1397 -3322 -3045 -615 2139 3332 1960 -626 -2825 -3292
1874 -3292 -1579 1193 3041 2769 467 -2249 -3006 -1840 782 3226 3493 1378 -1360 -2956 -2607 -614
1890 -614 1749 2923 1628 -825 -2956 -3445 -1531 1236 3204 3244 1325 -932 -2291 -1587 124 1889
1906 1889 2254 511 -1491 -3146 -2939 -760 1819 3176 2293 112 -2115 -2701 -1548 1243 2939 2867
1922 2867 884 -1703 -2837 -2569 -592 1395 2375 953 -1034 -2168 -2147 -537 1719 2873 2148 264
1938 264 -1870 -2646 -1475 530 2123 2427 690 -1890 -3035 -2637 -684 1564 2778 2208 123 -1140
1954 -1140 -1714 -631 1338 2108 1342 -361 -2235 -2676 -1585 299 2345 2489 1182 -882 -2054 -1948
1970 -1948 -245 1775 2671 1853 77 -1663 -2073 -1254 202 1666 1762 320 -1328 -1974 -1197 560 2051
1987 2051 2313 1112 -906 -2070 -1952 -187 1455 2395 1587 -253 -1725 -2460 -1574 165 1860 1870 1072
2004 1072 -776 -1484 -1257 -100 1151 1662 901 -483 -1796 -1556 -532 1148 2176 1597 236 -1640
2020 -1640 -2361 -1436 53 1469 2096 1010 -720 -1596 -1338 -236 1224 1519 884 -416 -1384 -1448 -374
2037 -374 702 1625 1274 170 -1218 -1760 -957 275 1465 1800 579 -716 -1887 -1896 -419 736 1691
2054 1691 1394 268 -634 -1194 -616 744 932 691 -142 -1343 -1630 -958 468 1449 1692 901 -481 -1212
2072 -1212 -1257 -338 978 1609 1068 -277 -1191 -1509 -1087 -60 835 1064 673 -219 -959 -343 306 1055 1148
2091 1148 536 -704 -1509 -1068 -621 740 1179 1037 214 -749 -1027 -732 242 1022 1127 479 -117 -999 -1003 -249
2111 -249 437 856 221 -334 -903 -796 -79 771 1081 1035 15 -901 -1118 -655 102 715 956 546 -205 -680
2131 -680 -801 -225 419 701 421 -244 -884 -778 -197 245 572 720 96 -405 -440 46 603 788 804 335 -231
2152 -231 -1177 -1259 -673 275 560 500 230 -195 -135 267 728 759 534 -9 -760 -863 -680 -52 201 317 -123
2173 -123 -370 -370 -16 338 806 800 599 52 -180 -311 -640 -154 54 114 -161 -445 -648 -71 480 528 757 310
2195 310 -150 -256 -382 111 199 12 24 -201 -629 -517 28 217 507 369 181 -168 49 12 435 475 51
2216 51 -78 -356 -556 -233 -90 449 147 86 -198 -463 0 303 326 175 179 -377 -340 -231 123 252 137 94
2238 94 -56 -354 -344 91 286 336 475 -189 -324 -380 -165 79 60 221 -80 -380 -453 -161 204 510 520 34
2260 34 -255 -508 -340 -82 329 417 140 -329 -419 -183 -96 412 539 387 49 -366 -604 -234 220 509 417 89
2282 89 -501 -621 -343 43 429 437 156 -342 -477 -440 -4 443 208 219 -111 -377 -329 -188 390 716 513 -197
2304 -197 -453 -805 -569 227 478 406 254 -244 -727 -384 132 685 782 288 -8 -570 -579 9 332 685 621 -360
2326 -360 -589 -688 -291 305 976 839 225 -299 -650 -748 -146 563 607 424 -295 -897 -855 -268 327 936 696
2347 696 236 -414 -1006 -365 401 714 777 416 -402 -921 -661 -139 780 742 653 -268 -763 -627 -218 500 784
2368 784 557 -51 -816 -978 -764 251 916 875 298 -698 -1154 -952 -254 789 886 601 -4 -826 -732 -573
2388 -573 425 826 620 81 -642 -1116 -509 51 772 1092 413 -516 -1150 -894 -310 751 1258 970 -155
2407 -155 -944 -1122 -718 170 1049 1056 372 -654 -1236 -570 -117 766 1030 462 -365 -1062 -707 11 895 1272
2427 1272 873 -261 -1093 -1166 -821 390 952 1061 600 -620 -1337 -789 -65 1224 994 567 -240 -1020 -928
2446 -928 -102 1052 1202 925 -30 -1224 -1531 -798 522 1456 1381 533 -693 -1387 -1135 -348 656 1232 857
2465 857 -93 -997 -1112 -404 553 1009 748 -280 -1292 -1729 -404 494 1489 1617 342 -761 -1773 -1538
2483 -1538 -284 925 1402 1194 -63 -1043 -1180 -568 406 1128 1123 369 -597 -1211 -459 465 1227 1193 553 -696
2503 -696 -1635 -1387 -100 1104 1787 1391 -80 -1240 -1457 -1019 509 1324 1381 506 -690 -1466 -1006 -28
2521 -28 1083 1348 436 -735 -1493 -1275 -31 1260 1860 1113 -274 -1559 -2043 -1332 151 1291 1471 652
2539 652 -815 -1309 -1086 75 1151 1452 725 -418 -1383 -1396 -465 522 1450 1071 -386 -1681 -1642 -708 879
2558 879 2035 2140 946 -643 -1500 -1551 -608 743 1304 754 -463 -1241 -1413 -750 793 1491 1385 370
2576 370 -1031 -1281 -537 622 1498 1485 96 -1320 -2396 -1883 -596 1160 2125 1461 339 -883 -1083
2593 -1083 -608 414 1556 874 -82 -1289 -1777 -1016 417 1539 1519 879 -893 -1734 -1544 -162 1249
2610 1249 2120 1469 -10 -1653 -1940 -1227 366 1575 1796 580 -877 -1404 -899 311 1322 1411 307
2627 307 -1026 -2019 -1437 -105 1439 2105 1530 158 -1445 -1865 -1019 598 1557 1404 432 -1309 -2238 -1680
2645 -1680 -301 932 1835 1176 -92 -942 -934 208 1785 1991 838 -648 -2164 -2794 -1452 -15 1605
2662 1605 1935 632 -603 -1233 -970 633 1547 1842 1064 -316 -1711 -1904 -932 214 1044 787 -441
2679 -441 -1408 -1418 -530 1259 2437 2457 1195 -609 -1877 -1666 -490 616 1266 680 -740 -1787 -1966 -471
2697 -471 949 1949 1769 587 -701 -1524 -848 625 1612 1625 401 -1201 -2222 -1977 -545 1140 1971
2714 1971 1215 2 -1327 -1452 -542 1089 1895 1706 515 -913 -1621 -1240 70 1017 1177 184 -931
2731 -931 -1805 -1329 83 1799 2125 1536 158 -1531 -1664 -855 732 1507 1378 171 -1180 -1950 -1596 -121
2749 -121 1144 1608 847 -267 -1258 -879 151 1517 2025 1298 -383 -1910 -2114 -1507 225 1356 1483
2766 1483 511 -865 -1207 -801 610 1392 1811 916 -870 -1899 -1852 -892 724 1500 1331 -177 -1339 -1555
2784 -1555 -502 868 2025 1793 599 -720 -1666 -1491 -105 990 1388 503 -743 -1806 -1527 -338
2800 -338 1048 2045 1674 249 -1071 -1611 -882 367 1370 1543 289 -1122 -1836 -1331 -200 1293 1777
2817 1777 1262 -365 -1357 -1349 -493 1032 1886 1205 77 -1515 -2176 -1335 350 1444 1650 494 -836 -1690
2835 -1690 -1367 -106 1491 1861 1259 -288 -1644 -1526 -640 712 1477 1105 -304 -1529 -2003 -1085 727
2852 727 1861 2332 1059 -591 -1607 -1211 -518 1056 1552 896 -383 -1781 -1809 -730 810 1660 1451
2869 1451 240 -933 -1370 -724 751 1895 1730 667 -1067 -2134 -1816 -505 1009 1765 1157 -6
2885 -6 -1341 -1294 -357 909 1871 1397 -94 -1452 -1840 -1338 210 1484 1344 433 -929 -1871 -1589 7
2903 7 1522 2014 1527 -272 -1682 -1801 -781 493 1563 1278 414 -995 -1521 -794 388 1325 1616 426
2921 426 -914 -1662 -1264 -40 1495 1876 1032 -630 -1919 -1808 -696 838 1746 1742 521 -790 -1422 -1250
2939 -1250 251 1352 1354 297 -950 -1815 -1303 48 1275 1814 1061 -494 -1716 -1509 -724 911 1852
2956 1852 1562 390 -1214 -1782 -1245 -117 1085 1472 831 -434 -1191 -1007 128 1223 1476 742 -531
2973 -531 -1351 -1596 -412 822 1747 1610 209 -1169 -2056 -1318 -232 1324 1973 1021 -55 -1057 -1333
2990 -1333 -527 718 1436 1072 -355 -1213 -1648 -485 806 1651 1288 235 -1274 -1882 -1281 115 1528
3007 1528 2078 1161 -73 -1257 -1430 -577 633 1097 926 -14 -1149 -1625 -736 561 1413 1446 520 -710
3025 -710 -1478 -1009 381 1685 1929 893 -650 -1918 -1969 -959 623 1523 1356 195 -1065 -1306 -509
3042 -509 687 1752 1707 733 -885 -1650 -1179 -270 1244 1389 457 -856 -1997 -1865 -579 1140 2435
3059 2435 1969 966 -668 -1528 -1125 91 929 881 41 -1067 -1659 -1095 -4 1273 1591 1005 -486 -1180
3077 -1180 -1363 -37 1347 2048 1504 107 -1420 -2171 -1594 -109 994 1183 697 -461 -1384 -992 213
3094 213 1423 1645 954 -479 -1384 -1574 -729 774 1570 1049 -213 -1361 -1749 -1002 415 1557 1744 912
3112 912 -491 -1630 -1493 -435 517 1296 1096 -334 -1152 -1289 -469 707 1557 1127 67 -1177 -1754 -935
3130 -935 478 1446 1723 907 -551 -1384 -1489 -599 755 1530 818 -7 -1166 -1220 -779 442 1414 1118 33
3149 33 -923 -1377 -801 403 1415 1642 623 -808 -1698 -1647 -309 797 1469 1011 15 -1174 -1457 -620
3167 -620 417 1117 1147 226 -823 -1491 -871 249 1378 1652 647 -584 -1508 -1408 -447 741 1281 1023
3185 1023 33 -1016 -1326 -646 682 1637 1341 646 -665 -1233 -979 -44 960 1074 618 -629 -1347 -1147
3203 -1147 -294 880 1670 1307 -136 -959 -1421 -756 271 1023 1102 277 -875 -1606 -1341 -335 633 1470
3221 1470 694 21 -661 -772 -25 926 1493 1108 -65 -970 -1641 -1355 -19 964 1155 490 -479 -1158 -1051
3240 -1051 107 1037 1318 906 -99 -1083 -1226 -559 526 1072 753 -13 -1266 -1335 -906 302 1161 1370
3258 1370 685 -2 -1062 -1095 -305 604 1093 765 -234 -1208 -1380 -834 481 1366 1147 325 -612 -1143 -860
3277 -860 439 1182 1327 520 -320 -1347 -970 -291 877 955 761 284 -920 -1190 -457 510 1105 1249 316
3296 316 -730 -1284 -992 16 856 1126 469 -303 -1107 -1070 -198 903 1208 601 162 -753 -1045 -799 205
3315 205 919 722 248 -854 -1170 -954 98 1021 1215 784 -155 -1070 -965 -404 734 867 756 120 -957
3334 -957 -1056 -872 222 1057 821 195 -524 -1078 -578 158 945 1013 796 -415 -1203 -933 -637 681 935 835
3354 835 35 -659 -1235 -484 409 897 1087 256 -659 -864 -783 -312 676 840 641 -324 -960 -868 39 515 1117
3375 1117 674 29 -1075 -1020 -885 228 737 877 424 -368 -753 -643 175 681 770 411 -48 -703 -869 -215
3395 -215 447 886 535 110 -539 -840 -624 214 771 766 399 -107 -758 -589 -172 581 642 647 -211 -567 -629 -206
3417 -206 393 624 679 530 -734 -777 -454 -63 704 610 460 -388 -760 -972 -102 642 737 686 -74 -610 -697 -260
3439 -260 173 662 634 161 -413 -752 -654 -67 695 717 350 -100 -804 -634 -81 693 947 789 40 -610 -661
3460 -661 -596 112 420 542 441 -323 -719 -453 66 651 771 513 -303 -678 -672 -153 358 738 715 -19 -491
3481 -491 -798 -462 19 557 501 249 -183 -484 -507 139 589 776 467 -177 -454 -720 -177 241 676 419 8
3502 8 -560 -740 -402 129 669 557 276 -360 -450 -634 151 527 507 370 -138 -528 -578 -374 115 809 379 -10
3524 -10 -455 -518 -251 88 548 709 411 -118 -525 -508 -189 163 537 361 -279 -603 -243 -182 387 555 536 152
3546 152 -391 -234 -246 164 483 383 204 -254 -304 -779 -139 214 598 290 32 -356 -333 17 222 386 210
3567 210 67 -279 -474 -355 54 386 509 1 -22 -444 -413 -119 457 544 434 145 -253 -337 -289 131 342 238
3589 238 -11 -142 -667 -218 137 304 325 172 -192 -151 -210 -125 277 478 98 -263 -333 -494 -232 -66 315 363
3611 363 -8 -236 -282 -213 21 359 343 238 -279 -457 -532 -59 222 231 113 -222 -246 -314 -121 158 558 410 339
3634 339 -288 -444 -250 -55 181 266 213 14 -337 -286 -184 80 146 243 150 -265 -417 93 54 490 435 153 15
3657 15 -365 -459 -154 110 192 142 27 -283 -331 90 250 181 170 68 -49 -446 -376 -78 131 362 0 -274 -144
3680 -144 -285 -214 173 441 309 -158 -255 -410 -117 219 500 372 109 -177 -193 -175 -126 173 250 139 -227 -358
3702 -358 -190 -224 54 374 230 -158 -253 -443 1 121 218 160 15 -22 -287 -191 -48 -44 185 77 29 -127 -433
3725 -433 135 269 425 133 -41 -194 -262 -219 -88 350 -26 -30 -52 -198 -259 55 227 275 104 102 -138 -289 59
3748 59 158 135 151 120 -62 -115 -117 -239 42 334 -97 56 -245 -437 151 33 206 266 -164 -59 -17 -90 18 176
3772 176 205 -115 -102 -398 92 46 237 178 22 -242 -83 -224 67 191 225 123 31 -313 -242 -62 23 59 44
3795 44 19 -160 -286 -240 -105 93 243 -10 61 -42 -118 -50 124 123 134 -118 -149 -311 22 60 -57 76 97 -282
3819 -282 69 -67 260 46 196 -75 -143 -8 -242 -180 -93 137 -58 115 -113 13 3 -90 29 177 33 -113
3841 -113 13 49 -72 -166 46 186 -43 -149 -81 -77 -42 -8 120 94 74 -146 -187 40 -16 96 83 -19 159 -193
3865 -193 -250 36 248 60 -6 -142 -300 -161 23 230 173 -207 14 -179 -40 -14 71 382 82 -115 37 -151
3887 -151 -56 -76 33 34 28 -46 -29 -28 -56 113 51 0 67 -168 -303 66 163 -43 42 109 24 -269 15 -64 -65 105 -78
3914 -78 -128 -10 105 -127 94 -67 -7 177 118 -49 -61 -49 221 202 -49 -202 -53 -53 50 25 45 0 37 -99
3938 -99 46 31 -76 233 23 182 72 -241 -73 156 73 34 -205 9 -217 -202 23 -3 132 164 -129 -20
3960 -20 -63 344 181 32 149 -254 144 -12 12 98 -37 -59 13 -38 -197 197 102 25 310 -252 121 -228 -159
3983 -159 -242 -23 -23 50 36 70 20 61 36 -104 230 3 113 -8 -340 88 -32 -93 -75 62 16 28 93 -188 242
4008 242 -55 193 -56 -38 -26 19 76 37 236 -63 25 -45 -86 -63 -76 14 118 -69 120 55 -29 255 78 -39
4032 -39 85 43 169 124 181 198 290 -481 -96 158 -172 145 126 191 -121 -123 -189 -67 274 31 -93 -69 -255 140
4056 140 76 -12 224 76 26 -92 -120 -176 61 143 93 71 18 -222 47 43 54 8 115 -82 -181 -222 -132 84 97 190
4082 190 -170 -44 -129 -10 146 170 67 19 10 -66 -19 162 113 -4 -75 24 66 -81 126 -26 116 155 106 -180
4106 -180 -17 187 5 226 -233 73 -93 -82 -132 85 144 137 -134 -201 64 -172 125 10 155 25 1 99 5
4129 5 -65 -60 268 -64 -205 -132 38 -118 52 205 84 86 4 1 -168 136 153 159 -65 -26 -320 -166 81 -75 204
4154 204 -31 -25 -53 -107 -128 -3 104 161 -24 -190 -222 -24 129 102 225 89 -35 -177 -60 50 -29 254 88
4177 88 -330 -271 -58 -89 73 7 123 24 -101 -66 -86 17 113 245 18 -112 234 -84 -87 155 209 177 155 -56
4201 -56 -147 -218 56 72 -50 -20 -53 -38 -93 175 103 470 177 169 -47 -317 -65 42 275 84 -68 -156 -247 78
4225 78 103 230 48 36 23 8 -44 -96 130 44 336 -183 -115 -484 -57 41 380 87 160 -107 -323 -157 26 52
4249 52 145 127 -95 -161 -192 57 -19 178 229 48 -162 -134 12 -60 113 14 273 -182 -437 -198 38 307 349 235
4273 235 10 -223 -316 -80 100 322 169 -8 61 -256 -35 175 241 227 163 -27 -127 -152 4 200 306 -33
4295 -33 -36 -256 -231 -9 164 471 199 171 -195 -527 -145 -44 71 282 149 -284 -146 -191 137 299 280 304 -24
4318 -24 -301 -543 -86 2 282 356 4 -329 -126 -207 -96 361 384 34 -185 -245 -75 26 249 248 26 224 -238
4341 -238 -250 -94 33 9 87 233 -247 -465 -21 209 332 240 225 -174 -641 -296 -95 292 25 61 -115 -437
4363 -437 -353 -225 308 260 357 67 -450 -151 -338 -47 47 308 84 -23 -204 -566 131 98 359 259 192 -166
4385 -166 -476 -190 186 170 387 -69 -63 -623 -375 121 230 428 303 51 -247 -457 -36 161 394 545 -14
4406 -14 86 -520 -125 188 355 436 229 -57 -115 -262 -201 428 226 109 161 -265 -175 -202 279 346 186 124 -296
4429 -296 -514 -254 -214 296 257 118 -158 -364 -344 -122 56 375 419 121 -368 -298 -103 62 278 190 157 34
4451 34 -336 -309 -127 340 309 1 -267 -422 -168 57 112 355 437 -204 -378 -382 -135 38 238 422 159 -95
4473 -95 -242 -182 -187 47 469 160 -91 -234 -357 -126 197 251 540 14 -492 -522 -242 35 404 345 207 78
4495 78 -408 -457 -67 427 527 295 -270 -338 -365 -197 -9 138 311 134 -339 -581 -158 276 290 378 472 -265
4517 -265 -214 -402 -2 302 352 448 2 -108 -404 -232 132 500 356 54 -299 -484 -142 -50 308 222 111 -222
4539 -222 -464 -362 -213 370 280 298 -116 -212 -425 -17 273 461 376 107 -299 -277 -259 98 426 520 88 -85
4561 -85 -266 -519 -243 206 137 330 -24 -198 -471 -192 180 270 499 196 -162 -448 -160 -33 26 392 251
4582 251 -62 -357 -411 -176 135 454 459 264 -257 -589 -465 113 177 253 140 -29 -525 -228 -128 167 355 233
4604 233 22 -292 -603 -143 190 376 195 -39 -110 -307 -116 -77 443 528 121 -40 -485 -476 -296 33 549 434
4626 434 35 -268 -380 -174 31 340 538 36 -183 -432 -136 -16 159 373 420 -155 -328 -451 -368 276 549
4647 549 339 210 -304 -457 -337 191 498 510 321 -9 -345 -497 -208 526 174 256 -175 -501 -341 -99 -15
4668 -15 539 473 96 -249 -547 -407 -115 150 352 57 62 -348 -521 -79 265 704 234 -88 -399 -662 -124
4689 -124 49 543 502 -19 -387 -439 -278 -149 424 539 541 90 -360 -637 -310 272 464 249 -35 -462 -369 -200
4711 -200 138 216 552 302 -308 -333 -327 3 325 541 249 -61 -551 -369 -234 153 310 375 73 -99 -394 -275
4733 -275 -149 207 353 172 -289 -485 -584 164 310 369 256 38 -428 -308 -216 240 183 323 179 -322 -450
4754 -450 -397 190 367 603 191 -327 -391 -262 32 346 312 178 -31 -411 -420 -228 24 430 523 165 -174 -219
4776 -219 -532 19 325 342 219 25 -366 -564 -39 254 589 469 64 -495 -261 -198 7 340 483 372 -299
4797 -299 -360 -372 -114 99 506 557 -75 -380 -456 -218 201 420 333 66 -278 -492 -132 70 454 674 232 -52
4819 -52 -471 -416 -173 501 561 136 1 -404 -645 -187 315 576 540 101 -371 -662 -473 214 402 400 287 -207
4841 -207 -435 -485 37 298 513 317 -146 -336 -675 -137 240 455 355 -67 -446 -344 -403 71 533 367 220
4862 220 -7 -578 -413 -181 287 407 149 -180 -376 -603 -151 65 448 360 309 -266 -677 -355 58 623 585
4883 585 189 -193 -377 -640 -93 244 696 459 51 -303 -669 -345 210 503 614 229 -187 -540 -415 -85
4903 -85 466 584 262 -2 -676 -536 -97 115 594 486 165 -249 -529 -410 101 380 613 277 -68 -352
4923 -352 -415 -240 348 606 162 205 -282 -386 -131 134 328 372 -164 -104 -625 -326 111 423 734 492 -221
4944 -221 -537 -655 -211 187 490 296 -142 -636 -599 -192 278 460 379 182 -385 -599 -300 166 501 481 185
4965 185 -157 -338 -469 -365 120 573 658 98 -358 -609 -174 237 485 519 300 -459 -514 -331 -109 319 715
4986 715 248 -251 -576 -580 -112 317 615 520 285 -164 -469 -423 -28 402 417 179 -266 -635 -334 -96 321 521
5008 521 316 54 -546 -469 -385 54 547 336 -21 -249 -692 -328 37 476 729 285 7 -523 -328 -79 201
5029 201 293 280 107 -301 -691 -331 276 510 440 108 -392 -531 -401 42 299 669 314 -414 -529 -480 -371
5050 -371 117 638 260 111 -181 -742 -331 118 450 566 113 -453 -527 -515 -6 398 583 397 -144 -598 -648
5071 -648 -122 259 434 723 166 -432 -479 -580 49 306 585 353 -280 -539 -352 192 426 556 201 -116
5091 -116 -532 -674 -187 324 407 496 54 -427 -614 -445 131 569 806 66 -145 -715 -627 -46 222 698 361
5112 361 -222 -445 -657 -312 81 624 327 96 -226 -778 -315 105 463 603 313 -264 -647 -507 -165 629
5132 629 495 424 -76 -519 -650 -260 67 351 672 74 -500 -620 -363 73 278 394 509 -159 -497 -571 -76
5153 -76 253 559 435 -28 -345 -616 -311 -10 448 602 193 -173 -561 -415 120 357 522 134 -34 -460
5173 -460 -609 -448 247 581 465 88 -360 -538 -287 94 453 614 397 -304 -743 -502 -100 267 490 314
5193 314 -48 -580 -542 -147 253 524 498 85 -233 -679 -239 -56 536 595 212 -241 -504 -461 -72 516 559 555
5215 555 -72 -556 -429 -350 202 575 638 157 -402 -792 -476 -55 455 607 155 -167 -572 -473 6 305 483
5236 483 574 -87 -563 -558 -278 243 614 208 254 -396 -465 -492 77 504 612 497 -255 -630 -796 -251 320 707
5258 707 500 -61 -338 -672 -414 205 640 475 341 -148 -531 -512 50 511 473 256 -192 -583 -457 -220 38
5279 38 413 430 -52 -381 -628 -237 118 552 652 359 -201 -694 -451 -142 512 542 533 124 -477 -455 -22 70
5301 70 587 365 20 -466 -663 -362 189 436 533 344 -91 -445 -297 -75 337 472 463 -14 -500 -468 -174 199
5323 199 495 428 -102 -359 -495 -452 121 547 601 547 -124 -424 -450 -264 250 514 363 -131 -579 -571 -132 -33 653
5346 653 785 83 -322 -636 -429 -54 575 583 336 -166 -371 -483 -22 436 553 486 58 -263 -574 -203 247
5367 247 522 526 73 -260 -526 -221 -47 264 756 101 26 -371 -379 -132 252 467 338 -199 -304 -605 -405 379
5389 379 418 573 367 -298 -440 -709 -180 256 572 356 -99 -655 -677 -257 15 427 503 76 -271 -365 -177
5410 -177 -42 557 635 108 -404 -508 -623 -163 462 471 317 -122 -522 -473 95 238 336 566 115 -316 -570 -255
5432 -255 18 398 638 100 -250 -450 -516 -419 444 406 552 76 -436 -321 -326 164 435 666 191 -191 -640 -244
5454 -244 -61 282 325 492 -74 -516 -376 -262 452 599 348 55 -411 -597 -279 57 370 599 109 -239
5474 -239 -524 -495 181 434 473 168 64 -548 -418 -25 285 362 503 -47 -392 -483 -328 178 552 531 172 -107
5496 -107 -538 -620 -48 515 632 251 25 -568 -469 -341 258 362 308 40 -316 -421 -315 -83 444 535 362
5517 362 -157 -665 -510 -130 309 605 466 -87 -299 -638 -251 125 461 524 5 -550 -559 -315 39 329 655
5538 655 248 -214 -296 -402 -43 335 526 407 95 -477 -745 -336 1 333 357 230 -206 -405 -328 -27 391
5559 391 490 378 -265 -338 -527 -196 189 492 380 132 -357 -616 -43 126 398 269 46 -236 -578 -318 0
5580 0 442 330 166 68 -382 -384 -128 319 547 253 140 -457 -450 -271 -77 531 620 212 -103 -427 -219 -42 371
5603 371 603 395 -146 -423 -435 -310 191 439 230 -13 -261 -440 -180 38 338 422 426 -44 -444 -191 -147 245
5625 245 307 409 -107 -305 -226 -287 22 362 316 -82 -224 -539 -404 17 352 340 134 -13 -315 -345 -255 343
5647 343 378 304 136 -350 -318 -409 73 111 380 193 -189 -425 -274 24 245 240 207 47 -410 -471 -62 435 545
5670 545 207 -204 -350 -479 -232 284 251 213 195 -100 -408 -315 -32 384 283 167 205 -272 -110 -358 29 636
5692 636 272 -99 -285 -312 -262 39 292 422 34 -220 -342 -61 28 327 430 262 -66 -482 -310 -51 166
5713 166 294 284 -46 -246 -429 -346 -104 338 303 238 -285 -297 -334 -49 370 486 118 5 -416 -395 -327 297 194
5736 194 332 -35 -268 -354 -334 58 333 387 245 -75 -283 -254 -31 267 284 243 21 -305 -174 -64 401 378
5758 378 288 -12 -61 -283 -257 149 256 500 185 -64 -171 -312 -11 107 303 146 -41 -501 -565 -23 -18 297
5780 297 173 283 -356 -272 -200 74 370 343 284 -244 -327 -380 -83 70 264 213 95 -150 -300 -36 -32 106 11
5803 11 216 -105 -207 -221 -119 395 365 352 37 -158 -288 -60 178 256 383 18 -286 -266 -347 -58 409 424 249
5826 249 -207 -183 -369 -220 152 382 352 -22 -180 -493 -112 -4 259 237 191 -180 -256 -115 -14 170 557 156
5848 156 66 -322 26 -90 143 141 387 68 -296 -430 -257 103 275 211 107 100 -246 -104 95 225 275 245 9
5871 9 -402 -474 -132 117 319 151 142 -162 -160 -58 -29 376 198 270 23 -253 -171 -40 205 256 291 -99 -93 -268 -36
5896 -36 59 119 307 186 -89 -263 -135 -31 294 258 270 -115 -242 -343 97 149 280 298 75 16 -292 -134 -2
5919 -2 285 261 196 -180 -227 -154 33 162 169 195 130 -274 -298 -160 80 207 158 62 101 -396 -81 -182 255 104 99
5944 99 -66 -356 22 -103 113 184 200 261 -134 -202 -68 60 102 218 58 -219 -51 -324 54 200 297 265 9
5967 9 -129 -201 55 -41 65 110 21 -268 -369 -48 6 130 72 320 -67 -236 -18 9 129 168 98 127 -98 -98 -188
5992 -188 154 140 207 206 -146 -85 -94 -53 53 253 331 68 -36 -152 -91 258 154 110 77 22 -263 -246 36 240 266
6017 266 -138 -112 -197 -183 -173 -75 382 195 -98 -146 -224 -141 -26 83 127 -23 -70 -247 -86 -34 97 316 -100 134
6041 134 -94 -232 -160 141 212 34 5 -211 -238 -199 -55 210 -58 -41 -163 -180 -259 -17 277 365 -34 -107 -234
6064 -234 -167 144 223 176 103 167 -162 -322 -53 -238 -25 265 19 28 -263 -206 126 -10 -8 430 242 -266 -240 -21
6088 -21 167 143 0 55 -38 -54 -287 -182 198 144 84 -104 -98 -174 170 92 228 171 13 -16 -28 -94 119 176 99 15
6114 15 99 -123 -53 25 -50 219 92 8 33 91 -114 47 159 333 74 142 -131 -116 -124 165 131 72 18 67 95 40
6140 40 106 117 99 4 -26 7 -59 60 348 281 10 -62 -236 2 -84 -52 63 -89 -104 -344 -301 -89 5 116 14
6165 14 -15 -99 -149 -222 78 200 305 280 -215 -292 -350 -41 174 162 -57 -98 -15 -126 -120 54 132 136 -19 -129 -138 -63
6191 -63 55 59 24 -7 299 -43 -68 5 -81 17 169 -136 -156 -100 -75 -239 117 206 60 1 -365 -74 115 174 167 -48
6217 -48 87 -157 -163 40 96 45 6 -63 -169 -70 -127 45 80 54 194 -218 -183 -41 -127 153 -3 -88 237 188 19
6242 19 -138 -117 194 197 108 -165 -162 -290 7 65 192 -18 -56 -228 -451 -122 -78 -74 235 -205 -58 -118 -264 -49
6266 -49 82 241 9 -227 37 -182 -205 60 179 27 111 20 -190 -38 39 15 148 -257 -27 102 -156 -27
6288 -27 64 147 94 -12 -190 67 45 10 -43 226 -48 -39 12 -147 96 164 87 190 -31 -185 129 -53 -22 -2 71
6313 71 -196 -23 -124 -4 40 110 88 -9 -8 -258 -181 -59 117 128 248 62 187 -238 -150 86 40 -56 97 104 -187
6338 -187 66 17 18 271 -49 -67 -138 -229 -78 195 -78 37 214 -169 -131 -74 -21 325 245 59 -150 -276 -67
6361 -67 39 104 103 -23 -192 -174 -117 -222 249 130 170 35 28 -201 -284 10 164 85 120 -29 -57 -182 103 106 -173
6386 -173 -83 19 -146 -114 -1 145 39 359 -96 97 -114 60 74 140 169 25 -208 22 14 -31 196 27 227
6409 227 -124 -90 -94 -41 -87 -77 140 229 63 -490 21 70 -125 -43 176 -80 32 -118 39 -65 123 93 -81
6432 -81 -156 -9 -97 -256 146 54 42 41 199 -37 -111 -66 267 132 124 64 -24 20 92 164 136 157 -99 -205 -315 -3
6458 -3 39 -55 -51 -186 37 28 72 -158 233 40 87 84 -8 46 -120 64 62 11 34 -64 -96 47 -44 279 128 17 -293
6485 -293 -117 -161 -157 34 46 54 71 -189 -19 158 158 173 -15 -162 -110 -45 -219 151 281 5 -158 -195 -48 -199
6509 -199 -108 13 50 300 -121 -159 -83 125 152 146 178 -148 -178 -107 -290 -27 -14 121 20 76 -155 -107 -245 -23
6533 -23 141 43 -69 -110 -110 42 113 -1 -29 56 -20 -213 -15 45 -195 45 -125 -261 -214 -106 -40 84 104 -17
6557 -17 -14 -96 -290 -17 43 234 173 37 -111 -146 -182 -166 182 91 198 -244 -311 -135 63 165 192 119 -40 -94 -47
6582 -47 -101 -121 52 15 -1 -175 -192 -100 145 67 219 74 -157 -181 18 -172 126 136 -31 49 -126 -224 55 262
6606 262 187 86 84 45 -277 12 -25 156 139 -161 144 -93 -66 30 -70 84 143 107 -77 -22 -53 118 -32 120
6630 120 33 -114 -263 -57 5 44 207 146 54 -31 -135 45 168 129 288 154 -15 -65 31 -66 -18 2 239 -159
6654 -159 -415 -168 86 -79 50 15 -25 -86 -349 222 52 66 126 -117 -22 -180 -175 -172 -47 261 140 -40 -207
6677 -207 -130 -22 18 136 -72 -25 84 -28 -86 117 107 104 113 104 -193 169 -44 211 196 209 144 -43 -102 114 140
6702 140 174 84 2 96 -137 -91 43 114 -58 166 -39 -188 79 -111 -100 -106 142 -48 -51 -270 -34 -66 -19 245
6726 245 -104 -151 -30 -24 1 262 213 222 -335 -266 21 -13 83 333 71 -18 7 -158 -71 23 -107 268 54 37 -78
6751 -78 13 -31 69 39 -68 60 -148 -162 -41 -92 117 4 160 197 -174 109 -185 -70 18 65 -21 150 -49
6774 -49 62 198 294 86 86 -60 -287 118 62 68 3 15 -3 -166 -170 -249 -22 -29 -22 -98 -32 107 103 147 76 393 93 -83
6802 -83 -206 -9 38 185 157 -81 -174 -70 -125 -152 -52 173 -36 86 -34 29 210 97 199 147 0 104 -134
6825 -134 70 185 37 2 -78 49 -54 -135 17 31 275 -29 -50 37 -157 24 -56 61 35 -96 -273 -207 -109
6848 -109 128 154 250 107 -30 -140 -231 -76 144 235 144 -105 -73 -242 -48 -10 91 214 106 -101 -5 30 -38
6871 -38 205 18 -46 -106 -72 -138 51 110 167 51 -150 -151 -389 -52 125 -202 157 95 -203 -331 30 116 -105 261
6895 261 5 -178 30 12 -128 241 110 180 -83 0 40 -122 -207 -38 -23 13 27 -98 -176 -87 -3 310 136 48
6919 48 32 -264 -49 135 177 -91 40 -200 -181 -55 -63 237 160 -154 63 -157 -192 -80 -8 183 129 -92 -10 -39
6943 -39 -86 112 63 175 -70 -291 -38 -47 -60 -149 192 27 -38 -33 -26 -91 59 148 30 135 98 -123 -68 -128 -8 287
6969 287 -219 -64 -216 -283 -93 29 115 63 27 69 -55 13 72 17 -36 89 -124 -159 23 -186 7 199 354
6992 354 147 -37 -57 91 289 -20 13 -29 -112 -414 -140 69 157 76 170 -179 -102 -254 -153 59 31 66 -104
7015 -104 -283 -16 -83 19 77 -85 112 -170 -258 -30 18 -25 0 -167 -6 -113 63 -165 241 249 171 -137 44
7038 44 80 127 96 -6 103 -38 -60 7 15 8 95 121 101 21 -160 -32 39 149 124 39 62 -282 -96 -167 292 -93
7064 -93 -129 20 -65 -250 27 243 188 48 -81 -9 -56 -128 -88 10 19 -58 14 -184 -141 84 -60 189 266 257 -133 -248
7090 -248 -132 -17 51 -92 90 -3 -15 -97 111 72 100 -128 -13 9 -51 -34 -215 174 36 30 -118 -166 25 -160
7114 -160 147 101 -80 27 -311 -211 6 173 181 -55 -61 132 29 -22 120 166 162 101 -32 -126 46 -225 184 254
7138 254 120 232 1 -168 115 -108 -58 229 -93 -129 -7 80 -18 -2 166 -141 -20 178 -115 42 37 214
7160 214 -51 13 -164 -22 -200 7 -2 -40 42 -94 114 -124 11 172 -22 -24 89 -262 -113 30 112 84 -38
7183 -38 -140 -50 125 -4 -30 -47 -32 -65 66 -105 -126 51 127 169 -46 -88 -104 -149 1 110 194 274 -47 -141 -128
7208 -128 -120 -7 157 45 96 84 -67 -44 119 -131 56 78 0 83 -67 -50 -169 145 88 -164 35 -31 -93 219
7232 219 226 53 104 149 -162 -181 -114 7 120 51 -62 -153 -91 -101 51 131 155 -89 198 -136 21 9 72 172 35
7257 35 -84 71 -68 -377 -67 157 159 -194 203 -86 -13 -146 97 -33 77 -118 -219 17 -250 -34 52 112
7279 112 94 69 -18 48 90 321 8 187 -13 -63 -169 104 -2 45 0 64 -27 -218 -200 120 182 155 45 -201
7303 -201 -91 62 -62 -86 -84 -174 -136 -218 -38 -28 174 -35 232 -157 -218 15 112 -8 156 117 68 -49 -229 -8
7327 -8 161 69 329 72 -118 181 -124 14 122 83 63 -35 -16 -186 37 23 59 -275 44 21 -50 -8 -2 -1 95 -68
7353 -68 40 -34 -148 231 -144 45 8 -97 -22 -93 41 150 59 -35 84 -11 61 -38 -143 -58 82 -111 -139 -60
7377 -60 -42 -170 49 120 67 45 -46 40 48 224 -106 -97 77 25 -36 -34 103 135 376 133 -56 -17 154 -15 161 -38
7403 -38 49 47 23 55 74 96 91 -95 -130 -126 -53 -16 -100 -33 -73 -98 -55 64 -212 -61 -7 -41 -29 -38 95 12 97 -109 92
7432 92 -49 -155 -61 -190 104 -261 -128 53 -112 218 57 -196 -101 -44 -16 32 -138 -33 -67 -105 145 21 13
7455 13 170 -107 107 -127 -101 25 128 267 -71 40 200 -85 -50 -28 29 48 -92 -39 21 -249 -150 63 -8
7478 -8 -271 -175 -54 -124 122 -168 219 -31 1 -97 -65 70 41 -58 -54 44 -52 168 80 -6 15 -19 98 -27 -208 -41
7504 -41 -133 -136 -73 52 71 110 111 -107 99 151 95 124 50 178 -67 115 63 88 100 -34 -8 -229 116 -72 -98 -22
7530 -22 193 -121 -171 53 105 -59 101 -170 2 -230 134 -14 92 94 147 -152 -65 70 -221 48 1 64 53
7553 53 -58 166 -50 -14 64 30 -44 -182 194 -297 61 -103 50 91 -28 -47 -17 -115 16 107 4 -131 -13
7576 -13 -339 171 -42 -48 133 -113 -3 -290 -83 90 -247 -147 -26 -102 -147 -206 -220 103 16 -70 -41 -68 4 -55
7600 -55 164 -35 227 184 -27 -75 30 119 -93 -111 18 -91 71 115 -33 160 -19 130 40 -48 -129 -31 35 -203
7624 -203 60 66 163 -81 -48 -59 -78 157 322 -75 -103 -275 -35 -69 -171 -133 65 -63 -137 -199 14 -118 -3 346
7648 346 76 16 -130 118 -34 120 103 26 -63 -313 -3 80 -71 290 -8 -193 -135 -62 -40 70 191 -10 75
7671 75 -17 -156 -148 -197 131 166 -31 -143 71 -2 -3 13 233 217 36 -175 -70 95 36 252 126 -22 -40 92
7695 92 -30 -258 58 -105 40 -25 -80 -1 -113 93 105 134 113 -66 -76 16 -35 142 122 127 1 -189 8 178
7719 178 99 245 27 -46 -9 -256 152 -5 103 227 -173 160 13 -144 53 -30 35 -12 -70 -140 61 99 54
7742 54 27 -152 129 16 -67 65 -30 131 54 168 -146 -168 -55 13 85 181 62 -182 -129 -322 100 -16 131
7765 131 71 34 -98 26 -125 -57 -26 -273 -189 -211 -26 -204 -3 36 45 184 -46 -271 -133 8 -27 98 180 -47
7789 -47 -37 -54 -46 178 136 6 -15 24 -90 -206 -217 118 48 107 -169 115 -185 83 -85 43 52 38 -20 -26 6 37
7815 37 255 160 121 -54 -228 63 51 59 127 114 -79 27 -139 -162 -127 -24 328 7 -73 -84 -226 -152 186 189 -44
7840 -44 -147 -49 -210 126 -55 27 -135 -27 -231 -75 -86 5 120 -83 -69 -249 -166 -225 87 33 188 93 -167
7863 -167 -61 -179 -59 -49 -82 72 -132 -164 -179 7 -45 83 17 -89 -235 46 -119 -20 9 223 36 -110 -256
7886 -256 -208 -25 25 -22 140 16 -138 140 38 50 187 128 -20 -14 -194 -85 -40 56 239 187 87 -108 -157 -152
7910 -152 -181 269 -51 -236 3 -202 18 -16 -83 256 110 -53 -228 -51 -46 -62 84 78 15 -24 -60 -70 -180 -80
7934 -80 154 122 -31 -77 -43 6 -13 191 82 110 -247 -101 66 197 66 40 -71 7 -78 -89 -84 74 234 281 -17
7959 -17 -125 -9 -154 77 247 -39 -4 -120 -151 -220 55 27 -60 -100 -146 10 42 -37 127 266 2 -233 -186 -165
7983 -165 78 -57 283 6 -281 83 -163 -46 242 -69 220 9 -164 -72 -205 -79 -60 -24 -46 -11 -111 59
8005 59 120 199 148 -23 -210 -129 -91 -239 6 -43 329 89 -130 82 -81 -33 193 11 -38 32 -213 52 -74
8028 -74 34 109 60 -112 -82 -287 -50 -67 212 207 -146 56 -42 39 8 -27 200 -52 -178 -148 -338 -48 -28 334
8052 334 -73 -12 -75 -205 -53 -130 3 -124 1 -324 -394 24 102 177 199 -105 -30 -208 -309 -34 -27 214 117 28
8076 28 -92 -66 -50 -40 170 -3 80 -2 -59 -182 71 26 143 55 -164 -54 -10 -27 9 257 204 30 -73 -288
8100 -288 -12 -75 14 48 12 -182 -211 -38 34 152 16 86 -175 -92 -124 1 69 107 26 125 -136 -83 -101 62 176
8125 176 172 129 -56 -113 -2 -206 188 -19 -63 2 -166 -219 -87 92 269 146 14 7 -295 67 10 -20 -41 16
8149 16 15 -211 -146 -87 159 107 -47 -56 -109 43 31 183 112 302 104 -76 -319 -65 -8 -57 52 91 58 -196 -59
8174 -59 -35 207 72 134 89 -106 -71 -92 71 61 139 -161 -5 53 -78 12 59
8191E9
##END NTUPLES=NMR FID
##END=
