##TITLE=1H_TG-2406
 200.13Hz, CDCl3.
 8 sc
 
 29.4.2026
##JCAMPDX= 6.0         $$ Bruker NMR JCAMP-DX V2.0
##DATA TYPE= NMR SPECTRUM
##DATA CLASS= NTUPLES
##ORIGIN= UXNMR, Bruker Analytische Messtechnik GmbH
##OWNER= pz
$$ XWIN-NMR		Version 3.5
$$ Wed Apr 29 14:06:22 2026 Russian Standard Time (UT+4h)  she@DPX200
##.OBSERVE FREQUENCY= 200.1313
##.OBSERVE NUCLEUS= ^1H
##.ACQUISITION MODE= SIMULTANEOUS
##.ACQUISITION SCHEME= undefined
##.AVERAGES= 8
##.DIGITISER RES= 18
##SPECTROMETER/DATA SYSTEM= spect
##.PULSE SEQUENCE= zg30
##.SOLVENT NAME= CDCl3
##.SHIFT REFERENCE= (INTERNAL, CDCl3, 0, 15.4791)
##AUDIT TRAIL= $$ (NUMBER, WHEN, WHO, WHERE, WHAT)
$$ ##TITLE= Audit trail, XWIN-NMR		Version 3.5
$$ ##JCAMPDX= 5.01
$$ ##ORIGIN= Bruker BioSpin GmbH
$$ ##OWNER= she
$$ F:/spectra/data/she/nmr/H-C/1/pdata/1/auditp.txt
$$ ##AUDIT TRAIL=  $$ (NUMBER, WHEN, WHO, WHERE, WHAT)
(   1,<2026-04-29 14:04:55.31 +0400>,<she>,<DPX200>,
      <created by zg, POWCHK disabled, PULCHK disabled
       configuration hash MD5:
       00 E9 B6 7A A2 85 ED C7 34 08 36 98 17 FE 4E 26
       data hash MD5: 16K
       E0 94 3A 07 E8 E1 8A B9 60 A6 4D 19 47 11 16 64>)
(   2,<2026-04-29 14:05:00.18 +0400>,<she>,<DPX200>,
      <Start of raw data processing
       efp BC_mod = 2 LB = 0.25 FT_mod = 6 PKNL = 1 PHC0 = -4059.637 PHC1 = 10.19229 SI = 16K 
       data hash MD5: 16K
       C5 3A 30 C4 CB 69 45 90 FA 1D B1 C9 E6 B6 20 37>)
(   3,<2026-04-29 14:05:21.42 +0400>,<she>,<DPX200>,
      <pk PHC0 = 0.8415072 PHC1 = -0.8 
       data hash MD5: 16K
       B7 B8 AA DD D7 41 3F AD 0B E6 8D 5C B0 0B 18 6E>)
(   4,<2026-04-29 14:05:25.37 +0400>,<she>,<DPX200>,
      <abs ABSG = 5 
       data hash MD5: 16K
       0B DE 1B B2 AE 8E B8 DC C6 50 CE EF 54 53 33 00>)
(   5,<2026-04-29 14:05:53.75 +0400>,<she>,<DPX200>,
      <abs ABSG = 5 
       data hash MD5: 16K
       17 40 17 CF 2A 99 90 88 14 96 A3 3A B6 E0 A5 54>)
$$ ##END=
$$ 
$$ hash MD5
$$ 2A 73 AC 74 82 69 51 67 1D D0 69 62 4E 37 0A 98
##$RELAX= 
##$RELAX= 
##$RELAX= 
##$RELAX= 
##$RELAX= 
##$RELAX= 
$$ Bruker specific parameters
$$ --------------------------
##$DU= <F:/spectra>
##$EXPNO= 1
##$NAME= <H-C>
##$PROCNO= 1
##$TYPE= <nmr>
##$USER= <she>
##$AMP= (0..31)
100 100 100 100 100 100 100 100 100 100 100 100 100 100 100 100 100 100 
100 100 100 100 100 100 100 100 100 100 100 100 100 100 
##$AQSEQ= 0
##$AQ_mod= 1
##$AUNM= <au_zg>
##$AUTOPOS= <>
##$BF1= 200.13
##$BF2= 200.13
##$BF3= 200.13
##$BF4= 200.13
##$BF5= 200.13
##$BF6= 200.13
##$BF7= 200.13
##$BF8= 200.13
##$BYTORDA= 1
##$CFDGTYP= 0
##$CFRGTYP= 5
##$CHEMSTR= <none>
##$CNST= (0..31)
1 1 145 1 1 1 1 1 1 1 1 1 1 1 1 1 1 1 1 1 1 1 1 1 1 1 1 1 1 1 1 1 
##$CPDPRG= <>
##$CPDPRG1= <>
##$CPDPRG2= <>
##$CPDPRG3= <>
##$CPDPRG4= <mlev>
##$CPDPRG5= <mlev>
##$CPDPRG6= <mlev>
##$CPDPRG7= <mlev>
##$CPDPRG8= <mlev>
##$CPDPRGB= <>
##$CPDPRGT= <>
##$D= (0..31)
0 0.7 0 0 0 0 0 0 0 0 0 0.03 0 0 0 0 0 0 0 0 0 0 0 0 0 0 0 0 0 0 0 0 
##$DATE= 1777457094
##$DBL= (0..7)
$$ [...]
##$SUBNAM3= <"">
##$SUBNAM4= <"">
##$SUBNAM5= <"">
##$SUBNAM6= <"">
##$SUBNAM7= <"">
##$SUBNAM8= <"">
##$SUBNAM9= <"">
##$SW= 18.0517328524113
##$SWIBOX= (0..15)
0 0 2 0 0 0 0 0 0 0 0 0 0 0 0 0 
##$SW_h= 3612.71676300578
##$TD= 16384
##$TD0= 1
##$TE= 0
##$TE2= 300
##$TE3= 300
##$TEG= 300
##$TL= (0..7)
0 120 120 120 120 120 120 120 
##$TP= (0..7)
150 150 150 150 150 150 150 150 
##$TP07= 0
##$TPNAME0= <>
##$TPNAME1= <>
##$TPNAME2= <>
##$TPNAME3= <>
##$TPNAME4= <>
##$TPNAME5= <>
##$TPNAME6= <>
##$TPNAME7= <>
##$TPOAL= (0..7)
0.5 0.5 0.5 0.5 0.5 0.5 0.5 0.5 
##$TPOFFS= (0..7)
0 0 0 0 0 0 0 0 
##$TUNHIN= 0
##$TUNHOUT= 0
##$TUNXOUT= 0
##$USERA1= <user>
##$USERA2= <user>
##$USERA3= <user>
##$USERA4= <user>
##$USERA5= <user>
##$V9= 5
##$VALIST= <valist>
##$VCLIST= <CCCCCCCCCCCCCCC>
##$VD= 0
##$VDLIST= <DDDDDDDDDDDDDDD>
##$VPLIST= <PPPPPPPPPPPPPPP>
##$VTLIST= <TTTTTTTTTTTTTTT>
##$WBST= 1024
##$WBSW= 4
##$XGAIN= (0..3)
0 0 0 0 
##$XL= 0
##$YL= 0
##$YMAX_a= 53933
##$YMIN_a= -48821
##$ZGOPTNS= <>
##$ZL1= 120
##$ZL2= 120
##$ZL3= 120
##$ZL4= 120
##$ABSF1= 15.47915
##$ABSF2= -2.5727
##$ABSG= 5
##$ABSL= 3
##$ALPHA= 0
##$AQORDER= 0
##$ASSFAC= 0
##$ASSFACI= 0
##$ASSFACX= 0
##$ASSWID= 0
##$AUNMP= <proc_1d>
##$AZFE= 0.1
##$AZFW= 0.1
##$BCFW= 0
##$BC_mod= 2
##$BYTORDP= 0
##$COROFFS= 0
##$CY= -3
##$DATMOD= 1
##$DC= 0
##$DFILT= <>
##$DTYPP= 0
##$F1P= 0
##$F2P= 0
##$FCOR= 1
##$FTSIZE= 16384
##$FT_mod= 6
##$GAMMA= 0
##$GB= 0
##$INTBC= 1
##$INTSCL= 3.241238e-09
##$ISEN= 128
##$LB= 0.25
##$LEV0= 0
##$LPBIN= 0
##$MAXI= 10000
##$MC2= 0
##$MEAN= 0
##$ME_mod= 0
##$MI= 1.114404
##$NCOEF= 0
##$NC_proc= -7
##$NLEV= 6
##$NOISF1= 3.799351
##$NOISF2= 2.8
##$NSP= 0
##$NTH_PI= 0
##$NZP= 0
##$OFFSET= 15.47915
##$PC= 1
##$PHC0= -4058.795
##$PHC1= 9.39229
##$PH_mod= 1
##$PKNL= yes
##$PPARMOD= 0
##$PSCAL= 0
##$PSIGN= 0
##$REVERSE= no
##$SF= 200.130008515687
##$SI= 16384
##$SIGF1= 3
##$SIGF2= 2
##$SINO= 0.751879
##$SIOLD= 32768
##$SREGLST= <19F.Aceton>
##$SSB= 0
##$STSI= 16384
##$STSR= 0
##$SW_p= 3612.71676300578
##$SYMM= 0
##$S_DEV= 0
##$TDeff= 16384
##$TDoff= 0
##$TI= <>
##$TILT= no
##$TM1= 0
##$TM2= 0
##$TOPLEV= 0
##$USERP1= <user>
##$USERP2= <user>
##$USERP3= <user>
##$USERP4= <user>
##$USERP5= <user>
##$WDW= 1
##$XDIM= 16384
##$YMAX_p= 325686173
##$YMIN_p= -3092395
$$ End of Bruker specific parameters
$$ ---------------------------------
##NTUPLES= NMR SPECTRUM
##VAR_NAME=  FREQUENCY,     SPECTRUM/REAL,   SPECTRUM/IMAG
##SYMBOL=    X,             R,               I
##VAR_TYPE=  INDEPENDENT,   DEPENDENT,       DEPENDENT
##VAR_FORM=  AFFN,          ASDF,            ASDF
##VAR_DIM=   16384,         16384,           16384
##UNITS=     HZ,            ARBITRARY UNITS, ARBITRARY UNITS
##FACTOR=    0.220516191357247, 1,           1
##FIRST=     3097.84238497607, 0,            0
##LAST=      -514.874378029709, 0,           0
##MIN=       -514.874378029709, -3092395,    0
##MAX=       3097.84238497607, 325686173,    0
$$ Real data points
##PAGE= N=1
##DATA TABLE= (X++(R..R)), XYDATA
$$ [...]
$$ plain form
5410 -46883 144361 -48870 -85516 166547 235095 36742 86063 -23134 -252147 -11734
5400 -11734 -2566 45671 -38865 84795 247951 52586 214304 158455 13138 179757 74438
5389 74438 -30330 -34185 -12524 129344 44133 88137 100542 211201 145511 281571 326474
5378 326474 156206 -25606 -67327 -20509 461919 506001 289609 191996 21510 410096
5368 410096 312584 297510 412687 298729 82953 244837 45404 139216 491440 521234
5358 521234 739580 478826 187715 567793 474125 443599 531515 814486 471453 246108
5348 246108 436009 480120 497414 368078 603305 789614 543889 410324 433450 662150
5338 662150 703642 412943 509421 337297 -106959 332861 219273 206178 407032 587957
$$ packed form
5410d6883J91244j93231l6646K52063O8548j98353M9321j09197k29013K40413
5400a1734R168M8237q4536J23660J63156j95365J61718n5849j45317J66619j05319
5389G4438j04768l855K1661J41868q5211M4004J2405J10659o5690J36060M4903
5378C26474j70268j81812m1721M6818M82428M4082k16392r7613j70486L88586
5368D10096r7512j5074J15177j13958k15776J61884j99433R3812L52224K9794
5358E21234K18346k60754k91111L80078r3668l0526Q7916K82971l43033k25345
5348B46108J89901M4111J7294j29336K35227J86309k45725j33565K3126K28700
5338F62150M1492k90699R6478j72124m44256M39820j13588j3095K00854J80925
$$ plain form
5328 587957 551266 217219 220313 485250 314262 243959 372919 101795 67737 42969 -136066
5317 -136066 -454844 -82279 90001 206037 56108 294809 82019 198929 688035 285314
5307 285314 -42511 88504 87559 30627 99912 132460 241847 -123736 -211049 73845 282875
5296 282875 228826 324115 256988 285012 279886 215869 78605 13309 -295597 -298037 100525
5285 100525 43535 -98784 -281281 -259073 -13649 -68255 -10966 -156384 -109078 -27373 250537
5274 250537 -67847 -315938 242971 337813 347339 1900 -167650 -214965 -4110 -304655
5264 -304655 -481316 -192449 -206868 -273961 -191201 -47884 30353 -79642 -3339 -52271 -164998
5253 -164998 -320810 -73281 152552 194757 33332 -21562 -48836 -200302 -559682 -437269
$$ packed form
5328E87957l6691l34047L094K64937j70988p0303J28960k71124l4058k4768j79035
5317a36066l18778L72565J72280J16036j49929K38701k12790J16910M89106m02721
5307B85314l27825J31015r45n6932O9285L2548J09387l65583q7313K84894K09030
5296B82875n4049R5289o7127K8024n126o4017j37264o5296l08906k440L98562
5285A00525n6990j42319j82497K2208K45424n4606N7289j45418M7306Q1705K77910
5274B50537l18384k48091N58909R4842R526l45439j69550m7315K10855l00545
5264c04655j76661K88867j4419o7093Q2760J43317P8237j09995P6303m8932j12727
5253a64998j55812K47529K25833M2205j61425n4894k7274j51466l59380J22413
$$ plain form
5243 -437269 -8318 195104 100316 -248282 -430128 -291471 -326649 -134369 146241 -170667
5233 -170667 -102640 87299 -26671 163074 41082 -278799 -180588 -173770 16108 -115283
5223 -115283 -172950 -457574 -602010 -233541 -301799 -384512 -79210 -32001 -51544 176622 195855
5212 195855 56475 107737 48828 -234091 -90312 -176438 -364372 -120724 -185365 -17087
5202 -17087 -181138 -91058 212448 139861 257870 188291 132597 210422 -83394 -86409 -231397
5191 -231397 -316405 49273 -7576 -196243 -103688 -157160 -47078 284907 147946 -186693
5181 -186693 -111246 186315 245832 49325 -91884 224522 415754 222453 8697 26383
5171 26383 -273351 380354 420516 27411 59472 85735 346543 204264 -199428 80394
$$ packed form
5243d37269M28951K03422r4788l48598j81846J38657l5178J92280K80610l16908
5233a70667O8027J89939j13970J89745j21992l19881R8211O818J89878j31391
5223a15283n7667k84624j44436L68469o8258q2713L05302M7209j9543K28166J9233
5212A95855j39380N1262n8909k82919J43779q6126j87934K43648o4641J68278
5202a7087j64051R0080L03506p2587J18009o9579n5694P7825k93816l015j44988
5191b31397q5008L65678n6849j88667R2555n3472J10082L31985j36961l34639
5181a86693P5447K97561N9517j96507j41209L16406J91232j93301k13756J7686
5171B6383k99734O53705M0162l93105L2061K6263K60808j42279m03692K79822
$$ plain form
5161 80394 137866 94012 13929 -212542 -109965 -199143 -138390 122811 69282 166509 101599
5150 101599 -283808 -102848 47179 -14267 -136593 -21643 -15011 156216 29644 -410442
5140 -410442 -370442 -103132 -90535 67225 56078 -451675 -379519 -182565 -363314 -158629
5130 -158629 -201620 -77345 -15000 17627 -48999 353716 165550 -219749 -124429 -134655 -68201
5119 -68201 57257 -75897 -331106 -389841 -375112 -381190 -807071 -416233 -48067 -409272 -203612
5108 -203612 194441 142168 -133559 109159 -80799 -285815 -120631 -185995 -199170 -52558
5098 -52558 -168872 -406071 -166381 -257347 -393609 -405961 -412610 -332428 -629218 -735601 -228508
5087 -228508 -151709 -38961 -293886 -511871 -477610 -794818 -640650 -704269 -417434 -451537
$$ packed form
5161H0394N7472m3854q0083k26471J02577q9178O0753K61201n3529R7227o4910
5150A01599l85407J80960J50027o1446j22326J14950O632J71227j26572m40086
5140d10442M0000K67310J2597J57760j1147n07753P2156J96954j80749K04685
5130a58629m2991J24275O2345L2627o6626M02715j88166l85299R5320j0226O6454
5119f8201J25458j33154k55209n8735J4729o078m25881L90838L68166l61205K05660
5108b03612L98053n2273k75727K42718j89958k05016J65184o5364j3175J46612
5098e2558j16314k37199K39690r0966j36262j2352o649Q0182k96790j06383N07093
5087b28508P6799J12748k54925k17985L4261l17208J54168o3619K86835l4103
$$ plain form
5077 -451537 -422815 -386643 -583241 -449752 -292368 -60385 -262095 5183 -181210 -435252
5067 -435252 -310564 -191384 -305360 -363100 -359240 -135104 11590 -125651 -210636 -429661
5057 -429661 -314725 -508539 -303050 -152765 -371221 -433976 -420001 -413353 -409282 105250 -222650
5046 -222650 -333454 -369574 -165411 80495 91263 206300 126546 132018 14285 -392289 -495041
5035 -495041 -530292 -357090 -171517 -259972 -220270 -335683 -21616 233311 -248228 -335468
5025 -335468 -466662 -313285 -97769 -12942 -22990 23697 -35595 83032 128988 -48454 -45189
5014 -45189 56961 60078 -59546 -236039 -587744 -257587 -220083 -275671 83704 166193 -64282
5003 -64282 -64156 -69535 -203742 -417737 -145154 -195727 -281017 -33211 -206715 -93376 205039
$$ packed form
5077d51537K8722L6172j96598J33489J57384K31983k01710K67278j86393k54042
5067d35252J24688J19180j13976n7740L860K24136J46694j37241q4985k19025
5057d29661J14936j93814K05489J50285k18456o2755J3975O648M071N14532l27900
5046b22650j10804l6120K04163K45906J0768J15037p9754N472j17733m06574j02752
5035d95041l5251J73202J85573q8455L9702j15413L14067K54927m81539q7240
5025c35468j31194J53377K15516Q4827j0048M6687n9292J18627M5956j77442L265
5014d5189J02150L117j19624j76493l51705L30157L7504n5588L59375Q2489k30475
5003f4282J26n379j34207k13995K72583n0573q5290K47806j73504J13339K98415
$$ plain form
4992 205039 148089 -113540 -343352 105870 183293 298705 218483 46301 52451 -47435 29071
4981 29071 115101 114447 -112994 -281228 -160980 -113910 -17279 -333644 -69032 63777 -50871
4970 -50871 -91500 -120574 -321568 -192232 -283309 -197245 33003 177127 252044 299382 143646
4959 143646 162908 297089 143925 67683 -85444 -41470 -234713 -404055 -62735 200049
4949 200049 206292 155600 -207956 -307267 -240968 -277060 -168367 195818 -68956 -260192 -204971
4938 -204971 23797 -44869 -21551 -116616 -357661 -324240 -315821 -325296 -55723 -322546 -144060
4927 -144060 24132 -109828 287632 81831 -140088 -8751 5339 -173301 21746 185147
4917 185147 63391 -205654 -242958 180202 233860 278847 538909 611155 814151 726035 623415
$$ packed form
4992B05039n6950k61629k29812M49222P7423J15412q0222j72182O150r9886P6506
4981B9071Q6030o54k27441j68234J20248M7070R6631l16365K64612J32809j14648
4970e0871m0629k9074k00994J29336r1077Q6064K30248J44124P4917M7338j55736
4959A43646J9262J34181j53164p6242j53127M3974j93243j69342L41320K62784
4949B00049O243n0692l63556r9311O6299l6092J08693L64185k64774j91236N5221
4938b04971K28768o8666K3318r5065k41045L3421Q419r475K69573k66823J78486
4927a44060J68192j33960L97460k05801k21919J31337J4090j78640J95047J63401
4917A85147j21756k69045l7304M23160N3658M4987K60062P2246K02996q8116j02620
$$ plain form
4906 623415 488420 346902 376063 390225 569648 358525 303574 315961 694981 391085
4896 391085 137267 408446 644142 656392 623221 565148 822861 877440 955646 1163450 1139426
4885 1139426 1067573 1341150 1051450 1148045 1168932 1318183 1375993 1175361 887414 749630
4875 749630 726752 775115 792174 647230 609781 696968 970065 1266234 1329254 1107665 1309077
4864 1309077 1447404 1076581 1072653 813235 513364 257165 225044 457277 202250 74492
4854 74492 11730 287767 374773 200498 542518 503732 164911 369936 180029 371108
4844 371108 -14328 192568 486465 332821 8655 288057 294852 467940 439268 520999
4834 520999 420531 316244 248280 493725 543237 813615 994977 911769 1319415 1255741
$$ packed form
4906F23415j34995j41518K9161J4162J79423k11123n4951J2387L79020l03896
4896C91085k53818K71179K35696J2250l3171n8073K57713N4579P8206K07804k4024
4885A139426p1853K73577k89700R6595K0887J49251N7810k00632k87947j37784
4875G49630k2878M8363J7059j44944l7449Q7187K73097K96169O3020k21589K01412
4864A309077J38327l70823l928k59418k99871k56199l2121K32233k55027j27758
4854G4492o2762K76037Q7006j74275L42020l8786l38821K05025j89907J91079
4844C71108l85436K06896K93897j53644l24166K79402O795J73088k8672Q1731
4834E20999j00468j04287o7964K45445M9512K70378J81362q3208M07646o3674
$$ plain form
4824 1255741 908441 788842 752259 513489 346087 366230 583194 588640 703082 787070
4814 787070 773313 943992 820718 983604 1020474 868843 973855 1081126 776479 784877
4804 784877 539563 391869 248598 225084 387279 211560 314205 204292 -95813 91393
4794 91393 -20280 -161666 225356 319678 499343 525622 352965 -97963 -174730 7992
4784 7992 194417 441487 513941 363873 413836 334385 -87117 28236 41681 -98576 197950
4773 197950 305686 201945 57995 -15494 170335 120046 -421643 -428408 -85990 -100292 -295872
4762 -295872 -66009 -36998 149055 -176915 -275552 -42588 -106827 -206702 107490 134977 -232560
4751 -232560 -42068 89093 168004 -136019 -196780 40451 165504 350011 303208 372968
$$ packed form
4824A255741l47300j19599l6583k38770j67402K0143K16964N446J14442Q3988
4814G87070j3757J70679j23274J62886L6870j51631J05012J07271l04647Q398
4804G84877k45314j47694j43271k3514J62195j75719J02645j09913l00105J87206
4794I1393j11673j41386L87022R4322J79665K6279j72657m50928p6767J82722
4784G992J86425K47070P2454j50068M9963p9451m21502J15353J3445j40257K96526
4773A97950J07736j03741j43950p3489J85829n0289n41689o765L42418j4302j95580
4762b95872K29863K9011J86053l25970r8637K32964o4239r9875L14192K7487l67537
4751b32560J90492J31161P8911l04023o0761K37231J25053J84507m6803O9760
$$ plain form
4741 372968 110072 -66995 406523 561102 448471 442178 693484 785722 266023 281475
4731 281475 278576 299392 169521 149507 -137782 -240381 -157212 -229945 -346590 -204983 108710
4720 108710 -39070 1962 189354 -84322 232021 62542 -389023 -55130 16524 -109249
4710 -109249 13612 190964 262353 454125 553127 578168 442855 -92076 -413151 -356936
4700 -356936 26373 -169333 -255987 -313978 -259963 208672 416871 -15243 -407168 -318785
4690 -318785 -295665 89373 137330 -427526 -550599 -146544 -71031 -236738 -24187 100839
4680 100839 200921 33878 -279372 -201411 -111085 159216 -49714 -169499 -358014 -125644
4670 -125644 129885 238387 -7154 97128 340570 332809 26830 -152706 -86598 195154
$$ packed form
4741C72968k62896j77067M73518J54579j12631o293K51306R2238n19699J5452
4731B81475k899K0816j29871k0014k87289j02599Q3169p2733j16645J41607L13693
4720A08710j47780M1032J87392k73676L16343j69479m51565L33893P1654j25773
4710a09249J22861J77352P1389J91772R9002K5041j35313n34931l21075N6215
4700c56936L83309j95706q6654n7991N4015M68635K08199m32114l91925Q8383
4690c18785K3120L85038M7957n64856j23073M04055P5513j65707K12551J25026
4680A00839J00082j67043l13250P7961R0326K70301k08930j19785j88515K32370
4670a25644K55529J08502k45541J04282K43442p761l05979j79536O6108K81752
$$ plain form
4660 195154 378912 414495 298224 138049 391393 149862 139278 213600 68544 -24814
4650 -24814 -12280 230623 54778 -15247 -7503 203746 409720 87746 188392 256216 387485
4639 387485 296607 258941 399729 210589 196848 243571 345189 378904 717308 490360 320410
4628 320410 441771 664374 613946 654297 871899 934744 1037193 1288287 1376677 1653676
4618 1653676 1916914 1532911 1338560 841996 792659 882188 793487 1124653 1418867 1396920
4608 1396920 1529232 1478431 1445900 1292677 782064 706146 959526 930509 1191729 1466785
4598 1466785 1499757 1839172 1508179 1424081 1386463 1588902 1510405 1603099 1708122 1699279 1754306
4587 1754306 1794617 1608800 1533191 1609978 2017252 1988009 1885177 2058739 2056371 1778514 2079429
$$ packed form
4660A95154J83758L5583j16271j60175K53344k41531j0584P4322j45056r3358
4650b4814J2534K42903j75845p0025P744K11249K05974l21974J00646O7824J31269
4639C87485r0878l7666J40788j89140j3741M6723J01618L3715L38404k26948j69950
4628C20410J21361K22603n0428M0351K17602O2845J02449K51094Q8390K76999
4618A653676K63238l84003j94351m96564m9337Q9529q8701L31166K94214k1947
4608A396920J32312n0801l2531j53223n10613p5918K53380k9017K61220K75056
4598A466785L2972L39415l30993q4098l7618K02439p8497R2694J05023q843N5027
4587A754306M0311j85817p5609P6787M07274k9243j02832J73562k368k77857L00915
$$ plain form
4576 2079429 2148372 1854947 1937137 1986754 1707466 1641554 1347111 1238477 1515077 1323637
4566 1323637 1637328 1866404 1974349 1998855 1836682 1709117 1719688 1633292 1420656 1326174
4556 1326174 966355 643345 950889 863978 1021170 939793 830978 595504 922030 819098
4546 819098 748772 1105789 1108336 1444345 1307175 1246086 1396659 986160 1276024 1185947 1458383
4535 1458383 1510250 1495330 1575351 1767582 1334720 850693 1139535 1195959 1332817 1763925
4525 1763925 1698144 1607312 1760172 1509571 1424906 1358758 1181230 1256658 1385294 1552804
4515 1552804 1649790 1437637 1124750 969705 1368201 1455597 1267964 1512120 1503168 1318900
4505 1318900 839840 920980 938754 1153123 829717 777205 572359 641922 757532 440587
$$ packed form
4576B079429O8943k93425Q2190M9617k79288o5912k94443j08634K76600j91440
4566A323637L13691K29076J07945K4506j62173j27565J0571q6396k12636r4482
4556A326174l59819l23010L07544q6911J57192q1377j08815k35474L26526j02932
4546H19098p0326L57017K547L36009j37170o1089J50573m10499K89864r0077K72436
4535A458383N1867j4920Q0021J92231m32862m84027K88842N6424J36858M31108
4525A763925o5781r0832J52860k50601q4665o6148j77528P5428J28636J67510
4515A552804R6986k12153l12887j55045L98496Q7396j87633K44156q952j84268
4505A318900m79060Q1140J7774K14369l23406n2512k04846O9563J15610l16945
$$ plain form
4495 440587 298338 334010 471608 348794 545331 693114 476646 313438 691028 688279
4485 688279 691829 723253 795962 916334 1068366 687713 814223 606523 635923 614520 544708
4474 544708 544192 148967 -32969 213483 561095 669248 550097 202910 53181 -178860
4464 -178860 86283 101507 -26743 131534 72368 215906 22313 -122265 -272606 62162
4454 62162 26591 -65177 18599 -57343 -201211 -159751 30724 231905 266591 120548 169598
4443 169598 209159 422966 478377 321100 -77304 -392101 -380447 -131824 398218 -48266
4433 -48266 -170657 -32721 -716 -3934 -235058 -426352 -280003 86017 38973 -346096 -74963
4422 -74963 -80934 -7277 -19844 78494 190817 50866 258566 90377 -172545 -190402 180325
$$ packed form
4495D40587j42249L5672J37598j22814J96537J47783k16468j63208L77590k749
4485F88279L550L1424P2709J20372J52032l80653J26510k07700K9400k1403o9812
4474E44708n16l95225j81936K46452L47612J08153j19151l47187j49729k32041
4464a78860K65143J5224j28250J58277n9166J43538j93593j44578j50341L34768
4454F2162l5571r1768Q3776p5942j43868M1460J90475K01181L4686j46043M9050
4443A69598L9561K13807N5411j57277l98404l14797J1654K48623N30042m46484
4433d8266j22391J37936L2005l218k31124j91294J46349L66020m7044l85069K71133
4422g4963n971P3657j2567R8338J12323j39951K07700j68189k62922j7857L70727
$$ plain form
4411 180325 405372 324501 105536 135713 217099 -44396 -95890 69644 266595 427340
4401 427340 211999 363029 608660 394257 147494 -158379 -6099 75673 308168 759952
4391 759952 1092662 879245 935828 860236 851025 564647 560679 713729 396506 271697 394762
4380 394762 219518 -114259 -279048 -133142 100070 -283128 18210 -106861 -114483 -172991
4370 -172991 -300635 -330440 -219575 -68922 -131705 -416780 -320347 -91524 -103489 -219561
4360 -219561 -415605 -489743 -357200 -212541 56797 402788 468589 -140540 84687 313347
4350 313347 259764 -224136 -109012 -107639 -150811 -110444 -85868 -52196 -337901 -167285 -273711
4339 -273711 -225497 -136109 -48651 -478033 -332222 297956 -120945 -178344 -167953 -174415 -83953
$$ packed form
4411A80325K25047q0871k18965L0177Q1386k61495n1494J65534J96951J60745
4401D27340k15341J51030K45631k14403k46763l05873J52280Q1772K32495M51784
4391G59952L32710k13417N6583p5592r211k86378l968J53050l17223j24809J23065
4380C94762j75244l33777j64789J45906K33212l83198L01338j25071p622n8508
4370a72991j27644k9805J10865J50653o2783k85075R6433K28823j1965j16072
4360b19561j96044p4138J32543J44659K69338L45991O5801o09129K25227K28660
4350C13347n3583m83900J15124J373m3172M0367K4576L3672k85705J70616j06426
4339b73711M8214Q9388Q7458m29382J45811O30178m18901n7399J0391o462R0462
$$ plain form
4328 -83953 -151032 244980 227932 -321854 -48675 -300335 25665 323099 211295 -36229
4318 -36229 -236423 -269732 -252364 79084 116911 -96802 -131395 32682 207101 146721 68665
4307 68665 6306 -174610 118157 176899 490283 628486 378664 86732 -180980 -29713
4297 -29713 -25328 -23055 163721 -27202 17602 -107964 -254541 -181105 -197549 109434 420265
4286 420265 397580 476952 240669 234374 83253 95558 -51867 -35529 -205455 -296215 69110
4275 69110 -65225 175542 108609 4133 155257 281791 324708 562824 551777 38894
4265 38894 93424 28860 128366 97177 222692 159699 37970 60091 -98339 -262790 123070
4254 123070 181471 147931 316400 303049 -120590 -211388 71365 142482 203153 -150939 -45127
$$ packed form
4328h3953o7079L96012j7048n49786K73179k51660L26000K97434j11804k47524
4318c6229k00194l3309J7368L31448L7827k13713l4593J64077J74419o0380p8056
4307F8665o2359j80916K92767N8742L13384J38203k49822k91932k67712J51267
4297b9713M385K273J86776j90923M4804j25566j46577P3436j6444L06983L10831
4286D20265k2685P9372k36283o295j51121J2305j47425J6338j69926r0760L65325
4275F9110j34335K40767o6933j04476J51124J26534M2917K38116j1047n12883
4265C8894N4530o4564R9506l1189J25515o2993j21729K2121j58430j64451L85860
4254A23070N8401l3540J68469j3351m23639r0798K82753P1117O0671l54092J05812
$$ plain form
4243 -45127 314204 291723 123558 -144774 -119366 -51440 57272 39505 262504 610554 534497
4232 534497 197364 4897 218477 270125 296014 496874 412992 670373 655131 778829
4222 778829 1010368 966230 1029284 515690 970189 1002980 890495 1057124 954249 1042081
4212 1042081 1613999 1898518 1961194 2131481 2005058 1771108 1374322 939706 1014942 1065068
4202 1065068 613375 1062279 1194188 891382 822557 680836 643225 670779 528996 418254
4192 418254 760819 845364 383205 369654 293679 328045 631519 326997 100914 34289 277827
4181 277827 227448 151677 352502 163970 99164 125882 -47299 -470787 -429073 -111909 147047
4170 147047 41475 12306 135432 -99930 196731 355475 540567 504916 511000 433973 111261
$$ packed form
4243d5127L59331k2481j68165k68332K5408O7926J08712j7767K22999L48050p6057
4232E34497l37133j92467K13580N1648K5889K00860q3882K57381j5242J23698
4222G78829K31539m4138O3054n13594M54499L2791j12485J66629j02875Q7832
4212A042081N71918K84519O2676J70287j26423k33950l96786m34616P5236N0126
4202A065068m51693M48904J31909l02806o8825j41721l7611K7554j41783j10742
4192D18254L42565Q4545m62159j3551p5975L4366L03474l04522k26083o6625K43538
4181B77827n0379p5771K00825j88532o4806K6718j73181m23488M1714L17164K58956
4170A47047j05572k9169J23126k35362K96661J58744J85092l5651O084p7027l22712
$$ plain form
4159 111261 322543 206238 -117661 108281 286768 346106 292595 337456 237014 12463
4149 12463 -154356 -283129 -135486 71687 -121292 -267753 -105090 506841 405307 65685
4139 65685 166816 15300 -48378 86423 117229 -1591 -98938 -53216 -76600 -31730 107972
4128 107972 -7334 -148097 -4372 107981 269704 226764 -137022 -218954 -97454 266237
4118 266237 126026 -124291 -117391 12535 236849 187225 -166417 -112385 -254454 -465847
4108 -465847 -177348 -198233 -38124 157151 71337 -59840 165307 413150 165169 64175
4098 64175 189811 132206 252006 288764 -91723 -39079 126167 207179 339713 487052 346392
4087 346392 271740 129215 -59313 -161718 168362 486981 406703 147045 442334 304739
$$ packed form
4159A11261K11282j16305l23899K25942J78487N9338n3511M4861j00442k24551
4149A2463j66819j28773J47643K07173j92979j46461J62663O11931j01534l39622
4139F5685J01131j51516o3678J34801L0806j18820r7347M5722k3384M4870J39702
4128A07972j15306j40763J43725J12353J61723m2940l63786q1932J21500L63691
4118B66237j40211k50317O900J29926K24314m9624l53642N4032j42069k11393
4108d65847K88499k0885J60109J95275q5814j31177K25147K47843k47981j00994
4098F4175J25636n7605J19800L6758l80487N2644J65246Q1012J32534J47339j40660
4087C46392p4652j42525j88528j02405L30080L18619q0278k59658K95289j37595
$$ plain form
4077 304739 312217 658567 277940 285925 240255 456208 812663 805493 599971 581968 338556
4066 338556 168451 218895 381329 655425 283107 536803 649295 925594 1205406 1025778
4056 1025778 912941 976761 831894 629017 897419 787723 413248 362835 582097 598864
4046 598864 634591 704840 616307 607187 574611 376536 488340 375905 158320 354112 560609
4035 560609 603469 629095 267218 292840 100947 422403 713028 834385 565489 372890
4025 372890 265722 447269 410107 316772 385664 322579 96834 174562 324709 39279 82338
4014 82338 112181 401026 642399 374177 585605 699397 914355 598042 84810 316049
4004 316049 292716 141561 390438 695339 518115 392306 247837 327987 202407 191047
$$ packed form
4077C04739P478L46350l80627P985m5670K15953L56455p170k05522j8003k43412
4066C38556j70105N0444J62434K74096l72318K53696J12492K76299K79812j79628
4056A025778j12837O3820j44867k02877K68402j09696l74475n0413K19262J6767
4046E98864L5727P0249q8533r120l2576j98075J11804j12435k17585J95792K06497
4035E60609M2860K5626l61877K5622j91893L21456K90625J21357k68896j92599
4025C72890j07168J81547l7162r3335O8892o3085k25745P7728J50147k85430M3059
4014H2338K9843K88845K41373k68222K11428J13792K14958l16313n13232K31239
4004C16049k3333j51155K48877L04901j77224j25809j44469Q0150j25580j1360
$$ plain form
3994 191047 203935 409677 281271 150379 -225562 -16748 369521 447732 434843 509188
3984 509188 636546 454769 700652 827131 720265 644487 365029 345678 367284 604910
3974 604910 634762 428050 332927 406975 651492 773844 891009 926362 478413 623794
3964 623794 448841 535409 380236 520820 618474 485124 403453 382822 316013 383432 174781
3953 174781 124452 386133 772287 903305 825213 753781 707859 878676 711105 743504 895939
3942 895939 1052150 821273 691581 801439 943383 1071751 804193 750432 766635 1010383
3932 1010383 788659 642140 661067 774720 1006437 980118 1181023 729631 1281964 1102242
3922 1102242 1050659 1007567 1076950 1152213 1449427 1552742 1523263 1288618 1322575 1530541 1305832
$$ packed form
3994A91047J2888K05742j28406j30892l75941K08814L86269P8211j2889P4345
3984E09188J27358j81777K45883J26479j06866p5778k79458j9351K1606K37626
3974F04910K9852k06712r5123P4048K44517J22352J17165L5353m47949J45381
3964F23794j74953Q6568j55173J40584R7654j33350q1671k0631o6809O7419k08651
3953A74781n0329K61681L86154J31018p8092p1432m5922J70817j67571L2399J52435
3942H95939J56211k30877j29692J09858J41944J28368k67558n3761J6203K43748
3932A010383k21724j46519J8927J13653K31717k6319K00905m51392N52333j79722
3922A102242n1583m3092O9383P5263K97214J03315k9479k34645L3957K07966k24709
$$ plain form
3911 1305832 1301155 1409994 1228185 1292882 1184974 1219025 1627115 1715789 1338889 1101800
3901 1101800 1390709 1701173 1757334 1813960 1567269 1678176 1872804 1907338 2002393 2164976
3891 2164976 2188660 2324011 2325813 1990771 2205358 2141211 1875648 1479865 1726361 1904753
3881 1904753 2036501 2463012 2348343 2556836 2613133 2719461 2963841 2877084 2884577 2822482
3871 2822482 2793756 2724058 2611156 3027808 3209794 3137546 3093403 3419853 3451742 3610917
3861 3610917 3629362 3649900 3977218 3798759 3997033 4071414 4272305 4250221 4233721 3943009
3851 3943009 4117529 4384901 4690046 4949821 4897467 5119725 5439560 5590064 5639610 5940109
3841 5940109 5789099 5881981 5792960 5648217 5750328 5587673 5530718 5616158 5739425 5597711
$$ packed form
3911A305832m677J08839j81809O4697j07908L4051M08090Q8674l76900k37089
3901A101800K88909L10464N6161N6626k46691J10907J94628L4534R5055J62583
3891B164976K3684J35351J802l35042K14587o4147k65563l95783K46496J78392
3881A904753J31748M26511j14669K08493N6297J06328K44380q6757P493o2095
3871B822482k8726o9698j12902M16652J81986p2248m4143L26450L1889J59175
3861C610917J8445K0538L27318j78459J98274P4381K00891k2084j6500k90712
3851C943009J74520K67372L05145K59775n2354K22258L19835J50504M9546L00499
3841E940109j51010R2882q9021j44743J02111j62655n6955Q5440J23267j41714
$$ plain form
3831 5597711 5580265 5679942 5642619 5568268 5771909 5752705 6186488 6139922 5707456 5760131 6064436
3820 6064436 6315599 6299553 6301067 6717260 6552989 6540445 6581214 6475998 6626006 6972873
3810 6972873 7042078 6920202 7258781 7258175 7430091 7963002 8479788 8510929 8702133 8939530
3800 8939530 9074458 9404834 9534815 9838954 10051485 10624680 10992491 11496839 11818693 11723442
3790 11723442 12450610 12896959 12961173 13464042 14093578 14755808 15206129 15589214 15803158 15997735
3780 15997735 16278583 16629273 16891146 17394716 17475052 17942434 17925857 17981419 18307957 18492059
3770 18492059 18703200 18320348 18428938 18186460 17787163 17754690 17752368 17390078 17022235 16664182
3760 16664182 16542392 16067612 15560443 15042950 14541802 13944177 13147538 12733719 12576090
$$ packed form
3831E597711j7446R9677l7323p4351K03641j9204M33783m6566m32466N2675L04305
3820F064436K51163j6046J514M16193j64271j2544M0769j05216J50008L46867
3810F972873O9205j21876L38579o06J71916N32911N16786L1141J91204K37397
3800H939530J34928L30376J29981L04139K12531N73195L67811N04348L21854r5251
3790A1723442P27168M46349O4214N02869O29536O62230M50321L83085K13944J94577
3780A5997735K80848L50690K61873N03570Q0336M67382j6577N5562L26538J84102
3770A8492059K11141l82852J08590k42478l99297l2473k322l62290l67843l58053
3760A6664182j21790m74780n07169n17493n01148n97625p96639m13819j57629
$$ plain form
3751 12576090 12204328 12120271 11785772 11328448 10829044 11173472 10976821 10355801 9771412 9360987
3741 9360987 9316296 9253635 9109029 8923958 9066866 8502934 8592306 8600748 8990523 8970560 8480610
3730 8480610 8527790 8457369 8412730 8291310 8115676 7811607 7634039 7291823 7183351 6858285
3720 6858285 6655564 6566495 6600747 6724569 6630588 6272557 6273298 6094249 5775277 5650208 5724386
3709 5724386 5550242 5396308 5541582 5588774 5293228 5011229 4977202 5191257 5088740 5146632
3699 5146632 5330129 5112349 4723907 4525820 4603052 4482539 4273708 4326653 4152723 3999328
3689 3999328 4155119 3919648 4080329 3698582 3542076 3606228 3416093 3308464 3291172 3259194
3679 3259194 3226680 3337378 3322470 3017845 2991661 3081310 2832297 2734476 2746939 2494068 2514393
$$ packed form
3751A2576090l71762q4057l34499m57324m99404L44428j96651o21020n84389m10425
3741I360987m4691o2661j44606j85071J42908n63932Q9372Q442L89775j9963m89950
3730H480610M7180p0421m4639j21420j75634l04069j77568l42216j08472l25066
3720F858285k02721q9069L4252J23822r3981l58031P41j79049l18972j25069P4178
3709E724386j74144j53934J45274M7192k95546k81999l4027K14055j02517N7892
3699E146632J83497k17780l88442j98087P7232j20513k08831N2945j73930j53395
3689C999328J55791k35471J60681l81747j56506O4152j90135j07629j7292l1978
3679C259194l2514J10698j4908l04625k6184Q9649k49013r7821J2463k52871K0325
$$ plain form
3668 2514393 2336070 2470437 2475665 2417361 2569557 2560680 2453722 2152102 2024002 2119718 2402440
3657 2402440 2079807 2066578 2034305 2132588 2040860 1961406 1884527 1687422 1497829 1540849 1626252
3646 1626252 1369899 1774904 1665531 1741034 1805256 1666632 1571656 1799479 1968596 1805054
3636 1805054 1823855 1905910 2170078 1870937 1754772 2000604 1971828 1936872 1674107 1806507
3626 1806507 1556578 1595305 1362959 1203047 1214711 1340580 1408091 1051249 905675 748985
3616 748985 623766 654541 918641 1079067 1107943 1156997 1138353 910875 1045111 1287555
3606 1287555 828309 626019 1169414 1274798 1178267 1084054 800679 884779 876268 606245
3596 606245 846925 1114068 1325847 1052103 1202078 1430455 1297913 898543 996038 903873
$$ packed form
3668B514393j78323J34367N228n8304J52196q877j06958l01620j28100R5716K82722
3657B402440l22633j3229l2273R8283r1728p9454p6879j97105j89593M3020Q5403
3646A626252k56353M05005j09373P5503O4222j38624r4976K27823J69117j63542
3636A805054J8801Q2055K64168k99141j16165K45832k8776l4956k62765J32400
3626A806507k49929L8727k32346j59912J1664J25869O7511l56842j45574j56690
3616G48985j25219L0775K64100J60426K8876M9054j8644k27478J34236K42444
3606A287555m59246k02290N43395J05384r6531r4213k83375Q4100q511k70023
3596F06245K40680K67143K11779k73744J49975K28377j32542l99370R7495r2165
$$ plain form
3586 903873 1075150 1339615 1418021 1360727 1358262 1407851 1468620 1353762 1280489 1377186 1429096
3575 1429096 1329255 1509150 1587957 1487348 1440749 1269914 1211710 893713 1005440 1247122
3565 1247122 1102795 1001284 1044734 1015203 1184664 1151493 909093 953348 1244447 1061305
3555 1061305 768653 873870 1151884 884517 1016637 1169067 1140857 991568 1030810 1163918
3545 1163918 1277607 1455791 1195778 988771 1061412 1103009 1180269 1057760 1103338 1090648
3535 1090648 1284117 1253192 1530247 1475142 1516817 1647932 1648240 1628508 1582506 1770451 1638444
3524 1638444 1674727 1418332 1587021 1587123 1476677 1234602 1353830 1424256 1370431 1500918 1485142
3513 1485142 1587850 1434748 1889976 1877656 2018805 2099550 1755606 1801068 1916362 2407531
$$ packed form
3586I03873J71277K64465P8406n7294k465M9589O0769j14858p3273R6697N1910
3575A429096r9841J79895P8807j00609m6599j70835n8204l17997J11727K41682
3565A247122j44327j01511M3450k9531J69461l3171k42400M4255K91099j83142
3555A061305k92652J05217K78014k67367J32120J52430k8210j49289L9242J33108
3545A163918J13689J78184k60013k07007P2641M1597P7260j22509M5578j2690
3535A090648J93469l0925K77055n5105M1675J31115L08j9732m6002J87945j32007
3524A638444L6283k56395J68689J02j10446k42075J19228P0426n3825J30487j5776
3513A485142J02708j53102M55228j2320J41149Q0745l43944M5462J15294M91169
$$ plain form
3503 2407531 2451969 2537138 2448667 2491303 2371592 2193741 2154930 2231198 2404824 2475481 2781472
3492 2781472 2907163 2563350 2561349 2717462 2794898 3451801 3787192 3786838 3760564 3809852 4000748
3481 4000748 4439614 4663731 4841491 5097671 5430337 5718185 5805380 6321252 7241116 7982722
3471 7982722 7593147 7346238 7250775 6802539 6490642 5952305 5310941 4955940 4690481 4240374
3461 4240374 3660770 3444237 3028462 3028357 2890033 2890076 2765581 2603797 2690334 2448134 2331933
3450 2331933 2338344 1909394 1856830 2082150 2159927 1955502 2061597 2170016 1755861 1785883
3440 1785883 2059386 2092576 1756544 1568100 1620729 1862301 1703808 1884334 1483225 1564696
3430 1564696 1851453 1767962 1689014 1584615 1319520 1124071 1164781 1323816 1364334 1535628
$$ packed form
3503B407531M4438Q5169q8471M2636j19711j77851l8811P6268J73626P0657L05991
3492B781472J25691l43813k001J56113P7436O56903L35391l54k6274M9288J90896
3481D000748M38866K24117J77760K56180L32666K87848Q7195N15872R19864P41606
3471G982722l89575k46909r5463m48236l11897n38337o41364l55001k65459m50107
3461D240374n79604k16533m15775j05j38324M3j24495j61784Q6537k42200j16201
3450B331933O411m28950n2564K25320P7777k04425J06095J08419m14155L0022
3440A785883K73503L3190l36032j88444N2629K41572j58493J80526m01109Q1471
3430A564696K86757q3491p8948j04399k65095j95449M0710J59035M0518J71294
$$ plain form
3420 1535628 1516554 1417996 1640720 1449121 1378328 1349433 1183591 1044201 913764 1054769
3410 1054769 812556 957538 913072 851464 931689 1058604 1057326 816516 756775 1176180 1398362
3399 1398362 1342976 1413201 1295003 1329808 1015240 1089683 1101754 1047060 928613 802487 1257290
3388 1257290 1572090 1077430 1079943 955277 1052984 1030475 1422990 1675680 1421250 1444323
3378 1444323 1500035 1598410 1640318 1605677 1652604 1812109 1814163 1520482 1130463 875862 875893
3367 875893 951316 938284 867624 668804 824286 1097815 1023765 736819 716646 853572 755826
3356 755826 621700 724968 754093 876299 1135443 1227119 937730 617206 857342 843545
3346 843545 938050 1137870 1282839 1199062 1028912 842990 916556 1232561 1453383 1519053
$$ packed form
3420A535628j9074r8558K22724j91599p0793k8895j65842j39390j30437J41005
3410A054769k42213J44982m4466o1608Q0225J26915j278k40810n9741M19405K22182
3399A398362n5386P0225j18198L4805l14568P4443J2071n4694j18447j26126M54803
3388A257290L14800m94660K513j24666R7707k2509L92515K52690k54430K3073
3378A444323N5712R8375M1908l4641M6927J59505K054k93681l90019k54601L1
3367H75893P5423j3032p0660j98820J55482K73529p4050k86946k0173J36926r7746
3356G55826j34126J03268K9125J22206K59144R1676k89389l20524K40136j3797
3346H43545R4505J99820J44969q3777j70150j85922P3566L16005K20822O5670
$$ plain form
3336 1519053 1160338 1081893 1388489 1248608 641972 685176 637079 880527 942354 1078570
3326 1078570 1128150 1052573 1097431 1325339 1251031 1078126 1157581 1194305 1260866 1340647 1328365
3315 1328365 1094604 1306715 1448508 1610589 1703301 1652174 1502354 1274087 1048430 881893
3305 881893 1432047 1757721 1568964 1281704 1347118 1106433 833078 912654 931501 1314521
3295 1314521 1354657 1222899 1111336 1079004 1466869 1395208 1466883 1728943 2032625 1614169
3285 1614169 1395018 1584660 1895559 2161046 2108244 2345473 2413596 2527498 2905577 3196872
3275 3196872 3526853 3934288 4301054 4377299 4469308 4192746 3843298 3836997 3659804 3165861
3265 3165861 2672642 2671012 2653728 2575921 2463400 2518477 2059055 2059441 2123017 2363381 2202463
$$ packed form
3336A519053l58715p8445L06596j39881o06636M3204m8097K43448O1827J36216
3326A078570M9580p5577M4858K27908p4308j72905P9455L6724O6561P9781j2282
3315A328365k33761K12111J41793J62081R2712n1127j49820k28267k25657j66537
3305H81893N50154L25674j88757k87260O5414k40685k73355P9576J8847L83020
3295A314521M0136j31758j11563l2332L87865p1661P1675K62060L03682m18456
3285A614169k19151J89642L10899K65487n2802K37229O8123J13902L78079K91295
3275C196872L29981M07435L66766P6245R2009k76562l49448o301j77193m93943
3265C165861m93219j630j7284p7807j12521N5077m59422L86O3576K40364j60918
$$ plain form
3254 2202463 1947191 2069311 2106963 1907119 1751392 1720087 1824123 1687858 1630625 1979080
3244 1979080 2173955 2292781 2646312 2788367 2886157 3399639 3853532 3665169 4011859 4061842
3234 4061842 3979165 4149445 3688740 3483348 3036002 3077399 2758203 2272752 2417905 2171682
3224 2171682 2047791 2583274 2651686 2557245 2469800 2395794 2551078 2423864 2124606 2209257
3214 2209257 2154593 1998244 1905562 1873493 2099079 2635158 2951595 3153620 2985387 3332136
3204 3332136 3668177 3836204 3655602 3577218 3896942 3818752 3698372 3583645 3731892 3717282
3194 3717282 3589954 3110514 3119937 3069678 3132036 2911980 2655313 2817281 3242107 3024479
3184 3024479 2996485 3038831 3101066 3295396 3316554 3222691 2962754 2953095 3314275 3205584 3097305
$$ packed form
3254B202463k55272J22120L7652j99844j55727l1305J04036j36265n7233L48455
3244A979080J94875J18826L53531J42055R7790N13482M53893j88363L46690M9983
3234D061842q2677J70280m60705k05392m47346M1397l19196m85451J45153k46223
3224B171682j23891N35483O8412r4441q7445p4006J55284j27214k99258Q4651
3214B209257n4664j56349r2682l2069K25586N36079L16437K02025j68233L46749
3204C332136L36041J68027j80602p8384L19724p8190j20380j14727J48247j4610
3194C717282j27328m79440R423n0259O2358k20056k56667J61968M24826k17628
3184C024479k7994M2346O2235J94330K1158r3863k59937r659L61180j08691j08279
$$ plain form
3173 3097305 3383197 3897597 3973310 4548388 4917443 5288581 6101681 6240803 6464254 6752889
3163 6752889 7861272 8830183 9844144 10730988 11305255 11627216 11768726 11589823 11894296
3154 11894296 12469459 13628633 14741431 15698518 16153594 15916961 15302806 14002005 12632729
3145 12632729 11354408 10060812 8814947 7994293 7394625 6794640 6612538 6624883 6602492
3136 6602492 6239260 5452656 5508520 5495183 5435619 5531563 5197728 4786234 5090865 4973242
3126 4973242 4905768 5109073 5323134 5277341 4510428 4231682 3873549 3555318 3624102 3722867
3116 3722867 3321230 3522413 3609397 3624490 3413525 3396144 3673553 3651234 3552193 3538294 3866567
3105 3866567 4173468 4405010 3871531 3879464 4133625 3979494 4358172 4099866 3871427 4166710
$$ packed form
3173C097305K85892N14400P5713N75078L69055L71138Q13100J39122K23451K88635
3163F752889J108383R68911J013961Q86844N74267L21961J41510j78903L04473
3154A1894296N75163J159174J112798R57087M55076k36633o14155j300801j369276
3145A2632729j278321j293596j245865q20654n99668n99985j82102J2345k2391
3136F602492l63232p86604N5864j3337n9564R5944l33835m11494L04631j17623
3126D973242o7474K03305K14061m5793p66913k78746l58133l18231O8784R8765
3116C722867m01637K01183Q6984J5093k10965j7381K77409k2319r9041j3899L28273
3105C866567L06901K31542n33479P933K54161j54131L78678k58306k28439K95283
$$ plain form
3095 4166710 4131621 4432824 4491506 4277611 4133162 4307266 4225740 4131455 4027195 4361346
3085 4361346 4509954 3990093 4049225 4011374 4183443 4238413 4267039 4222596 3974599 3962185 4311183
3074 4311183 4142089 4561959 4909516 5870605 6981545 7738728 8233405 8819641 9007967
3065 9007967 9014156 9479287 9872546 10441624 11329621 12867612 14259838 15559336 16502304
3056 16502304 16615655 16248792 15545307 14938247 14606982 13986222 13650515 13563720 13527656 13844564
3046 13844564 14055988 14475927 14469008 14044073 13660132 12867040 11540220 10081223 8646606
3037 8646606 7316471 6333671 5419269 5092036 4696136 3890581 3274218 2947795 2392829
3028 2392829 2549903 2468578 2419930 2191181 2243293 2075874 2068706 2112339 1940662 1850675 1744150
$$ packed form
3095D166710l5089L01203N8682k13895j44449J74104q1526r4285j04260L34151
3085D361346J48608n19861N9132l7851J72069N4970K8626m4443k47997j2414L48998
3074D311183j69094M19870L47557R61089J110940P57183M94677N86236J88326
3065I007967O189M65131L93259N69078Q87997J537991J392226J299498R42968
3056A6502304J13351l66863p03485o07060l31265o20760l35707q6795l6064L16908
3046A3844564K11424M19939o919m24935l83941p93092j326820j458997j434617
3037H646606j330135r82800r14402l27233l95900q05555o16363l26423n54966
3028B392829J57074q1325m8648k28749N2112j67419p168M3633j71677q9987j06525
$$ plain form
3017 1744150 1900044 1972483 1818593 2057025 2149573 2503547 2553637 2530736 2732814 2995821
3007 2995821 3162455 3193284 3350746 3382833 2983498 2549851 2147464 1493153 1536367 1665435
2997 1665435 1435091 1130402 1046180 961942 1313373 1345239 1421074 1119494 1205810 943715
2987 943715 890586 1180151 817354 718342 955181 1255577 912630 953488 1141884 1226148
2977 1226148 968904 1048970 1032204 1268275 1330775 1161772 1004636 732528 906283 1059387
2967 1059387 1020381 781511 487231 442818 176880 555983 762650 788659 681084 449717
2957 449717 727105 579901 912816 791859 1073098 1438516 1133004 1521098 1950410 2059154
2947 2059154 1901123 1736182 1713286 1447024 1102565 976553 994859 612778 451176 226016
$$ packed form
3017A744150J55894P2439j53890K38432R2548L53974N0090k2901K02078K63007
3007B995821J66634L0829J57462L2087l99335m33647m02387o54311M3214J29068
2997A665435k30344l04689q4222q4238L51431L1866P5835l01580Q6316k62095
2987I43715n3129K89565l62797r9012K36839L00396l42947M0858J88396Q4264
2977A226148k57244Q0066j6766K36071O2500j69003j57136k72108J73755J53104
2967A059387l9006k38870k94280m4413k65938L79103K06667K6009j07575k31367
2957D49717K77388j47204L32915j20957K81239L65418l05512L88094M29312J08744
2947B059154j58031j64941k2896k66262l44459j26012J8306l82081j61602k25160
$$ plain form
2937 226016 186450 453248 662382 576756 596065 422246 35979 81494 240785 257198 246263
2926 246263 162974 293104 267212 333667 626560 533539 593639 302606 -42640 -121207 227447
2915 227447 436484 255941 89508 122749 28603 114685 332253 306026 267296 39370 267810
2904 267810 357100 26874 -8507 202570 -101758 295371 172855 -171506 -207256 -175754
2894 -175754 64085 269068 277720 485875 264250 -2755 207401 255284 78970 -51176
2884 -51176 -282047 -445513 -165436 281101 399018 280969 254713 181311 1248 -70307
2874 -70307 -158524 -131602 -92523 153421 111995 103578 -16293 13722 101880 170535 37084
2863 37084 38667 92057 93222 55019 93291 -74816 166485 375551 -218443 -455765 -591876
$$ packed form
2937B26016l9566K66798K09134q5626J9309j73819l86267M5515J59291J6413j0935
2926B46263q3289J30130k5892O6455K92893r3021O0100k91033l45246p8567L48654
2915B27447K09037j80543j66433L3241r4146Q6082K17568k6227l8730k27926K28440
2904B67810Q9290l30226l5381K11077l04328L97129j22516l44361l5750L1502
2894a75754K39839K04983Q652K08155k21625k67005K10156M7883j76314j30146
2884e1176k30871j63466K80077M46537J17917j18049k6256p3402j80063p1555
2874g0307q8217K6922L9079K45944m1426q417j19871L0015Q8158O8655j33451
2863C7084J583N3390J165l8203L8272j68107K41301K09066n93994k37322j36111
$$ plain form
2852 -591876 -414377 -152379 -71149 -231816 -331218 -111265 -62161 -44313 125760 -47080
2842 -47080 -35050 -195044 77078 -51669 -314886 -348376 -235089 -69549 -32692 -24892 311018
2831 311018 209184 238080 86907 -3869 -142896 -238680 -128273 92215 113759 179526 144075
2820 144075 50611 -126732 -54813 -91812 143751 -44930 -287409 -172072 -111398 -9172
2810 -9172 -216797 -357151 -185762 -65374 415199 211879 -142299 -295835 -360681 -295092
2800 -295092 -240794 -9285 -57487 -129086 -52309 47345 125376 -214218 -316341 -463714 -11081
2789 -11081 174817 22364 204095 154761 -84859 -301665 -137373 -162139 -447447 -577348
2779 -577348 -74263 15593 28793 -109117 225283 323245 338054 296768 12513 -61607 -186273
$$ packed form
2852e91876J77499K61998Q1230j60667r9402K19953M9104J7848J70073j72840
2842d7080J2030j59994K72122j28747k63217l3490J13287J65540L6857P800L35910
2831C11018j01834K8896j51173r0776j39027r5784J10407K20488K1544O5767l5451
2820A44075r3464j77343P1919l6999K35563j88681k42479J15337O0674J02226
2810i172k07625j40354J71389J20388M80573k03320l54178j53536o4846O5589
2800b95092N4298K31509m8202p1599P6777R9654P8031l39594j02123j47373M52633
2789a1081J85898j52453J81731m9334k39620k16806J64292k4766k85308j29901
2779e77348N03085Q9856J3200j37910L34400R7962J4809m1286k84255p4120j24666
$$ plain form
2768 -186273 -117574 87078 -86286 215284 130260 -107582 -108854 278264 290378 123379 88769
2757 88769 228449 121187 -124294 -193391 -210265 -401287 -192963 -47432 10321 -113763
2747 -113763 -226008 -154019 -565362 -278530 -137028 -231463 -459917 -552278 -68829 -28511
2737 -28511 -53601 163463 201317 -143087 -190150 -97257 -81403 -34372 98189 -152021 58067
2726 58067 -272058 -339591 -396204 -585412 -386065 -289776 -554058 -756590 -614722 -514627
2716 -514627 -204781 -368311 -381482 -254429 -240887 -68975 -128237 127053 216381 -129585
2706 -129585 121816 13752 16542 -194705 -349984 -248388 -100580 11108 -305054 -633193
2696 -633193 -416196 -254742 -336836 -199238 -38003 -22971 85066 -21778 -65660 -232530
$$ packed form
2768a86273O8699K04652j73364L01570q5024k37842j272L87118J2114j66999l4610
2757H8769J39680j07262k45481o9097j6874j91022K08324J45531N7753j24084
2747a13763j12245P1989m11343K86832J41502r4435k28454r2361M83449M0318
2737b8511k5090K17064L7854l44404m7063R2893J5854M7031J32561k50210K10088
2726E8067l30125o7533n6613j89208J99347R6289k64282k02532J41868J00095
2716e14627L09846j63530j3171J27053J3542J71912n9262K55290Q9328l45966
2706a29585K51401j08064K790k11247j55279J01596J47808J11688l16162l28139
2696f33193K16997J61454q2094J37598J61235J5032J08037j06844m3882j66870
$$ plain form
2686 -232530 -221594 -136768 107791 327516 -202755 -228674 -105775 -21094 -203836 -390753
2676 -390753 -190611 -102879 -101370 -18394 217206 -930 -94876 -203797 -264569 -217571 226074
2665 226074 -111561 -131529 -277319 -52313 84639 -67542 27790 -139893 -387344 -323400
2655 -323400 -29061 -273999 -152324 -38967 -57319 115692 -113374 -165835 -166827 5176 7701
2644 7701 -331923 -276082 -500926 -694833 -570521 48533 2294 -162931 122086 243081
2634 243081 218448 -56744 -252365 13998 -522195 -487688 -260262 -156799 -109607 -59892
2624 -59892 -110452 -96342 -25811 -88279 6649 -2937 -27467 289084 -17269 275223 706602
2613 706602 180507 117147 333656 147523 357327 533764 474094 436959 668276 957766
$$ packed form
2686b32530J0936Q4826K44559K19725n30271k5919J22899Q4681j82742j86917
2676c90753K00142Q7732J509Q2976K35600k18136r3946j08921o0772M6998M43645
2665B26074l37635j9968j45790K25006J36952j52181R5332j67683k47451O3944
2655c23400K94339k44938J21675J13357j8352J73011k29066n2461r92J72003K525
2644G701l39624N5841k24844j93907J24312O19054m6239j65225K85017J20995
2634B43081k4633k75192j95621K66363n36193L4507K27426J03463M7192M9715
2624e9892n0560J4110P0531o2468R4928r586k4530L16551l06353K92492M31379
2613G06602n26095o3360K16509j86133K09804J76437n9670l7135K31317K89490
$$ plain form
2603 957766 868894 989678 987421 1071535 1028973 628325 313989 306104 233983 401912 91032
2592 91032 -75266 26607 218930 82020 207000 269354 26825 194556 401671 20587
2582 20587 -79297 -212702 -64228 336665 308279 101313 119218 443683 401676 90669 358138
2571 358138 144036 -15656 31610 39252 -312750 -222967 -156299 -150407 9555 -200304 -240064
2560 -240064 -115982 -90024 -241665 129954 -64790 22686 -177986 76021 -86737 -300601
2550 -300601 -261936 7985 85672 62086 -289854 -93455 252794 140197 352807 193028
2540 193028 -173707 -277166 237480 366781 186656 -139181 156715 325493 189757 199795
2530 199795 501811 285322 55400 -70200 -75548 -188834 304467 35759 19896 165123
$$ packed form
2603I57766q8872J20784k257Q4114m2562m00648l14336p885p2121J67929l10880
2592I1032j66298J01873J92323j36910J24980O2354k42529J67731K07115l81084
2582B0587r9884j33405J48474M00893k8386k06966J7905L24465m2007l11007K67469
2571C58138k14102j59692M7266P642l52002Q9783O6668N892J59962k09859l9760
2560b40064J24082K5958j51641L71619j94744Q7476k00672K54007j62758k13864
2550c00601L8665K69921P7687k3586l51940J96399L46249j12597K12610j59779
2540A93028l66735j03459N14646J29301j80125l25837K95896J68778j35736J0038
2530A99795L02016k16489k29922j25600n348j13286M93301k68708j5863J45227
$$ plain form
2520 165123 -29992 226914 227467 231768 219284 97349 201448 302764 291271 89127 -229613
2509 -229613 135237 33293 3058 -248268 -79702 -161829 -127719 -276375 119018 -117407
2499 -117407 -112054 90539 106601 421328 717731 653459 396407 509502 262008 401823
2489 401823 337489 -4614 245933 381399 467630 418215 314077 412606 549615 384973
2479 384973 295869 452566 402665 176994 391541 506419 648730 633605 190351 -105160
2469 -105160 -171443 52533 178495 363616 511658 517966 401324 478184 216534 544826
2459 544826 709124 640635 539317 637919 716431 649351 893880 824008 630002 634300 590781
2448 590781 829741 647930 722797 705901 1209990 1256523 1005625 599145 696870 717210 727950
$$ packed form
2520A65123j95115K56906N53M301j2484j21935J04099J01316j1493k02144l18740
2509b29613L64850j01944l0235k51326J68566q2127L4110j48656L95393k36425
2499a17407N353K02593J6062L14727K96403o4272k57052J13095k47494J39815
2489D01823o4334l42103K50547J35466Q6231m9415j04138R8529J37009j64642
2479C84973q9104J56697m9901k25671K14547J14878J42311j5125m43254k95511
2469a05160o6283K23976J25962J85121J48042O308j16642P6860k61650L28292
2459E44826J64298o8489j01318R8602P8512o7080K44529o9872j94006M298m3519
2448E90781K38960j81811P4867j6896N04089M6533k50898m06480R7725K0340J0740
$$ plain form
2437 727950 620249 889199 1098806 914913 582665 895358 922449 794924 1313583 1439330
2427 1439330 941366 913625 1162220 981491 850008 877667 1023762 965131 1246911 1183523
2417 1183523 1091821 1192900 1441603 1367706 1554016 1436859 1740469 1538683 1739393 1899572
2407 1899572 1794444 1702278 1644662 2024562 2278089 2093576 2119740 2431801 2380365 2215807
2397 2215807 2263675 2143950 2175955 2434206 2514511 2723931 2605302 2410208 2589827 2459583
2387 2459583 2314087 2529238 2909128 3215893 3416740 3254121 3479738 3580147 3607549 3411636
2377 3411636 3464419 3678615 3889182 4096752 4469617 4545075 4749347 4733359 4878889 5008034
2367 5008034 5166415 5260244 5594867 6296448 6611831 7083836 7551724 8106305 8574288 9036916
$$ packed form
2437G27950j07701K68950K09607j83893l32248L12693K7091j27525N18659J25747
2427A439330m97964k7741K48595j80729j31483K7659J46095n8631K81780o3388
2417A183523r1702J01079K48703p3897J86310j17157L03610k01786K00710J60179
2407A899572j05128r2166n7616L79900K53527j84513K6164L12061n1436j64558
2397B215807M7868j19725L2005K58251Q0305K09420j18629j95094J79619j30244
2387B459583j45496K15151L79890L06765K00847j62619K25617J00409K7402j95913
2377C411636N2783K14196K10567K07570L72865P5458K04272j5988J45530J29145
2367E008034J58381R3829L34623P01581L15383M72005M67888N54581M67983M62628
$$ plain form
2357 9036916 9990857 10469848 11883794 13448697 15951132 19157683 22330113 24401828 25954984
2348 25954984 26947393 28341668 30585959 33024276 36376319 41407837 49070067 60965025
2340 60965025 79251261 112841157 165364546 234855554 299953290 325686173 309327850
2333 309327850 260491761 209808379 169174625 136140175 109752470 86421826 67860151
2326 67860151 54413073 44520640 38052737 34346301 31670660 30455941 28908306 26228477
2318 26228477 23775602 21144145 19292233 17758415 15920408 14611321 13411118 12491018
2310 12491018 11586473 10932436 10397237 9687165 9346298 8936854 8783045 8667491 7984604
2301 7984604 7389024 7114398 6977029 6706410 6670591 6777591 6586548 5999037 5678010 5480587
$$ packed form
2357I036916R53941M78991J413946J564903K502435L206551L172430K071715J553156
2348B5954984R92409J394275K244291K438317L352043N031518P662230J1894958
2340F0965025J8286236L3589896N2523389O9491008O5097736K5732883j6358323
2333C09327850m8836089n0683382m0633754l3034450k6387705k3330644j8561675
2326F7860151j3447078r892433o467903l706436k675641j214719j547635k679829
2318B6228477k452875k631457j851912j533818j838007j309087j200203r20100
2310A2491018r04545o54037n35199p10072l40867m09444j53809j15554o82887
2301G984604n95580k74626j37369k70619l5819J07000j91043n87511l21027j97423
$$ plain form
2291 5480587 5492944 5208219 5008474 4987220 4921650 4776369 4589216 4566879 4506246 4232096
2281 4232096 4088048 3936230 3801003 3614782 3425932 3329674 3387978 3427536 3281482 3275574
2271 3275574 3224038 2809440 2563477 2628662 2408849 2297050 2203310 2011760 1908846 1707891
2261 1707891 1666751 1693069 1754791 2025198 1988242 1877139 1883466 1913045 1954755 1626674 1985467
2250 1985467 2100548 2026494 1595415 1659389 1729158 1475111 1266539 1531331 1622392 1655472
2240 1655472 1515578 1429536 1374285 1287639 1372712 1241383 1379045 1570509 1494830 1022224
2230 1022224 1168594 1142696 1262665 1005051 899445 1095961 864272 896874 776772 983474
2220 983474 966996 783582 1004120 804894 626836 671708 1101996 865169 548878 431995
$$ packed form
2291E480587J2357k84725j99745k1254o5570j45281j87153k2337o0633k74150
2281D232096j44048j51818j35227j86221j88850r6258N8304L9558j46054n908
2271C275574n1536m14598k45963O5185k19813j11799r3740j91550j02914k00955
2261A707891m1140K6318O1722K70407l6956j11103O327K9579M1710l28081L58793
2250A985467J15081p4054m31079O3974O9769k54047k08572K64792R1061L3080
2240A655472j39894q6042n5251q6646Q5073j31329J37662J91464p5679m72606
2230A022224J46370k5898J19969k57614j05606J96516k31689L2602j20102K06702
2220I83474j6478j83414K20538j99226j78058M4872M30288k36827l16291j16883
$$ plain form
2210 431995 813191 1006414 680629 803227 658234 521678 750686 718710 411625 382043
2200 382043 285988 660407 687059 609056 493511 287032 161497 422837 191779 119021
2190 119021 247065 101118 98492 156675 186143 357167 220028 66611 163246 156064 215711
2179 215711 226092 101708 -88177 -684193 -319029 -89981 64814 94215 113754 75083
2169 75083 -148621 -26726 -104300 -7369 -72379 167338 545798 194744 31592 40960 41460
2158 41460 3065 228467 128009 61041 23447 163262 323106 321209 110845 13321 511762
2147 511762 505871 379692 141993 -139260 -10496 477274 307909 41238 -49793 8704
2137 8704 246662 350738 110566 32602 54643 328782 480462 481356 303947 -8059 -61676
$$ packed form
2210D31995L81196J93223l25785J22598j44993j36556K29008l1976l07085k9582
2200C82043r6055L74419K6652p8003j15545k06479j25535K61340k31058p2758
2190A19021J28044j45947k626N8183K9468J71024j37139j53417R6635p182N9647
2179B15711J0381j24384j89885n96016L65164K29048J54795K9401J9539l8671
2169G5083k23704J21895p7574R6931o5010K39717L78460l51054j63152R368N00
2158D1460l8395K25402j00458o6968l7594J39815J59844j897k10364r7524M98441
2147E11762n891j26179k37699k81253J28764M87770j69365k66671r1031N8497
2137H704K37958J04076k40172p7964K2041K74139J51680Q94j77409l12006n3617
$$ plain form
2126 -61676 93966 154942 -59690 -9122 -16235 -269307 6642 10481 229498 243872 -242678
2115 -242678 -403819 209692 277479 83160 94092 601541 171158 -87508 7372 142156
2105 142156 -17059 159574 -178439 -77255 -29793 -162503 77606 257574 -131893 59660
2095 59660 211055 310611 317987 169824 212970 -8629 -234729 41957 -175132 -273306 -110112
2084 -110112 -357336 -205391 -113088 -29415 16382 94665 110336 518958 590205 541177 660244
2073 660244 709044 683038 355019 379276 663217 869821 1091769 1081455 1380900 1142907
2063 1142907 897360 492097 222041 341915 444008 173474 176849 420476 245027 -259920
2053 -259920 -53677 -12824 -58000 -52583 31899 -182421 -20436 384591 302752 86928 95181
$$ packed form
2126f1676J55642O0976k14632N0568p113k53072K75949L839K19017J4374m86550
2115b42678j61141O13511O7787j94319J0932N07449m30383k58666R4880J34784
2105A42156j59215J76633l38013J01184M7462j32710K40109J79968l89467J91553
2095E9660J51395R9556P376j48163M3146k21599k26100K76686k17089r8174J63194
2084a10112k47224J51945R2303Q3673M5797P8283J5671M08622P1247m9028J19067
2073F60244M8800k6006l28019K4257K83941K06604K21948j0314K99445k37993
2063A142907k45547m05263k70056J19874J02093k70534L375K43627j75449n04947
2053b59920K06243M0853m5176N417Q4482k14320J61985M05027q1839k15824Q253
$$ plain form
2042 95181 198759 364285 322547 121024 -208992 -514859 -285103 -206072 -499223 -505173 -71207
2031 -71207 201234 -300901 -178415 235649 372623 283308 44726 -285684 -272606 -296760
2021 -296760 201767 114162 -48281 -147050 14223 -76004 -196825 -391100 -410829 -365374 -230479
2010 -230479 -39890 -371200 -296523 -89602 -326651 -446201 -471510 -466164 -411087 -293679 -431374
1999 -431374 -405556 -206468 -369518 -278160 -203307 -354624 -218257 -34395 16175 -157868
1989 -157868 -530194 -381937 -254617 -131952 -373373 -445912 -81049 177257 -14719 78572
1979 78572 122284 -95314 -287477 -253866 -109262 -221769 181788 40041 -207658 -118467
1969 -118467 -320190 -216953 17626 34957 81814 -20140 -20802 234146 349324 445229 324553
$$ packed form
2042I5181J03578J65526m1738k01523l30016l05867K29756P9031k93151n950M33966
2031g1207K72441n02135J22486M14064J36974q9315k38582l30410J3078k4154
2021b96760M98527q7605j62443r8769J61273r0227j20821j94275j9729M5455J34895
2010b30479J90589l31310P4677K06921k37049j19550k5309N346N5077J17408j37695
1999d31374K5818J99088j63050R1358P4853j51317J36367J83862N0570j74043
1989a57868l72326J48257J27320J22665k41421p2539L64863K58306j91976R3291
1979G8572M3712k17598j92163L3611J44604j12507M03557j41747k47699Q9191
1969a18467k01723J03237K34579J7331M6857j01954o62K54948J15178R5905j20676
$$ plain form
1958 324553 6890 -203394 193315 134230 -57648 -43493 -6028 -129466 -119072 68536
1948 68536 204622 89830 -116566 -201036 -427080 -390969 91907 169751 216760 -70794 -126048
1937 -126048 168464 -125881 -139314 -263820 -356135 -308873 -454202 -344248 -25701 -136832
1927 -136832 -656006 -489161 -613831 -492708 -77989 -75896 -227462 -405506 -385191 -7255
1917 -7255 63332 305772 38789 -172344 -207409 -196059 -203181 16565 -243087 -575096 -449669
1906 -449669 -78684 -142891 159665 261991 -4057 -316790 -347780 -396723 -589366 -426008
1896 -426008 -289748 -7333 -148537 -141163 117697 -180031 -236812 -153414 -64058 -165816 -340573
1885 -340573 -97070 -228597 -117075 -161518 -166951 -245083 -506077 -196416 -277894 -506380 -348605
$$ packed form
1958C24553l17663k10284L96709n9085j91878J4155L7465j23438J0394J87608
1948F8536J36086j14792k06396q4470k26044L6111M82876P7844M7009k87554n5254
1937a26048K94512k94345j3433j24506r2315M7262j45329J09954L18547j11131
1927a36832n19174J66845j24670J21123M14719K093j51566j78044K0315L77936
1917g255P0587K42440k66983k11133l5065J1350p122K19746k59652l32009J25427
1906d49669L70985o4207L02556J02326k66048l12733l0990m8943j92643J63358
1896d26008J36260K82415j41204P374K58860k97728n6781Q3398Q9356j01758j74757
1885c40573K43503j31527J11522m4443n433p8132k60994L09661q1478k28486J57775
$$ plain form
1874 -348605 -252578 -61474 -119084 -213123 -43646 -163655 -377250 -506514 -462676 -83327
1864 -83327 77801 292184 303607 -191985 -120470 -188651 -146892 -60572 -318525 -429975 -369341
1853 -369341 54109 195135 155006 -30982 -308873 -513804 -308411 -447921 -290008 -215537
1843 -215537 -101652 -143290 45677 -120967 -283567 -293406 -397116 -272393 -115563 -144047
1833 -144047 -136334 -129068 -97507 -32619 -189868 -552541 -267667 -215857 -559915 -370043 -64747
1822 -64747 42725 197886 102498 92043 -13778 -125684 -157298 -92383 -17419 35397 -89963
1811 -89963 -118413 -252697 -77546 -261394 -449460 -254146 -353088 -124621 79614 68590
1801 68590 -262315 -503112 -257013 -142853 -88211 8942 215638 127466 -156646 -352751
$$ packed form
1874c48605R6027J91104n7610r4039J69477j20009k13595j29264M3838L79349
1864h3327J61128K14383J1423m95592P1515o8181M1759Q6320k57953j11450O0634
1853c69341M23450J41026m0129j85988k77891k04931K05393j39510J57913P4471
1843b15537J13885m1638J88967j66644j62600r839j03710J24723J56830k8484
1833a44047P713P266L1561O4888j57249l62673K84874N1810l44058J89872L05296
1822f4747J07472J55161r5388j0455j05821j11906l1614O4915P4964N2816j25360
1811h9963k8450j34284J75151j83848j88066J95314r8942K28467K04235j1024
1801F8590l30905k40797K46099J14160N4642R7153K06696q8172k84112j96105
$$ plain form
1791 -352751 -32723 -65797 -579993 -233081 137169 -306302 -167012 -268924 -145998 -79408
1781 -79408 -122346 -249796 -668835 -451339 -314901 -110646 -30411 297531 320714 376637 310518
1770 310518 10257 -51458 -128970 -412509 -242968 -264760 -382870 -158145 193381 -43181
1760 -43181 -213460 -249396 -297220 -32664 61960 -42936 -304941 -446137 -286815 -41575
1750 -41575 141518 195550 430481 462719 419352 261345 94841 -380264 -148106 38441
1740 38441 -18889 102350 379337 -38442 -230419 -90346 37402 -169367 -155283 -224151
1730 -224151 7098 276776 16717 -56800 95475 -97570 -541313 -233054 -274824 120835
1720 120835 106514 199468 37734 -46368 284897 66707 71990 230557 336026 236961 -16517
$$ packed form
1791c52751L20028l3074n14196L46912L70250m43471J39290j01912J22926O6590
1781g9408m2938j27450m19039K17496J36438K04255Q0235L27942K3183N5923o6119
1770C10518l00261o1715p7512k83539J69541k1792j18110K24725L51526k36562
1760d3181j70279l5936m7824K64556R4624j04896k62005j41196J59322K45240
1750d1575J83093N4032K34931L2238m3367j58007j66504m75105K32158J86547
1740C8441n7330J21239K76987m17779j91977J40073J27748k06769J4084o8868
1730b24151K31249K69678k60059p3517J52275j93045m43743L08259m1770L95659
1720A20835j4321R2954j61734q4102L31265k18190N283J58567J05469r9065k53478
$$ plain form
1709 -16517 -193960 -111231 -337926 -432504 -28893 210399 380136 305001 416325 93535
1699 93535 -78374 -176012 -159656 114150 -96372 -365269 -452007 -75818 15615 -343492 -209840
1688 -209840 -25254 37535 288839 408654 195712 -22305 51581 56552 178591 -265300
1678 -265300 -176623 -181813 -12602 -236076 -417774 -342469 -583601 -342044 -230453 -85909
1668 -85909 -49550 -392976 -377969 -289813 -151960 -47497 -158925 24138 -10480 9662 40480
1657 40480 -322861 -179995 -243821 -132937 -50014 -1762 171539 -25608 -5690 48477 160763
1646 160763 39940 78496 113388 -159049 -357194 -328488 -278372 -284585 -681687 -591948 -289662
1635 -289662 58688 -228128 -325998 -59506 223784 -177635 -288781 -67922 -248471 -455539
$$ packed form
1709a6517j77443Q2729k26695r4578M03611K39292J69737p5135J11324l22790
1699I3535j71909r7638J6356K73806k10522k68897q6738L76189R1433l59107J33652
1688b09840J84586O2789K51304J19815k12942k18017P3886M971J22039m43891
1678b65300Q8677n190J69211k23474j81698P5305k41132K41557J11591J44544
1668h5909L6359l43426J5007Q8156J37853J04463j11428J83063l4618K0142L0818
1657D0480l63341J42866o3826J10884Q2923M8252J73301j97147J9918N4167J12286
1646A60763j20823L8556L4892k72437j98145K8706N0116o213l97102Q9739L02286
1635b89662L48350k86816r7870K66492K83290m01419j11146K20859j80549k07068
$$ plain form
1625 -455539 -266660 16363 354598 351234 -3196 85583 66986 -142552 -244160 7742
1615 7742 -48819 5784 103146 -46305 -96131 -409782 -62083 232878 -288399 -270764 -245829
1604 -245829 -179527 -133477 -384119 -224170 -166047 -162820 -396528 -417522 -78968 -264714 -107397
1593 -107397 -107497 -105336 -186136 -509963 -460227 -455785 -339430 -61621 -175731 -223230 -101363
1582 -101363 80726 215465 420509 353976 66073 -38362 -326706 -329976 -365380 -190457
1572 -190457 136981 169457 -176447 -361761 -1728 311472 51292 48434 357351 330595
1562 330595 117339 276945 241447 386011 95785 -52849 -204390 111757 304135 -5812
1552 -5812 -46788 8330 250206 139107 -23354 -12004 -59809 -9119 -221075 -379835 -275206
$$ packed form
1625d55539J88879K83023L38235l364l54430Q8779j8597k09538j01608K51902
1615G742n6561N4603R7362j49451m9826l13651L47699K94961n21277J7635K4935
1604b45829O6302M6050k50642J59949N8123L227k33708k0994L38554j85746J57317
1593a07397j00K161q0800l23827M9736M442J16355K77809j14110m7499J21867
1582a01363J82089J34739K05044o6533k87903j04435k88344l270l5404J74923
1572a90457L27438L2476l45904j85314L60033L13200k60180k858L08917k6756
1562C30595k13256J59606l5498J44564k90226j48634j51541L16147J92378l09947
1552e812m0976N5118K41876j11099j62461J1350m7805N0690k11956j58760J04629
$$ plain form
1541 -275206 -377141 -309552 21994 -144299 -243065 -175671 -252882 -434633 -443947 -172659 -379655
1530 -379655 -412053 164281 104628 -173465 -193903 -56543 -147378 -516457 -177650 -145344 -91045
1519 -91045 151207 -21119 -260563 6594 -327538 20012 -92833 -304274 -462805 -346659
1509 -346659 -398411 -445730 -306778 -230503 -174410 39810 44410 -253978 -126425 -166133 34019
1498 34019 -38865 14489 303845 318233 157604 -147186 -117829 75127 -27814 -64336 220008
1487 220008 28274 -107048 -121031 -108908 -177382 -473366 -643416 -420555 -510823 -440678 -71539
1476 -71539 -209371 -152493 72997 -96985 -195078 -389548 -250349 -306487 -354797 -249809 -247738
1465 -247738 -70365 -272835 -137887 -187170 -397437 -50690 -48919 -351647 -360814 -115437 246703
$$ packed form
1541b75206j01935O7589L31546j66293r8766O7394p7211j81751r314K71288k06996
1530c79655l2398N76334n9653k78093k0438J37360r0835l69079L38807L2306N4299
1519i1045K42252j72326k39444K67157l34132L47550j12845k11441j58531J16146
1509c46659n1752m7319J38952P6275N6093K14220M600k98388J27553l9708K00152
1498C4019p2884N3354K89356J4388j60629l04790K9357J92956j02941l6522K84344
1487B20008j91734j35322j3983J2123o8474k95984j70050K22861r0268P0145L69139
1476g1539j37832N6878K25490j69982r8093j94470J39199n6138m8310J04988K071
1465b47738J77373k02470J34948m9283k10267L46747J771l02728r167K45377L62140
$$ plain form
1454 246703 30635 -269248 -293359 -172606 -208473 -152497 -496750 -485230 -267128 -387946
1444 -387946 -17147 -162615 -362550 -495788 -445100 1696 -187861 -78450 -66117 -112566
1434 -112566 255516 199339 111807 -335963 -331546 -405937 -322654 -285182 -311287 -51216 -76095
1423 -76095 56849 -230309 -123305 24021 147035 270776 256882 77346 -82249 -208626
1413 -208626 -272140 -238994 -56400 -168942 -360616 -233561 -106743 -209579 229267 41019
1403 41019 -441022 -165174 -18496 -31745 -61649 -144604 -292587 -178820 -183029 -224179 -189446
1392 -189446 -202125 -185615 -142900 81523 64652 228656 231709 55849 -183866 13667 224805
1381 224805 64858 -138644 140838 185446 189397 -137104 -129201 -11363 -303782 -116247 -121080
$$ packed form
1454B46703k16068k99883k4111J20753l5867N5976l44253J1520K18102j20818
1444c87946L70799j45468j99935j33238N0688M46796j89557J09411J2333m6449
1434a12566L68082n6177q7532m47770M417p4391Q3283L7472k6105K60071k4879
1423g6095J32944k87158J07004J47326J23014J23741j3894j79536j59595j26377
1413b08626o3514L3146J82594j12542j91674J27055J26818j02836M38846j88248
1403D1019m82041K75848J46678j3249k9904q2955j47983J13767m209m1150L4733
1392a89446j2679J6510M2715K24423j6871J64004L053j75860k39715J97533K11138
1381B24805j59947k03502K79482M4608L951l26501P903J17838k92419J87535m833
$$ plain form
1370 -121080 7095 54716 162602 330228 22430 -308243 -174964 -57309 149352 -102969
1360 -102969 147104 449396 355107 382097 15705 -54644 -174227 -370960 -223735 -30163
1350 -30163 -17964 241884 -138896 -482178 -354520 54250 374162 240122 452723 179224
1340 179224 26668 -318267 -369346 -387667 -541113 -767566 -359149 49220 -290763 -110581
1330 -110581 -343631 77931 19982 -343082 -535802 -310502 -265705 -276396 43886 -3567
1320 -3567 -161163 -41044 312301 377682 826458 791678 423297 164905 71558 -105650 -190011
1309 -190011 106907 -24840 -111719 159450 145548 145129 -1202 399831 336597 317255 224466
1298 224466 64891 39416 -88832 -159095 110473 205931 1325 -174177 13242 -50585
$$ packed form
1370a21080J28175M7621J07886J67626l07798l30673J33279J17655K06661k52321
1360a02969K50073L02292r4289K6990l66392p0349j19583j96733J47225J93572
1350c0163J2199K59848l80780l43282J27658M08770L19912j34040K12601k73499
1340A79224j52556l44935n1079j8321j53446k26453M08417M08369l39983J80182
1330a10581k33050M21562n7949l63064j92720K25300M4797j0691L20282m7453
1320c567j57596J20119L53345O5381M48776l4780l68381k58392r3347j77208q4361
1309a90011K96918j31747q6879K71169j3902m19j46331M01033o3234j9342r2789
1298B24466j59575k5475j28248p0263K69568R5458k04606j75502J87419o3827
$$ plain form
1288 -50585 -401528 -139645 -137555 -141985 -60202 -209511 -182916 176388 279486 149062 10131
1277 10131 125978 31472 -155941 -95219 -236853 -98582 73179 195582 -191780 -484699
1267 -484699 -151358 10989 -184082 151243 5352 122104 467625 125929 155086 68889
1257 68889 -225824 -366107 -349539 4892 40571 -178950 30091 -212827 -136017 25158
1247 25158 -94804 -260389 -263055 -105402 169863 123303 97361 89792 -87664 114661 157559
1236 157559 263052 169941 8332 -8859 99965 299750 152363 163237 228669 224184 -137952
1225 -137952 -139533 -222897 -383294 -83184 -322890 2242 103306 -27405 74996 44645
1215 44645 -64501 96689 399450 162742 -10824 -94265 -202962 -567875 -366653 -134644
$$ packed form
1288e0585l50943K61883K090m430Q1783j49309K6595L59304J03098j30424j38931
1277A0131J15847r4506j87413O0722j41634J38271J71761J22403l87362k92919
1267d84699L33341J62347j95071L35325j45891J16752L45521l41696K9157q6197
1257F8889k94713j40283J6568L54431L5679k19521K09041k42918P6810J61175
1247B5158j19962j65585k666J57653K75265m6560k5942p569j77456K02325M2898
1236A57559J05493r3111j61609j7191J08824J99785j47387J0874O5432m485l62136
1225a37952j581q3364j60397L00110k39706L25132J01064j30711J02401l0351
1215D4645j09146J61190L02761k36708j73566q3441j08697l64913K01222K32009
$$ plain form
1205 -134644 60424 -38620 -359331 -75414 124497 -2135 -290561 -35421 -62455 -345745
1195 -345745 -422753 -120833 -168467 -325618 -380136 -442725 194714 144972 -222152 -524732 -528801
1184 -528801 -221016 -57934 168268 -9320 353083 371219 304228 404550 277434 110710
1174 110710 -240753 -310683 43555 294689 320706 408256 -59602 20426 342585 310036 52878
1163 52878 -259846 -503872 -369593 -278045 -305142 -640491 -285098 -216344 -461448 -209872
1153 -209872 -97232 -270805 -295394 -62281 155729 205996 83234 -121178 320079 92215
1143 92215 -159976 17764 166795 238598 417707 168076 -42383 -191315 -341550 -43611
1133 -43611 224616 -14355 -36931 175124 74706 78899 309314 265127 -135066 192482 482605
$$ packed form
1205a34644J95068r9044l20711K83917J99911j26632k88426K55140k7034k83290
1195c45745p7008L01920m7634j57151n4518o2589O37439m9742l67124l02580m069
1184e28801L07785J63082K26202j77588L62403J8136o6991J00322j27116j66724
1174A10710l51463o9930L54238K51134K6017Q7550m67858Q0028L22159l2549k57158
1163E2878l12724k44026J34279R1548k7097l35349L55393O8754k45104K51576
1153b09872J12640j73573k4589K33113K18010N0267j22762k04412M41257k27864
1143I2215k52191J77740J49031P1803J79109k49631k10459j48932j50235K97939
1133d3611K68227k38971k2576K12055j00418M193K30415m4187m00193L27548K90123
$$ plain form
1122 482605 352812 259694 83931 58132 -146262 -485403 -124800 -141962 -52208 -131955 -171660
1111 -171660 -350630 -151323 -92842 -326862 -257198 -22455 -282164 -216802 -419202 -288505
1101 -288505 -174114 -375737 -491060 30218 47643 253869 -23187 -653288 -243654 -357550
1091 -357550 -450769 -311035 -158504 -161881 -135088 -148768 -73774 55003 169302 40735 139575
1080 139575 -112858 263968 406796 -145550 -308484 103094 236632 52735 388694 152297
1070 152297 13033 64275 161883 119288 161978 317295 -235311 -288884 -306315 -43634 148995
1059 148995 -371277 -380356 -138793 -247646 -17516 -105212 44470 520269 604885 318848
1049 318848 105901 177795 -15135 99199 -8964 108491 115350 298579 91645 -120431
$$ packed form
1122D82605j29793r3118j75763k5799k04394l39141L60603j7162Q9754p9747l9705
1111a71660j78970J99307N8481k34020O9664K34743k59709O5362k02400J30697
1101b88505J14391k01623j15323N21278J7425K06226k77056o30101M09634j13896
1091c57550r3219J39734J52531l377K6793j3680P4994J28777J14299j28567R8840
1080A39575k52433L76826J42828n52346j62934M11578J33538j83897L35959k36397
1070A52297j39264N1242R7608m2595M2690J55317n52606n3573j7431K62681J92629
1059A48995n20272r079K41563j08853K30130q7696J49682M75799Q4616k86037
1049C18848k12947P1894j92930J14334j08163J17455O859J83229k06934k12076
$$ plain form
1039 -120431 -41220 8487 150772 145551 -17045 -43802 73084 377808 294074 -39851 -42238
1028 -42238 -49287 241036 289091 34573 -184763 -195605 -147728 -89471 108477 14542 160383
1017 160383 79769 13731 -70663 20985 185160 -241267 -310933 -135092 -65098 204808 124471
1006 124471 53369 127418 148652 225214 -3421 -2282 116632 102108 -322220 51647 285252
995 285252 -10839 -249975 -69901 -83181 -265423 -609002 -438280 -349883 -69131 59315
985 59315 -230898 -370043 -211958 -208952 115463 196586 -32546 -28964 143830 52978 -161100
974 -161100 52918 57731 56587 12279 331425 71912 -210830 -48093 44197 -280751 -82621
963 -82621 175397 255960 -13913 109558 87386 60422 -122510 -196999 -107310 -289354 -78240
$$ packed form
1039a20431P9211M9707J42285n221j62596k6757J16886L04724q3734l33925k387
1028d2238p049K90323M8055k54518k19336j0842M7877N8257J97948r3935J45841
1017A60383q0614o6038q4394R1648J64175m26427o9666J75841O9994K69906q0337
1006A24471p1102P4049K1234P6562k28635J139J18914j4524m24328L73867K33605
995B85252k96091k39136J80074j3280j82242l43579J70722Q8397K80752J28446
985E9315k90213j39145J58085L006L24415Q1123k29132L582J72794r0852k14078
974a61100K14018M813j144m4308L19146k59513k82742J62737R2290l24948J98130
963h2621K58018Q0563k69873J23471k2172k6964j82932p4489Q9689j82044K11114
$$ plain form
952 -78240 58336 101678 128570 201311 270704 293551 99005 279233 325501 455543 275908
941 275908 185295 554312 575683 448141 224887 -41104 125771 93304 35641 -38178 -188587
930 -188587 149330 75991 -187609 -93999 -236247 -90192 336974 150292 -129997 -277962
920 -277962 -196 -182346 -159278 -89689 38421 377588 538199 52026 -179512 -95179
910 -95179 -116229 -1211 10787 -41080 -258133 81805 -143073 -365561 -20989 192591 -400049
899 -400049 -564579 -331802 42159 109642 389833 269132 168232 110420 10466 167915
889 167915 -82092 161981 55738 -232304 -101091 -203407 -42485 223130 159568 141399
879 141399 68952 80744 40886 110548 53272 153272 130809 3766 69495 314987 451557
$$ packed form
952g8240J36576M3342K6892P2741O9393K2847j94546J80228M6268J30042j79635
941B75908r0613L69017K1371j27542k23254k65991J66875l2467n7663p3819j50409
930a88587L37917p3339k63600R3610j42248J46055M27166j86682k80289j47965
920b77962K77766j82150K3068O9589J28110L39167J60611m86173k31538Q4333
910i5179k1050J15018J1998n1867k17053L39938k24878k22488L44572K13580n92640
899d00049j64530K32777L73961O7483K80191j20701j00900n7812r9954J57449
889A67915k50007K44073j06243k88042J31213j02316J60922K65615o3562j8169
879A41399p2447J1792l9858O9662n7276J00000k2463j27043O5729K45492J36570
$$ plain form
868 451557 325531 -126932 -474787 -252873 -7292 -132582 -411689 -71028 385 -341146
858 -341146 -102490 -174729 119672 212264 56735 22639 -189204 -153409 -22884 -157838 -166602
847 -166602 78298 182970 321357 69272 38378 -173971 126646 94878 44691 168172
837 168172 236309 615428 404436 -2596 96900 125409 -583 -105246 -205643 -19873
827 -19873 -299903 76586 174907 -57850 -128839 144650 301018 5059 106618 589447
817 589447 687929 248664 522635 409066 238553 372684 -59766 -372289 -509886 -336095
807 -336095 -167189 -337849 -389163 -198989 -16673 -100533 -185625 86761 161796 464072 158776
796 158776 166269 145720 -51513 -310942 -313292 -301973 -261756 -200644 70870 148110 -198289
$$ packed form
868D51557j26026m52463l47855K21914K45581j25290k79107L40661P1413l41531
858c41146K38656p2239K94401R2592j55529l4096k11843L5795J30525j34954q764
847a66602K44900J04672J38387k52085l0894k12349L00617l1768n0187J23481
837A68172O8137L79119k10992m07032R9496K8509j25992j04663j00397J85770
827a9873k80030L76489R8321k32757p0989K73489J56368k95959J01559M82829
817E89447R8482m39265K73971j13569j70513J34131m32450l12523j37597J73791
807c36095J68906j70660n1314J90174J82316q3860q5092K72386P5035L02276l05296
796A58776P493k0549j97233k59429k350J1319M0217O1112K71514P7240l46399
$$ plain form
785 -198289 54566 59724 -126730 -108988 -161356 192984 318952 48299 271752 168363 353729
774 353729 418884 248535 54119 -370378 -183471 -159313 138217 128447 -113212 156017 431054
763 431054 511633 295063 109782 92733 234725 73021 38328 106732 130462 -132853 -167735
752 -167735 -62154 196215 57323 288616 246500 207544 295015 371196 -76792 -149867 -37785
741 -37785 -173375 4544 -23904 370717 111050 181430 135346 1314 257652 228762 83253
730 83253 166709 176556 170269 481397 263341 -115811 -331089 -92581 329047 369266 302728
719 302728 344868 71087 -99434 13435 -130020 -67157 349081 71092 -50280 -80413
709 -80413 237857 106019 44419 350532 254837 6369 12797 -143715 57199 113625 126533
$$ packed form
785a98289K52855N158j86454J7742n2368L54340J25968k70653K23453j03389J85366
774C53729O5155j70349j94416m24497J86907K4158K97530r770k41659K69229K75037
763D31054Q0579k16570j85281j7049J41992j61704l4693O8404K3730k63315l4882
752a67735J05581K58369j38892K31293m2116l8956Q7471P6181m47988p3075J12082
741c7785j35590J77919k8448L94621k59667P0380m6084j34032K56338k8890j45509
730H3253Q3456R847o287L11128k18056l79152k15278K38508M21628M0219o6538
719C02728M2140k73781j70521J12869j43455O2863M16238k77989j21372l0133
709h0413L18270j31838o1600L06113r5695k48468O428j56512K00914N6426J2908
$$ plain form
698 126533 230305 -162949 -85388 -160562 -292337 -22577 -50878 -188665 -296136 -133272
688 -133272 301076 237576 160223 320915 95552 37321 285398 405146 190394 229680 -9063
677 -9063 -5492 -144274 -244985 109050 -63664 -64552 -295091 -235221 -180221 -280426 -2277
666 -2277 307333 303975 277931 343393 486548 212032 183075 178432 310996 201502 283755 -70112
654 -70112 255372 408807 163224 -34582 91549 -198420 -439623 -298859 -125648 206571
644 206571 105739 113794 453331 153376 -250972 145803 243867 150592 321823 295261 -323577
633 -323577 -237330 -124085 -52902 374321 375947 215667 261842 481116 745518 677324 337200
622 337200 158806 282065 354379 157955 -45801 -57556 -201038 -62672 390310 110794
$$ packed form
698A26533J03772l93254P7561p5174j31775K69760k8301j37787j07471J62864
688a33272M34348o3500p7353J60692k25363n8231K48077J19748k14752L9286k38743
677i063L571j38782j00711L54035j72714q88k30539N9870N5000j00205K78149
666b277L09610l358k6044O5462J43155k74516k8957m643J32564j09494Q2253l53867
654g0112L25484J53435k45583j97806J26131k89969k41203J40764J73211L32219
644B06571j00832Q055L39537k99955m04348L96775R8064r3275J71231k6562o18838
633c23577Q6247J13245P1183M27223J626j60280M6175K19274K64402o8194l40124
622C37200j78394J23259P2314j96424k03756j1755j43482J38366M52982k79516
$$ plain form
612 110794 -18850 162577 569128 589647 88084 91990 359215 212940 -70074 -94533 -242089
601 -242089 -351528 -283818 4664 194835 18535 138611 -265976 1227 268863 181017
591 181017 139614 -73383 -108343 -209915 -98646 -180211 358996 220824 -133729 -203216 227594
580 227594 290254 36873 250058 222570 95582 -90202 105169 192527 113716 394267 336794
569 336794 -4093 65040 158802 -120180 -397893 -90994 231706 93031 87750 118127 -28245
558 -28245 170146 52066 86912 275706 50979 28363 -59744 219019 -79799 -371678 -71228
547 -71228 229895 135858 84744 87687 2786 -75549 -140239 -128564 26206 373225 480395
536 480395 52553 -118364 -25068 277964 300520 293893 365582 26121 -94963 -7011 -142024
$$ packed form
612A10794j29644J81427M06551K0519n01563L906K67225j46275k83014k4459j47556
601b42089j09439O7710K88482J90171j76300J20076m04587K67203K67636q7846
591A81017m1403k12997l4960j01572J11269q1565N39207j38172l54553o9487M30810
580B27594O2660k53381K13185k7488j26988j85784J95371Q7358p8811K80551n7473
569C36794l40887O9133R3762k78982k77713L06899L22700j38675n281L0377j46372
558b8245J98391j18080L4846J88794k24727k2616q8107K78763k98818k91879L00450
547g1228L01123r4037n1114K943q4901p8335o4690J1675J54770L47019J07170
536D80395m27842j70917R3296L03032K2556o627P1689l39461j21084Q7952j35013
$$ plain form
525 -142024 110986 10866 225542 272937 -131107 -107839 -117066 -233863 -45269 146100 -5366
514 -5366 97375 328179 331694 206652 230518 510967 453625 57104 161297 78123 364774
503 364774 196392 33328 253348 29532 7983 313776 241259 -97909 218392 74773
493 74773 -33884 -19390 159811 157388 -114558 107586 407990 240186 236460 95652 -225652
482 -225652 -141147 -109895 221451 169037 369165 411235 500755 217908 -13562 -216495 -55875
471 -55875 53781 199640 39969 -204034 181265 208230 -8731 93977 297635 364087
461 364087 62454 -22204 79092 -231349 -175836 -35656 291126 76383 -231241 -199445
451 -199445 30385 142096 142450 350250 455834 49339 241732 79134 -71365 -157849 68471
$$ packed form
525a42024K53010j00120K14676M7395m04044K3268r227j16797J88594J91369j51466
514e366J02741K30804L515j25042K3866K80449n7342l96521J04193q3174K86651
503C64774j68382j63064K20020k23816k1549L05793p2517l39168L16301j43619
493G4773j08657J4494J79201k423k71946K22144L00404j67804l726j40808l21304
482b25652Q4505L1252L31346n2414K00128M2070Q9520k82847k31470k02933J60620
471e5875J09656J45859j59671k44003L85299K6965k16961J02708K03658O6452
461C64087l01633q4658J01296l10441N5513J40180L26782k14743l07624L1796
451a99445K29830J11711L54K07800J05584m06495J92393j62598j50499q6484K26320
$$ plain form
440 68471 15707 -328000 -264356 -242023 -31899 -48125 224993 224551 212851 241 38709 -9857
428 -9857 104711 167527 -84636 71220 -87631 -149742 -6372 -70981 96666 104896 253552
417 253552 194161 172038 257973 458960 431473 468740 -44136 -272244 -213964 -200902 -415890
406 -415890 -187906 148610 -116365 -210356 193320 318266 236246 247975 -18812 -285850
396 -285850 -181424 -122895 3680 284950 -25111 -310564 -145451 -68950 35838 142077
386 142077 146948 -23068 -201473 -47257 46284 172322 -29667 15486 113670 26388 4722
375 4722 10121 49284 -132567 -415090 -226874 -293605 -176752 -78626 -174941 -322319 -68585
364 -68585 -38523 -192313 -269332 -24490 214601 179104 66337 -35209 -224847 -183888 -154579
$$ packed form
440F8471n2764l43707O3644K2333K10124j6226K73118m42j1700k12610L8468m8566
428i857J14568O2816k52163J55856j58851o2111J43370o4609J67647Q230J48656
417B53552n9391k2123Q5935K00987k7487L7267n12876k28108N8280J3062k14988
406d15890K27984L36516k64975r3991M03676J24946q2020J1729k66787k67038
396b85850J04426N8529J26575K81270l10061k85453J65113P6501J04788J06239
386A42077M871j70016j78405J54216R3541J26038k01989M5153R8184q7282k1666
375D722N399L9163j81851k82523J88216o6731J16853R8126r6315j47378K53734
364f8585L0062j53790p7019K44842K39091l5497j12767j01546j89638M0959K9309
$$ plain form
353 -154579 331459 289681 102367 15005 -254611 -223834 171048 170017 184546 197606 296858
342 296858 49877 -113356 -246113 -151297 -1828 -219918 98564 34861 121062 -166701
332 -166701 -190355 199738 102807 -210071 69556 270015 20945 -476841 -481710 -175592 39183
321 39183 197398 276485 49176 -23660 84472 -53292 325866 426667 262041 226158 227525
310 227525 -224167 -269151 -271254 -268069 -270992 14544 30017 77582 123304 -147342 -70953 -128570
298 -128570 82201 -61443 -199704 -35200 -72968 -256881 -253475 -292280 -53177 -75017 -168908
287 -168908 -22221 141664 24003 273263 226077 337834 285212 -52471 -156436 -272824
277 -272824 -65570 391779 -50749 -369738 -278999 -321732 -288780 -167796 -187136 -45075 -305580
$$ packed form
353a54579M86038m1778j87314q7362k69616L0777L94882j031J4529J3060R9252
342B96858k46981j63233j32757R4816J49469k18090L18482o3703Q6201k87763
332a66701k3654L90093r6931l12878K79627K00459k49070m97786m869L06118K14775
321C9183J58215P9087k27309p2836J08132j37764L79158J00801j64626l5883J367
310B27525m51692m4984k103L185k923K85536J5473M7565M5722k70646P6389n7617
298a28570K10771j43644j38261J64504l7768j83913L406l8805K39103k1840r3891
287a68908J46687J63885j17661K49260m7186J11757n2622l37683j03965j16388
277b72824K07254M57349m42528l18989R0739m2733L2952J20984j9340J42061k60505
$$ plain form
266 -305580 -757315 -638410 -451894 -245315 -179756 -69878 -150770 -457073 -202032 148214
256 148214 236846 -53140 -86306 109726 -90157 -195806 -369771 -284445 -220536 -53235 -72196
245 -72196 -161760 299366 341336 300689 371942 1168 -71855 120275 -174806 -233729 -8098
234 -8098 -87271 -252501 -122534 2217 -70043 -113709 136705 279501 395680 443606 108536
223 108536 29670 27902 90929 54193 107253 172543 293684 147970 468493 405887 223598
212 223598 -136457 96517 335629 -197936 -208999 -335737 -329728 26152 48142 -216511 -317682
201 -317682 -275094 183503 69323 -88902 26286 2286 152793 123181 109607 115615 277688
190 277688 254315 340221 -9039 -465784 -179576 -338224 -386692 -96987 -82414 116808 135710
$$ packed form
266c05580m51735J18905J86516K06579O5559J09878q0892l06303K55041L50246
256A48214Q8632k89986l3166J96032j99883j05649j73965Q5326O3909J67301j8961
245g2196q9564M61126M1970m0647P1253l70774p3023J92130k95081n8923K25631
234h098p9173j65230J29967J24751p2260m3666K50414J42796J16179M7926l35070
223A08536p8866j768O3027l6736N3060O5290J21141j45714L20523o2606j82289
212B23598l60055K32974K39112n33565j1063j26738O009L55880K1990k64653j01171
201c17682M2588M58597j14180j58225J15188k4000J50507k9612j3574O008J62073
190B77688k3373Q5906l49260m56745K86208j58648m8468K89705J4573J99222J8902
$$ plain form
179 135710 54110 229555 84218 -290419 -44901 146217 174046 168352 219038 298063 22024
168 22024 255671 225905 59751 -194717 77046 208751 44489 -88781 -95115 73122 -174312
157 -174312 -320510 -263490 -272173 -139601 -79379 -67381 -277212 -225765 -321491 -458440 -246581
146 -246581 -143967 98760 51860 -191107 -138634 9552 121812 71307 -84379 18683
136 18683 -63886 -245842 -212549 -131381 -219616 -151820 -26760 23912 -37472 64490 208462
125 208462 37474 116773 177522 45936 216051 269696 102289 86399 -41199 -150036 198050
114 198050 193323 264240 114104 191132 117063 -110883 -145383 20537 -161641 -185833 -299294
103 -299294 -349062 -183072 -331366 -227122 44419 -228835 -114085 -18954 -76863 246486
$$ packed form
179A35710q1600J75445j45337l74637K45518J91118K7829n694N0686P9025k76039
168B2024K33647k9766j66154k54468K71763J31705j64262j33270o334J68237k47434
157a74312j46198N7020q683J32572O0222J1998k09831N1447r5726j36949K11859
146b46581J02614K42727m6900k42967N2473J48186J12260n0505j55686J03062
136A8683q2569j81956L3293Q1168q8235O7796J25060N0672o1384J01962J43972
125B08462j70988P9299O0749j31586J70115N3645j67407j5890j27598j08837L48086
114A98050m727P0917j50136P7028p4069k27946l4500J65920j82178k4192j13461
103b99294m9768J65990j48294J04244K71541k73254J14750R5131n7909L23349
$$ plain form
93 246486 263147 27599 68329 -42266 266 -32823 -161682 -29813 -145485 -2343 71051
82 71051 241283 -142276 -352622 -345695 -82510 -63194 -62643 47038 104605 -80981 -41606 102643
70 102643 229843 4799 -129221 14191 209174 171988 -24938 52736 148213 -29111 62450
59 62450 146374 244023 266136 -100344 -3061 179420 172733 230299 -117539 1234 73549 172542
47 172542 267170 74708 19777 -52129 -108237 -71341 49546 51087 -105251 -331875 -248284
36 -248284 -122167 -85786 -196692 -157548 -68692 206212 -36499 -61416 -148211 -62007 92421
25 92421 -30058 -68464 7522 373569 -10591 -132929 15845 -99311 -63274 -103169 -109968
14 -109968 -104244 -26063 51156 -73763 -202766 -18862 150126 142508 191817 -25894 -69546
$$ packed form
93B46486J6661k35548M0730j10595M2532l3089j28859J31869j15672J43142P3394
82G1051J70232l83559k10346O927K63185J9316N51J09681N7567j85586L9375J44249
70A02643J27200k25044j34020J43412J94983l7186j96926P7674R5477j77324R1561
59F2450Q3924R7649K2113l66480R7283J82481o687N7566l47838J18773P2315R8993
47A72542R4628j92462n4931p1906n6108L6896J20887J541j56338k26624Q3591
36b48284J26117L6381j10906L9144Q8856K74904k42711k4917q6795Q6204J54428
25I2421j22479l8406P5986L66047l84160j22338J48774j15156L6037l9895o799
14a09968N724P8181P7219j24919j29003J83904J68988p618M9309k17711m3652
$$ plain form
3 -69546 38194 71568 97087
0 97087
$$ packed form
3f9546J07740L3374K5519
0I7087
$$ Imaginary data points
##PAGE= N=2
##DATA TABLE= (X++(I..I)), XYDATA
$$ plain form
16383 -271222 -391371 -531779 -530897 -254003 -169638 -347122 -420278 -257313 -70125 -280270
16373 -280270 -269704 -290853 -284426 -288677 -247984 -257879 -292331 -555789 -436768 -279238 -218267
16362 -218267 -125401 -152574 -229594 -223251 -120852 -223962 -176341 -61264 -162288 -182907 -197997
16351 -197997 -169335 -181360 -131918 -37102 139078 19189 2652 -200720 1987 51212 -128180
16340 -128180 108413 94078 -34993 -40672 -312073 -392205 -50972 -98527 -254110 -23181
16330 -23181 92473 214587 334494 337163 247247 86312 -109177 -174894 -5775 154205
16320 154205 364573 331946 249729 31104 -140306 -26646 94400 133465 239189 133612
16310 133612 252191 97098 476 211661 74593 70058 196878 279716 289000 251490 150034
$$ packed form
16383b71222j20149j40408Q82K76894Q4365j77484p3156J62965J87188k10145
16373b80270J0566k1149O427m251M0693r895l4452k63458J19021J57530O0971
16362b18267R2866k7173p7020O343J02399j03110M7621J15077j01024k0619j5090
16351a97997K8662j2025M9442R4816J76180j19889j6537k03372K02707M9225j79392
16340a28180K36593j4335j29071n679k71401q0132L41233m7555j55583K30929
16330b3181J15654J22114J19907K669q9916j60935j95489o5717J69119J59980
16320A54205K10368l2627q2217k18625j71410J13660J21046L9065J05724j05577
16310A33612J18579j55093r6622K11185j37068m535J26820Q2838R284l7510j01456
$$ plain form
16299 150034 215612 550201 314918 16178 -14639 69749 305111 317281 150256 178009
16289 178009 432925 327512 234554 352198 400657 588641 421767 523945 622556 341315
16279 341315 149571 196299 310731 426453 635422 630375 442327 511123 348300 441672
16269 441672 556681 534591 601057 559632 584503 456079 735161 667190 292183 594980
16259 594980 662537 632640 491544 393990 630228 798386 768887 828548 600175 436063
16249 436063 375946 382890 586685 458717 503645 410843 480958 557603 515656 549754 464361
16238 464361 458514 471576 581555 446527 497351 512722 684094 774992 633990 678504 629353
16227 629353 667049 788146 736362 606724 897060 853005 630353 529601 817940 883591
$$ packed form
16299A50034O5578L34589k35283k98740l0817Q4388K35362J2170j67025K7753
16289A78009K54916j05413r2958J17644M8459J87984j66874J02178R8611k81241
16279C41315j91744M6728J14432J15722K08969n047j88048O8796j62823R3372
16269D41672J15009k2090O6466m1425K4871j28424K79082o7971l75007L02797
16259E94980O7557k9897j41096r7554K36238J68158k9499N9661k28373j64112
16249D36063o0117O944K03795j27968M4928r2802P0115P6645m1947L4098q5393
16238D64361n847J3062J09979j35028N0824J5371J71372R0898j41002M4514m9151
16227F29353L7696J21097n1784j29638K90336m4055k22652j00752K88339O5651
$$ plain form
16217 883591 843921 779109 813998 770052 246770 313716 581339 840043 841488 756997 916068
16206 916068 729658 705826 664393 667554 976349 1135650 913379 769380 791245 1079547
16196 1079547 573630 416358 511118 718920 650833 566183 710421 540477 377698 504087
16186 504087 526034 555368 624977 695094 862468 859430 713583 462407 332568 689283 939489
16175 939489 740315 766867 690576 769521 803393 935948 835620 1005717 846675 870498
16165 870498 859256 863998 660729 535430 553046 661674 907250 802302 794329 908942 814951
16154 814951 955299 1181166 1367280 1037629 705869 692841 892040 940478 817788 1341971
16144 1341971 1113237 1078358 955938 796136 862983 763509 801367 880455 861749 978370
$$ packed form
16217H83591l9670o4812L4889m3946n23282O6946K67623K58704J445q4491J59071
16206I16068j86410k3832m1433L161L08795J59301k22271j43999K1865K88302
16196A079547n05917j57272R4760K07802o8087q4650J44238j69944j62779J26389
16186E04087K1947K9334O9609P0117J67374l038j45847k51176j29839L56715K50206
16175I39489j99174K6552p6291P8945L3872J32555j00328J70097j59042K3823
16165H70498j1242M742k03269j25299J7616J08628K45576j04948p973J14613r3991
16154H14951J40348K25867J86114l29651l31760j3028J99199M8438j22690N24183
16144A341971k28734l4879j22420j59802O6847r9474L7858P9088j8706J16621
$$ plain form
16134 978370 730128 814455 855654 926316 1367314 1258341 1226100 1095953 788788 896693
16124 896693 1078263 1020721 1021546 996336 689510 689221 667445 768963 877530 793212 876894
16113 876894 1044365 719936 712052 802206 879146 926007 910596 963857 880225 959654 875700
16102 875700 1013039 631385 837564 1087890 845217 531632 580093 834140 982803 683758
16092 683758 874276 1126575 1039770 639644 526618 771461 655861 733037 613835 616267
16082 616267 606308 1121024 1331944 899344 965971 1215555 1144116 1242780 1207746 978291 946181
16071 946181 885215 930826 926129 942289 1107409 1121578 759620 863649 758068 1009801 803782
16060 803782 868275 810529 727411 872497 1041747 825076 887115 795402 672727 842841
$$ packed form
16134I78370k48242Q4327M1199P0662M40998j08973l2241j30147l07165J07905
16124H96693J81570n7542Q25k5210l06826k89k1776J01518J08567q4318Q3682
16113H76894J67471l24429p884R0154P6940M6861j5411N3261q3632P9429q3954
16102H75700J37339l81654K06179K50326k42673l13585M8461K54047J48663k99045
16092F83758J90518K52299q6805m00126j13026K44843j15600P7176j19202K432
16082F16267r959N14716K10920m32600O6627K49584p1439R8664l5034k29455l2110
16071I46181o0966M5611m697J6160J65120J4169l61958J04029j05581K51733k06019
16060H03782O4493n7746q3118J45086J69250k16671O2039r1713j22675J70114
$$ plain form
16050 842841 1269118 1350261 1010413 1181244 1262690 1374500 1209093 1387226 1271443 949674
16040 949674 882718 1120044 1067446 1363382 1504610 1368220 807675 951989 1146272 1172574
16030 1172574 1186514 1112483 673196 693216 775547 1034921 1058314 995649 1193560 1150041 890793
16019 890793 861782 600730 315388 675961 1009167 1003124 1032650 1061167 887185 525802
16009 525802 346856 281479 528511 749060 815035 930481 1014498 1143709 1021385 1138058
15999 1138058 897720 636969 487257 450189 455201 697983 1024039 1060791 1014165 1088545
15989 1088545 709472 743662 1134876 1341029 963002 671219 763131 697763 589091 980679
15979 980679 943650 909494 782635 872152 992758 772112 1051255 1014027 809919 1044783
$$ packed form
16050H42841M26277Q1143l39848J70831Q1446J11810j65407J78133j15783l21769
16040I49674o6956K37326n2598K95936J41228j36390n60545J44314J94283K6302
16030A172574J3940p4031m39287K0020Q2331K59374K3393o2665J97911m3519k59248
16019H90793k9011k61052k85342L60573L33206o043K9526K8517j73982l61383
16009E25802j78946o5377K47032K20549O5975J15446Q4017J29211j22324J16673
15999A138058k40338k60751j49712l7068N012K42782L26056L6752m6626P4380
15989A088545l79073L4190L91214K06153l78027k91783R1912o5368j08672L91588
15979I80679l7029l4156j26859Q9517J20606k20646K79143l7228k04108K34864
$$ plain form
15969 1044783 845293 748979 939467 671010 901343 825105 995170 1073556 788813 798484
15959 798484 848200 736618 609753 771812 1188682 1436462 1242079 1128768 984121 1121447
15949 1121447 925460 972471 1287632 1170990 1159798 1021289 968774 648041 1127282 1294901
15939 1294901 956183 572863 649386 751121 806137 841269 686246 1004070 1227129 929229
15929 929229 734680 666054 858079 1097334 990215 1112245 1059196 860611 765053 610958
15919 610958 618990 821788 725684 911673 1000089 795158 1042883 956568 901099 982224 812866
15908 812866 943493 647012 604832 1045607 1058387 1055290 845025 444330 695362 919157
15898 919157 1237767 1410842 957326 774379 901595 1200964 1478547 1147283 1271324 1175244
$$ packed form
15969A044783j99490r6314J90488k68457K30333p6238J70065P8386k84743R671
15959G98484M9716j11582j26865J62059M16870K47780j94383j13311j44647J37326
15949A121447j95987M7011L15161j16642j1192j38509n2515l20733M79241J67619
15939A294901l38718l83320P6523J01735N5016L5132j55023L17824K23059k97900
15929I29229j94549o8626J92025K39255j07119J22030n3049j98585r5558j54095
15919F10958Q032K02798r6104J85989Q8416k04931K47725q6315n5469Q1125j69358
15908H12866J30627k96481m2180M40775J2780l097k10265m00695K51032K23795
15898I19157L18610J73075m53516j82947J27216K99369K77583l31264J24041r6080
$$ plain form
15888 1175244 1178878 1394832 1258401 1157578 995132 1110178 1059924 914195 856113 899548
15878 899548 909870 910707 1018024 1078010 1113201 984764 1057025 893063 1081653 1317275 1383797
15867 1383797 1175062 1009134 875348 671311 859003 805125 708898 781272 938870 966522
15857 966522 561588 746547 1158782 922605 936234 944505 705654 974820 744235 335639
15847 335639 498196 580405 854438 843465 809622 771924 819960 869391 876603 598456 600863
15836 600863 953630 733163 799631 823658 1035390 1026973 859749 991469 1094501 699234
15826 699234 536303 999810 1032348 934684 1020296 1075865 1052059 1116251 1168896 1231027 936514
15815 936514 978197 983152 1091166 1197704 823165 722356 857833 1181427 1294812 1022850
$$ packed form
15888A175244L634K15954j36431j00823j62446J15046n0254j45729n8082M3435
15878H99548J0322Q37J07317N9986L5191j28437P2261j63962J88590K35622O6522
15867A383797k08735j65928j33786k04037J87692n3878r6227P2374J57598K7652
15857I66522m04934J84959M12235k36177J3629Q271k38851K69166k30585m08596
15847C35639J62557Q2209K74033j0973l3843l7698M8036M9431P212k78147K407
15836F00863L52767k20467O6468K4027K11732q417j67224J31720J03032l95267
15826F99234j62931M63507L2538r7664Q5612N5569k3806O4192N2645O2131k94513
15815I36514M1683M955J08014J06538l74539j00809J35477L23594J13385k71962
$$ plain form
15805 1022850 1286530 1211818 1244435 1037196 1028056 1116133 939680 1076259 1210799 1292523
15795 1292523 920995 845838 857583 1046682 1068019 1156382 1044149 1321987 1084776 889508
15785 889508 1186033 845139 605979 782188 833737 752347 991356 1023304 899173 836779
15775 836779 983785 807558 764600 670230 827800 901375 884063 867523 1015717 1142857
15765 1142857 873638 760879 747487 893242 1006159 892421 837671 796900 622263 730545
15755 730545 1069776 1315184 1460046 1282567 924365 862441 757588 1028370 959132 925007
15745 925007 1129562 1129550 808160 601702 974082 1020697 1333560 936677 880879 889604 921227
15734 921227 903685 1065803 921793 727865 1138023 1016679 752870 962661 892126 993908
$$ packed form
15805A022850K63680p4712L2617k07239r140Q8077j76453J36579J34540Q1724
15795A292523l71528p5157J1745J89099K1337Q8363j12233K77838k37211j95268
15785H89508K96525l40894k39160J76209N1549q1390K39009L1948j24131o2394
15775H36779J47006j76227m2958r4370J57570P3575j7312j6540J48194J27140
15765A142857k69219j12759j3392J45755J12917j13738n4750m0771j74637J08282
15755G30545L39231K45408J44862j77479l58202o1924j04853K70782o9238l4125
15745I25007K04555j2l21390k06458L72380M6615L12863l96883n5798Q725L1623
15734I21227j7542J62118j44010j93928M10158j21344k63809K09791p0535J01782
$$ plain form
15724 993908 1114537 1087892 909728 923332 831240 869576 959490 630476 661976 917382 1125677
15713 1125677 1013674 1201327 1029377 1192471 879935 1106506 991672 822922 944209
15704 944209 789845 949722 980378 958968 969144 1157359 1089301 1306151 1202888 1103328
15694 1103328 682067 768330 971117 957800 1101858 834815 806571 856600 957040 969892
15684 969892 1227037 1051036 1095964 1253476 1640153 1605222 1160486 1074370 1288830 1157740
15674 1157740 1120839 1540095 1475421 1362500 1312147 1419447 1296666 1027894 970722 1317922
15664 1317922 1393144 1075703 1200653 1286892 1066852 779539 608180 951406 1221591 1031994
15654 1031994 1081336 830654 1054631 959526 966279 836388 734772 938855 569085 915314
$$ packed form
15724I93908J20629k6645j78164J3604r2092L8336Q9914l29014L1500K55406K08295
15713A125677j12003J87653j71950J63094l12536K26571j14834j68750J21287
15704I44209j54364J59877L0656k1410J0176J88215o8058K16850j03263r9560
15694A103328m21261Q6263K02787j3317J44058k67043k8244N0029J00440J2852
15684I69892K57145j76001M4928J57512L86677l4931m44736q6116K14460j31090
15674A157740l6901M19256o4674j12921n0353J07300j22781k68772n7172L47200
15664A317922P5222l17441J24950Q6239k20040k87313j71359L43226K70185j89597
15654A031994M9342k50682K23977r5105O753j29891j01616K04083l69770L46229
$$ plain form
15644 915314 1049010 816426 946724 906153 967814 1080362 892364 1029241 1116959 901786
15634 901786 1282852 1365520 1126053 953461 928891 1049838 1451231 1124979 884829 867407
15624 867407 847051 1140292 1186631 725002 750056 629004 746198 716181 744811 891014
$$ packed form
15644I15314J33696k32584J30298m0571O1661J12548j87998J36877Q7718k15173
15634I01786L81066Q2668k39467j72592k4570J20947M01393l26252k40150j7422
15624H67407k0356K93241M6339m61629K5054j21052J17194l0017K8630J46203
$$ [...]
##END NTUPLES=NMR SPECTRUM
##END=
