##TITLE=1H_TG-2406-1
 200.13Hz, CDCl3.
 8 sc
 
 29.4.2026
##JCAMPDX= 6.0         $$ Bruker NMR JCAMP-DX V2.0
##DATA TYPE= NMR SPECTRUM
##DATA CLASS= NTUPLES
##ORIGIN= UXNMR, Bruker Analytische Messtechnik GmbH
##OWNER= pz
$$ XWIN-NMR		Version 3.5
$$ Wed Apr 29 14:00:26 2026 Russian Standard Time (UT+4h)  she@DPX200
##.OBSERVE FREQUENCY= 200.1313
##.OBSERVE NUCLEUS= ^1H
##.ACQUISITION MODE= SIMULTANEOUS
##.ACQUISITION SCHEME= undefined
##.AVERAGES= 8
##.DIGITISER RES= 18
##SPECTROMETER/DATA SYSTEM= spect
##.PULSE SEQUENCE= zg30
##.SOLVENT NAME= CDCl3
##.SHIFT REFERENCE= (INTERNAL, CDCl3, 0, 15.4703)
##AUDIT TRAIL= $$ (NUMBER, WHEN, WHO, WHERE, WHAT)
$$ ##TITLE= Audit trail, XWIN-NMR		Version 3.5
$$ ##JCAMPDX= 5.01
$$ ##ORIGIN= Bruker BioSpin GmbH
$$ ##OWNER= she
$$ F:/spectra/data/she/nmr/H-C/1/pdata/1/auditp.txt
$$ ##AUDIT TRAIL=  $$ (NUMBER, WHEN, WHO, WHERE, WHAT)
(   1,<2026-04-29 13:58:50.79 +0400>,<she>,<DPX200>,
      <created by zg, POWCHK disabled, PULCHK disabled
       configuration hash MD5:
       00 E9 B6 7A A2 85 ED C7 34 08 36 98 17 FE 4E 26
       data hash MD5: 16K
       1B 79 FC 74 A8 B4 43 BC 6F 49 B6 E4 42 50 98 CA>)
(   2,<2026-04-29 13:58:52.98 +0400>,<she>,<DPX200>,
      <Start of raw data processing
       efp BC_mod = 2 LB = 0.25 FT_mod = 6 PKNL = 1 PHC0 = -4060.637 PHC1 = 8.392291 SI = 16K 
       data hash MD5: 16K
       B6 0F 69 4A 81 22 74 5E 6F BB F9 FA E5 86 A3 BD>)
(   3,<2026-04-29 13:59:19.78 +0400>,<she>,<DPX200>,
      <pk PHC0 = 1.00011 PHC1 = 1.8 
       data hash MD5: 16K
       B3 27 35 F3 CE 70 1A 9E 8D 66 AA A2 8C 2D 29 DD>)
(   4,<2026-04-29 13:59:26.93 +0400>,<she>,<DPX200>,
      <abs ABSG = 5 
       data hash MD5: 16K
       7B E7 20 D3 00 8C A3 42 FA 0B F9 61 B1 EA 63 CE>)
$$ ##END=
$$ 
$$ hash MD5
$$ 43 DB C0 3E D2 68 DE B5 73 19 0E EB C6 9E 8C 1A
##$RELAX= 
##$RELAX= 
##$RELAX= 
##$RELAX= 
##$RELAX= 
##$RELAX= 
$$ Bruker specific parameters
$$ --------------------------
##$DU= <F:/spectra>
##$EXPNO= 1
##$NAME= <H-C>
##$PROCNO= 1
##$TYPE= <nmr>
##$USER= <she>
##$AMP= (0..31)
100 100 100 100 100 100 100 100 100 100 100 100 100 100 100 100 100 100 
100 100 100 100 100 100 100 100 100 100 100 100 100 100 
##$AQSEQ= 0
##$AQ_mod= 1
##$AUNM= <au_zg>
##$AUTOPOS= <>
##$BF1= 200.13
##$BF2= 200.13
##$BF3= 200.13
##$BF4= 200.13
##$BF5= 200.13
##$BF6= 200.13
##$BF7= 200.13
##$BF8= 200.13
##$BYTORDA= 1
##$CFDGTYP= 0
##$CFRGTYP= 5
##$CHEMSTR= <none>
##$CNST= (0..31)
1 1 145 1 1 1 1 1 1 1 1 1 1 1 1 1 1 1 1 1 1 1 1 1 1 1 1 1 1 1 1 1 
##$CPDPRG= <>
##$CPDPRG1= <>
##$CPDPRG2= <>
##$CPDPRG3= <>
##$CPDPRG4= <mlev>
##$CPDPRG5= <mlev>
##$CPDPRG6= <mlev>
##$CPDPRG7= <mlev>
##$CPDPRG8= <mlev>
##$CPDPRGB= <>
##$CPDPRGT= <>
##$D= (0..31)
0 0.7 0 0 0 0 0 0 0 0 0 0.03 0 0 0 0 0 0 0 0 0 0 0 0 0 0 0 0 0 0 0 0 
##$DATE= 1777456730
##$DBL= (0..7)
120 120 120 120 120 120 120 120 
##$DBP= (0..7)
150 150 150 150 150 150 150 150 
##$DBP07= 0
##$DBPNAM0= <>
##$DBPNAM1= <>
##$DBPNAM2= <>
##$DBPNAM3= <>
##$DBPNAM4= <>
##$DBPNAM5= <>
$$ [...]
##$SUBNAM3= <"">
##$SUBNAM4= <"">
##$SUBNAM5= <"">
##$SUBNAM6= <"">
##$SUBNAM7= <"">
##$SUBNAM8= <"">
##$SUBNAM9= <"">
##$SW= 18.0517328524113
##$SWIBOX= (0..15)
0 0 2 0 0 0 0 0 0 0 0 0 0 0 0 0 
##$SW_h= 3612.71676300578
##$TD= 16384
##$TD0= 1
##$TE= 0
##$TE2= 300
##$TE3= 300
##$TEG= 300
##$TL= (0..7)
0 120 120 120 120 120 120 120 
##$TP= (0..7)
150 150 150 150 150 150 150 150 
##$TP07= 0
##$TPNAME0= <>
##$TPNAME1= <>
##$TPNAME2= <>
##$TPNAME3= <>
##$TPNAME4= <>
##$TPNAME5= <>
##$TPNAME6= <>
##$TPNAME7= <>
##$TPOAL= (0..7)
0.5 0.5 0.5 0.5 0.5 0.5 0.5 0.5 
##$TPOFFS= (0..7)
0 0 0 0 0 0 0 0 
##$TUNHIN= 0
##$TUNHOUT= 0
##$TUNXOUT= 0
##$USERA1= <user>
##$USERA2= <user>
##$USERA3= <user>
##$USERA4= <user>
##$USERA5= <user>
##$V9= 5
##$VALIST= <valist>
##$VCLIST= <CCCCCCCCCCCCCCC>
##$VD= 0
##$VDLIST= <DDDDDDDDDDDDDDD>
##$VPLIST= <PPPPPPPPPPPPPPP>
##$VTLIST= <TTTTTTTTTTTTTTT>
##$WBST= 1024
##$WBSW= 4
##$XGAIN= (0..3)
0 0 0 0 
##$XL= 0
##$YL= 0
##$YMAX_a= 552761
##$YMIN_a= -599690
##$ZGOPTNS= <>
##$ZL1= 120
##$ZL2= 120
##$ZL3= 120
##$ZL4= 120
##$ABSF1= 18.09324
##$ABSF2= 0.04134369
##$ABSG= 5
##$ABSL= 3
##$ALPHA= 0
##$AQORDER= 0
##$ASSFAC= 0
##$ASSFACI= 0
##$ASSFACX= 0
##$ASSWID= 0
##$AUNMP= <proc_1d>
##$AZFE= 0.1
##$AZFW= 0.1
##$BCFW= 0
##$BC_mod= 2
##$BYTORDP= 0
##$COROFFS= 0
##$CY= -3
##$DATMOD= 1
##$DC= 0
##$DFILT= <>
##$DTYPP= 0
##$F1P= 0
##$F2P= 0
##$FCOR= 1
##$FTSIZE= 16384
##$FT_mod= 6
##$GAMMA= 0
##$GB= 0
##$INTBC= 1
##$INTSCL= 3.241238e-09
##$ISEN= 128
##$LB= 0.25
##$LEV0= 0
##$LPBIN= 0
##$MAXI= 10000
##$MC2= 0
##$MEAN= 0
##$ME_mod= 0
##$MI= 1.114404
##$NCOEF= 0
##$NC_proc= -5
##$NLEV= 6
##$NOISF1= 3.799351
##$NOISF2= 2.8
##$NSP= 0
##$NTH_PI= 0
##$NZP= 0
##$OFFSET= 15.47034
##$PC= 1
##$PHC0= -4059.637
##$PHC1= 10.19229
##$PH_mod= 1
##$PKNL= yes
##$PPARMOD= 0
##$PSCAL= 0
##$PSIGN= 0
##$REVERSE= no
##$SF= 200.130010279312
##$SI= 16384
##$SIGF1= 3
##$SIGF2= 2
##$SINO= 0.751879
##$SIOLD= 32768
##$SREGLST= <19F.Aceton>
##$SSB= 0
##$STSI= 16384
##$STSR= 0
##$SW_p= 3612.71676300578
##$SYMM= 0
##$S_DEV= 0
##$TDeff= 16384
##$TDoff= 0
##$TI= <>
##$TILT= no
##$TM1= 0
##$TM2= 0
##$TOPLEV= 0
##$USERP1= <user>
##$USERP2= <user>
##$USERP3= <user>
##$USERP4= <user>
##$USERP5= <user>
##$WDW= 1
##$XDIM= 16384
##$YMAX_p= 291176025
##$YMIN_p= -968945
$$ End of Bruker specific parameters
$$ ---------------------------------
##NTUPLES= NMR SPECTRUM
##VAR_NAME=  FREQUENCY,     SPECTRUM/REAL,   SPECTRUM/IMAG
##SYMBOL=    X,             R,               I
##VAR_TYPE=  INDEPENDENT,   DEPENDENT,       DEPENDENT
##VAR_FORM=  AFFN,          ASDF,            ASDF
##VAR_DIM=   16384,         16384,           16384
##UNITS=     HZ,            ARBITRARY UNITS, ARBITRARY UNITS
##FACTOR=    0.220516191357247, 1,           1
##FIRST=     3096.0792582123, 0,             0
##LAST=      -516.63750479348, 0,            0
##MIN=       -516.63750479348, -968945,      0
##MAX=       3096.0792582123, 291176025,     0
$$ Real data points
##PAGE= N=1
##DATA TABLE= (X++(R..R)), XYDATA
$$ [...]
6044A809800J7052j02444l6347J0432p130o9569j8164M7612P9490N0534O5509
$$ 1809800 1826852 1724408 1688061 1698493 1691363 1621794 1603630 1651242 1730732 1781266 1846775
6033A846775j18853j39474l428N2296J14166O855K0059L2150M8416L2596l4720
$$ 1846775 1727922 1588448 1585020 1637316 1751482 1758337 1778396 1810546 1858962 1891558 1856838
6022A856838Q1891l771l4990L6355L5176N3788K9871L4172J41541J46793N0313
$$ 1856838 1938729 1934958 1899968 1936323 1971499 2025287 2055158 2089330 2230871 2377664 2427977
6011B427977J56967Q0167Q2273J68348J16892J32637R6280J35311L6978N7286
$$ 2427977 2584944 2665111 2747384 2915732 3032624 3165261 3261541 3396852 3433830 3491116
6001C491116P9134P557M4975R3444N5565N1939Q3100J61557K39810K32200K90245
$$ 3491116 3570250 3577807 3622782 3716226 3771791 3823730 3906830 4068387 4308197 4540397 4830642
5990D830642L65836L08467L22548L52566M93543N58820M01456L01832J89538J00376
$$ 4830642 5196478 5504945 5827493 6180059 6673602 7232422 7633878 7935710 8125248 8225624
5980H225624R6259l051m9090m7655o3634L8514K14849K41109L57929N09577O53981
$$ 8225624 8321883 8318832 8269742 8222087 8158453 8196967 8411816 8652925 9010854 9520431 10174412
5969A0174412O51000Q25245P11868M85590N37137M61299K58850J85821P0787k8864
$$ 10174412 10825412 11650657 12362525 12848115 13385252 13846551 14105401 14291222 14362009 14333145
5959A4333145k06030l21323j39961j35898j04984l7497L2335K00146L98408N26783
$$ 14333145 14127115 13805792 13665831 13529933 13424949 13387452 13419787 13619933 14018341 14545124
5949A4545124P48177Q50681J132095J128950J035433O61702L94293J08720j70310
$$ 14545124 15293301 16143982 17276077 18405027 19440460 20102162 20496455 20605175 20434865
5940B0434865l94499o23677n54631o84883n81206m47775k87155j58628L5003J25841
$$ 20434865 20040366 19416689 18862058 18177175 17595969 17148194 16861039 16702411 16737414 16863255
5930A6863255K24874K87109M44529L64815M04663M85716L52494M58770M31313
$$ 16863255 17088129 17375238 17819767 18184582 18589245 19074961 19427455 19886225 20317538
5921B0317538J44243k43610k83662n17982o54014o63513p24980o59793m72580
$$ 20317538 20461781 20218171 19934509 19416527 18762513 18099000 17374020 16714227 16241647
5912A6241647m29164k48894j23514J6837J04599K07839L00948J25971j5531l90176
$$ 16241647 15812483 15563589 15440075 15456912 15561511 15769350 16070298 16196269 16180738 15790562
5902A5790562l37079m02899n52998p25880o21525n70830n35297m73561m14497
$$ 15790562 15453483 15050584 14497586 13771706 13150181 12579351 12044054 11570493 11155996
5893A1155996k84652l10555j95057j86415q9082j20273M3961q5779k37199k37814
$$ 11155996 10871344 10560789 10365732 10179317 10090235 9969962 10013923 9928144 9690945 9453131
5883I453131l73317l03016k96826m41233m56603l62327l55934m16636m07502m47582
$$ 9453131 9079814 8776798 8479972 8038739 7582136 7219809 6863875 6447239 6039737 5592155
5873E592155l99267k45198k31872k59615j37194j86510j22596N5168M589m4876
$$ 5592155 5192888 4947690 4715818 4456203 4319009 4132499 4009903 4065071 4069660 4024784
5863D024784q8744j48497j43440k22669j53160j95254k36861j88816k25625k01741
$$ 4024784 3936040 3787543 3644103 3421434 3268274 3073020 2836159 2647343 2421718 2219977
5853B219977n5390j30805j31379o464o7496p3215r9022n6825r4128p2013k2408
$$ 2219977 2164587 2033782 1902403 1895939 1828443 1755228 1656206 1599381 1505253 1433240 1410832
5842A410832J1521r7166p420l9004k5511j76438n6324j5340k8250j2414L2273
$$ 1410832 1422353 1325187 1317767 1278763 1253252 1076814 1020490 1005150 976900 964486 996759
5831I96759r349M0634q3420o9417R1363J67j3875j0812N827j30265n1991j1778
$$ 996759 987410 1028044 944624 875207 966570 966737 952862 942050 947877 817612 765621 753843
5819G53843O8487M7350k1407j0883k3620J4103l3743O2160o876K008o7247K0696
$$ 753843 822330 869680 848273 837390 813770 827873 794130 856290 849414 851422 784175 804871
5807H04871N7877n2115r956j0159j7536q3974p084O7645Q1512o3715l0147N600
$$ 804871 862748 810633 800677 790518 772982 689008 681924 749569 831081 767366 737219 742819
5795G42819O1919m9818M556N3497j1947j1010L9723j8711j014r1900K5961J02332
$$ 742819 804738 754920 759476 812973 801026 790016 829739 811028 810014 718114 744075 846407
5783H46407n5648p9576M8010L5795k056p397m9101N4423K5261p2998j2122O9825
$$ 846407 790759 711183 759193 794988 792932 785535 736434 790857 816118 743120 730998 800823
5771H00823L0131P4655L3343k1221R979K5732k9366o0612J7795L9948K264N7458
$$ 800823 830954 905609 938952 917731 927710 953442 924076 863464 881259 921207 923471 980929
5759I80929j8613m3910K5889M8028k3314K5831L6620M1060J08759o5112P8424
$$ 980929 962316 918406 944295 992323 969009 994840 1031460 1072520 1181279 1116167 1194591
5748A194591R9212O9963R1842J67906K88390M75035Q05012J177314Q17182k1889
$$ 1194591 1293803 1363766 1455608 1623514 1911904 2386939 3191951 4369265 5186447 5164558
5738E164558m41516p03271n47321m15083l93141k39721k82005k55992j40266j13545
$$ 5164558 4723042 4019771 3472450 3057367 2664226 2424505 2142500 1886508 1746242 1632697
5728A632697n7400l6530L842M0551O3154J01254m4211J2813j7198Q9214J79844
$$ 1632697 1575297 1538767 1542609 1583160 1646314 1747568 1703357 1716170 1698972 1788186 1968030
5717A968030J55955K60833K62336L83361N07146R13900J619934K556456L279975
$$ 1968030 2123985 2384818 2647154 3030515 3537661 4451561 6071495 8627951 11907926
5708A1907926K251134k18385j728393j851868j716982j445284j168325r94439
$$ 11907926 14159060 13940675 12212282 10360414 8643432 7198148 6029823 5035384
5700E035384p87769o18961m78245l39699k84318m9430k12234p5819M6571q1085
$$ 5035384 4247615 3628654 3150409 2810710 2526392 2476962 2264728 2188909 2235480 2154395
5690B154395o1623O987J30674Q6194J44664Q4540J04332K82623M87577O15594
$$ 2154395 2092772 2099759 2230433 2316627 2461291 2545831 2650163 2932786 3420363 4035957
5680D035957R27814J704847K801095L294812J905289n16608j816224j987917j740674
$$ 4035957 4963771 6668618 9469713 12764525 14669814 14153206 12336982 10349065 8608391
5671H608391j475933j203197r18847q54411o20319m77684m04743j43943k01849
$$ 8608391 7132458 5929261 5010414 4156003 3535684 3058000 2653257 2509314 2307465
5662B307465j88680r7059q3563j54142p373q647K8052m3869l0859K3239J06646
$$ 2307465 2118785 2021726 1938163 1784021 1776648 1768001 1796053 1752184 1721325 1744564 1851210
5651A851210N2585J41728K39582M44398M87363J004073J046930M64085k82345
$$ 1851210 1903795 2045523 2285105 2729503 3216866 4220939 5267869 5731954 5449609
5642E449609p40001n77113n12221m37691m83660l58412j97958j51008j88662j33388
$$ 5449609 4709608 4132495 3620274 3182583 2698923 2340511 2142553 1991545 1802883 1669495
5632A669495p0271o645n7034r5819n9724q9159l1793k9378p4647m4277O1427J24148
$$ 1669495 1599224 1592579 1535545 1439726 1380002 1290843 1259050 1229672 1155025 1110748 1172175 1296323
5620A296323K7948p6825m4757K942K4028p1212j23198M381j31r0974l6380Q1153
$$ 1296323 1324271 1247446 1202689 1205631 1229659 1158447 1035249 1039630 1039499 948525 912145 993298
5608I93298j840P3008l9924l1229l4848O7432l1589p4349M4426n2942n2954J0894
$$ 993298 991458 1064466 1024542 993313 958465 1025897 994308 919959 964385 911443 858489 869383
5596H69383P7367N2465r2320M1702M7647q1255l1630N8277O727m0267O181M0705
$$ 869383 946750 999215 906895 948597 996244 914989 883359 941636 948363 908096 914277 954982
5584I54982l313k3983O3236j3114l1832l5654J7698l1237k9017O3666j5242m9566
$$ 954982 951669 927686 990922 977808 945976 910322 928020 896783 867766 931432 916190 866624
5572H66624o8730R0109P7621M247p7101R007O950n2200K6644J7929n5028M3475
$$ 866624 797894 888003 965624 969871 892770 901777 908727 856527 883171 901100 846072 889547
5560H89547n8167q242n6652N398L2133n4466K5532N173P380k3023k5048k3294
$$ 889547 831380 823138 766486 771884 804017 749551 775083 780256 787636 764613 739565 716271
5548G16271P7274q9811J1589M0999R0147P952n4421K4783q2652k6301N1518P0105
$$ 716271 793545 703734 715323 756322 846469 854421 800000 824783 742131 715830 767348 837453
5536H37453k8750J5478N8132p416m0712R0092k5997l414K3081l5493j3602k3142
$$ 837453 808703 824181 882313 874897 834185 924277 898280 894866 917947 882454 868852 845710
5524H45710M2233L2970q8169o9829M7188l2877P6536j2057L0662J8646m0075q82
$$ 845710 887943 920913 832744 762915 810103 777226 853762 841705 872367 891013 850938 850056
5512H50056m4090N260Q4085M5582K1354j6656j7071J12000J2748j16334k1765
$$ 850056 805966 811226 895311 940893 962247 945591 928520 1040520 1053268 936934 915169
5501I15169K0826L6096k5530o2164O7527O5315q8732q0101K3971J5424k5804l3294
$$ 915169 935995 972091 946561 884397 951924 1017239 928507 848406 872377 887801 861997 828703
5489H28703N5876L3588N9876l5614J1449Q4868L5736L4201k6899N1417N5125P1280
$$ 828703 884579 918167 978043 942429 953878 1038746 1074482 1108683 1081784 1133201 1188326 1259606
5477A259606J21983K67022M95006P57456O97864K33497l49523m72468l27277l57924
$$ 1259606 1381589 1648611 2143617 2901073 3598937 3832434 3482911 3010443 2683166 2325242
5467B325242l32157k50800j98286j64977r7798j48060k6701k68q4213K0797k0557
$$ 2325242 1993085 1742285 1543999 1379022 1281224 1133164 1106463 1106195 1021982 1042779 1022222
5456A022222j7636m2953l0169q5767M8074M0397j08756j3789l3925K2213K8653
$$ 1022222 1004586 961633 931464 845697 893771 934168 825412 811623 777698 799911 828564
5445H28564l1486n0755m2352M5116M6950R907L9065o0256K3970n5710p3715N8048
$$ 828564 797078 746323 703971 749087 796037 805944 845009 784753 808723 753013 679298 737346
5433G37346o650L7609K8409K8687r6236j3400N6375K9594p5551n3958J8607m1813
$$ 737346 730696 768305 796714 825401 729165 715765 772140 801734 726183 672225 690832 649019
5421F49019Q933P4465K0082K4169M2239K1726j924M259j01339q9344Q7273N746
$$ 649019 657952 732417 752499 776668 818907 840633 838709 842968 741629 652285 739558 745304
5409G45304J6531l6447p2494L9557N8075n2245q0449K5708M5286Q7848M175o7577
$$ 745304 761835 725388 652894 692451 750526 698281 617832 643540 688826 776674 780849 713272
5397G13272j4614l2165o162r405P0306k9864k5572P4822O378k8090K0110N7223
$$ 713272 698658 666493 660331 650926 721232 691368 665796 740618 746996 718906 739016 796239
5385G96239L6067J1248l1358L1317j6414n4458o267q8757j8709p986m426R1442
$$ 796239 832306 843554 812196 843513 827099 772641 766374 677617 658908 650922 646496 737938
5373G37938M5992M816m6372p7420j0317M3790K324m0344N0480R4986l5903j35875
$$ 737938 783930 788746 742374 664954 654637 698427 700751 660407 710887 805873 769970 634095
5361F34095Q6505m1046q6011O8565K075Q1913J14249q4684q6336M3292J1268O416
$$ 634095 720600 679554 593543 662108 664183 746096 860345 775661 689325 732617 743885 750301
5349G50301n9151j3075o20k9055r6409M0335J09025M7218Q6582o547q4708l4162
$$ 750301 691150 678075 677455 648400 551991 592326 701351 748569 835151 828604 743896 709734
5337G09734P0917R3336l6343p795j8459M8026l3901m1608O1972m3889m3247k6311
$$ 709734 780651 873987 837644 829849 811390 859416 825515 783907 845879 801990 758743 732432
5325G32432j9846l5418j6855R989j1018L4824J42595j2841K8755n3451n779J9063
$$ 732432 712586 677168 660313 670302 659284 694108 836703 823862 852617 799166 793387 812450
5313H12450o966P8795P046k4160m3328o0400N1971P3496l2669J8428L741r5416
$$ 812450 805484 884279 891325 867165 823837 763437 815408 888904 856235 874663 878404 782988
5301G82988j3773j1267N3421J0842j6978O629L9111P4499l535q1452m6676M8357
$$ 782988 769215 757948 811369 822211 805233 811862 850973 925472 921937 840485 793809 842166
5289H42166r286n4927K4406j2201J4286n3911P8655O721n3721Q0365R231R8644
$$ 842166 832880 777953 802359 790158 804444 750533 829188 835909 782188 862553 871784 970428
5277I70428j47423k4547J1666J3149R3465o9851m8523Q0239o778P708N2946o2605
$$ 970428 823005 798458 810124 823273 916738 846887 798364 878603 871825 879533 932479 869874
5265H69874Q2072k172r1393p2825l7980J09190l2894m8485j9837J3117k0346R1495
$$ 869874 951946 949774 858381 785556 747576 856766 823872 775387 755550 768667 748321 839816
5253H39816m4884R382J58860M2490m2483o2174m7750q506N1397J704L9851k8507
$$ 839816 794932 804314 963174 1005664 963181 901007 853257 844751 896148 897852 937703 909196
5241I09196n5328J2935R014n9314Q611L6478P337j2170q256N2071O2529o2826
$$ 909196 853868 866803 875817 816503 825114 861592 868929 856759 848503 900574 963103 900277
5229I00277l1493L3389j8810n5063L7283O288j2008M0313N9685N7901l7130r4855
$$ 900277 868784 902173 883363 828300 865583 871871 859863 900176 959861 1017762 980632 885777
5217H85777O5193N0088r2931m8736N6779N411O2344j9865q4440j3676r742j2661
$$ 885777 950970 1001058 908127 859391 916170 921581 983925 964060 879620 865944 856202 843541
5205H43541p707O2558o8441N5086k7872L0714r43N6477l6616m4611M4636K4377
$$ 843541 835834 898392 829951 885037 857165 887879 886936 943413 906797 862186 906822 931199
5193I31199J09093K9315j06680l0510O6899O353j5083l4361l0984N7390N5794
$$ 931199 1040292 1069607 962927 932417 999316 1005669 990586 956225 925241 982631 1038425
5182A038425j18993j09925K8466p87P4830M2518l4902m591J9838M0259r8685p574
$$ 1038425 919432 809507 837973 837186 912016 954534 919632 915041 934879 975138 876453 868879
5170H68879K1499O1859N8126m1899k2434K1147O6718l5488m4535M5409R498K5636
$$ 868879 890378 952237 1010363 968464 946030 967177 1033895 998407 953872 999281 1008779 1034415
5158A034415j2718M9881m18k8893n9814N5760K4003M4966q184R596l5451o7784
$$ 1034415 1021697 1071578 1071160 1042267 982453 1038213 1062216 1107182 1098998 1108594 1073143 1005359
5146A005359K6977k8872O6006m1623j205p1922P3748m0565m5707L6751L4089J5006
$$ 1005359 1032336 1003464 1069470 1027847 1026642 954720 1028468 987903 942196 978947 1013036 1028042
5134A028042k0496M6698M4433M3233k3756k5162q8393M8944o802l852o1457L7233
$$ 1028042 1007546 1054244 1098677 1141910 1118154 1092992 1004599 1053543 1046741 1042889 981432 1018665
5122A018665J1337J6264N0088N3949n5143r7189J3497O8670N8514j6958M2598
$$ 1018665 1030002 1046266 1096354 1150303 1095160 997971 1011468 1080138 1138652 1121694 1164292
5111A164292l8294j6468k2696j6258P302N666o061j08835L0042P4711O5957n8126
$$ 1164292 1125998 1109530 1086834 1070576 1077878 1083544 1077483 968648 998690 1073401 1139358 1081232
5099A081232l1389L7323N0180o9042o3678Q9538j6124M6488J08457l3564m0152
$$ 1081232 1049843 1087166 1137346 1068304 1004626 1094164 1078040 1124528 1232985 1199421 1159269
5088A159269N3570K9471O612j14632J07495J9535o665K2981m4141j8449K7482
$$ 1159269 1212839 1242310 1248922 1134290 1241785 1261320 1254655 1277636 1233495 1215046 1242528
5077A242528k2213M830m7998P185n2512M1802L918N1239O6430r4793Q8830n762
$$ 1242528 1220315 1225145 1177147 1184332 1131820 1173622 1177540 1228779 1295209 1200416 1289246 1283484
5065A283484l7740K5502O6770N0520n1826N9502K0124q7928L0630j3800p9030
$$ 1283484 1245744 1271246 1338016 1388536 1336710 1396212 1416336 1328408 1359038 1345238 1266208
5054A266208j5327K8078o7046Q965m3280J0823M0316O0620L668j06013K4576P8410
$$ 1266208 1250881 1278959 1211913 1220878 1177598 1188421 1228737 1289357 1293025 1187012 1211588 1289998
5042A289998M4709N239N067o4275n8407L1634K6763J7138m6057J395L8625J31451
$$ 1289998 1334707 1339946 1345013 1280738 1222331 1253965 1280728 1297866 1251809 1253204 1291829 1423280
5030A423280K4351n2430K7221o8364N2975M0995K6126J49700j8236j07905r1090
$$ 1423280 1447631 1395201 1422422 1354058 1407033 1448028 1474154 1623854 1605618 1497713 1406623
5019A406623L9325M0379m5395j1238O8103m6286j672N1580Q1176O0166M7200p1411
$$ 1406623 1445948 1486327 1440932 1429694 1497797 1451511 1449839 1501419 1582595 1642761 1689961 1618550
5007A618550l968M6270N1439K5074L597k6502K9555N1140P979R2781O9674M9280
$$ 1618550 1614582 1660852 1712291 1737365 1740962 1714460 1744015 1795155 1803134 1895915 1965589 2014869
4995B014869q529J29528J09327J11809J63767L53937N38637Q82626J218903J059692
$$ 2014869 2006340 2135868 2245195 2357004 2520771 2874708 3413345 4295971 5514874 6574566
4985F574566O31228q604n25471p20620q07328o38012o05430m07026m27248k94499
$$ 6574566 7205794 7197190 6671719 5951099 5143771 4505759 3900329 3493303 3066055 2771556
4975B771556j40454k41335q9794j15685n1485m9105m0439M6181j17253j9248L3079
$$ 2771556 2631102 2389767 2299973 2184288 2132803 2083698 2043259 2089440 1972187 1952939 1986018
4964A986018l1764j18000J7825j6351L9865j7874L626J07022m5299p1997J8345
$$ 1986018 1954254 1836254 1854079 1837728 1877593 1859719 1863345 1970367 1925068 1853071 1871416
4953A871416N4337n5498O9527P3120q5838M737J63131N2601l9343k4930L4731
$$ 1871416 1925753 1870255 1939782 2012902 1927064 1931801 2094932 2147533 2108190 2083260 2117991
4942B117991J23439J6345J7427J10323j6204R8598J38227J39596J13718N7941
$$ 2117991 2241430 2257775 2275202 2385525 2369321 2467919 2606146 2745742 2859460 2917401
4932B917401K42509L08721L09746K81279K04683K01479K1583n7023j63263k13169
$$ 2917401 3159910 3468631 3778377 4059656 4264339 4465818 4487401 4430378 4267115 4053946
4922D053946j33262l2518m0077j24088n4481P0297J09590J65384K29006L93993
$$ 4053946 3920684 3888166 3848089 3724001 3669520 3739817 3849407 4014791 4243797 4637790
4912D637790M47464M56666O87976Q64980Q02519N38565L83394J23216j62871n36143
$$ 4637790 5085254 5541920 6229896 7094876 7897395 8435960 8819354 8942570 8779699 8243556
4902H243556q52282r39620p07982o08131n27511l42456j91688k05764j40167j47238
$$ 8243556 7391274 6451654 5743672 5135541 4608030 4265574 4073886 3868122 3727955 3580717
4892C580717j06238p7624L1560K2302j14904l2743J12777N3391Q083L8773O8020
$$ 3580717 3474479 3396855 3428415 3450717 3335813 3303070 3415847 3469238 3477321 3516094 3584114
4881C584114J61948J74393J81435K40040M11213L53860M70731N07979K72677J36722
$$ 3584114 3746062 3920455 4101890 4341930 4753143 5107003 5577734 6085713 6358390 6495112
4871F495112q2160k16420k04031k01188j04768j62605l4228k8724Q0852J63032
$$ 6495112 6412952 6196532 5992501 5791313 5686545 5523940 5489712 5460988 5541840 5704872
4861E704872K32026L92071M42646N18255O24482M80321N72755O13302M89428O13083
$$ 5704872 5936898 6328969 6771615 7289870 7914352 8394673 8967428 9580730 10070158 10683241
4851A0683241Q27514Q41136N28649Q4635j44577l87460l91009n30702m29207m85295
$$ 10683241 11510755 12351891 12880540 12965175 12820598 12433138 12042129 11511427 11082220 10596925
4841A0596925m80057m13419l70524j41339L240r492K07532M15046O71434R39408
$$ 10596925 10116868 9703449 9332925 9191586 9194826 9185334 9392866 9807912 10479346 11418754
4831A1418754R41627Q56387L89398J4042j86502l60592n47589n51969o57472o99502
$$ 11418754 12360381 13216768 13606166 13620208 13433706 13073114 12525525 11973556 11316084 10616582
4821A0616582n94869n39958l89559l08552k54029j11573l2972J150r4185J92474
$$ 10616582 10021713 9481755 9092196 8783644 8529615 8418042 8385070 8386220 8292035 8484509
4811H484509K57393J11407J59444L01670L03140K83556K80646L52310L56941N16479
$$ 8484509 8741902 8853309 9012753 9314423 9617563 9901119 10181765 10534075 10891016 11407495
4801A1407495N62919O50148R28669J087032J343316J489489J459465J000531L77520
$$ 11407495 11970414 12620562 13549231 14636263 15979579 17469068 18928533 19929064 20306584
4792B0306584p3210m48594m33028n31178l84804m17158m80185l89234k09745p7464
$$ 20306584 20233374 19784780 19351752 18820574 18435770 18018612 17538427 17149193 16939448 16861984
4782A6861984J93798L92742Q51898J232024J482861J873737J900462J536274O41764
$$ 16861984 17055782 17448524 18300422 19532446 21015307 22889044 24789506 26325780 26967544
4773B6967544j97752q06005j278467j505929j502191j575185j344973j110947
$$ 26967544 26769792 25963787 24685320 23179391 21677200 20102015 18757042 17646095
4765A7646095r01678n76307l09513N8160K10419L54529O06911K64142j9862m21747
$$ 17646095 16744417 16168110 15858597 15916757 16127176 16481705 17088616 17352758 17332896 16911149
4755A6911149p52814r78762r84784q52415r15659q03979p04272o50644l92383
$$ 16911149 16158335 15179573 14194789 13342374 12426715 11622736 10918464 10267820 9875437
4746I875437l63800l56797k98704l24616j69882j22977o0630j97517r1856K6083
$$ 9875437 9511637 9154840 8856136 8531520 8361638 8238661 8178031 7980514 7888658 7914741
4736G914741q4483j05416j15677r2436r7564K5406K01771J97236L21419M08549
$$ 7914741 7830258 7724842 7609165 7516729 7419165 7444571 7646342 7843578 8164997 8573546
4726H573546O92592Q48334J127349J551492J518829J324221P83483J58864m07607
$$ 8573546 9266138 10114472 11241821 12793313 14312142 15636363 16419846 16578710 16171103
4717A6171103q22844r85593r42627q80866p13874n12743j65600p0545K42239O30849
$$ 16171103 15348259 14362666 13420039 12539173 11825299 11312556 11146956 11076411 11318650 11949499
4707A1949499Q30230J009700J031124P44735J46306m71022q65060j227743j208901
$$ 11949499 12779729 13789429 14820553 15565288 15711594 15240572 14375512 13147769 11938868
4698A1938868j133212j068594r10483p68843n82003n87621m63376m83453k82036
$$ 11938868 10805656 9737062 8826579 8057736 7475733 6888112 6424736 5941283 5659247
4689E659247k15161k32258k23059j91021j58224p2696j93308m4695q6660j0671
$$ 5659247 5444086 5211828 4988769 4797748 4639524 4566828 4373520 4328825 4242165 4231494
4679D231494p761j49896k2412Q0859P165j03662J3978n3671n5559N6393j965p9117
$$ 4231494 4223733 4073837 4051425 4132284 4139449 4035787 4049765 3996094 3940535 3996928 3994963 3915846
4667C915846k1374k9332l529N5546J00456L3777k4570O7875O2574j7957N1768
$$ 3915846 3894472 3865140 3861611 3917157 4017613 4051390 4026820 4094695 4157269 4139312 4191080
4656D191080N1073R0241J3459P064l302Q2955L9036Q5905Q1618J23818J36085
$$ 4191080 4242153 4332394 4345853 4352917 4349615 4432570 4471606 4557511 4639129 4762947 4899032
4645D899032K13693K85211L12001M05973L95171L52463L90675J33928j80162j28797
$$ 4899032 5112725 5397936 5709937 6115910 6511081 6863544 7254219 7388147 7207985 7079188
4635G079188k38558l02206k08873j22546j43018r2938j09489o4494m0295m1931
$$ 7079188 6840630 6538424 6329551 6207005 6063987 5971049 5861560 5797066 5756771 5714840
4625E714840K791M6148J1466O7019P2121R9176K05397J13049J76852J94450K13284
$$ 5714840 5717631 5763779 5775245 5842264 5914385 6013561 6218958 6332007 6508859 6703309 6916593
4614F916593L10765M08918L43209L07196N43457O00648O42643Q19601J104966
$$ 6916593 7227358 7636276 7979485 8286681 8830138 9430786 10073429 10893030 11997996
4605A1997996J361905J643271K035710K362170K487233K211878J509098P51497
$$ 11997996 13359901 15003172 17038882 19401052 21888285 24100163 25609261 26360758
4597B6360758J20632j36231l0052N9096N8794j64234n89100r89546j102607r29639
$$ 26360758 26481390 26345159 26315107 26374203 26432997 26268763 25679663 24690117 23587510 22657871
4587B2657871n40584l90539k77673n5306p2220k09544m04807o72757o88205p34793
$$ 22657871 22117287 21726748 21449075 21393769 21321549 21112005 20707198 20034441 19346236 18611443
4577A8611443q61135p71173o17029m70506l59595k10067Q3448K03260L59768O20860
$$ 18611443 17750308 16979135 16362106 15891600 15532005 15321938 15405386 15608646 15968414 16589274
4567A6589274R12972J192074J646663K175827K483307K802603K973825K918864
$$ 16589274 17502246 18694320 20340983 22516810 25000117 27802720 30776545 33695409
4559C3695409K485133J971899J285429O29205k05133q99344j382817j430304j094017
$$ 33695409 36180542 38152441 39437870 40067075 39861942 38962598 37579781 36149477 35055460
4550C5055460o86877j26008K47351N73711M39486R8214k97284p39977p87681n31352
$$ 35055460 34368583 34242575 34489926 35063637 35503123 35601337 35304053 34564076 33776395 33245043
4540C3245043k79453K2251M7928l48136q59403j162265j508463j532275j504089
$$ 33245043 32965590 32987841 33035769 32687633 31828230 30665965 29157502 27625227 26121138
4531B6121138j482253j226581q98893o26691k58152j983J72770L00771J88640
$$ 26121138 24638885 23412304 22513411 21886720 21628568 21626585 21799355 22100126 22288766
4522B2288766J16964O0705j52079j22511n3006J63099M05947M12020N51467M57218
$$ 22288766 22405730 22466435 22314356 22191845 22138839 22301938 22707885 23119905 23671372 24128590
4512B4128590M16270M14238M51320M09734N25551N83218P13096O17720M99683
$$ 24128590 24544860 24959098 25410418 25820152 26345703 26928921 27642017 28259737 28759420
4503B8759420M40522L67889j25129p51794j283882j618920j927483j944879j783320
$$ 28759420 29199942 29567831 29442702 28690908 27407026 25788106 23860623 21915744 20132424
4494B0132424j648699j458868j288786j027738p90849p92061p07120m53510k49464
$$ 20132424 18483725 17024857 15736071 14708333 13917484 13125423 12418303 11964793 11715329
4485A1715329k21479j5455J65451L85903O14924N04764N68691N43886K08758p0454
$$ 11715329 11493850 11478395 11643846 12029749 12644673 13149437 13718128 14262014 14470772 14400318
4475A4400318k82381n37586p94667r57235r73604r91257p82096o23200o73589
$$ 14400318 14117937 13580351 12785684 11828449 10854845 9863588 9081492 8458292 7784703
4466G784703n13567m49945l15187k89910k99352j77975k10340j87125k44630j03415
$$ 7784703 7271136 6821191 6506004 6216094 5916742 5738767 5528427 5341302 5096672 4993257
4456D993257k0851j25114j64618j48232k330o2208q2456n9094r1972p9557m9357
$$ 4993257 4972406 4847292 4682674 4534442 4532112 4469904 4387448 4328354 4236382 4156825 4107468
4445D107468J8879p2976k2733J0960j15486j16330M9944L9099j5057j20879m30
$$ 4107468 4126347 4053371 4030638 4041598 3926112 3809782 3859726 3898825 3883768 3762889 3762459
4434C762459p7479k9282J6947N7360L9699j24610j14138P7767K9594L5755k8437
$$ 3762459 3684980 3655698 3672645 3730005 3769704 3645094 3530956 3608723 3638317 3674072 3645635
4423C645635m0980l8319J8523m7700l9089n5180m4070Q1496m640M143J8690J561
$$ 3645635 3604655 3566336 3584859 3537159 3498070 3442890 3398820 3480316 3475676 3479819 3498509 3500070
4411C500070k5556o041K1852n2324m8845j9820l9013P1656P6107k3540m3730n4512
$$ 3500070 3474514 3468473 3490325 3438001 3389156 3369336 3330323 3401979 3478086 3454546 3410816 3356304
4399C356304L5898L9827Q0882m9455k962J5791K1727J2551J70034J33721K27565
$$ 3356304 3392202 3432029 3512911 3463456 3460494 3476285 3498012 3510563 3680597 3814318 4041883
4388D041883K12761m4156j05359j55913j11871j19157r2882o4348l8701j25635
$$ 4041883 4254644 4210488 4105129 3949216 3837345 3718188 3625306 3560958 3522257 3396622
4378C396622O5980n4170r916n2493k5632K3125k0868l861m2106j0206K9496n2125
$$ 3396622 3462602 3408432 3398516 3346023 3320391 3343516 3322648 3318787 3276681 3266475 3295971 3243846
4366C243846O8566m1716p675j1266L8073J1774j4755k3740m8358o966j4114M4577
$$ 3243846 3312412 3270696 3263021 3251755 3289828 3301602 3286847 3263107 3214749 3207783 3193669 3238246
4354C238246M8719n000N647j7767o9164R0980q111n0862J7937n5851L3007O4916
$$ 3238246 3286965 3281965 3287612 3269845 3200681 3291661 3283550 3232688 3250625 3194774 3227781 3292697
4342C292697K8239Q7984M6214q1196j2758j0587l4807N0593j5019L7334J8602
$$ 3292697 3320936 3408920 3455134 3373938 3361180 3350593 3315786 3366379 3351360 3388694 3407296
4331C407296m9397r0729J8497R2396L4501n117O42R4056K8299O724Q8629J017
$$ 3407296 3357899 3267170 3285667 3378063 3412564 3407447 3408089 3502145 3530444 3537168 3625797 3626814
4319C626814O5240Q1728J15441J27364K3050R7024P3370K7512J12755K940n3701
$$ 3626814 3692054 3773782 3889223 4016587 4039637 4136661 4210031 4237543 4350298 4353238 4299537
4308D299537J9966J14389N9684J53917R2945M3409J13309M7233K8086M9310N5026
$$ 4299537 4319503 4433892 4493576 4647493 4740438 4783847 4897156 4944389 4972475 5021785 5076811
4297E076811n808J16794L483N1504J55771L5197j9810N3204j1423l0742k4985
$$ 5076811 5071003 5187797 5191280 5242784 5398555 5433752 5413942 5467146 5455723 5424981 5399996
4286E399996R1498o1235K2399j2154M01L6505J8545J9148m5021m8665n4879l8141
$$ 5399996 5491494 5430259 5452658 5440504 5440905 5477410 5495955 5515103 5470082 5421417 5366538 5328397
4274E328397m2867o7554M3964O7462J10642k034P3884Q6796l6367j54222j23061
$$ 5328397 5285530 5217976 5261940 5329402 5440044 5438010 5511894 5598690 5562323 5408101 5285040
4263E285040R2016O9863R2590M3572J96171L6606J67473J05731R719M3512J4756
$$ 5285040 5377056 5446919 5539509 5583081 5779252 5815858 5983331 6089062 6098781 6142293 6157049
4252F157049M5522N2769P2643M7025J54807J84145N1608J46235N4503n555j6591
$$ 6157049 6202571 6255340 6327983 6375008 6529815 6713960 6765568 6911803 6966306 6960751 6944160
4241F944160K0309K0276k191N7244M5871M9542J4053p534k6413n7584l1663q5600
$$ 6944160 6964469 6984745 6982554 7039798 7085669 7135211 7149264 7141730 7115317 7057733 7026070 6940470
4229F940470j17702j43934j03063n6933J41997k2189j2547m2896q7681o4100l5058
$$ 6940470 6822768 6678834 6575771 6518838 6660835 6638646 6626099 6583203 6495522 6431422 6396364
4218F396364j20080j91428r0321j62745o079K7999L3385m6138K7127p0705r6155
$$ 6396364 6276284 6084856 5994535 5831790 5825711 5853710 5887095 5840957 5868084 5797379 5701224
4207E701224r3744p2044r1055p1016J20291K9022k9323L0694K6858o3331m632
$$ 5701224 5607480 5535436 5444381 5373365 5493656 5522678 5493355 5524049 5550907 5487576 5482944
4196E482944K3852j6242j9314m8O1791r191P0431N3438q9655J5739J7963j1845
$$ 5482944 5506796 5490554 5471240 5471192 5532983 5523792 5594223 5647661 5558006 5573745 5591708 5579863
4184E579863o7412n5345l4207l0022J350L4445j4945l1131l839p6375p1337j85701
$$ 5579863 5512451 5457106 5422899 5392877 5394227 5428672 5413727 5382596 5378757 5302382 5231045 5045344
4172E045344j53665j3392q8172l0499l1928p4491k6393M9004m0951m0107j05967
$$ 5045344 4891679 4878287 4790115 4759616 4727688 4653197 4626804 4675808 4634857 4594750 4488783
4161D488783m3394r4827j56774j16195k4334q7149p3465N7820k8160L3488j28821
$$ 4488783 4445389 4350562 4193788 4077593 4053259 3966110 3892645 3950465 3922305 3955793 3826972
4150C826972L0308m248n0471j22266n4531N8931R6761K8408o6824j02205L8127
$$ 3826972 3857280 3853032 3802561 3680295 3625764 3684695 3781456 3809864 3743040 3640835 3678962
4139C678962N5919j09135k4221l3597n9134J0070j9690O75Q7836Q594l2933n9866
$$ 3678962 3734881 3625746 3601525 3567928 3508794 3518864 3499174 3499849 3587685 3596279 3563346 3503480
4127C503480Q244K6167j30n4244j0600J13437k2553p0363k6871j6589k616K4083
$$ 3503480 3511724 3537891 3537761 3483517 3472917 3586354 3563801 3493438 3466567 3449978 3447362 3471445
4115C471445O5059j0052q6143k3139j6932M7429K6537J06255o6140j2983j5177
$$ 3471445 3536504 3526452 3440309 3417170 3400238 3447667 3474204 3580459 3514319 3501336 3486159
4104C486159p9658L2672J38266r5727r7935J30683L0189k2236M2015L1533m8927
$$ 3486159 3406501 3439173 3577439 3481712 3383777 3514460 3544649 3522413 3564428 3595961 3547034
4093C547034L7389O2580K7692m2958n5254l6488Q711p901J2269L285o0996k8178
$$ 3547034 3584423 3647003 3674695 3631737 3576483 3539995 3548706 3540805 3553074 3556359 3495363 3467185
4081C467185O4110Q3657n3798k9746O2176K0739m3664k4607P3375o7113N5587
$$ 3467185 3531295 3614952 3561154 3531408 3593584 3614323 3570659 3546052 3619427 3552314 3607901
4070C607901m2387J8795m9032L2197K419M2390j4199p3481J04061L9158m7769
$$ 3607901 3565514 3584309 3535277 3567474 3569893 3612283 3598084 3524603 3628664 3667822 3620053
4059C620053J868m7873P595k3053O794k9056k437M4369m166K0571J7072O1410
$$ 3620053 3621921 3574048 3581643 3558590 3565384 3536328 3533891 3578260 3574094 3594665 3611737 3673147
4047C673147p3430Q1975O3119K297r111J0645j22711J4542K8929o6685J157N2421
$$ 3673147 3599717 3681692 3744811 3747108 3737997 3748642 3625931 3640473 3669402 3602717 3603874 3656295
4035C656295l3471O5186l2782M1364O7581k9371Q7350N8206r7147o5214Q601o1707
$$ 3656295 3622824 3688010 3655228 3696592 3764173 3734802 3822152 3880358 3783211 3717997 3726598 3664891
4023C664891L9623L6959M6780L4424M3874j8994k7023m3410l9323J38676j4998
$$ 3664891 3704514 3741473 3788253 3822677 3866551 3847557 3820534 3777124 3737801 3876477 3861479
4012C861479J8343J41441n5862k6683J0860n5066M4138N0637K6735k0127k9196
$$ 3861479 3879822 4021263 3965401 3938718 3949578 3894512 3938650 3989287 4016022 3995895 3966699
4001C966699m9634K468P7513p1666l3264M4862j453o1615N6905Q0344l6866o3056
$$ 3966699 3917065 3919533 3997046 3925380 3892116 3936978 3935525 3873910 3930815 4011159 3974293 3911237
3989C911237J05488K6539j14662L6432J3178j4051Q831J01412K1611p4344K4665
$$ 3911237 4016725 4043264 3928602 3965034 3978212 3964161 3972992 4074404 4096015 4021671 4046336
3978D046336O9112P9256k1201K3822l598M7588R301k0548J8459K6073N1011l1196
$$ 4046336 4115448 4194704 4173503 4197325 4193727 4241315 4250616 4230068 4248527 4274600 4325611 4294415
3966D294415L0427k3873q658J05688N8962Q5881k8226P2150k1761p408M8587Q0299
$$ 4294415 4324842 4300969 4292311 4397999 4456961 4542842 4514616 4586766 4565005 4557597 4606184 4686483
3954D686483J35899J6398P5248J6050P1450M433P6449O6529N6161P6556N7217
$$ 4686483 4822382 4838780 4914028 4930078 5001528 5005961 5082410 5148939 5205100 5281656 5338873
3943E338873M0390P9680J0619l4944K9530J51671J09756L3096J89960J05486J75808
$$ 5338873 5379263 5458943 5469562 5434618 5464148 5615819 5725575 5758671 5948631 6054117 6229925
3932F229925J94303J85104J41173K96342J20942P3896P4440Q0017K5775P7326
$$ 6229925 6424228 6609332 6750505 7046847 7167789 7241685 7316125 7396142 7421917 7499243
3922G499243O3008Q4430J29146R0307J70360J94821J78571J95497L60518J42995
$$ 7499243 7562251 7646681 7775827 7866134 8036494 8231315 8409886 8605383 8965901 9108896
3912I108896N4608K22655L53241K40453J90337J66884K72780K01124J72420P2588
$$ 9108896 9163504 9386159 9739400 9979853 10170190 10337074 10609854 10810978 10983398 11055986
3902A1055986P3164J46134K65968L60004L90182M06455M46043M29537K65577M13246
$$ 11055986 11129150 11275284 11541252 11901256 12291438 12697893 13143936 13573473 13839050 14252296
3892A4252296L48702L20584M73832N13274M89893M61944O24652O28138N36943
$$ 14252296 14600998 14921582 15395414 15908688 16398581 16860525 17485177 18113315 18650258
3883A8650258N34580M93198O01564O75609M87949M56470N81827P18901P98788
$$ 18650258 19184838 19678036 20279600 20955209 21443158 21899628 22481455 23200356 23999144
3874B3999144Q47930Q62258R31293R20344R76558R28034R54265R84322R40431
$$ 23999144 24847074 25709332 26640625 27560969 28537527 29465561 30419826 31404148 32344579
3865C2344579Q74767R33397J050705J148478J051043J072494J083925R45737P48588
$$ 32344579 33219346 34152743 35203448 36351926 37402969 38475463 39559388 40505125 41253713
3856D1253713N63459M13976K05051K3967p4184J0669K72545M55658P00921Q09961
$$ 41253713 41817172 42231148 42436199 42460166 42385982 42396651 42669196 43124854 43825775 44635736
3846D4635736Q21176P36152N35625K25233l4759l38704p28631r62578j175170
$$ 44635736 45456912 46193064 46728689 46953922 46919163 46580459 45851828 44889250 43714080
3837D3714080r71671r94311r78044p05816n66697m63881m68146n50442l97275
$$ 43714080 42742409 41748098 40770054 40064238 39497541 39033660 38565514 38015072 37617797
3828C7617797n25179n87752n59230o71106p59423p15612p21441p93459q14062
$$ 37617797 37092618 36504866 35945636 35274530 34515107 33799495 33078054 32284595 31470533
3819C1470533n64459m33439k65929l003K16920M04735M97293O13750O88053N62049
$$ 31470533 30906074 30472635 30206706 30203703 30420623 30825358 31322651 31936401 32624454 33186503
3809C3186503M93360M40173L80557M14693L06502K35238O8144J932k00315n15526
$$ 33186503 33679863 34120036 34500593 34915286 35221788 35457026 35525170 35527102 35326787 34811261
3799C4811261m52258o57715q60323q91021q48894q00765r11749r26927p32643
$$ 34811261 34359003 33701288 32840965 31949944 31101050 30300285 29388536 28461609 27728966
3790B7728966o61888l52749j63119P7730J40924K20964L85257N43333N19509M12570
$$ 27728966 27067078 26714329 26551210 26628940 26769864 26990828 27376085 27919418 28438927 28851497
3780B8851497L12632J36327j5705l0236j69832l38737k56515k69841k93797l35347
$$ 28851497 29164129 29300456 29284751 29254515 29084683 28745946 28489431 28219590 27925793 27590446
3770B7590446k79227k64930j69700r1617N4305J40566J94251K73828O37211P49706
$$ 27590446 27311219 27046289 26876589 26784972 26839277 26979843 27174094 27447922 28085133 28834839
3760B8834839R02576J167967J139439J128219J086719Q11044O33137L76611K32255
$$ 28834839 29737415 30905382 32044821 33173040 34259759 35070803 35703940 36080551 36312806
3751C6312806N1469N8114O5030K2787J19221P3016O903N7187q8645j26712p8681
$$ 36312806 36364275 36422389 36487419 36510206 36629427 36702443 36709346 36766533 36677888 36551176 36472495
3740C6472495R3727L23224M77592N45046O51400P64260N13727Q9494j04810l39830
$$ 36472495 36566222 36889446 37367038 37912084 38563484 39327744 39841471 39930965 39826155 39486325
3730C9486325l56699k50249j9272K95704O63688Q89706J097675J412791J394992
$$ 39486325 39129626 38879377 38860105 39155809 39819497 40709203 41806878 43219669 44614661
3721D4614661J345428J244452J029993Q96067P26007N45877N03394L87746M28842
$$ 44614661 45960089 47204541 48234534 49130601 49856608 50402485 50905879 51293625 51722467
3712E1722467M04336L49037K20899n3858l38068m89949o71075o97544q31726o94484
$$ 51722467 52126803 52475840 52696739 52642881 52304813 51814864 51143789 50446245 49614519 48920035
3702D8920035n33959m89318m12269k91167j66913k90222m94269o51848r12327
$$ 48920035 48386076 47896758 47484489 47193322 47026409 46736187 46241918 45590070 44677743
3693D4677743j123160j282915j275620j394264j301202j264832j325044j289737
$$ 44677743 43554583 42271668 40996048 39601784 38300582 37035750 35710706 34420969
3685C4420969j280561j096537j082097r18213r05868q16547p38027p44526o72115
$$ 34420969 33140408 32043871 30961774 30043561 29137693 28321146 27583119 26838593 26166478
3676B6166478p63753r00940q89843p45348p38031q48116r04105r93608q16573
$$ 26166478 25402725 24501785 23611942 22866594 22128563 21280447 20376342 19382734 18566161
3667A8566161p60983o54436m45204k24939r3828Q8046K11033L59489K97046J67465
$$ 18566161 17805178 17150742 16705538 16480599 16386771 16474817 16685850 17045339 17342385 17509850
3657A7509850K37526J1804m0155j18048k39557l65817n09153l47382j70741k08011
$$ 17509850 17747376 17759180 17719025 17600977 17361420 16995603 16486450 16139068 15968327 15760316
3647A5760316m9005N0433P7162O9666K23671K04999K05610J39947J86310N5268
$$ 15760316 15711311 15761744 15838906 15908572 16132243 16337242 16542852 16682799 16869109 16924377
3637A6924377p3555k47875k63096l83001m76803m15937n52300o89026p40421p05638
$$ 16924377 16850822 16602947 16339851 15956850 15480047 15064110 14511810 13822784 13082363 12376725
3627A2376725p05663n99867o23943m81025l92268k90138k59798j51976k49066
$$ 12376725 11671062 11071195 10447252 9966227 9573959 9283821 9024023 8872047 8622981
3618H622981j57111l0787j37848j38809j11111k35086j86707j95256j93153j47188
$$ 8622981 8465870 8435083 8297235 8158426 8047315 7812229 7625522 7430266 7237113 7089925
3608G089925j89498j99851j75526q1683l0002P2335J3383j6825N4600r1119M946
$$ 7089925 6900427 6700576 6525050 6443367 6413365 6485700 6499083 6482258 6536858 6445739 6450685
3597F450685R8595m5948n6443P0833q2246j87959j94818k05246k34158j07709
$$ 6450685 6549280 6503332 6446889 6517722 6435476 6247517 6052699 5847453 5613295 5505586
3587E505586j94078j98221o4857m9152j7696m2188K9723K1828J0800J5461L7815
$$ 5505586 5311508 5113287 5048430 4999278 4981582 4939394 4969117 4990945 5001745 5017206 5055021
3576E055021j6552j09254j32456j61054j55171j33680j47905m6189p3660j04040
$$ 5055021 5038469 4929215 4796759 4635705 4480534 4346854 4198949 4152760 4079100 3975060
3566C975060j4084M803K3197O7947r764O9474J08513J5026L4800J23811J3887
$$ 3975060 3960976 3965779 3988976 4056923 4047159 4116633 4225146 4240172 4274972 4398783 4412670
3555D412670p1969p0461M4776l1310N5944N1905n5505N179m3437K6563M4729Q9625
$$ 4412670 4340701 4270240 4315016 4283706 4339650 4391555 4336050 4341229 4297792 4324355 4369084 4458709
3543D458709K09776J90136N5128k7095R0514J33628P3248N0829R3984M7998j9281
$$ 4458709 4668485 4858621 4913749 4886654 4977168 5110796 5184044 5234873 5328857 5376855 5357574
3532E357574m166O3833k0364j9689R8249Q5745J53057P2681P0923R6725J52875
$$ 5357574 5353408 5417241 5396877 5377188 5475437 5561182 5714239 5786920 5857843 5954568 6107443
3521F107443J1246L9017J43n2752J992l4404J7137m0398L4406n8623l7667o5439
$$ 6107443 6118689 6157706 6157849 6105097 6107089 6072685 6089822 6049424 6083830 6025207 5987540 5922101
3509E922101l4365n1083j89896n9170N075o0651O0204K5952o774o2040n7465k0579
$$ 5922101 5887736 5836653 5646757 5587587 5592662 5532011 5592215 5618167 5611393 5549353 5491888 5471309
3497E471309P6406J30690j1062R4642J15759J34160K12393K58043L43487L72100
$$ 5471309 5547715 5678405 5667343 5761985 5877744 6011904 6224297 6482340 6825827 7197927
3487G197927N64593Q23542J252593K195286L272564L499359J444438p96586j724960
$$ 7197927 7762520 8586062 9838655 12033941 15306505 18805864 20250302 19453716 17728756
3478A7728756j796212j421034j197363r26650q14405p45106n32397l62645l05854
$$ 17728756 15932544 14511510 13314147 12387497 11573092 10827986 10295589 9932944 9627090
3469I627090j60612j05952j41387o7064j0960k8387K0692O3598J71303J50596
$$ 9627090 9466478 9360526 9219139 9152075 9141115 9112728 9133420 9197018 9368321 9518917
3459I518917K08085K68669L13908N10496P55972J309558K315816M170528O452839
$$ 9518917 9727002 9995671 10309579 10820075 11576047 12885605 15201421 19371949 25824788
3450B5824788O246268J348181k778300l978686l868137l221363k641971k144484
$$ 25824788 32071056 33419237 30640937 26662251 22794114 19572751 16930780 14786296
3442A4786296j890871j409887j069896q85461p58246n74735l24046k98817j83782
$$ 14786296 12895425 11485538 10415642 9530181 8771935 8197200 7873154 7574337 7390555
3433G390555k58409l08840k18180j00096o9401j72852m4341Q9290J28768K22271
$$ 7390555 7132146 6823306 6605126 6505030 6435629 6262777 6218436 6307726 6436494 6658765
3423F658765M26909P54947J239185K199113L078170K650996N05683j444362j944305
$$ 6658765 7085674 7840621 9079806 11278919 14357089 17008085 17513768 16069406 14125101
3414A4125101j741666j432795j205000r74164p82174n95726m43931l76763k53842
$$ 14125101 12383435 10950640 9745640 8771476 7989302 7393576 6949645 6572882 6319040
3405F319040j36291j55672j01849j79681l4920p2042q9096j41142p3210l5922
$$ 6319040 6182749 6027077 5925228 5745547 5710627 5638585 5549489 5408347 5335137 5299215
3395E299215k6457p561p131j39318m3482j19194n6117q0550L4436l3214l2230
$$ 5299215 5272758 5265197 5258066 5118748 5075266 4956072 4899955 4819405 4853841 4820627 4788397
3384D788397K3766j1022l3625N2544M4388R3795J85208K4466P9759R1720J20000
$$ 4788397 4812163 4801141 4767516 4820060 4864448 4958243 5143451 5167917 5247676 5339396 5459396
3373E459396J56165J73825J94954J02064P7558N3269j12909j30597r2791n1114
$$ 5459396 5615561 5789386 5984340 6086404 6163962 6217231 6104322 5973725 5880934 5829820
3363E829820j10558M999m0946R0331P9282K8395P8121J14990N9613J33229J80866
$$ 5829820 5719262 5724261 5683315 5773646 5852928 5881323 5959444 6074434 6134047 6267276 6448142
3352F448142K30598K90022L22504L37194M45928K97826K14251J92390J19057J00436
$$ 6448142 6678740 6968762 7291266 7628460 8074388 8372214 8586465 8778855 8897912 8998348
3342H998348O6802P1198Q168m4715j8073K4439J19918J01437J88136K39105L01781
$$ 8998348 9065150 9136348 9144516 9099801 9081728 9106167 9226085 9327522 9515658 9754763 10056544
3331A0056544M02019M20021M99655M17814M07831L53722L38668L02328K95788
$$ 10056544 10458563 10878584 11378239 11796053 12203884 12557606 12896274 13198602 13494390
3322A3494390K24515P8253J2345r0116p5444k3241K8071l6301Q3259J07338J06264
$$ 13494390 13718905 13797158 13809503 13719387 13643943 13620702 13648773 13612472 13695731 13803069 13909333
3311A3909333J12114J60612J33775N9509J26501O3914M4448l3588l985m740j8625
$$ 13909333 14021447 14182059 14315834 14375343 14501844 14565758 14610206 14576618 14572633 14567893 14549268
3300A4549268J21491J68146K34466M13172M32766K89262M09241L22692K31961
$$ 14549268 14670759 14838905 15073371 15486543 15919309 16208571 16617812 16940504 17172465
3291A7172465L59818M54905O35683R02203J176338J244589J558835J843141K180118
$$ 17172465 17532283 17987188 18622871 19525074 20701412 21946001 23504836 25347977 27528095
3282B7528095K585138K984533L796548M194560M411133M347620L716970K733050
$$ 27528095 30113233 33097766 36894314 41088874 45500007 49847627 53564597 56297647
3274E6297647J587500L52794p72041j637027k596943l144531l600316l756775
$$ 56297647 57885147 58237941 57465900 55828873 53231930 50087399 46487083 42730308
3266D2730308l666090l388904l053336k545347k043800j776611j291558q92687
$$ 42730308 39064218 35675314 32621978 30076631 28032831 26256220 24964662 24071975
3258B4071975o34710k78877j46361j24515R6911K67654J90639K75639N60362P82130
$$ 24071975 23437265 23158388 23012027 22887512 22984423 23252077 23442716 23718355 24278717 25060847
3248B5060847J102731J520923J928994K423769K845205L049785L180100K835042
$$ 25060847 26163578 27684501 29613495 32037264 34882469 37932254 41112354 43947396
3240D3947396K304325J609992O15558j29636o44108j024934j405253j592664j845104
$$ 43947396 46251721 47861713 48477271 48347635 47703527 46678593 45273340 43680676 41835572
3231D1835572k062829k388420k550433k373928k415359k344947k081646j885320
$$ 41835572 39772743 37384323 34833890 32459962 30044603 27699656 25618010 23732690
3223B3732690j615409j489490j339652j250001q34301p06677o80002m24526l93261
$$ 23732690 22117281 20627791 19288139 18038138 17203837 16497160 15817158 15392632 14999371
3214A4999371j29933j56135k166K6344q3345L691L4616J828l5076R7178J25785
$$ 14999371 14869438 14713303 14711137 14737481 14654136 14657827 14692443 14694271 14659195 14756373 14882158
3203A4882158K52032J52217K38802J85892J96492J58408J68687L76707L37265
$$ 14882158 15134190 15286407 15525209 15711101 15907593 16066001 16234688 16611395 16948660
3194A6948660M40084M81255O61762O27407P26828N42858N07338M13959K42841
$$ 16948660 17388744 17869999 18531761 19159168 19885996 20428854 20936192 21350151 21592992
3185B1592992L52718M53042M57896M85544N73026O12034P13683Q87923J070747
$$ 21592992 21945710 22398752 22856648 23342192 23915218 24527252 25240935 26128858 27199605
3176B7199605J478607J926826K550014L454214M420863N965562Q202403J0880657
$$ 27199605 28678212 30605038 33155052 36609266 41030129 46995691 55198094 66078751
3168F6078751J3861409J6581709J7509911J5918842J1844283O214704Q58420k521875
$$ 66078751 79940160 96521869 114031780 129950622 141794905 148009609 148868029 146346154
3160A46346154k964257r52649K461594N329154O069277L998159l29549n933380
$$ 146346154 143381897 142429248 144890842 150219996 156289273 160287432 159957883 154024503
3152A54024503j1061312j4289579j5501341j4848966j3332251j1385145r506980
$$ 154024503 142963191 128673612 113172271 98323305 84991054 73605909 64098929
3145F4098929p704122o089444m971325m027718l331230k790242k261362j996257
$$ 64098929 56394807 50305363 45334038 41306320 37975090 35184848 32923486 30927229
3137C0927229j676824j360998j220164r62899p95928o96555p67024o40788n26784
$$ 30927229 29250405 27889407 26669243 25706344 24910416 24213861 23446837 22806049 22279265
3128B2279265m92956l26305m11788k92322k35784j09463j22477j032Q3638Q9101
$$ 22279265 21786309 21460004 21048216 20755894 20520110 20410647 20288170 20287138 20370776 20459877
3118B0459877J71016K42320K83278L59487M71201O95153Q80569R41869J238906
$$ 20459877 20630893 20873213 21156491 21515978 21987179 22682332 23562901 24504770 25743676
3109B5743676J437389J905060K444541L062342L782988M360376M560609M468230
$$ 25743676 27181065 29086125 31530666 34593008 38375996 42736372 47296981 51765211
3101E1765211L950967L272707K785053K671632L082797L369537L308685K765487
$$ 51765211 55716178 58988885 61773938 64445570 67528367 70897904 74206589 76972076
3093G6972076J997536J354182R46940Q77726O52277J01295n52569j590655j878320
$$ 76972076 78969612 80323794 81270734 82148460 82800737 82902032 82349463 80758808 78880488
3084G8880488j490452m08980J223840K698668L848456L823056L316182K491282
$$ 78880488 77390036 76981056 78204896 80903564 84752020 88575076 91891258 94382540
3076I4382540J955286K344760L626646N880080R251263J3542530J8033617K1883165
$$ 94382540 96337826 98682586 102309232 108189312 117440575 130983105 149016722 170899887
3068A70899887K4313744K3092375J8081301J2214520R182875R721136J0909722
$$ 170899887 195213631 218306006 236387307 248601827 257784702 267505838 278415560
3061B78415560R006145L754320j461342m511902n451124n029095m750167n216867
$$ 278415560 287421705 291176025 289714683 285202781 279751657 274722562 269972395 264755528
3053B64755528o031748o651688o148897m921266m100726m755109p249696j0755867
$$ 264755528 258723780 252072092 245923195 241001929 236901203 232146094 224896398 214140531
3045B14140531j3925162j5783797j5899423j4703345j3064034j1643420j0541523
$$ 214140531 200215369 184431572 168532149 153828804 140764770 129121350 118579827
3038A18579827r537727q552955p015995n042734k654145m64113L45592l27948
$$ 118579827 109042100 100489145 93473150 88430416 85776271 85312158 85657750 85329802
3030H5329802k430769m073592m239352l098452j452555m21254n81947k025175
$$ 85329802 82899033 78825441 74586089 71487637 70035082 69613828 69031881 67006706
3022F7006706l912735n226934n647855n426503m904005m173576l478924l004524
$$ 67006706 63093971 57867037 52219182 46792679 41888674 37715098 34236174 31231650
3014C1231650k521465k090129j736536j383476j075308q89767o71607o04233n50567
$$ 31231650 28710185 26620056 24883520 23500044 22424736 21534969 20863362 20259129 19708562
3005A9708562o22426p99835p63915q00533o72970o96785o60822n74266m20962
$$ 19708562 19086136 18286301 17522386 16721853 16048883 15352098 14691276 14117010 13696048
2996A3696048m81433l65842k08322k66765j76514j130Q2519o7278j48751j95508
$$ 13696048 13214615 12848773 12640451 12373686 12197172 12196042 12278561 12211283 12062532 11867024
2986A1867024k57603l85444l79119l31537k48946k10395k43891k30053j38237
$$ 11867024 11609421 11223977 10844858 10513321 10264375 10053980 9810089 9580036 9441799
2977I441799n5439j03792R6927R6932J71989K65339K32504K25163K96819L2142
$$ 9441799 9386360 9282568 9379495 9476427 9648416 9913755 10146259 10371422 10668241 10700383
2967A0700383j32117k30778l46644m44712m60502m54209m64148m08314l30769
$$ 10700383 10568266 10337488 9990844 9546132 9085630 8631421 8167273 7758959 7428190
2958G428190l09897l15184j41177j40536k1345N2383J10176J04064Q8681K0889
$$ 7428190 7118293 6803109 6661932 6521396 6500051 6552434 6662610 6766674 6855355 6876244
2948F876244k9356n148j25709k78888l62838l49649l19744k68553l26935j70831
$$ 6876244 6846888 6841740 6716031 6437143 6074305 5724656 5404912 5136359 4809424 4638593
2938D638593j3495k4968J3966J05852R9078J94891J76027M2786J03051j0757j06501
$$ 4638593 4625098 4600130 4614096 4719948 4819026 5013917 5189944 5232730 5335781 5325024 5218523
2927E218523j57523j81307l05727j50309k04407j60407j68449j24393m6997J28212
$$ 5218523 5061000 4879693 4573966 4423657 4219250 4058843 3890394 3766001 3719004 3847216
2917C847216Q5953R3587K78297K40470J09342O9408k9774j14698j17092k20849
$$ 3847216 3933169 4026756 4305053 4545523 4654865 4724273 4694499 4579801 4462709 4241860
2907D241860l44316l05129k48939j74376k31874j85455j28193j60960m9887r4816
$$ 4241860 3897544 3592415 3343476 3169100 2937226 2751771 2623578 2462618 2412731 2317915
2897B317915q8763j32071q4760l7763M5746l8990m7503l7054j09198N6415Q9737
$$ 2317915 2229152 2097081 2012321 1974558 2020304 1981314 1933811 1896757 1787559 1843974 1933711
2886A933711L5828j2740l646O7209J02049n7157q0939N012n6344k3184J6670j09051
$$ 1933711 1969539 1956799 1953153 2020362 2122411 2065254 1984315 1989327 1932983 1909799 1926469 1817418
2874A817418R488K8649K0140J9783L2998j21081j84876k7597j01944j61511n5630
$$ 1817418 1826906 1855555 1875695 1895478 1928476 1807395 1622519 1594922 1492978 1331467 1275837
2863A275837m7513m8779p991q6323n7907m7661j3038J3559O057m2329n8326m7794
$$ 1275837 1228324 1179545 1171554 1085231 1027324 979663 966625 980184 986241 943912 885586 837792
2851H37792M5661O7716k5683r1004p2300j9076n9277Q4366J9791r9588M5351r377
$$ 837792 883453 951169 925486 834482 762182 743106 683829 768195 787986 688398 733749 724372
2839G24372m0713k0021l8230k4298M8134R2847K9953j14458J8296n8446k666O39
$$ 724372 683659 663638 625408 601110 649244 742091 772044 657586 675882 617436 614770 615409
2827F15409m8533O1630J51864q607m2326K7599L0593k8709j6289N8815J2877Q3588
$$ 615409 566876 628506 780370 771763 729437 757036 787629 758920 742631 801446 814323 897911
2815H97911J3641j8158J982k5718J6320n3610n4912K7677Q7607K3978J488J388
$$ 897911 911552 893394 895376 869658 885978 832368 777456 805133 892740 916718 918206 919594
2803I19594p2677O484L2965j7658n6471k7117P2134P2148q852Q0980O9142p5897
$$ 919594 846917 853401 886366 868708 812237 785120 857254 929402 920550 1001530 1070672 994775
2791I94775m7385K6470L2666l9235J70213J29234O4052N8355L2155J07609O6536
$$ 994775 947390 973860 1006526 967291 1137504 1266738 1330790 1389145 1421300 1528909 1595445
2780A595445N8087J647M3491L0241L867K0205j4088k7434j07114O737k3360o7401
$$ 1595445 1653532 1655179 1698670 1728911 1732778 1752983 1738895 1711461 1604347 1611084 1587724 1520323
2768A520323o1173J3143l4008j0690P7118k6316r4571r8470n7861j25988n3111
$$ 1520323 1459150 1472293 1438285 1427595 1504713 1478397 1383826 1285356 1227495 1101507 1048396
2757A048396o6381Q213K1014p3496m1931j03565q0569K5784J7931n5173j0144
$$ 1048396 982015 990228 1011242 937746 895815 792250 711681 737465 755396 700223 690079
2746F90079r37r0596m1455O2731N1887l1076o837p0543J2825q1234n6520m4044
$$ 690079 689142 598546 557091 619822 671709 640633 633796 563253 576078 494844 438324 394280
2734C94280n0964R5808q9520L4217L3551p1156J01257p5661j0217j3662r3340
$$ 394280 343316 439124 349604 383821 417372 346216 447473 371812 361595 347933 254593
2723B54593q2292m826N4096M4646k4499L7232m1389m8415L089q138N858L1948
$$ 254593 172301 167475 221571 266217 241718 278950 237561 189146 192235 184097 189955 221903
2711B21903k4867r4294L8085Q1868k7870L1490J7153j0314K427J3593m7004j38599
$$ 221903 197036 102742 140827 222695 194825 226315 243468 233154 235581 249174 202170 63571
2699F3571J7796Q3594L8139L0103L0532k3236O4005k7924j8667L0357p2729Q887
$$ 63571 81367 164961 203100 233203 263735 240499 304504 276580 257913 288270 215541 224428
2687B24428J12018L0851j32037o3880L8144M7669m0848o2303P2124j4759q616
$$ 224428 336446 367297 235260 171380 209524 257193 216345 154042 226166 211407 202791
2676B02791m1461Q9618K7859J9574q4941l6340p3765N102J04920K4979N5186r8470
$$ 202791 161330 250948 278807 298381 213440 177100 103335 108437 213357 238336 293522 195052
2664A95052k9801j8499L3823J8572l07M4360j1039o3891K1579k2577M4357J3554
$$ 195052 165251 146752 180575 199147 198840 243200 232161 168270 189849 167272 211629 225183
2652B25183L3119k7669l1226K7706M1818L3747k4970M8035J11613p6973n4454
$$ 225183 258302 230633 199407 227113 268931 302678 277708 325743 437356 360383 305929
2641C05929O04r0142M0679K9640J2816L531l5165p0398n543L5486K3977J3546
$$ 305929 306533 216391 257070 286710 299526 303057 267892 197494 191951 227437 251414 264960
2629B64960K9543r8386Q4877P6923r7473k0067N989o4053J4586J48284j1567K1501
$$ 264960 294503 196117 280994 357917 260444 240377 246366 182313 196899 345183 333616 355117
2617C55117o2126L563j629J00155J66741L2569R408q9921j0421K0107j30697q1711
$$ 355117 292991 296554 294925 395080 561821 594390 603798 513877 503456 523563 392866 311155
2605C11155J5478q6346n4498K7061L9007l7722q6622O8245O3226J3070m7884Q1493
$$ 311155 326633 240287 185789 212850 251857 214135 127513 195758 258984 272054 224170 305663
2593C05663P073j04929n4802k0558P0476k262j1807o2038q9672k7868Q3622N5123
$$ 305663 312736 207807 153005 132447 202923 200661 188854 126816 37144 9276 92898 148021
2581A48021K489K5193M6200k0702K95m0927L2001l8202L5355l9750l9278n5576
$$ 148021 150510 175703 221903 201201 201496 160569 192570 154368 189723 149973 110695 55119
2569E5119K0815J25999m0264j5582j6671j1242q976J157n8875o268L1232J0772
$$ 55119 75934 201933 161669 146087 129416 118174 109198 110355 51480 45212 76444 87216
2557H7216L2888L7267J958j408j8272P10K8527K8921M328r7697J0404M6816p471
$$ 87216 120104 157371 159329 157921 139649 140359 168886 197807 202135 104438 114842 161658 154187
2544A54187J7456K1489J4205q5048m8984R6967M7706k0077q4339K8226l170K9137
$$ 154187 171643 193132 207337 122289 73305 170272 217978 197901 113562 141788 138618 167755
2532A67755O8942q8876j06114K4729K6052J0063K7593M837k7187l2428N3453J467
$$ 167755 236697 147821 41707 66436 92488 102551 130144 134981 107794 75366 128819 130286
2520A30286k2238p101j9310Q130l3453N6101N4595q1437L5897K5021l0613o2993
$$ 130286 108048 100947 81637 89767 56314 112415 167010 85573 121470 146491 115878 52885
2508E2885M1434K4931n9254R0253N7547j07274j2146K694J8775n8727J794R312
$$ 52885 94319 119250 59996 150249 207796 100522 88376 91070 109845 51118 52912 62224
2496F2224k5926K9262J1815R9025j1911p4673j5243J21654L7721K7071k0334K4237
$$ 62224 36298 65560 77375 176400 164489 89816 74573 196227 233948 261019 240685 264922
2484B64922j0726j00816N9200k0683k4741L2645P289l1614R08O0596Q3781k9002
$$ 264922 254196 153380 212580 191897 167156 199801 207090 175476 176384 236980 320761 291759
2472B91759j11257k7097J7761N9552K9820j0681K6650l8629m8689K2475J15545
$$ 291759 180502 153405 171166 230718 260538 249857 276507 237878 189189 211664 327209
2461C27209k7888O948K5060l8650n7704m547K0626j1918J553J0172J4674o9722
$$ 327209 299321 306269 331329 292679 234975 230428 251054 239136 240689 250861 265535 195813
2449A95813r846K651l8010J4477n0829M7684J08488l5942l1892K0748M4304L6764
$$ 195813 185967 188618 150608 165085 114256 161940 270428 234486 202594 223342 267646 304410
2437C04410k6861J9740j238K4181J21451M5738l4168o1918K833M2736o4588m9330
$$ 304410 277549 297289 296051 320232 441683 487421 453253 391335 394168 436904 372316 322986
2425C22986m0273M4458N458M2096j8183O1443k5208j8324N7529j04738K936P4194
$$ 322986 282713 327171 332629 374725 356542 417985 392777 374453 431982 327244 330180 404374
2413D04374m5606q863J3889J00380Q7108k8802l8381j1249k6847M6493M1964O8833
$$ 404374 358768 349905 363794 464174 551282 522480 484099 472850 446003 492496 534460 603293
2401F03293n3020N5547L8585j0984N7198j06290N7413m812J074J8755M6816j8278
$$ 603293 550273 605820 644405 633421 690619 584329 641742 636930 638004 656759 703575 685297
2389F85297M5232P022M720M3696Q796M7829O0958L6651Q1190j6749L6313J06488
$$ 685297 730529 737551 742271 785967 794763 842592 903550 940201 1021391 1004642 1040955 1147443
2377A147443P2428J28810l1343J7529j0149J1520J01876N8251K8891P8953J00516
$$ 1147443 1219871 1348681 1317338 1334867 1324718 1336238 1438114 1496365 1525256 1604209 1704725
2366A704725K22548J97859K02787L05263M35736O44528P01967M29222O3548L2141
$$ 1704725 1927273 2125132 2327919 2633182 3068918 3713446 4415413 4844635 4908183 4940324
2356D940324J78979M11823N51393Q96952J181555J776053K404435M276981P413708
$$ 4940324 5119303 5531126 6082519 6979471 8161026 9937079 12341514 16618495 24032203
2347B4032203J2461017J6733488J5321311J381489r319333j0134872r378371p655252
$$ 24032203 36493220 53226708 68548019 69929508 60610175 50475303 41096932 33441680
2339C3441680o549688n440714m418861l092145k304080j643635j098357o16743
$$ 33441680 26891992 21451278 17032417 13940272 11636192 9992557 8894200 8277457
2331H277457n05672l77038n83442o70258o35403m68344m71456m28125l96218j90787
$$ 8277457 7771785 7394747 6811305 6141047 5505644 5037300 4565844 4137719 3741501 3550714
2321C550714k35246k01301k37052j36177j71645j14839j91835o6812J08019j84557
$$ 3550714 3315468 3114167 2877115 2740938 2569293 2454454 2262619 2195807 2303826 2119269
2311B119269j79260j13807j03971M1072m5837o2519j05953o5782j7426r2725m0511
$$ 2119269 1940009 1826202 1722231 1763303 1717466 1654947 1548994 1483212 1465786 1373061 1332550
2300A332550k9237K8441n2640k6591j4753r1825n3743n7328O847o8685L4974j05462
$$ 1332550 1303313 1331754 1279114 1252523 1237770 1145945 1092202 1034874 1041721 973036 1008010 902548
2288I02548m8459k688o0888K2072J7165r6163M843k473J02647k0377r9500l6082
$$ 902548 854089 851401 790513 812585 829750 733587 738430 735957 838604 818227 718727 682645
2276F82645q664L1892K3138M8637j02620p0111J8013m2863o1364J1787Q20p7577
$$ 682645 673981 705873 729011 777648 675028 604917 622930 580067 518703 530490 531310 453733
2264D53733K7372j8767m1686J34695k2967j21504k6727j1181m2553j308j2009
$$ 453733 481105 462338 420652 555347 532380 410876 384149 372968 330415 329107 317098
2253C17098L5626O4717J2631k23k2325K6861j24385q949J05891J5720o391K1144
$$ 317098 352724 417441 430072 429849 407524 434385 310000 301051 406942 422662 416271 437415
2241D37415L051o8653N1067m1087n6914k7518n4427J8290J27387m1588m9760r2146
$$ 437415 440466 371813 422880 381793 324879 297361 242934 261224 388611 347023 297263 205117
2229B05117n3229j1473M3102K2252m497J4884K2321k3499j6542j1467l3495n0386
$$ 205117 151888 140415 183517 205769 201272 216156 238477 214978 198436 186969 153474 103088
2217A03088k4514L9122P6914n2681P347J06402M640j7012m9325p3718n371p147
$$ 103088 78574 117696 194610 141929 149276 255678 260318 243306 193981 120263 114892 107745
2205A07745K1360J7557l054l2056j3794N1429L1062n023P8909n0271P743k7945
$$ 107745 129105 146662 143608 111552 97758 149187 180249 175226 254135 203864 211607 183662
2193A83662j5884j6869j2719M5810m9052Q68j3112M4604o5622p5592j8P5596o4686
$$ 183662 167778 150909 138190 184000 134948 135816 122704 167308 101686 26094 26076 101672 36986
2180C6986j5117K0636M4642K0691l0948L6354K4439L8087q624O4804n62j7094
$$ 36986 21869 42505 87147 107838 76890 113244 137683 175770 167146 231950 231388 214294
2168B14294m8342n3150J8868n0872j6413j5631O0479k3863j7591k9112o2606J2617
$$ 214294 165952 112802 131670 80798 64385 48754 109233 85370 67779 38667 -23939 -11322
2156a1322l3276J7100N0864J8943P45P6764l1362N880k3713m9244k7447k7088
$$ -11322 -44598 -27498 23366 42309 43054 119818 88456 94336 70623 21379 -6068 -33156
2144c3156N3095j0760m5792N4846M0322l3344m8573L0475N5035l3410O3744r0724
$$ -33156 19939 9179 -36613 18233 58555 25211 -23362 7113 62148 28738 92482 1758
2132A758M6777J01222o1434q5894L9294k661l0614Q260k4828J2650P5543k5239
$$ 1758 48535 149757 88323 2429 41723 39062 8448 16708 -8120 4530 80073 54834
2120E4834J5204J6676j23105l760k9445K9897q78J4593J42412Q364j01370K2300
$$ 54834 70038 86714 -36391 -40151 -69596 -39699 -40577 -25984 116428 124792 23422 45722
2108D5722J6829J845j5853P8903k9070p1291K1341N390N3464n9164j20439N7970
$$ 45722 62551 64396 48543 127446 98376 27085 48426 53816 107280 48116 -72323 -14353
2096a4353K9077m5159J3395K0278J305k0181k6569O0327L0819P406J1042j0702
$$ -14353 14724 -30435 -17040 3238 4543 -15638 -42207 18120 48939 56345 67387 56685
2084E6685N8285m3493N2791m2875L0009O2668M1077O1253L1313o0331N0126p301
$$ 56685 114970 71477 124268 81393 111402 174070 215147 276400 307713 247382 297508 290207
2072B90207l8036n5327m4659q072k6790j8474k898K5735l1100K3403j18635j0968
$$ 290207 252171 196844 152185 144113 117323 98849 95951 121686 90586 113989 -4646 -15614
2060a5614P3184K3364n3777P2091o7514j40736O7154l7951J5283K9335j7530Q1277
$$ -15614 57570 80934 27157 99248 31734 -109002 -41848 -79799 -64516 -35181 -52711 28566
2048B8566J575l1613n5181M9562m242m4749K6973M2746J7771O5048l2312k2753
$$ 28566 30141 -1472 -56653 -7091 -11333 -56082 -29109 13637 31408 96456 64144 41391
2036D1391q8578J5932L042N517M0149K0173n1083j5997J04J369Q7893n2182k2830
$$ 41391 -47187 -31255 -28213 -22696 17453 37626 -13457 -29454 -29350 -27981 59912 7730 -15100
2023a5100J585M867J301p403K2676n9969l2669K5545K5191L3157r0678M8788n1901
$$ -15100 -13515 -8648 -7347 -14750 7926 -52043 -84712 -59167 -33976 -819 -91497 -42709 -94610
2010i4610K4659L2314J9843n4034k8468Q2247k6824j2176R418K0779R692O0884
$$ -94610 -69951 -37637 -17794 -71828 -100296 -18049 -44873 -57049 -47631 -26852 -17160 43724
1998D3724Q5081j02850q2520K8465L8008J6795J2596l101m7001K208M2562m5665
$$ 43724 128805 25955 -56565 -28100 9908 26703 39299 36198 -10803 -8595 33967 -11698
1986a1698l3958L3940k8792N350P6403J4431M7476j7722o6823j09904N5913N8883
$$ -11698 -45656 -11716 -40508 -35158 41245 55676 103152 85430 18607 -91297 -35384 23499
1974B3499j7547k4908n1432J01264j8529l9006L8504l4569L2898n0487l5679M4629
$$ 23499 5952 -18956 -70388 30876 12347 -26659 11845 -22724 10174 -40313 -75992 -31363
1962c1363M5936L2342m1866j6846O1103o3344j0873O5660m239l6615p598l4603
$$ -31363 14573 46915 5049 -11797 49306 -14038 -24911 40749 36510 -105 -7703 -42306
1950d2306l2377j8982j2658N4565N837j05581P5961k2453k553N4562j7200K0089
$$ -42306 -74683 -93665 -106323 -51758 -45921 -151502 -75541 -97994 -100547 -45985 -63185 -43096
1938d3096j2685N6497L9530p253j54550M8391k2193L8543P5167N379J0116k4281
$$ -43096 -55781 716 40246 32993 -121557 -73166 -95359 -56816 18351 23730 33846 9565
1926I565o9063M204O0872K1292p1104p4498j284M3573L3687M7857K9573L8021
$$ 9565 -59498 -55294 5578 26870 -44234 -118732 -120016 -76443 -42756 5101 34674 72695
1914G2695n1540l4595k923J7813K9663o4147K0554n6259M0403l2398p6783K2353
$$ 72695 21155 -13440 -16363 1450 31113 -33034 -12480 -68739 -28336 -60734 -137517 -115164
1902a15164j8597K6419o17K4553j0402M7623l6727P4714m6353r522m1484o542
$$ -115164 -133761 -107342 -107959 -83406 -93808 -46185 -82912 -8198 -54551 -64073 -105557 -112099
1890a12099N1562M0375k3445j4702L7389n1336N1934K0906l0358L0792l4594m8051
$$ -112099 -60537 -20162 -43607 -58309 -20920 -72256 -20322 584 -29774 1018 -33576 -81627
1878h1627L5996j9593L1971P423P2670m9074j7266J7500m6216K2094n926j1345
$$ -81627 -45631 -65224 -33253 -25830 46840 -2234 -19500 -2000 -48216 -26122 -32048 -43393
1866d3393M4704k0701L1011m356j2574R722L5098j8242K0945J7536m2309l1142
$$ -43393 1311 -19390 11621 7265 -5309 4413 39511 21269 42214 59750 17441 -13701
1854a3701N2935j9408q1554j1948O6915M0271m3710L147K850M2555l4644j8243
$$ -13701 39234 19826 -61728 -73676 -6761 33510 -10200 -7053 -4203 38352 3708 -14535
1842a4535p6120N3494r472l9785J5957P5261k6577K1911m371m7112K3933M3540
$$ -14535 -90655 -37161 -46633 -86418 -70461 4800 -21777 134 -4237 -51349 -27416 16124
1830A6124k1650J1203M528p8673M2045K5404j6831l673N5108l8621M0747n0273
$$ 16124 -5526 5677 10205 -68468 -26423 -1019 -17850 -21523 33585 -5036 35711 -14562
1818a4562n0655n3729O0912J1322o5201k2200L8531N6859O1547k3474L7757q0828
$$ -14562 -65217 -118946 -58034 -46712 -111913 -134113 -95582 -38723 22824 -650 37107 -43721
1806d3721Q476J01613j13672j7988p3993R256O5506p2881M078N4226J2883L8133
$$ -43721 -35245 66368 -47304 -65292 -139285 -130029 -64523 -137404 -133326 -79100 -66217 -28084
1794b8084Q5125o5748m3794o361J3247Q9810j6560m6878o0026N1046r957j3384
$$ -28084 57041 -8707 -52501 -58862 -45615 44195 27635 -19243 -79269 -28223 -38180 -51564
1782e1564j1291M3298M4524p2316N6780q7780L40k570P018j0162j4030L2162J7432
$$ -51564 -62855 -19557 24967 -47349 9431 -78349 -78009 -80579 -73561 -83723 -97753 -65591 -48159
1769d8159O5497n8065m0619P611M888l1936k0105N6991k8770J1865M9823K688
$$ -48159 17338 -40727 -81346 -73735 -68847 -100783 -120888 -63897 -92667 -80802 -30979 -28291
1757b8291j4237L7750P110m271j4881N88K2861o8754L1725j1718P1972n1807l0024
$$ -28291 -42528 -4778 2332 -1939 -16820 -16232 6629 -62125 -30400 -42118 29854 -21953 -51977
1744e1977M427P7524m5508m6863L6151n4203J1931P208M2929k746m789p0224j3557
$$ -51977 -47550 29974 -15534 -62397 -26246 -80449 -68518 -61310 -18381 -21127 -25916 -96140 -109697
1731a09697L8512Q638L0849K9822O52k2698R1096K187r962k6586k6804J2261j0844
$$ -109697 -71185 -62547 -31698 -1876 -1224 -23922 67174 69361 59399 32813 6009 18270 7426
1718G426j2002n1747O7790l1844m8081N6797P60k3052Q7652j0505K6309K5235
$$ 7426 -4576 -56323 11467 -20377 -68458 -11661 -10901 -33953 53699 43194 69503 94738
1706I4738q9099l378M8952k0976J5844n5868J8415J382K3542K3008r0926r785
$$ 94738 5639 2261 51213 30237 46081 -9787 8628 10010 33552 56560 -34366 -44151
1694d4151k488m270J5030J20003L3795j06202m6581j8689J6338J42247o1636r2145
$$ -44151 -46639 -50909 -35879 84124 117919 11717 -34864 -53553 -37215 105032 43396 -48749
1682d8749M6155P7680q5997M8329J7524n6879m4508m2980o0679k0495P8094n05
$$ -48749 -2594 75086 -10911 37418 54942 -1937 -46445 -89425 -150104 -170599 -92505 -93010
1670i3010l555q4140K2191M7242p2363O3580N5691p9016J09754J0533k7343J3002
$$ -93010 -96565 -180705 -158514 -111272 -183635 -120055 -64364 -143380 -33626 -23093 -50436 -37434
1658c7434m0936j9035p151L2664K6611M7392m068j9167q8667l886P5728N5057
$$ -37434 -78370 -97405 -104556 -71892 -45281 2111 -1957 -21124 -109791 -113677 -37949 17108
1646A7108l8995K510k1997O1285j2249k2242K2790M3051j7151K684J085L7590
$$ 17108 -21887 -19377 -41374 19911 7662 -14580 8210 51261 34110 36794 37879 75469
1634G5469n8780m3640l9187L2957j2614N431j0453o6915N460M6254J41989j7700
$$ 75469 16689 -26951 -66138 -33181 -45795 -40364 -50817 -117732 -112272 -66018 75971 58271
1622E8271n3655k0051L0554j5760n7992N5220k9377k4770Q2305m657k5174o3538
$$ 58271 4616 -15435 15119 -641 -58633 -3413 -32790 -57560 24745 20088 -5086 -68624
1610f8624O408N4143m739O5864p0728l8656P8662r2776L0604J8999M5144M644
$$ -68624 -62216 -8073 -12812 53052 -17676 -56332 22330 -70446 -39842 -20843 24301 28945
1598B8945J1865m5447j6760K1431p6516J13763L6029j20674P973l4044K4217k7188
$$ 28945 40810 -4637 -21397 34 -76482 37281 73310 -47364 -39391 -73435 -49218 -76406
1586g6406K2587J4671k498k2102J08513r786j8217k1683K2563L6486m870l4443
$$ -76406 -53819 -39148 -41646 -63748 44765 34979 16762 -4921 17642 54128 49258 14815
1574A4815k1882J2915k2581M2906j0924j9356k2504j32777N4890L3237L2880k5058
$$ 14815 -7067 5848 -16733 26173 15249 -4107 -26611 -159388 -104498 -71261 -38381 -63439
1562f3439N0124L0789K1666k9143k6213J5683L7436n6997J1160j122l3220K895
$$ -63439 -13315 17474 39140 9997 -16216 -533 36903 -20094 -8934 -10056 -43276 -40381
1550d0381N1116K5429l7007j374N5431J3030q2083N4903K1686k7551r3414q1696
$$ -40381 10735 36164 -843 -2217 53214 66244 -15839 39064 60750 33199 -60215 -141911
1538a41911P6223P0265p8839L1155m2354l7215Q220R6724J0394n0634j3856L6981
$$ -141911 -65688 4577 -74262 -43107 -85461 -122676 -114456 -17732 -7338 -57972 -71828 -34847
1526c4847m9168J21998K8862m3268k4360L8453J601j4764q1677j5835L2703P8516
$$ -34847 -84015 37983 66845 23577 -783 37670 39271 24507 -57170 -73005 -40302 38214
1514C8214n1203j2806j3081n9117m8010L6540J09556p1815O920M369J4512P411
$$ 38214 -12989 -25795 -38876 -97993 -146003 -109463 93 -71722 -64802 -60433 -45921 -38510
1502c8510o3475j3670m2157K3677J33269J5944K1266m212J0712J5468N7500m3239
$$ -38510 -101985 -115655 -157812 -134135 -866 15078 36344 32132 42844 58312 115812 72573
1490G2573j05874K146l916j5482Q4406L8298j07878K2027J068l2215N5212m0227
$$ 72573 -33301 -31155 -35071 -50553 33853 72151 -35727 -13700 -12632 -44847 10365 -29862
1478b9862K9663M2006o7915l4321j0836j0180m1235J03522k6184Q388Q9505n3598
$$ -29862 -199 41807 -26108 -60429 -71265 -81445 -122680 -19158 -45342 -36954 52551 -1047
1466a047m4703O3587N7290r9984m6584M7064m4072m5040J01685K953n0885J8440
$$ -1047 -45750 17837 75127 -24857 -71441 -24377 -68449 -113489 -11804 -8851 -59736 -41296
1454d1296J0863M732P5956j9568q5235L6784Q897K1808j1074l0269K9015K349
$$ -41296 -30433 -25701 50255 30687 -54548 -17764 -8867 12941 1867 -28402 613 2962
1442B962l120p52n2784N4998n6565L3113J4227r6351j5986N1782L7856l5126O1046
$$ 2962 -158 -910 -53694 1304 -55261 -22148 -7921 -104272 -120258 -68476 -30620 -65746 -4700
1429d700m4464l6656o9463L7182J12084r814l6K7765j6299J8703O1243r85q9977
$$ -4700 -49164 -85820 -155283 -118101 -6017 -15831 -15867 11898 -4401 14302 75545 74560 -15417
1416a5417m5501M4176N2520n3424n9393J9404J7552P5352m0550l8032N283J8157
$$ -15417 -60918 -16742 35778 -17646 -77039 -57635 -40083 35269 -5281 -43313 -38030 -19873
1404a9873M01k802N16N8806m4435j3916J1860q245M6856l1559M6733o2753m7634
$$ -19873 -19472 -22274 -21758 37048 -7387 -21303 -9443 -17688 29168 -2391 44342 -18411 -66045
1391f6045r707j990P0969O172j3683K3350q4545P8897L6624L509l6751q1505k3083
$$ -66045 -75752 -77742 -6773 -601 -14284 9066 -75479 3418 40042 43551 6800 -74705 -97788
1378i7788J11432J2083n4479j5365Q7100m2304l8021O6948m4614j7175L2415l7997
$$ -97788 13644 25727 -28752 -44117 42983 679 -37342 29606 -15008 -32183 232 -37765
1366c7765k9003K9744L0817P3909j34795l5814m35K3204j4888M2364N9155k9073
$$ -37765 -66768 -37024 -6207 67702 -67093 -102907 -103342 -80138 -95026 -52662 6493 -22580
1354b2580l279J7803N4045J3684n4770j03282N878J143k1693L2244l0591K6065
$$ -22580 -25859 -8056 45989 59673 4903 -98379 -92501 -91358 -113051 -80807 -111398 -85333
1342h5333L4365n4213j2731M5364J9795l0455M9287O5290l4769m7545N9440J9608
$$ -85333 -50968 -105181 -117912 -72548 -52753 -83208 -33921 31369 -3400 -50945 8495 28103
1330B8103K3326m3540k8541k6145k1428M137M1570n8365L8292j4594m754O7624
$$ 28103 51429 7889 -20652 -46797 -68225 -64088 -22518 -80883 -42591 -57185 -61939 5685
1318E685k3645k1745m2850k3296k6128Q8508J00628l8628M6451M954n2847j8198
$$ 5685 -17960 -39705 -82555 -105851 -131979 -43471 57157 18529 64980 69934 17087 -1111
1306a111n2359j7367P629p837K3881N3420l62q1638k5498R7635L8925R6526N119
$$ -1111 -53470 -70837 -63208 -71045 -47164 6256 5894 -75744 -101242 -3607 35318 131844 136963
1293A36963k4203n9150j1815L0864n2944n3013N6449r6346Q5381O2069r8364j6328
$$ 136963 112760 53610 41795 72659 19715 -33298 23151 -73195 12186 74255 -24109 -40437
1281d0437k2575Q1561r24l3833N4476M4217n8815r2853j5527N1338o3194l458
$$ -40437 -63012 18549 17625 -16208 38268 82485 23670 -69183 -84710 -33372 -96566 -100024
1269a00024L7471M416L4862K2003L5670k5338K4801K1031J3251j186r3677K8490
$$ -100024 -62553 -58137 -23275 -1272 34398 9060 33861 54892 68143 66957 -26720 1770
1257A770K0617o7805n5168j114Q1457Q5485n0216n4677K7433j2350q471N9687
$$ 1770 22387 -45418 -100586 -101700 -20243 65242 15026 -39651 -12218 -24568 -33039 26648
1245B6648n358k6161m0040m7072P3761k0083O6676r570J571Q5098N9306l2821
$$ 26648 21290 -4871 -44911 -91983 -18222 -38305 28371 18801 20372 105470 164776 131955
1233A31955j20930q5398l195j3326N1203k0648J3486j9505O9810l8426r0525L494
$$ 131955 11025 -74373 -77568 -90894 -39691 -60339 -46853 -66358 3452 -34974 -125499 -122005
1221a22005l6529Q0059J4434n0195P3019K0331j6902m1510M4035p1012J7785P7806
$$ -122005 -158534 -78475 -64041 -114236 -41217 -20886 -37788 -79298 -35263 -106275 -88490 -10684
1209a0684m3810R950k9903j2926o772R5181K9151J2022J896n7413M1764J0039
$$ -10684 -54494 -44544 -74447 -87373 -94145 1036 30187 42209 44105 -13308 28456 38495
1197C8495k7149l6961p6739Q4049j560o3948O0077o344j3174K105Q0327n9146
$$ 38495 11346 -25615 -102354 -18305 -19865 -83813 -23736 -30080 -43254 -41149 39178 -19968
1185a9968j6793K1199m3299m0807m2762P5628J6432L0548Q0266r566k7592K1089
$$ -19968 -36761 -15562 -58861 -99668 -142430 -66802 -50370 -19822 60444 50878 23286 44375
1173D4375l1773K6219o3529p650m5239O2462J5328r4133j5974K9189P2299j4113
$$ 44375 12602 38821 -24708 -32358 -77597 -15135 193 -93940 -109914 -80725 -8426 -22539
1161b2539l9306L5047l2160R3347N4093j9163j31363O830P0702O6619j073J0006
$$ -22539 -61845 -26798 -58958 34389 88482 69319 -62044 -55214 15488 82107 81034 91040
1149I1040p2353r0879n449J6682K0679K7199M6582M80o8188k7505l5692J40666
$$ 91040 18687 -72192 -77641 -60959 -40280 -13081 33501 33981 -34207 -61712 -97404 43262
1137D3262k1897k605j06077J7250K6050N7554J9157m0623J9662m3120N2418l5978
$$ 43262 21365 18760 -87317 -70067 -44017 13537 32694 -7929 11733 -31387 21031 -14947
1125a4947n0450L6442O9790p6715L0473K9785j6902o5138M7886k688L6520K7785
$$ -14947 -65397 -28955 40835 -35880 -5407 24378 7476 -57662 -9776 -12464 24056 51841
1113E1841r7518M7421N8947l8895N1645j7951q0295j3171n5020k565J21085j2584
$$ 51841 -45677 1744 60691 21796 73441 55490 -24805 -37976 -92996 -95561 25524 12940
1101A2940k7654k0632j3441m1737J31484O3002j11702l9330N2557n9738k3927
$$ 12940 -14714 -35346 -48787 -90524 40960 103962 -7740 -47070 5487 -54251 -78178
1090g8178M9549m929r0259M7013N9865n7408N2110j3183j7314M3990q8952P4104
$$ -78178 -28629 -33558 -123817 -76804 -16939 -74347 -22237 -35420 -52734 -8744 -97696 -23592
1078b3592M3513k3223o0053R6859q3014N249O3817j33140N9823R0626M085p9541
$$ -23592 19921 -3302 -63355 33504 -49510 -44261 19556 -113584 -53761 36865 40950 -38591
1066c8591l963M6782L032j03554l7013J00341Q6202o2475K7733m3566n2341J08376
$$ -38591 -42554 4228 7260 -96294 -133307 -32966 53236 -9239 18494 -25072 -77413 30963
1054C0963l3049k1450M5845L8437J6322k2198Q765j8539l6429L1512l0383j0183
$$ 30963 -2086 -23536 22309 60746 77068 54870 63635 45096 8667 40179 9796 -387
1042c87r98K4661o2477K0212Q982j1682p0615k5935O5078K2240n1961Q43Q7352
$$ -387 -1385 23276 -39201 -18989 -10007 -21689 -92304 -118239 -53161 -30921 -82882 -82039 5313
1029E313L0511K470o1996K1422k2923P52K9552j6931o5117R5267p615l3621M8856
$$ 5313 35824 38294 -23702 -2280 -25203 -24451 5101 -11830 -76947 18320 10705 -22916 25940
1016B5940k6857K2095j1075p815K5932k0044o770M3930M0957q7088L4325n6092
$$ 25940 -917 21178 10103 2288 28220 8176 1406 45336 86293 -795 33530 -22562
1004b2562P5712Q06J1928M8591k6500n2129p0730L0920n1574N169Q7272N8174
$$ -22562 53150 53956 65884 114475 87975 35846 -34884 -3964 -55538 -50369 36903 95077
992I5077j6720K6820l6269l2799l3640J5384m3906J6617m2506L4480O4594o3069
$$ 95077 78357 105177 68908 36109 2469 17853 -26053 -9436 -51942 -17462 47132 -15937
980a5937L883k2624J2307M31Q738j6436k0409j7788l5199O1210r457q4082O2572
$$ -15937 -12054 -34678 -22371 -21940 -13202 -29638 -50047 -67835 -103034 -41824 -51281 -135363 -72791
967g2791M5363O547O2127j3279L2035J6046j11690N6042Q3796j03533k2921J8408
$$ -72791 -27428 -20881 41246 27967 60002 76048 -35642 20400 104196 663 -22258 -3850
955c850K6140K3598j00171M6642Q7052j21347p2269J48842l7714N747P562M2172
$$ -3850 22290 45888 -54283 -7641 79411 -41936 -114205 34637 -3077 2670 10232 52404
943E2404j7594o6031K783j300j0218M2191k3297p5682L0222O5774R3161j30217
$$ 52404 34810 -31221 -28438 -29738 -39956 2235 -21062 -96744 -66522 -748 92413 -37804
931c7804N3282J17198n6225j50746M3765J71059k337j09907q8685N7140L5894
$$ -37804 15478 132676 76451 -74295 -30530 140529 138192 28285 -60400 -3260 32634
920C2634N7522n3270K8095n2446m8518n9080L402Q1568N0168M7631n2680l4086
$$ 32634 90156 36886 64981 12535 -35983 -95063 -91661 -10093 40075 87706 35026 940
908I40k8758N3090j4899K8241l6009p649P886j9511P847j07070O338J14329l3767
$$ 940 -27818 25272 10373 38614 2605 -5044 2842 -16669 -8822 -115892 -109554 4775 -28992
895b8992J8480N777K9195j1922K7470O070O7866k1165j23994K46n5868J954j9844
$$ -28992 -10512 -4735 24460 12538 40008 46078 113944 92779 -31215 -30969 -86837 -84883 -104727
882a04727O1063k1476k9412K7696N9151j6778r903J01975j6562l9661l0413r4628
$$ -104727 -43664 -65140 -94552 -66856 -7705 -24483 -34386 67589 51027 11366 -19047 -113675
870a13675l3027N0389Q1039L4899l3740P7463p3877m0975q822M5259N734K8967
$$ -113675 -146702 -96313 -15274 19625 -14115 63348 -10529 -51504 -60326 -15067 -9333 19634
858A9634k5196m8807M4971M2140p6363k8227O6513p7220O4746Q252K6102M8650
$$ 19634 -5562 -54369 -9398 32742 -43621 -71848 -5335 -82555 -17809 -9557 16545 65195
846F5195j5088k5764N972n3126J17284n3597p3152O7220J8102o0682j5899q7607
$$ 65195 50107 24343 30315 -22811 94473 40876 -32276 34944 53046 -7636 -23535 -111142
834a11142p007M8262M3502M5360p2124R7849l0295p2603p704N2975m2815M2537
$$ -111142 -118149 -69887 -26385 18975 -53149 44700 14405 -58198 -65902 -12927 -55742 -13205
822a3205L9456k827L5293J1897k632J6005l5927q4674J5427J13622N0151j16799
$$ -13205 26251 23424 58717 70614 67982 83987 48060 -36614 -21187 92435 142586 25787
810B5787M7849J3561q1940K1889j59928J20961Q1857k5434m6279k2916O4297l0363
$$ 25787 73636 87197 5257 27146 -132782 -11821 70036 44602 -1677 -24593 39704 9341
798I341p4833k8547M6122M4467N6349q0831L4724l4513K7967M668m6599Q6523
$$ 9341 -65492 -94039 -47917 -3450 52899 -27932 6792 -27721 246 4914 -41685 44838
786D4838Q087J8273J2633k6263j3868L03p0595k2598M814K0045K0772Q731l1132
$$ 44838 52925 71198 83831 57568 43700 44003 -26592 -49190 -44376 -24331 -3559 5172 -25960
773b5960l0863p494M3384L2310N8791j7826p2139J0396N4253n0328J3312n2199
$$ -25960 -56823 -64317 -20933 11377 70168 52342 -19797 -9401 44852 -5476 7836 -44363
761d4363o6607J12549Q687m863j8596O6890j3890k3893N958L1548O0131n9675
$$ -44363 -110970 1579 10266 5403 -13193 53697 39807 15914 21872 53420 113551 53876
749E3876R601L4132o9579q611K8733O2847k3161q3782k711M6395j2017P3321n0588
$$ 53876 63477 97609 28030 19419 48152 110999 87838 4056 1345 47740 35723 109044 58456
736E8456o067n2215K0014L1723l823p181Q4393q4323j41611P0289O401O873N3807
$$ 58456 52389 174 20188 51911 48088 40907 125300 40977 -100634 -30345 -23944 -17071 36736
723C6736K9288L9037j7598j0695j07769O702M9610L6970J4415p3976J5139o2283
$$ 36736 66024 105061 87463 76768 -31001 -24299 25311 62281 76696 2720 17859 -44424
711d4424J6180L465j955M5509l202l4812l1655k0063O5734o4038J4058L0015k2829
$$ -44424 -28244 -24779 -26734 18775 15573 -19239 -50894 -70957 -5223 -69261 -55203 -25188 -48017
698d8017n4759J05496N922n3491O333K8790j8362J5464q349J3708M900n909l7364
$$ -48017 -102776 2720 8642 -44849 -38516 -9726 -28088 -12624 -20973 -7265 -2365 -8274 -45638
685d5638j0251M2323N1562K7265n022o7284K7688k4551K8183L3000Q6486k2810
$$ -45638 -55889 -13566 37996 65261 60239 -7045 20643 -3908 24275 57275 143761 120951
673A20951l5758p3645k2723P3898j04930Q6054J3500m3479m2785K2504j5160K8054
$$ 120951 85193 11548 -11175 62723 -42207 43847 57347 13868 -28917 -6413 -21573 6481
661F481n0272L3144N5707o5796p8429J39381L654l9245k0408M17N1447n9934k1337
$$ 6481 -43791 -10647 45060 -20736 -99165 40216 43870 4625 -15783 -15366 36081 -23853 -45190
648d5190q2467P4525J11168n9080N8926l8607l5001j7010J6657M0570m7031J6883
$$ -45190 -127657 -53132 58036 -1044 57882 19275 -15726 -32736 -16079 24491 -22540 -5657
636e657K8116K9056n2732k512N6780n8983J9061L1189k6630n8973K5872P6932
$$ -5657 22459 51515 -1217 -3729 53051 -5932 13129 44318 17688 -41285 -15413 61519
624F1519q353J3838j0477M0847n4045k8355O7225N7047n563L565j25072k235O0073
$$ 61519 53166 67004 56527 97374 43329 14974 82199 139246 133683 137248 12176 9941 70014
611G0014P5033N8900p5640l0158j0878K925n0226L2777O982K0176k8078q2328
$$ 70014 145047 203947 128307 98149 87271 90196 39970 72747 79729 99905 71827 -10501
599a0501R387O1880m9006m0024k3820r704O8513N921Q14p604R634P5098k3820
$$ -10501 -1114 60766 11760 -28264 -52084 -61788 6725 12646 13460 5856 15490 90588 66768
586F6768k2259m7424L0068m2853k0752K9544k4303J769J24832j0243k3225o7357
$$ 66768 44509 -2915 27153 -15700 -36452 -6908 -31211 -29442 95390 85147 61922 -5435
574e435n1840K7204M2775L518q693L1398k6518K8994O3643J2852n3314j8353j05485
$$ -5435 -57275 -30071 12704 16222 7529 38927 12409 41403 105046 117898 64584 46231 -59254
561e9254N5985L1482N606L5904r4154j7387N9602K4503O5854j19771Q0416N5998
$$ -59254 -3269 28213 33819 69723 -24431 -41818 17784 42287 108141 -11630 68786 124784
549A24784J3J2421j3501j9401j4973n4543q5212k0767P6038K1751J2505l543p3366
$$ 124784 124797 137218 123717 104316 89343 34800 -50412 -71179 4859 26610 39115 35572 -37794
536c7794k4164J70770K271j50952N1884J6140P9571j0827k2810K9433K3770m4706
$$ -37794 -61958 108812 111083 -39869 12015 28155 107726 96899 74089 103522 127292 82586
524H2586l4638j8399r752j2611m5932P4521L3844m9843j4376o5989L7531R4002
$$ 82586 47948 29549 19797 7186 -38746 35775 69619 19776 5400 -60589 -23058 70944
512G0944j05249L1392M881j2162O8934J6993k000o5538N4119M4241j11925M2001
$$ 70944 -34305 -2913 1968 -10194 58740 75733 73733 8195 62314 106555 -5370 36631
500C6631P8594l8795j5815j1982q9945N0563K8282q9573R627N5234O6863M813
$$ 36631 115225 76430 60615 48633 -41312 9251 37533 -52040 -42413 12821 79684 84497
488H4497p4922o5008L2276P6092O1495L7542r1802j5624L0124n6058L8964L9412
$$ 84497 9575 -55433 -23157 52935 114430 151972 60170 44546 74670 18612 57576 96988
476I6988m3532J2636O0007K8275k2087q6899j2407M7204m701j18885k9547R8287
$$ 96988 53456 66092 126099 154374 132287 45388 32981 80185 75484 -43401 -72948 25339
464B5339l845l6593J0750L9648r6024n9713P6480L2980K0617O8003j1982l2806
$$ 25339 21494 -15099 -4349 35299 -60725 -120438 -43958 -10978 9639 77642 65660 32854
452C2854j2726n578K6759M8220q4088r7699J10729Q4347p0984l7618M0880l3792
$$ 32854 20128 14550 41309 89529 5441 -92258 18471 102818 31834 -5784 35096 1304
440A304K77J7130N5768r6808l037J05934j912p8311N0374k407j2712r8888Q0529
$$ 1304 1581 18711 74479 -22329 -25366 80568 78656 345 50719 48312 35600 -63288 17241
427A7241O3910o536r3735N3638J6966N6614o2449n00r2910K6224Q3766n6878Q4374
$$ 17241 81151 74615 -19120 34518 51484 108098 45649 45149 -47761 -21537 62229 5351 89725
414H9725n2326n0863M8603K9896k8916K914J12147R5525j00262l8041j26803J8255
$$ 89725 37399 -13464 35139 65035 36119 39033 151180 246705 146443 108402 -18401 -146
402a46k1335J8128k788k5353L3115P4364p6667o922m9488L0947J04858M1262L4724
$$ -146 -21481 -3353 -6141 -31494 1621 75985 -682 -7604 -57092 -26145 78713 119975 154699
389A54699p4217l5788l2052r504k7874j2740M3641j8185n078Q161L0294Q5030
$$ 154699 80482 44694 12642 3138 -24736 -37476 6165 -12020 -17098 -8937 21357 106387
377A06387m2110k2592O6321m838l4724M6249L2451M334m7034n6764K6247K8203
$$ 106387 64277 41685 108006 103168 68444 114693 147144 151478 104444 47680 73927 102130
365A02130o0390l0839M7951k7326l4092L8438n9023r2598R1073N2690J9184p9514
$$ 102130 41740 10901 58852 31526 -2566 35872 -23151 -115749 -24676 28014 47198 -32316
353c2316p636J16464l6556o0269L8900J5126M2190p6305n274J1049l7335R8331
$$ -32316 -39952 76512 39956 -20313 18587 33713 75903 -402 -5676 5373 -31962 66369
341F6369J09559l4339J4796j00852j390L2679o8569p2062J3145P4258M0214q3572
$$ 66369 175928 141589 156385 55533 54143 86822 18253 -53809 -40664 33594 73808 -9764
329i764j6186Q6270J9756L8759p0511R0525J712l8098k6813K8164M1910j00584
$$ -9764 -25950 60320 80076 118835 48324 138849 140561 102463 75650 103814 145724 45140
317D5140l4526n6402J11992l0107m9514K9001L6797N1403m2039Q7532l6958m8303
$$ 45140 10614 -45788 66204 36097 -13417 15584 52381 103784 61745 149277 112319 64016
305F4016p6440k6481M0686K531O4172l3504j4213J1404K3698k4811O2672o43r288
$$ 64016 -12424 -38905 1781 4312 68484 34980 20767 32171 55869 31058 93730 93087 83799
292H3799J00226n0869j1239m3416p0573J9841N1487m4257L889j0941J6249n7340
$$ 83799 184025 133156 121917 78501 7928 27769 79256 34999 38888 27947 44196 -13144
280a3144n7223J02163L151k5446k8272K7857m4041K6258P9998O6364O640o3066
$$ -13144 -70367 31796 34947 9501 -18771 9086 -34955 -8697 71301 137665 144305 81239
268H1239j7230K560K3904K6159Q431m5457k3777j9363O6906j00536j8967p366
$$ 81239 64009 66569 90473 116632 125063 79606 55829 36466 103372 2836 -16131 -23497
256b3497m8209O5155Q561R2767L9910K1696n6269n028J4677m7046m2512M288p761
$$ -23497 -71706 -6551 2010 94777 134687 156383 100114 95086 109763 62717 20205 24493 16732
243A6732l6604N4978k6391m4820m310L5184m7302m305L5668K5948M0806M3488
$$ 16732 -19872 35106 8715 -36105 -40415 -5231 -52533 -56838 -21170 4778 45584 89072
231H9072M2415m4986n8292M5498L7121j6710k3250k8617j09046q953m8121J19270
$$ 89072 131487 86501 28209 73707 110828 94118 70868 42251 -66795 -75748 -123869 -4599
219d599K9863M5775L0363j3609K3311M4440o6042j508l091l0870l7443m6273K9115
$$ -4599 25264 71039 101402 87793 111104 155544 89502 87994 84903 54033 16590 -29683 -568
206e68Q6514k909L4064n9985n3654L5246M9970k0990o1145O1266l2778n4687M7431
$$ -568 85946 83037 117101 57116 3462 38708 88678 67688 6543 67809 35031 -19656 27775
193B7775J00035o0263k4733L6067J132N088J0418n2050J9789o92m4511o4211J6343
$$ 27775 127810 67547 42814 78881 80013 85101 95519 43469 63258 62566 18055 -46156 -29813
180b9813k1022J5599N1142N6643m0348K9318l2836k1639L293Q8792k357p730J8674
$$ -29813 -50835 -35236 15906 72549 32201 61519 28683 7044 10337 99129 96772 89042 107716
167A07716p737M5606l1756j1498k7348l4860o731l1799j6208K2920l80m9351Q0824
$$ 107716 99979 145585 113829 102331 74983 40123 33392 1593 -14615 8305 7925 -41426 39398
154C9398L3365n933L2453l2247q0273J7906P4153P6988n1037j9718L7156l6942
$$ 39398 72763 66830 99283 67036 -13237 4669 78822 155810 104773 85055 122211 85269
142H5269J88K0604J538K4516J2749n6484p6716n8890O7975j5718N2003N8971J0177
$$ 85269 85457 106061 107599 132115 144864 88380 11664 -47226 20749 5031 57034 116005 126182
129A26182l6802n706J3649j1671J5122j6030L5243J5175m2575j7397N1804J6297
$$ 126182 89380 83674 97323 85652 100774 84744 119987 135162 92587 75190 126994 143291
117A43291p0703l9763j13L3931J07622q6807n7270L3215K597m9256j5400J3695
$$ 143291 72588 32825 32712 66643 174265 87458 30188 63403 66000 16744 1344 15039
105A5039j1929j715M1107j0859l1449j1711N513Q1196L4678m6966M0501m6789
$$ 15039 3110 1395 42502 31643 194 -11517 -6004 75192 109870 62904 103405 56616
93E6616n9471J8269K3938r391J5675k522M833K2983j3697n1197m6719J438K9760
$$ 56616 -2855 15414 39352 29961 45636 43114 47947 70930 57233 6036 -40683 -39245 -9485
80i485p495J9956O3497k7920l1748n400N3561l9067o3260R3974P7960m2104J2375
$$ -9485 -16980 2976 66473 38553 6805 1405 54966 15899 -47361 46613 124573 82469 94844
67I4844j5579J7669j4529n0113k324J6746n2125k129J7499k9837l1895p552O9936
$$ 94844 79265 96934 82405 32292 29968 46714 -5411 -7540 9959 -19878 -51773 -59325 10611
54A0611N2516K7336N5996o2405m7880L6190M0932k9030k1277J8097J8665j7873
$$ 10611 63127 90463 146459 84054 36174 72364 113296 84266 62989 81086 99751 81878
42H1878J0247K4872P628p1526L2851N7700l280j5298J6504l8173l409n666m5108
$$ 81878 92125 116997 124625 53099 85950 143650 140370 125072 141576 103403 99994 94328 49220
29D9220l760k3306K2947L695k3056N9048M524j7268K9565l3711o2706J6770N4397
$$ 49220 45460 22154 45101 48796 25740 84788 89312 72044 101609 67898 5192 21962 76359
16G6359j7823J1536k9992j5250N5623N562R498L1515l1275k6285p1307K5383N1783
$$ 76359 58536 70072 40080 24830 80453 86015 95513 127028 95753 69468 -1839 23544 75327
3G5327o3376k3197L124
$$ 75327 11951 -11246 -8122
0h122
$$ -8122
$$ Imaginary data points
##PAGE= N=2
##DATA TABLE= (X++(I..I)), XYDATA
16383a331103M9334L8791O674K6639n6112j669J14840O4265n4993K2906K1270
$$ -1331103 -1281769 -1242978 -1236304 -1209665 -1265777 -1267446 -1152606 -1088341 -1143334 -1120428 -1099158
16372a099158M4102J556L2241N112L6602O0408m9784Pk9633Q9515N6084K8768
$$ -1099158 -1055056 -1053500 -1021259 -1016147 -979545 -919137 -968921 -968914 -998547 -909032 -852948 -824180
16360h24180M2794L538M0938k3381O276J0318J0275N7854L0837L3474Q0348j0588
$$ -824180 -781386 -777848 -736910 -760291 -754015 -743697 -733422 -675568 -644731 -611257 -530909 -541497
16348e41497l6623L0647K103O4323L7212j7437J4123L058P41J1119L6089M1879
$$ -541497 -578120 -547473 -545370 -481047 -443835 -461272 -447149 -444091 -443350 -432231 -396142 -354263
16336c54263K1361j4507O4567J2123O014n755P453N3486M0385O7605J0817j8201
$$ -354263 -332902 -347409 -282842 -270719 -264705 -270460 -263007 -209521 -169136 -101531 -90714 -108915
16324a08915L0287J904p304j9865m968M1154N6357O4411K2179o374N2295m8251
$$ -108915 -78628 -76724 -84028 -103893 -108861 -67707 -11350 53061 75240 68866 121161 72910
16312G2910P6123o0795m310L8580O5824L3359o4891L1685L5601L8430j6907L4935
$$ 72910 149033 88238 83928 122508 188332 221691 156800 188485 224086 262516 245609 280544
16300B80544R110J3950O1579J0715k0887Q0722l0663L3460j482j6656R3743O48
$$ 280544 289654 303604 365183 375898 355011 435733 405070 438530 437048 420392 514135 514783
16288E14783P284m0584M0181j2319J5019R9949j8647J8771R592J7908J1694P7821
$$ 514783 522067 481483 521664 509345 524364 624313 605666 624437 634029 651937 663631 741452
16276G41452k608l3819J0112K6480J8356N8072l2873q4953R0081R2499Q040J5059
$$ 741452 738844 705025 715137 741617 759973 818045 785172 700219 790300 882799 890839 905898
16264I05898n3609P292Q2705m8806N634j7446K7857o6901J10171J05828j3481
$$ 905898 852289 859581 942286 893480 899114 881668 909525 842624 952795 1058623 1045142
16253A045142J4024j6811J9058l5426N7602M961M970q99p091k3720O3151l0466
$$ 1045142 1059166 1042355 1061413 1025987 1083589 1088550 1093520 1092621 1085530 1061810 1124961 1094495
16241A094495Q0836o373l3630J18068N9050m3545k8788J3082J6290n3047j9884
$$ 1094495 1175331 1168958 1135328 1253396 1312446 1268901 1240113 1253195 1269485 1216438 1196554
16230A196554L9062p742O2451M4346n0697k9980P2836r815m878M3883k6831L1425
$$ 1196554 1235616 1227874 1290325 1334671 1283974 1253994 1326830 1317015 1312137 1356020 1329189 1360614
16218A360614M3929O5007K2216l4135m4340M5821L8581N2362n5707J7275K4618
$$ 1360614 1404543 1469550 1491766 1457631 1413291 1459112 1497693 1550055 1494348 1511623 1536241
16207A536241j3291J9940k1408J8524L8596j8132l4462J9706l4545J8930j7508
$$ 1536241 1522950 1542890 1521482 1540006 1578602 1560470 1526008 1545714 1511169 1530099 1512591
16196A512591J1168M5789m0340J7375K4783O1239M2407k8944p3264l2690N3021
$$ 1512591 1523759 1569548 1529208 1546583 1571366 1632605 1675012 1646068 1572804 1540114 1593135
16185A593135R2356j8448m4088L191N1484L4505m954L9995o0841K4341k3905K2832
$$ 1593135 1685491 1667043 1622955 1626146 1677630 1712135 1707181 1747176 1686335 1710676 1686771 1709603
16173A709603L2493n8587J9652P0909p4163j7551J5115J7207O9511o1866J7103
$$ 1709603 1742096 1683509 1703161 1774070 1699907 1682356 1697471 1714678 1784189 1722323 1739426
16162A739426L5069N353j429j9758M8725m666K716N2118o9434N0345P7652n7622
$$ 1739426 1774495 1779848 1778419 1758661 1807386 1802720 1805436 1857554 1788120 1838465 1916117 1858495
16150A858495l4246q5756p390R0119O3118j9027l4464l3135q153P4048P8331n2869
$$ 1858495 1824249 1738493 1731103 1821222 1884340 1865313 1830849 1797714 1789561 1863609 1941940 1889071
16138A889071m1520N1540n803m2060R4910n1897J7804n9754M2489p057K8921j5393
$$ 1889071 1847551 1899091 1893288 1851228 1946138 1894241 1912045 1852291 1894780 1887723 1916644 1901251
16126A901251m6473o140O4168K2834n2563N3031k7617N0088J378q6858k8568P0020
$$ 1901251 1854778 1848638 1912806 1935640 1883077 1936108 1908491 1958579 1959957 1873099 1844531 1914551
16114A914551J8541r97L2797l7125m8068j3943M1945N494N5331m913P287M0611
$$ 1914551 1933092 1932095 1964892 1927767 1879699 1865756 1907701 1913195 1968526 1963613 1970900 2011511
16102B011511p3513l8728R2702k1931j19705P6637J4192J11140p957m3775J8529
$$ 2011511 1937998 1899270 1991972 1970041 1850336 1926973 1941165 2052305 2044348 2000573 2019102
16091B019102K7445p7183n5961K5283O2139l0723J8953j96J2814O5462n3469M1199
$$ 2019102 2046547 1969364 1913403 1938686 2000825 1970102 1989055 1988859 2001673 2067135 2013666 2054865
$$ [...]
##END NTUPLES=NMR SPECTRUM
##END=
