##TITLE=1H_TG-2388-X2
 200.13MHz,DMSO,
 8 sc
 
 11.11.2025
##JCAMPDX= 6.0         $$ Bruker NMR JCAMP-DX V2.0
##DATA TYPE= NMR SPECTRUM
##DATA CLASS= NTUPLES
##ORIGIN= UXNMR, Bruker Analytische Messtechnik GmbH
##OWNER= pz
$$ XWIN-NMR		Version 3.5
$$ Tue Nov 11 15:27:38 2025 Russian Standard Time (UT+4h)  she@DPX200
##.OBSERVE FREQUENCY= 200.1313
##.OBSERVE NUCLEUS= ^1H
##.ACQUISITION MODE= SIMULTANEOUS
##.ACQUISITION SCHEME= undefined
##.AVERAGES= 8
##.DIGITISER RES= 18
##SPECTROMETER/DATA SYSTEM= spect
##.PULSE SEQUENCE= zg30
##.SOLVENT NAME= DMSO
##.SHIFT REFERENCE= (INTERNAL, DMSO, 0, 15.5166)
##AUDIT TRAIL= $$ (NUMBER, WHEN, WHO, WHERE, WHAT)
$$ ##TITLE= Audit trail, XWIN-NMR		Version 3.5
$$ ##JCAMPDX= 5.01
$$ ##ORIGIN= Bruker BioSpin GmbH
$$ ##OWNER= she
$$ F:/spectra/data/she/nmr/H-C/1/pdata/1/auditp.txt
$$ ##AUDIT TRAIL=  $$ (NUMBER, WHEN, WHO, WHERE, WHAT)
(   1,<2025-11-11 15:24:39.64 +0400>,<she>,<DPX200>,
      <created by zg, POWCHK disabled, PULCHK disabled
       configuration hash MD5:
       00 E9 B6 7A A2 85 ED C7 34 08 36 98 17 FE 4E 26
       data hash MD5: 16K
       B9 67 D0 D2 15 90 F0 D2 28 58 19 DE 7D 8F 33 8E>)
(   2,<2025-11-11 15:24:42.87 +0400>,<she>,<DPX200>,
      <Start of raw data processing
       efp BC_mod = 2 LB = 0.25 FT_mod = 6 PKNL = 1 PHC0 = -2636.576 PHC1 = 41.99237 SI = 16K 
       data hash MD5: 16K
       B9 15 EE 92 E7 48 67 C4 59 CE D0 BB 59 AE A0 EF>)
(   3,<2025-11-11 15:25:15.23 +0400>,<she>,<DPX200>,
      <pk PHC0 = 18.28965 PHC1 = -41.60001 
       data hash MD5: 16K
       21 13 E7 74 FE 02 1E 22 D8 F3 58 2B 64 78 B9 93>)
(   4,<2025-11-11 15:25:19.73 +0400>,<she>,<DPX200>,
      <abs ABSG = 5 
       data hash MD5: 16K
       A8 08 F5 D2 A5 3A 87 08 14 E9 20 D1 FC 5E B9 88>)
$$ ##END=
$$ 
$$ hash MD5
$$ DF 89 4D 24 0D 33 BB 1D 16 7F D1 C4 C3 1A 5A 87
##$RELAX= 
##$RELAX= 
##$RELAX= 
##$RELAX= 
##$RELAX= 
##$RELAX= 
$$ Bruker specific parameters
$$ --------------------------
##$DU= <F:/spectra>
##$EXPNO= 1
##$NAME= <H-C>
##$PROCNO= 1
##$TYPE= <nmr>
##$USER= <she>
##$AMP= (0..31)
100 100 100 100 100 100 100 100 100 100 100 100 100 100 100 100 100 100 
100 100 100 100 100 100 100 100 100 100 100 100 100 100 
##$AQSEQ= 0
##$AQ_mod= 1
##$AUNM= <au_zg>
##$AUTOPOS= <>
##$BF1= 200.13
##$BF2= 200.13
##$BF3= 200.13
##$BF4= 200.13
##$BF5= 200.13
##$BF6= 200.13
##$BF7= 200.13
##$BF8= 200.13
##$BYTORDA= 1
##$CFDGTYP= 0
##$CFRGTYP= 5
##$CHEMSTR= <none>
##$CNST= (0..31)
1 1 145 1 1 1 1 1 1 1 1 1 1 1 1 1 1 1 1 1 1 1 1 1 1 1 1 1 1 1 1 1 
##$CPDPRG= <>
##$CPDPRG1= <>
##$CPDPRG2= <>
##$CPDPRG3= <>
##$CPDPRG4= <mlev>
##$CPDPRG5= <mlev>
##$CPDPRG6= <mlev>
##$CPDPRG7= <mlev>
##$CPDPRG8= <mlev>
##$CPDPRGB= <>
##$CPDPRGT= <>
##$D= (0..31)
0 0.7 0 0 0 0 0 0 0 0 0 0.03 0 0 0 0 0 0 0 0 0 0 0 0 0 0 0 0 0 0 0 0 
##$DATE= 1762860279
##$DBL= (0..7)
120 120 120 120 120 120 120 120 
##$DBP= (0..7)
150 150 150 150 150 150 150 150 
##$DBP07= 0
##$DBPNAM0= <>
##$DBPNAM1= <>
##$DBPNAM2= <>
##$DBPNAM3= <>
##$DBPNAM4= <>
$$ [...]
##$SUBNAM3= <"">
##$SUBNAM4= <"">
##$SUBNAM5= <"">
##$SUBNAM6= <"">
##$SUBNAM7= <"">
##$SUBNAM8= <"">
##$SUBNAM9= <"">
##$SW= 18.0517328524113
##$SWIBOX= (0..15)
0 0 2 0 0 0 0 0 0 0 0 0 0 0 0 0 
##$SW_h= 3612.71676300578
##$TD= 16384
##$TD0= 1
##$TE= 0
##$TE2= 300
##$TE3= 300
##$TEG= 300
##$TL= (0..7)
0 120 120 120 120 120 120 120 
##$TP= (0..7)
150 150 150 150 150 150 150 150 
##$TP07= 0
##$TPNAME0= <>
##$TPNAME1= <>
##$TPNAME2= <>
##$TPNAME3= <>
##$TPNAME4= <>
##$TPNAME5= <>
##$TPNAME6= <>
##$TPNAME7= <>
##$TPOAL= (0..7)
0.5 0.5 0.5 0.5 0.5 0.5 0.5 0.5 
##$TPOFFS= (0..7)
0 0 0 0 0 0 0 0 
##$TUNHIN= 0
##$TUNHOUT= 0
##$TUNXOUT= 0
##$USERA1= <user>
##$USERA2= <user>
##$USERA3= <user>
##$USERA4= <user>
##$USERA5= <user>
##$V9= 5
##$VALIST= <valist>
##$VCLIST= <CCCCCCCCCCCCCCC>
##$VD= 0
##$VDLIST= <DDDDDDDDDDDDDDD>
##$VPLIST= <PPPPPPPPPPPPPPP>
##$VTLIST= <TTTTTTTTTTTTTTT>
##$WBST= 1024
##$WBSW= 4
##$XGAIN= (0..3)
0 0 0 0 
##$XL= 0
##$YL= 0
##$YMAX_a= 258946
##$YMIN_a= -321167
##$ZGOPTNS= <>
##$ZL1= 120
##$ZL2= 120
##$ZL3= 120
##$ZL4= 120
##$ABSF1= 15.46703
##$ABSF2= -2.58482
##$ABSG= 5
##$ABSL= 3
##$ALPHA= 0
##$AQORDER= 0
##$ASSFAC= 0
##$ASSFACI= 0
##$ASSFACX= 0
##$ASSWID= 0
##$AUNMP= <proc_1d>
##$AZFE= 0.1
##$AZFW= 0.1
##$BCFW= 0
##$BC_mod= 2
##$BYTORDP= 0
##$COROFFS= 0
##$CY= -3
##$DATMOD= 1
##$DC= 0
##$DFILT= <>
##$DTYPP= 0
##$F1P= 0
##$F2P= 0
##$FCOR= 1
##$FTSIZE= 16384
##$FT_mod= 6
##$GAMMA= 0
##$GB= 0
##$INTBC= 1
##$INTSCL= 3.241238e-09
##$ISEN= 128
##$LB= 0.25
##$LEV0= 0
##$LPBIN= 0
##$MAXI= 10000
##$MC2= 0
##$MEAN= 0
##$ME_mod= 0
##$MI= 1.114404
##$NCOEF= 0
##$NC_proc= -6
##$NLEV= 6
##$NOISF1= 3.799351
##$NOISF2= 2.8
##$NSP= 0
##$NTH_PI= 0
##$NZP= 0
##$OFFSET= 15.51661
##$PC= 1
##$PHC0= -2618.286
##$PHC1= 0.3923607
##$PH_mod= 1
##$PKNL= yes
##$PPARMOD= 0
##$PSCAL= 0
##$PSIGN= 0
##$REVERSE= no
##$SF= 200.130001017984
##$SI= 16384
##$SIGF1= 3
##$SIGF2= 2
##$SINO= 0.751879
##$SIOLD= 32768
##$SREGLST= <19F.Aceton>
##$SSB= 0
##$STSI= 16384
##$STSR= 0
##$SW_p= 3612.71676300578
##$SYMM= 0
##$S_DEV= 0
##$TDeff= 16384
##$TDoff= 0
##$TI= <>
##$TILT= no
##$TM1= 0
##$TM2= 0
##$TOPLEV= 0
##$USERP1= <user>
##$USERP2= <user>
##$USERP3= <user>
##$USERP4= <user>
##$USERP5= <user>
##$WDW= 1
##$XDIM= 16384
##$YMAX_p= 308440836
##$YMIN_p= -440292
$$ End of Bruker specific parameters
$$ ---------------------------------
##NTUPLES= NMR SPECTRUM
##VAR_NAME=  FREQUENCY,     SPECTRUM/REAL,   SPECTRUM/IMAG
##SYMBOL=    X,             R,               I
##VAR_TYPE=  INDEPENDENT,   DEPENDENT,       DEPENDENT
##VAR_FORM=  AFFN,          ASDF,            ASDF
##VAR_DIM=   16384,         16384,           16384
##UNITS=     HZ,            ARBITRARY UNITS, ARBITRARY UNITS
##FACTOR=    0.220516191357247, 1,           1
##FIRST=     3105.33920422835, 0,            0
##LAST=      -507.377558777426, 0,           0
##MIN=       -507.377558777426, -440292,     0
##MAX=       3105.33920422835, 308440836,    0
$$ Real data points
##PAGE= N=1
##DATA TABLE= (X++(R..R)), XYDATA
$$ [...]
$$ plain form
8668 6042437 6047916 5935412 5790847 5692322 5430741 5210681 4846739 4723760 4632504 4342767
8658 4342767 4203354 4023261 3753236 3535493 3383617 3245719 3102020 3100722 3032352 2981445
8648 2981445 2858594 2815876 2773388 2718655 2662440 2646003 2550408 2565291 2534850 2437524 2600768
8637 2600768 2398213 2281556 2319255 2276472 2307886 2309074 2202534 2212865 2197141 2117096 2089555
8626 2089555 2103099 2083006 2068216 1912723 1893409 2049697 1957239 1877716 1940460 1823403 1950957
8615 1950957 1971632 1932311 1822397 1920827 2119061 2142444 2120674 2030070 1975837 2011675 1962584
8604 1962584 1926030 2078999 2154121 2064618 2002031 2273306 2334688 2256293 2191721 2106041 2089597
8593 2089597 2042601 2029089 2097750 2104063 2100574 2194482 2006911 1951321 1813833 1774386 1801727
$$ packed form
8668F042437N479j12504j44565r8525k61581k20060l63942j22979r1256k89737
8658D342767j39413j80093k70025k17743j51876j37898j43699j298o8370n0907
8648B981445j22851m2718m2488n4733n6215j6437r5595J4883l0441r7326J63244
8637B600768k02555j16657L7699m2783L1414J188j06540J0331j5724q0045k7541
8626B089555J3544k0093j4790j55493j9314J56288r2458p9523O2744j17057J27554
8615A950957K0675l9321j09914R8430J98234K3383k1770r0604n4233L5838m9091
8604A962584l6554J52969P5122q9503o2587K71275O1382p8395o4572q5680j6444
8593B089597m6996j3512O8661O313l489R3908j87571n5590j37488l9447K7341
$$ plain form
8582 1801727 1838142 1819771 1722890 1582202 1504183 1575872 1602623 1583159 1572720 1482600 1501703
8571 1501703 1368243 1346930 1336406 1288602 1376297 1474512 1426012 1367959 1360235 1383039 1389031 1383556
8559 1383556 1441295 1409523 1421123 1363704 1400490 1349675 1466550 1416956 1438914 1401915 1311566
8548 1311566 1303622 1359902 1250202 1285343 1253040 1262132 1255865 1138542 1124130 1011339 976354
8537 976354 1032258 911593 917750 967148 976147 890388 811366 920102 960988 819770 807023
8526 807023 841896 754887 819986 830126 805570 797229 794003 698481 673949 617418 652460 542085
8514 542085 422972 497746 513389 498003 540640 591130 541172 441967 443916 483258 536148 463295
8502 463295 626680 535005 516319 576584 533876 559584 548429 613141 548680 488181 477239
$$ packed form
8582A801727L6415j8371r6881j40688p8019P1689K6751j9464j0439r0120J9103
8571A501703j33460k1313j0524m7804Q7695R8215m8500n8053p724K2804N992n475
8559A383556N7739l1772J1600n7419L6786n0815J16875m9594K1958l6999r0349
8548A311566p944N6280j09700L5141l2303R092o267j17323j4412j12791l4985
8537I76354N5904j20665O157M9398Q999q5759p9022J08736M0886j41218j2747
8526H07023L4873q7009O5099J0140k4556q341l226r5522k4532n6531L5042j10375
8514E42085j19113P4774J5643j5386M2637N0490m9958r9205J949L9342N2890p2853
8502D63295J63385r1675j8686O0265m2708K5708j1155O4712o4461o0499j0942
$$ plain form
8491 477239 435054 523029 621241 539523 697950 766160 619953 463131 431190 363083 350364
8480 350364 199220 215243 318064 446333 485176 364932 328139 294466 319562 375497 426424
8469 426424 494234 525725 401120 491935 461217 488235 426129 391249 455358 325951 317172
8458 317172 206164 171249 270332 260301 216946 271121 382068 385095 396092 444316 320230
8447 320230 371014 269946 386566 378213 207579 283697 293921 376628 322507 326136 249876
8436 249876 178119 112773 137241 190940 137053 209692 205219 224462 112065 120582 50403 102328
8424 102328 129599 181942 219626 103901 173182 250425 180213 136431 105102 70905 100003
8413 100003 30614 4447 9602 107974 159159 136228 147863 166451 383194 366472 203754
$$ packed form
8491D77239m2185Q7975R8212q1718J58427O8210j46207j56822l1941o8107j2719
8480C50364j51144J6023J02821J28269L8843j20244l6793l3673K5096N5935N0927
8469D26424O7810L1491j24605R0815l0718K7018o2106l4880O4109j29407q779
8458C17172j11008l4915R9083j0031m3355N4175J10947L027J0997M8224j24086
8447C20230N0784j01068J16620q353j70634P6118J0224Q2707n4121L629p6260
8436B49876p1757o5346K4468N3699n3887P2639m473J9243j12397Q517p0179N1925
8424A02328K7271N2343L7684j15725O9281P7243p0212m3782l1329l4197K9098
8413A00003o9389k6167N155R8372N1185k2931J1635J8588K16743j6722j62718
$$ plain form
8402 203754 149513 174211 125627 86716 122624 95134 98009 143292 192140 132465 135247 254151
8390 254151 272139 293368 282197 276198 207676 255441 404723 338654 334219 255543 359579 359686
8378 359686 165936 117882 259019 335040 270347 125418 159168 160948 278664 284425 140613
8367 140613 96661 55747 155411 119060 19998 22483 51542 22288 10659 35316 73800 73580
8355 73580 184136 241784 143316 132004 46045 124826 149829 210974 162726 194495 62945
8344 62945 87680 23031 98004 208973 181496 14826 139381 156354 147501 101870 92503 170354
8332 170354 143697 125004 112427 258839 181746 57212 67772 74948 118710 124843 3817
8321 3817 -8769 74985 177782 171623 154719 156509 161753 23281 105665 56386 21371 -9979
$$ packed form
8402B03754n4241K4698m8584l8911L5908k7490K875M5283M8848n9675K782J18904
8390B54151J7988K1229j1171n999o8522M7765J49282o6069m435p8676J04036J07
8378C59686j93750m8054J41137P6021o4693j44929L3750J780J17716N761j43812
8367A40613m3952m0914R9664l6351r9062K485K9059k9254j1629K4657L8484k20
8355G3580J10556N7648r8468j1312q5959P8781K5003O1145m8248L1769j31550
8344F2945K4735o4649P4973J10969k7477j66670J24555J6973q853m5631r367P7851
8332A70354k6657j8693j2577J46412p7093j24534J0560P176M3762O133j21026
8321C817j2586Q3754J02797o159j6904J790N244j38472Q2384m9279l5015l1350
$$ plain form
8309 -9979 -107974 -115605 35756 51740 117837 166436 183544 96405 57543 34154 9101 -14280
8297 -14280 -624 79783 136054 64670 35073 6177 168354 212051 193251 185193 199692 142232
8285 142232 69650 98223 220674 301850 275986 219058 71882 67900 17799 -7547 -131506
8274 -131506 -34191 -9856 30276 -6592 -77137 30282 53945 108509 61608 141936 33521
8263 33521 -20757 -96848 -129659 -108900 -20506 -25680 39891 170863 101281 66679 109475 69368
8251 69368 41848 12477 50143 205958 136831 52486 -37357 -10569 -1238 37417 -75761 -136936
8239 -136936 77886 16668 -100152 -128083 -54272 23675 33458 -57462 -18760 86534 136263
8228 136263 157413 67025 40234 -69247 11581 109553 58564 -4161 -95407 -134535 -144091 -124643
$$ packed form
8309i979r7995p631J51361J5984O6097M8599J7108q7139l8862k3389k5053k3381
8297a4280J3656Q0407N6271p1384k9597k8896J62177M3697j8800q058J4499n7460
8285A42232p2582K8573J22451Q1176k5864n6928j47176l982n0101k5346j23959
8274a31506R7315K4335M0132l6868p0545J07419K3663N4564m6901Q0328j08415
8263C3521n4278p6091l2811K0759Q8394n174O5571J30972o9582l4602M2796m0107
8251F9368k7520k9371L7666J55815o9127q4345q9843K6788R331L8655j13178o1175
8239a36936K14822o1218j16820k7931P3811P7947R783r0920L8702J05294M9729
8228A36263K1150r0388k6791j09481Q0828R7972n0989o2725r1246l9128r556J9448
$$ plain form
8216 -124643 -114674 -129390 -56378 -51082 -74449 -99490 -126130 -204269 -99484 -122371 -69475 32929
8204 32929 22848 89181 80767 -77500 15355 -3821 -117450 -21619 118696 -53971 -99335
8193 -99335 -199958 -38511 291398 152865 168473 39388 173523 221686 49250 -1297
8183 -1297 170317 147309 19050 -113214 97521 94709 -54597 27797 44709 -17784 15365
8172 15365 -127793 -114408 -41742 -112177 -220562 -211892 -38263 2660 67352 170801 147374
8161 147374 73025 45750 -107750 -138397 -163441 -55014 2499 119751 158433 53765 28142
8150 28142 7534 -34585 49270 18524 -33320 55084 75585 123988 86844 45361 55258 -11166
8138 -11166 -17866 -2464 11717 -76389 -55032 31209 5216 -26921 14576 -90906 -50148 -34574
$$ packed form
8216a24643R969j4716P3012N296k3367k5041k6640p8139J04785k2887N2896J02404
8204C2929j0081O6333q414j58267R2855j9176j13629R5831J40315j72667m5364
8193i9335j00623J61447L29909j38533J5608j29085J34135M8163j72436n0547
8183a297J71614k3008j28259j32264K10735k812j49306Q2394J6912o2493L3149
8172A5365j43158J3385P2666p0435j08385Q670J73629M0923O4692J03449k3427
8161A47374p4349k7275j53500l0647k5044J08427N7513J17252L8682j04668k5623
8150B8142k0608m2119Q3855l0746n1844Q8404K0501M8403l7144m1483R897o6424
8138a1166o700J5402J4181q8106K1357Q6241k5993l2137M1497j05482M0758J5574
$$ plain form
8126 -34574 -37964 -172908 -175785 -36394 20946 -29319 -122975 -151668 -72757 63488 56939 -76796
8114 -76796 -81579 -58705 -33249 -136236 -70359 27458 84235 -169 30008 -22704 -81207 -46805
8102 -46805 37647 69628 -47504 -90000 -5385 -39626 -96193 59110 154209 165716 33621
8091 33621 53696 -15981 19155 -21524 370 -47437 7311 46170 12540 -45219 7320 71945
8079 71945 -51791 -132811 -77877 3159 16454 -108841 -120360 -118105 -93443 -122241 -81894 -85375
8067 -85375 -162176 -199858 -114024 -29929 -58433 -94703 -41903 -44295 -30750 -10408 35857 3511
8055 3511 -101529 -50944 -160193 -45067 -63622 -74188 -107329 68934 45398 -6451 -19651
8044 -19651 -67844 -55711 -29885 -42550 -125011 -83995 -159299 -140522 -48350 -61986 -186201 -115611
$$ packed form
8126c4574l390j34944k877J39391N7340n0265r3656k8693P8911J36245o549j33735
8114g6796m783K2874K5456j02987O5877R7817N6777q4404L0177n2712n8503L4402
8102d6805Q4452L1981j17132m2496Q4615l4241n6567J55303R5099J1507j32095
8091C3621K0075o9677L5136m0679K1894m7807N4748L8859l3630n7759N2539O4625
8079G1945j23736q1020N4934Q1036J3295j25295j1519K255K4662k8798M0347l481
8067h5375p6801l7682Q5834Q4095k8504l6270N2800k392J3545K0342M6265l2346
8055C511j05040N0585j09249J15126j8555j0566l3141J76263k3536n1849j3200
8044a9651m8193J2133K5826j2665q2461M1016p5304J8777R2172j3636j24215P0590
$$ plain form
8032 -115611 -43425 109515 -29469 -58485 -91197 -61943 -81763 -10128 -59503 -184239 -282932
8021 -282932 -147677 -90330 -106078 -107563 -106564 -91053 -144681 -184725 -148911 -82233 -25814 -36040
8009 -36040 5616 52447 -33549 -92826 -33492 48228 71507 71389 83232 53645 82197 134715
7997 134715 44786 3018 -115603 -86375 -75293 -87574 -60534 -14849 -40153 9691 -157186
7986 -157186 -272246 -148315 -181988 -104970 -36497 46704 109317 -89081 -64615 -126652 -167991
7975 -167991 -172479 -85842 -168506 -35812 127229 -13421 -60479 -176796 -211651 -180086 -177080
7964 -177080 -66752 39294 -28982 -134972 -194956 -95470 56788 -41470 -116939 -94100 -79966
7953 -79966 -51021 -48611 16466 -16763 -30898 -24483 -117911 -104737 78358 70092 -121581 -83262
$$ packed form
8032a15611P2186J52940j38984k9016l2712K9254j9820P1635m9375j24736r8693
8021b82932J35255N7347j5748j485R99J5511n3628m0044L5814O6678N6419j0226
8009c6040M1656M6831q5996n9277N9334Q1720K3279j18J1843k9587K8552N2518
7997A34715q9929m1768j18621K9228J1082j2281K7040M5685k5304M9844j66877
7986a57186j15060J23931l3673P7018O8473Q3201O2613j98398K4466o2037m1339
7975a67991m488Q6637q2664J32694J63041j40650m7058j16317l4855L1565L006
7964a77080J10328J06046o8276j05990n9984R9486J52258r8258p5469K2839J4134
7953g9966K8945K410O5077l3229j4135O415r3428J3174J83095q266j91673L8319
$$ plain form
7941 -83262 -92851 -129560 -86333 -5147 12024 22178 -3185 -82365 -179753 -154387 -35977 94800
7929 94800 -114072 -133387 -146294 -153934 -169272 -251917 -210806 -169631 -287232 -47314 83358
7918 83358 34389 25879 2334 6637 5868 -32216 -77028 44747 -14827 -77255 -119636 -32208
7906 -32208 -40778 -113513 -144732 -162068 -207765 -131585 -115163 -127011 -210691 -209160 -112352 -94275
7894 -94275 -114972 -81254 -37800 -152585 -88532 -51935 -41606 -92274 -227769 15139 23282
7883 23282 -33848 -87096 13632 -100653 45032 -37766 -95616 -117925 -35033 -8536 -126661
7872 -126661 26566 -28359 1133 70651 170916 8051 25498 71598 73465 25604 -2687
7861 -2687 -30333 28641 -136171 -107740 -919 -53820 10186 -19589 -38319 -36393 -6198 10850
$$ packed form
7941h3262r589l6709M3227Q1186J7171J0154k5363p9180r7388K5366J18410J30777
7929I4800k08872j9315j2907p640j5338q2645M1111M1175j17601K39918J30672
7918H3358m8969q510k3545M303p69l8084m4812J21775n9574o2428m2381Q7428
7906c2208q570p2735l1219j7336m5697P6180J6422j1848q3680J531R6808J8077
7894i4275k0697L3718M3454j14785O4053L6597J0329n0668j35495K42908Q143
7883B3282n7130n3248J00728j14285J45685q2798n7850k2309Q2892K6497j18125
7872a26661J53227n4925K9492O9518J00265j62865J7447M6100J867m7861k8291
7861b687k7646N8974j64812K8431J06821n2901O4006k9775j8730J926L0195J7048
$$ plain form
7849 10850 7946 1942 -1774 -158510 -149752 21184 40907 46343 34091 -75681 -75111 -34450 -5063
7836 -5063 3314 31519 158742 170327 50257 -23932 -88741 -148873 -182031 -175911 -195999 -169334
7824 -169334 -92420 -42872 23104 75265 16484 -66334 -123086 -134642 -157909 -126596 -103901 -118484
7812 -118484 3052 -13631 139328 126489 -130280 -19887 -41940 14792 -96043 -63455 -63157
7801 -63157 38174 -175 -40118 -41662 -21014 59427 -57712 -225451 -84181 49714 -66970
7790 -66970 -196591 -174200 -39124 -76802 -6221 30904 -110934 -345726 -239320 -195298 -87004
7779 -87004 -90981 -99130 -153133 -101825 -8402 -45007 -137994 -119597 -149660 -29365 -42158 -34495
7767 -34495 -5703 30417 -100683 -84514 -98528 -83119 106389 96573 100603 72580 54585 64928
$$ packed form
7849A0850k904o004l716j56736Q758J70936J9723N436j2252j09772N70M0661K9387
7836e063Q377K8205J27223J1585j20070p4189o4809o0132l3158O120k0088K6665
7824a69334P6914M9548O5976N2161n8781q2818n6752j1556k3267L1313K2695j4583
7812a18484J21536j6683J52959j2839k56769J10393k2053N6732j10835L2588K98
7801f3157J01331l8349l9943j544K0648Q0441j17139j67739J41270J33895j16684
7790f6970j29621K2391J35076l7678P0581L7125j41838k34792J06406M4022J08294
7779h7004l977q149n4003N1308R3423l6605r2987J8397l0063J20295j2793P663
7767c4495K8792L6120j31100J6169j4014J5409J89508r816M030k8023j7995J0343
$$ plain form
7755 64928 41328 -22237 28686 -128776 -132008 -79953 -60303 -149073 -106996 -5815 42674 112169
7743 112169 161990 31474 -2640 88494 -14334 -99343 -33805 154879 103375 58495 7445
7732 7445 96179 68729 -14133 -26797 3452 60773 43886 -13744 76558 -1974 -51371 49193
7720 49193 -10822 50644 -5374 25550 -57142 -83039 -31373 19747 13326 -150192 -175527 -76415
7708 -76415 -55775 -16647 88944 171851 75888 -58048 -57604 -146323 -201387 -124741 -58995 9457
7696 9457 -51017 -76267 -3324 62537 -16237 -36848 -19612 20395 5009 -87547 -43000 -111880
7684 -111880 -158410 7786 -37774 -85110 -146596 -97629 -43973 -89359 -61652 -67962 -792 768
7672 768 88441 88251 -25735 -73426 -94243 -63685 -34919 -13748 -61149 90192 55786 -3146
$$ packed form
7755F4928k3600o3565N0923j57462l232N2055J9650q8770M2077J01181M8489O9495
7743A12169M9821j30516l4114R1134j02828q5009O5538J88684n1504m4880n1050
7732G445Q8734k7450q2862j2664L0249N7321j6887n7630R0302p8532m9397J00564
7720D9193o0015O1466n6018L0924q2692k5897N1666N1120o421j63518k5335R9112
7708g6415K0640L9128J05591Q2907r5963j33936M44q8719n5064P6646O5746O8452
7696I457o0474k5250P2943O5861p8774k0611J7236M0007j5386r2556M4547o8880
7684a11880m6530J66196m5560m7336o1486M8967N3656m5386K7707o310O7170J560
7672G68Q7673j90j13986m7691k0817L0558K8766K1171m7401J51341l4406n8932
$$ plain form
7660 -3146 66529 53628 3890 146346 213877 99151 72059 35575 -3011 22958 25200 24770
7648 24770 91332 31202 124940 53406 119565 124438 76926 -19489 -108571 -146153 -82076 -213514
7636 -213514 -162101 -263801 -217787 -62568 -12231 -49813 -43428 -56515 -105509 8157 -16402
7625 -16402 -77835 -169191 -101237 61584 -61180 -113668 -21333 -75251 -81834 -83882 10948 56652
7613 56652 56130 45135 62850 -134425 -41547 -6559 11842 42669 39789 22705 -47297 -17098
7601 -17098 60596 139449 152463 -17690 -48313 21478 57971 -52801 -64420 -130518 21002
7590 21002 69186 -41630 130060 117960 118766 209546 89259 -20408 -41145 9938 2893 -137335
7578 -137335 -145718 63256 114308 150183 82004 42295 156830 19519 -11674 -50846 -27396
$$ packed form
7660c146O9675j2901m9738J42456O7531j14726k7092l6484l8586K5969K242m30
7648B4770O6562o0130R3738p1534O6159M873m7512r6415q9082l7582O4077j31438
7636b13514N1413j01700M6014J55219N0337l7582O385j3087m8994J13666k4559
7625a6402o1433r1356O7954J62821j22764n2488R2335n3918o583k048R4830M5704
7613E6652n22j0995J7715j97275R2878L4988J8401L0827k880j7084p0002L0199
7601a7098P7694P8853J3014j70153l0623O9791L6493j10772j1619o6098J51520
7590B1002M8184j10816J71690j2100Q06R0780j20287j09667k0737N1083p045j40228
7578a37335q383K08974N1052L5875o8179l9709J14535j37311l1193l9172K3450
$$ plain form
7567 -27396 -63711 129040 153786 126914 38203 -105492 69768 156193 156711 140427 49635 66087
7555 66087 76142 239828 289565 231827 275592 388782 580970 627678 586004 593503 639218
7544 639218 738274 793764 829539 763929 665357 836532 713721 667255 626804 589750 570890
7533 570890 581381 482005 305607 163861 246084 199912 225591 252975 261657 200278 99025
7522 99025 170424 81935 14149 10610 3000 -102138 -102013 -91477 -63781 -43703 18475 -70
7510 -70 176075 187274 95942 85821 -40908 8050 69391 -41500 84420 90601 121566 60633
7498 60633 97154 121276 -4567 -204749 -163909 -126109 -168904 -40903 -114962 -52691 7512
7487 7512 -54222 -77390 -46564 82627 97896 124952 3830 -11755 19820 -115342 -185622
$$ packed form
7567b7396l6315J92751K4746k6872q8711j43695J75260Q6425N18j6284r0792J6452
7555F6087J0055J63686M9737n7738M3765J13190J92188M6708m1674P499M5715
7544F39218R9056N5490L5775o5610r8572J71175j22811m6466m0451l7054j8860
7533E70890J0491r9376j76398j41746Q2223m6172K5679K7384Q682o1379j01253
7522I9025P1399q8489o7786l539p610j05138J25J0536K7696K0078O2178j8545
7510g0J76145J1199r1332j0121j26729M8958O1341j10891J25920O181L0965o0933
7498F0633L6521K4122j25843k00182M0840L7800m2795J28001p4059O2271O0203
7487G512o1734k3168L0826J29191J5269K7056j21122j5585L1575j35162p0280
$$ plain form
7476 -185622 -137452 -16592 -55933 -46194 9295 65976 3793 -96752 -52638 1476 -14960
7465 -14960 -86461 -115783 -8778 -29581 51030 29947 6495 103097 -22391 -28575 -42623 -191504
7453 -191504 -121933 -60111 -12908 12333 -27997 -169335 -164664 -114538 -138798 -159321 -25636
7442 -25636 16718 9180 -14649 153040 100120 -20003 2115 -104638 -50194 62877 35482
7431 35482 59301 87883 46943 -47920 -21496 59781 -44946 12698 15911 -1844 -31180 34605
7419 34605 -113425 -171976 -6880 26553 55098 57811 30147 -35714 -75129 -86046 -145083 -184464
7407 -184464 -258185 -68327 16433 -110470 -104710 9273 57630 -62472 -138341 -222862 -161927
7396 -161927 -58281 74510 48609 -64653 -126765 -147600 -77820 2250 122200 161245 100591
$$ packed form
7476a85622M8170J20860l9341R739N5489N6681o2183j00545M4114N4114j6436
7465a4960p1501k9322J07005k0803Q0611k1083k3452R6602j25488o184j4048j48881
7453a91504O9571O1822M7203K5241m0330j41338M671N0126k4260k0523J33685
7442b5636M2354p538k3829J67689n2920j20123K2118j06753N4444J13071k7395
7431C5482K3819K8582m0940r4863K6424Q1277j04727N7644L213j7755k9336O5785
7419C4605j48030n8551J65096L3433K8545K713k7664o5861l9415j0917n9037l9381
7407a84464p3721J89858Q4760j26903N760J13983M8357j20102p5869q4521O0935
7396a61927J03646J32791k5901j13262o2112k0835O9780Q0070J19950L9045o0654
$$ plain form
7385 100591 35822 -26387 -114273 -95197 -195935 -24276 26614 -79577 -45905 -54260 -120420
7374 -120420 -106520 49755 105551 28715 -38895 9973 -34651 -67854 -71939 -141599 -124441 -80273
7362 -80273 30915 -15163 -75875 -88085 -22452 -924 -47679 42322 -7680 1402 -880 -224513
7350 -224513 -257312 -152807 -136143 -67220 41211 48946 -31216 9489 -78097 -74488 -31500 -134849
7338 -134849 -118667 -62384 -4310 41211 -39292 -82511 -124579 -96471 -79073 57062 23000
7327 23000 -120934 -126893 -93365 -85526 -16657 -42046 -51322 -7986 -242149 -202896 -73526 -77084
7315 -77084 -58755 -10777 58612 82172 79802 67984 -17295 -189545 -141583 -59828 69509 5243
7303 5243 -87155 -103460 -136 -36509 67360 92574 -30345 77392 -2796 50270 79499
$$ packed form
7385A00591o4769o2209q7886J9076j00738J71659N0890j06191L3672q355o6160
7374a20420J3900J56275N5796p6836o7610M8868m4624l3203m085o9660J7158M4168
7362h0273J11188m6078o0712j2210O5633K1528m6755R0001n0002R082k282k23633
7350b24513l2799J04505J6664O8923J08431P735q0162M0705q7586L609M2988j03349
7338a34849J6182N6283N8074M5521q0503m3219m2068K8108J7398J36135l4062
7327B3000j43934n959L3528P839O8869k5389r276M3336k34163L9253J29370l558
7315g7084J8329M7978O9389K3560k370j1818q5279j72250M7962Q1755J29337o4266
7303E243r2398j6305J03324l6373J03869K5214j22919J07737q0188N3066K9229
$$ plain form
7292 79499 16090 -107640 -87907 -15250 97057 90595 1789 -123028 -95191 -23621 -34173
7281 -34173 -10310 -44123 13787 -11858 15259 29433 35189 90550 -44478 12785 130099 169271
7269 169271 131147 72170 21803 -56663 -113848 -80936 -4944 -26845 -145474 -183208 -112102
7258 -112102 -10571 57660 12798 36742 47554 -35763 88176 45391 -76137 -128040 -173558
7247 -173558 -141615 -213041 -130981 10952 17596 -73735 -116261 -56325 -37650 -126096 -123799 -164497
7235 -164497 -93508 -123699 52325 602 -60113 -10259 44836 160975 113868 -2081 -6117
7224 -6117 72180 32659 -5397 -79939 -115147 -29898 30315 -14187 -52625 -145762 -15313 38841
7212 38841 -12342 -61538 -42652 52390 96726 -72051 13061 -65092 -138565 -108840 -181723 -87800
$$ packed form
7292G9499o3409j23730J9733P2657J12307o462q8806j24817K7837P1570j0552
7281c4173K3863l3813N7910k5645K7117J4174N756N5361j35028N7263J17314L9172
7269A69271l8124n8977n0367p8466n7185L2912P5992k1901j18629l7734P1106
7258a12102J01531O8231m4862K3944J0812q3317J23939m2785j21528n1903m5518
7247a73558L1943p1426Q2060J41933O644r1331m2526N9936J8675q8446K297m0698
7235a64497P0989l0191J76024n1723o0715M9854N5095J16139m7107j15949m036
7224f117P8297l9521l8056p4542l5208Q5249O0213m4502l8438r3137J30449N4154
7212C8841n1183m9196J8886R5042M4336j68777Q5112p8153p3473K9725p2883R3923
$$ plain form
7200 -87800 -40922 -41426 -178450 -280562 -127465 12888 252 -90762 23485 76632 154486
7189 154486 70003 -77103 -36600 31363 84305 -20624 -138733 -128871 12303 86141 -33977
7178 -33977 -100166 -128060 -90892 17745 65058 156498 -11518 -36596 88106 37040 -77893
7167 -77893 -40420 71703 -61031 9680 91228 15648 -45153 -5630 -12038 11438 69224 4322
7155 4322 -49815 27312 91929 60661 -55690 -87292 -29480 -78288 -127137 -62016 24330 -52615
7143 -52615 45214 24201 -17680 -66234 -34857 -97832 -20078 38431 9346 -116985 -102945 414
7131 414 -44970 -70418 -65625 -108432 -92370 22816 -2205 52517 134104 72531 8930 -134123
7119 -134123 -168545 -81632 -87356 -99241 -39093 -14745 -17803 -19954 -74152 -80345 -97815 -34449
$$ packed form
7200h7800M6878n04j37024j02112J53097J40353j2636r1014J14247N3147P7854
7189A54486q4483j47106M0503O7963N2942j04929j18109R862J41174P3838j20118
7178c3977o6189k7894L7168J08637M7313R1440j68016k5078J24702n1066j14933
7167g7893L7473J12123j32734P0711Q1548p5580o0801L9523o408K3476N7786o4902
7155D322n4137P7127O4617l1268j16351l1602N7812m8808m8849O5121Q6346p6945
7143e2615R7829k1013m1881m8554L1377o2975P7754N8509k9085j26331J4040J03359
7131D14m5384k5448M793m2807J6062J15186k5021N4722Q1587o1573o3601j43053
7119a34123l4422Q6913n724j1885O0148K4348l058k151n4198o193j7470O3366
$$ plain form
7107 -34449 11313 98789 76393 11550 15444 42024 130395 201193 139934 82313 12292 27930
7095 27930 98943 27557 36456 110148 157107 36790 40684 174783 127776 66492 -3991 -32073
7083 -32073 31628 176517 106837 50203 -1072 59544 116944 2639 -75214 -149260 -96288
7072 -96288 14331 -38140 -73563 -113114 52043 90891 -7999 19941 -25044 -22661 19123 78191
7060 78191 -6088 57702 -7396 -10976 42604 110117 125164 17595 20014 -22702 -106812 80483
7048 80483 31137 -1614 103253 44470 94449 203215 88402 59603 23675 -28298 -8812
7037 -8812 64185 42492 -2861 -30120 -9161 39195 -64018 -31551 -80217 13775 38596 83234
7025 83234 121355 76380 -3546 69219 64225 62896 166232 19894 10254 -26639 -86198 20674
$$ packed form
7107c4449M5762Q7476k2396o4843L894K6580Q8371P0798o1259n7621p0021J5638
7095B7930P1013p1386Q899P3692M6959j20317L894J34099m7007o1284p0483k8082
7083c2073O3701J44889o9680n6634n1275O0616N7400j14305p7853p4046N2972
7072i6288J10619n2471l5423l9551J65157L8848r8890K7940m4985K383M1784N9068
7060G8191q4279O3790o5098l580N3580O7513J5047j07569K419m2716q4110J87295
7048H0483m9346l2751J04867n8783M9979J08766j14813k8799l5928n1973J9486
7037h812P2997k1693m5353k7259K0959M8356j03213L2467m8666R3992K4821M4638
7025H3234L8121m4975p9926P2765m994j329J03336j46338r640l6893n9559J06872
$$ plain form
7013 20674 -55099 16265 128029 130114 89785 -44820 -61548 97844 205056 120692 96709
7002 96709 117839 119907 118929 -63263 -97104 -69460 -30678 13007 72016 67197 85428 81320 153629
6989 153629 107022 138034 181630 139676 170419 164819 143985 263238 237923 18546 55161
6978 55161 149641 91171 66964 169139 44902 21132 56369 147291 87007 39395 44742 115299
6966 115299 98988 43688 48336 137102 131332 117056 218333 177945 135269 204068 51306 103434
6954 103434 254073 182060 219448 243019 264677 277825 179036 107184 51371 -17850 62699
6943 62699 120552 203809 187276 147312 197694 251679 154568 187180 118208 75286 189250 256427
6931 256427 262515 232451 204100 241112 228866 66940 45219 92189 160123 162849 206024 94437
$$ packed form
7013B0674p5773P1364J11764K085m0329j34605j6728J59392J07212q4364k3983
7002I6709K1130K068r78j82192l3841K7644L8782M3685N9009m819J8231m108P2309
6989A53629m6607L1012M3596m1954L0743n600k0834J19253k5315k19377L6615
6978E5161R4480n8470k4207J02175j24237k3770L5237R0922o0284m7612N347P0557
6966A15299j6311n5300M648Q8766n770j4276J01277m0388m2676O8799j52762N2128
6954A03434J50639p2013L7388K3571K1658J3148r8789p1852n5813o9221Q0549
6943F2699N7853Q3257j6533l9964N0382N3985r7111L2612o8972m2922J13964O7177
6931B56427O088l0064k8351L7012j2246j61926k1721M6970O7934K726M3175j11587
$$ plain form
6919 94437 196598 385009 357401 294873 213840 255358 286264 266955 282642 312969 278751
6908 278751 409669 358843 298525 274379 342477 399379 382509 374139 352965 390045 274231
6897 274231 277865 313212 239769 241921 347166 348024 363872 407592 292862 243059 326292 427482
6885 427482 334842 395248 468297 418461 439398 339519 295827 365251 280097 223891 298295 372298
6873 372298 392416 269023 305664 314118 315493 270325 249193 321448 326015 286673 408790 433414
6861 433414 436286 378322 307064 295688 355120 298077 215508 329496 362080 336054 331923 338233
6849 338233 213379 259103 390495 455581 393776 397545 406202 327732 416877 311658 267239
6838 267239 303899 316871 275204 301729 421088 438321 359354 347727 363006 395282 502286
$$ packed form
6919I4437J02161J88411k7608o2528q1033M1518L0906j9309J5687L0327l4218
6908B78751J30918n0826o0318k4146O8098N6902j6870q370k1174L7080j15814
6897B74231L634L5347p3443K152J05245Q58J5848M3720j14730m9803Q3233J01190
6885D27482r2640O0406P3049m9836K0937r9879m3692O9424q5154n6206P4404P4003
6873C72298K0118j23393L6641Q454J375m5168k1132P2255M567l9342J22117K4624
6861D33414K872n7964p1258j1376N9432n7043q2569J13988L2584k6026m131O310
6849C38233j24854M5724J31392O5086o1805L769Q657p8470Q9145j05219m4419
6838B67239L6660J2972m1667K6525J19359J7233p8967j1627J5279L2276J07004
$$ plain form
6827 502286 479655 514685 509104 325706 248816 254481 341970 364409 405362 436592 374816 394391
6815 394391 522419 469655 400640 456621 557650 563846 527333 573441 489746 525593 503232
6804 503232 491943 447098 453190 461638 411254 329522 376124 480599 595825 562470 450688
6793 450688 540835 589346 576715 527346 461570 424856 400721 467695 575583 549131 601266
6782 601266 676612 607529 601956 461085 332514 364718 406192 483870 748911 682060 551525
6771 551525 572243 532212 583708 685334 780805 725373 770153 760564 554540 729569 710306
6760 710306 688095 750575 680467 731541 748055 697669 677884 763142 869569 883506 738807
6749 738807 775646 857665 797341 802223 804304 741710 681305 694242 676991 699043 863226 775859
$$ packed form
6827E02286k2631L5030n581j83398p6890N665Q7489K2439M0953L1230o1776J9575
6815C94391J28028n2764o9015N5981J01029O196l6513M6108q3695L5847k2361
6804E03232j1289m4845O092Q448n0384q1732M6602J04475J15226l3355j11782
6793D50688R0147M8511j2631m9369o5776l6714k4135O6974J07888k6452N2135
6782F01266P5346o9083n573j40871j28571L2204M1474P7678K65041o6851j30535
6771E51525K0718m0031N1496J01626R5471n5432M4780r589k06024J75029j9263
6760G10306k2211O2480p0108N1074J6514n0386j9785Q5258J06427J3937j44699
6749G38807L6839Q2019o0324M882K081o2594o0405J2937j7251K2052J64183q7367
$$ plain form
6737 775859 743778 701604 758787 812809 803177 872179 791136 681209 781554 868179 934894
6726 934894 799249 825640 833699 736131 791273 971497 988978 898912 903057 960155 1003058 996848
6714 996848 1046049 1116646 1215281 1094840 1036515 1009628 1064174 1100460 1093082 1106166 1083966 1109880
6702 1109880 1057220 1125067 1158628 1126848 1088726 1104868 1161128 1192205 1166180 1156301 1133040 1158499
6690 1158499 1276725 1252391 1308782 1138489 1296500 1239091 1185655 1103455 1230152 1340328
6680 1340328 1231572 1355082 1421095 1376463 1430162 1406619 1347755 1264664 1295219 1434477 1410429
6669 1410429 1380409 1225175 1254349 1321824 1398898 1457500 1619522 1737844 1719679 1683829 1596592
6658 1596592 1626775 1590464 1609131 1688406 1670780 1731999 1692384 1655262 1631628 1614188 1475282
$$ packed form
6737G75859l2081m2174N7183N4022r632O9002q1043j09927J00345Q6625O6715
6726I34894j35645K6391Q059r7568N5142J80224J7481r0066M145N7098M2903o210
6714I96848M9201P0597R8635j20441n8325k6887N4546L6286p378J3084k2200K5914
6702A109880n2660O7847L3561l1780l8122J6142N6260L1077k6025r879k3261K5459
6690A158499J18226k4334N6391j70293J58011n7409n3436q2200J26697J10176
6680A340328j08756J23510O6013m4632N3699k3543n8864q3091L0555J39258k4048
6669A410429l0020j55234K9174O7475P7074N8602J62022J18322j8165l5850q7237
6658A596592L0183l6311J8667P9275j7626O1219l9615l7122k3634j7440j38906
$$ plain form
6647 1475282 1606422 1750874 1746498 1775663 1900543 1913233 1909682 1870020 1976188 1969539 1871414
6636 1871414 1875027 1881392 1930228 2003408 1964980 1975984 1918160 2028196 2106584 1972292 1941535
6625 1941535 2009087 1954797 1898129 1866591 1949482 2099170 2092578 2232705 2363334 2318241 2172481
6614 2172481 2109197 2061463 2177464 2300370 2324156 2375044 2419470 2421938 2412227 2517168 2466082
6603 2466082 2363202 2413819 2405515 2408509 2315608 2370717 2469097 2335787 2369707 2393102 2522298
6592 2522298 2541482 2414531 2484632 2598424 2704772 2564706 2488918 2475293 2651742 2580663
6582 2580663 2690268 2793719 3015310 2939228 2841043 2852069 2852384 2800481 2774599 2793373 2843213
6571 2843213 2837385 2725278 2797411 2849914 2924856 2876507 2879544 2794223 2923554 3114937 3173958
$$ packed form
6647A475282J31140J44452m376K9165J24880J2690l551l9662J06168o649r8125
6636A871414L613O365M8836P3180l8428J1004n7824J10036P8388j34292l0757
6625A941535O7552n4290n6668l1538Q2891J49688o592J40127J30629m5093j45760
6614B172481o3284m7734J16001J22906K3786N0888M4426K468r711J04941n1086
6603B466082j02880N0617q304K994r2901N5109R8380j33310L3920K3395J29196
6592B522298J9184j26951P0101J13792J06348j40066p5788j3625J76449p1079
6582B580663J09605J03451K21591p6082r8185J1026L15n1903k5882J8774M9840
6571B843213n828j12107P2133N2503P4942m8349L037q5321J29331J91383N9021
$$ plain form
6560 3173958 3137691 3111693 3079007 3221987 3176800 3251140 3362891 3454252 3311203 3397130 3454196
6549 3454196 3448024 3485339 3486989 3689848 3733648 3652371 3703428 3835410 3899191 3849321 3874870
6538 3874870 3922776 4113864 4278778 4217541 4252860 4435236 4605559 4559122 4774181 4918979
6528 4918979 5128599 5238555 5281941 5349563 5467282 5411580 5652451 6002028 6287358 6493369
6518 6493369 6652309 6823625 6964852 7125931 7260188 7595503 7832032 8088690 8288658 8375451
6508 8375451 8520816 8732454 8861353 9012685 9205273 9344233 9489920 9610671 9683899 9851661
6498 9851661 10075753 10216621 10344929 10286528 10425350 10646630 10779781 11005405 11241787 11413766
6488 11413766 11576951 11912558 12191291 12279702 12623853 12906834 13212438 13472879 13736908 14122820
$$ packed form
6560C173958l6267k5998l2686J42980m5187P4340J11751R1361j43049Q5927N7066
6549C454196o172L7315J650K02859M3800q1277N1057J31982O3781m9870K5549
6538C874870M7906J91088J64914o1237L5319J82376J70323m6437K15059J44798
6528D918979K09620J09956M3386O7622J17719n5702K40871L49577K85330K06011
6518F493369J58940J71316J41227J61079J34257L35315K36529K56658J99968Q6793
6508H375451J45365K11638J28899J51332J92588J38960J45687J20751P3228J67762
6498I851661K24092J40868J28308n8401J38822K21280J33151K25624K36382J71979
6488A1413766J63185L35607K78733Q8411L44151K82981L05604K60441K64029L85912
$$ plain form
6478 14122820 14564464 15078830 15439533 15759971 15874260 16119094 16440243 16768629 16992742
6469 16992742 17165269 17268305 17475089 17566625 17510700 17626563 17622119 17443922 17395786 17430467
6459 17430467 17243431 17035226 16754387 16520827 16337800 15927994 15667423 15512158 15351094
6450 15351094 15078243 14781539 14634844 14380391 14079278 13906217 13615979 13221201 13020539
6441 13020539 12897576 12700466 12644061 12554931 12396407 12278838 12258125 12014087 11794935 11689582
6431 11689582 11568479 11309073 11118106 11073831 10933352 10802755 10469809 10216801 10230189 10294357
6421 10294357 10205255 10177690 10062208 9971014 9964658 9905083 9944399 9944631 9886879 9926530 9962764 10059858
6409 10059858 10218165 10253321 10489143 10677547 10825449 10999910 11019860 11091219 11253988 11320443
$$ packed form
6478A4122820M41644N14366L60703L20438J14289K44834L21149L28386K24113
6469A6992742J72527J03036K06784R1536n5925J15863m444j78197m8136L4681
6459A7430467j87036k08205k80839k33560j83027m09806k60571j55265j61064
6450A5351094k72851k96704j46695k54453l01113j73061k90238l94778k00662
6441A3020539j22963j97110n6405q9130j58524j17569k0713k44038k19152j05353
6431A1689582j21103k59406j90967m4275j40479j30597l32946k53008J3388O4168
6421A0294357q9102k7565j15482r1194o356n9575L9316K32n7752L9651L6234R7094
6409A0059858J58307L5156K35822J88404J47902J74461J9950P1359J62769O6455
$$ plain form
6399 11320443 11268341 11290444 11307955 11294720 11197349 11087630 11060349 10925160 10804590 10628845
6389 10628845 10416908 10226962 10027047 9678073 9470438 9278910 9049290 8802210 8538040
6380 8538040 8033800 7678696 7447912 7018194 6702849 6601955 6479394 6173619 5912932 5716646
6370 5716646 5508398 5230769 5025109 4829743 4635760 4538246 4293997 4047673 3983405 3795245
6360 3795245 3697090 3643998 3636481 3409531 3366713 3342135 3102329 2890789 2968748 2824296 2705460
6349 2705460 2655258 2668300 2563046 2513999 2619871 2557358 2489354 2431713 2306329 2181842 2219235
6338 2219235 2125574 2032158 2064870 2133081 2004295 1930321 1971932 1895838 1893740 1982553 1950032
6327 1950032 1801621 1796896 1816290 1902988 1972017 2018509 1958459 1843329 1911418 1938071 1909127
$$ packed form
6399A1320443n2102K2103J7511j3235r7371j09719k7281j35189j20570j75745
6389A0628845k11937j89946j99915l48974k07635j91528k29620k47080k64170
6380H538040n04240l55104k30784m29718l15345j00894j22561l05775k60687j96286
6370E716646k08248k77629k05660j95366j93983r7514k44249k46324o4268j88160
6360C795245r8155n3092p517k26950m2818k4578k39806k11540P7959j44452j18836
6349B705460n0202J3042j05254m9047J05872o2513o8004n7641j25384j24487L7393
6338B219235r3661r3416L2712O8211j28786p3974M1611p6094k098Q8813l2521
6327A950032j48411m725J9394Q6698O9029M6492o0050j15130O8089K6653k8944
$$ plain form
6316 1909127 1936492 1849067 1789908 1753345 1736934 1904290 1899328 1806760 1793881 2007707 2064072
6305 2064072 2011559 1999941 1895856 1748981 1672535 1687712 1650935 1777341 1910097 1805908
6295 1805908 1727984 1749091 1803985 1670829 1754354 1675466 1588441 1549052 1475414 1437352 1449333
6284 1449333 1459089 1459270 1453580 1458701 1564081 1625113 1699618 1616312 1628603 1672986 1581409 1560007
6272 1560007 1486967 1588122 1634857 1522171 1517562 1638500 1733135 1721031 1672482 1635607 1727918
6261 1727918 1715289 1750803 1685046 1679912 1676019 1704792 1637524 1610341 1655534 1642927 1798431 1826416
6249 1826416 1786682 1908926 1980115 1873210 1786833 1827554 1870801 1829636 1878577 1989605 1935053
6238 1935053 2093127 2230048 2289340 2286978 2368317 2490644 2553079 2631297 2563553 2662937 2821384
$$ packed form
6316A909127K7365q7425n9159l6563j6411J67356m962r2568j2879K13826N6365
6305B064072n2513j1618j04085j46875p6446J5177l6777J26406J32756j04189
6295A805908p7924K1107N4894j33156Q3525p8888q7025l9389p3638l8062J1981
6284A449333R756J81n690N121J05380O1032P4505q3306J2291M4383r1577k1402
6272A560007p3040J01155M6735j12686m609J20938R4635j2104m8549l6875R2311
6261A727918j2629L5514o5757n134l893K8773o7268k7183M5193j2607J55504K7985
6249A826416l9734J22244P1189j06905q6377M0721M3247m1165M8941J11028n4552
6238A935053J58074J36921N9292k362Q1339J22327O2435P8218o7744R9384J58447
$$ plain form
6227 2821384 2869091 2927386 3100856 3089698 3100758 3115370 3368004 3689309 3817447 3918469
6217 3918469 3954305 4122677 4236493 4476354 4738467 4768098 5009930 5239841 5553714 5836864
6207 5836864 5942834 6025578 6122018 6264863 6355337 6475248 6612040 6684083 6778075 6823053 6955683
6196 6955683 7013139 6994146 6977840 7003581 7194675 7088003 7071051 7203001 7170374 7122733 7162824
6185 7162824 7309449 7330051 7171821 7199666 7264546 7281390 7263387 7249723 7310248 7203186 7273588
6174 7273588 7327024 7303086 7261982 7200593 7234713 7108222 7068826 6995767 6831549 6844476 6936391
6163 6936391 6664572 6604460 6598428 6647217 6545567 6408327 6306940 6254197 6195037 6043925 6008890
6152 6008890 5877446 5914598 6013798 5895492 5831249 5764308 5633371 5683696 5712155 5812233 5812459
$$ packed form
6227B821384M7707N8295J73470j1158J1060J4612K52634L21305J28138J01022
6217C918469L5836J68372J13816K39861K62113K9631K41832K29911L13873K83150
6207E836864J05970Q2744R6440J42845R0474J19911J36792P2043R3992M4978J32630
6196F955683N7456j8993j6306K5741J91094j06672j6952J31950l2627m7641M0091
6185G162824J46625K0602j58230K7845O4880J6844j8003j3664O0525j07062P0402
6174G273588N3436k3938m1104o1389L4120j26491l9396p3059j64218J2927R1915
6163F936391k71819o0112o032M8789j01650j37240j01387n2743n9160j51112l5035
6152F008890j31444L7152R9200j18306o4243o6941j30937N0325K8459J00078K26
$$ plain form
6141 5812459 5939236 6063132 5974351 5929178 5967863 5978714 5864762 5760544 5756936 5697568 5691186
6130 5691186 5630980 5604855 5566606 5551717 5506410 5353620 5321150 5362881 5265654 5309835 5352110
6119 5352110 5304312 5282659 5335164 5331786 5189695 5093606 5091697 5114257 5014580 4966267 4985427 4978419
6107 4978419 4937374 4881211 4862619 4945734 4938271 4810903 4679265 4594446 4581683 4467718 4360542
6096 4360542 4174253 4130380 4108425 3902814 3856783 3702263 3556890 3525742 3417212 3342601
6086 3342601 3172842 3102493 3065586 3021358 2925445 2815213 2830939 2753575 2665791 2674415 2711947
6075 2711947 2551715 2520139 2419111 2318688 2260865 2223977 2284562 2276113 2180043 2109008 2096054
6064 2096054 2205433 2299691 2244569 2232899 1969383 1943075 1895367 1784988 1925268 1884793 1945916
$$ packed form
6141E812459J26777J23896q8781m5173L8685J0851j13952j04218l608n9368o382
6130E691186o0206k6125l8249j4889m5307j52790l2470M1731r7227M4181M2275
6119E352110m7798k1653N2505l378j42091r6089j909K2560r9677m8313J9160p008
6107D978419m1045n6163j8592Q3115p463j27368j31638q4819j2763j13965j07176
6096D360542j86289m3873k1955k05611m6031j54520j45373l1148j08530p4611
6086C342601j69759p0349l6907m4228r5913j10232J5726p7364q7784Q624L7532
6075B711947j60232l1576j01028j00423n7823l6888O0585q449r6070p1035j2954
6064B096054J09379R4258n5122j1670k63516k6308m7708j10379J40280m0475O1123
$$ plain form
6053 1945916 1951000 1875815 1842708 1853179 1846286 1810110 1796713 1892186 1821044 1848245 1948474 1875887
6041 1875887 1795322 1753137 1674346 1642724 1695892 1758534 1702190 1737054 1715067 1673379 1645339
6030 1645339 1621587 1616210 1647191 1721000 1775080 1868814 1763062 1849978 1812673 1663480 1691995
6019 1691995 1743343 1768326 1819019 1770328 1706660 1676357 1654913 1505923 1571951 1582232 1659508
6008 1659508 1617287 1649577 1810734 1756162 1681679 1621138 1650402 1598822 1514882 1561878 1620763
5997 1620763 1504781 1470707 1479728 1493907 1644779 1681664 1582992 1573857 1579859 1548239 1727978
5986 1727978 1692104 1515285 1548611 1595825 1596473 1614636 1643097 1541456 1515527 1538342 1446326
5975 1446326 1600537 1712952 1531937 1398021 1467784 1688900 1608518 1644397 1579291 1559762
$$ packed form
6053A945916N084p5185l3107J0471o893l6176j3397R5473p1142K7201J00229p2587
6041A875887q0565m2185p8791l1622N3168O2642n6344L4864k1987m1688k8040
6030A645339k3752n377L0981P3809N4080R3734j05752Q6916l7305j49193K8515
6019A691995N1348K4983N0693m8691o3668l0303k1444j48990O6028J0281P7276
6008A659508m2221L2290J61157n4572p4483o0541K9264n1580q3940M6996N8885
5997A620763j15982l4074R021J4179J50872L6885r8672r135O002l1620J79739
5986A727978l5874j76819L3326M7214O48J8163K8461j01641k5929K2815r2016
5975A446326J54211J12415j81015j33916O9763K21116q0382L5879o5106j9529
$$ plain form
5965 1559762 1552143 1515770 1461910 1559774 1630585 1764394 1647210 1520470 1538754 1490848 1491940
5954 1491940 1542400 1476113 1480578 1465581 1378418 1471215 1421440 1431720 1447953 1458323 1382728 1367185
5942 1367185 1467146 1444242 1446402 1494832 1544287 1590401 1548941 1401704 1421045 1422378 1402307 1542898
5930 1542898 1544288 1466834 1518204 1531410 1551069 1649227 1559817 1576364 1506811 1623038 1539251
5919 1539251 1446023 1532915 1604211 1617284 1598423 1640091 1684749 1767508 1836947 1756630 1706818
5908 1706818 1764169 1791935 1825445 1752393 1655341 1679844 1810257 1736273 1694197 1754193 1793560
5897 1793560 1798185 1794589 1702199 1699477 1903274 1934000 1983744 1918918 1858736 1925942 1909143 1920885
5885 1920885 1846581 1815776 1897019 2057357 2126588 2068891 1969975 1916951 1821110 1776137 1924840
$$ packed form
5965A559762p619l6373n3860R7864P0811J33809j17184j26740J8284m7906J092
5954A491940N0460o6287M465j4997q7163R2797m9775J0280J6233J0370p5595j5543
5942A367185R9961k2904K160M8430M9455M6114m1460j47237J9341J333k0071J40591
5930A542898J390p7454N1370J3206J9659R8158q9410J6547o9553J16227q3787
5919A539251r3228Q6892P1296J3073j8861M1668M4658Q2759O9439q0317m9812
5908A706818N7351K7766L3510p3052r7052K4503J30413p3984m2076N9996L9367
5897A793560M625l596r2390k722K03797L0726M9744o4826o0182O7206j6799J1742
5885A920885p4304l0805Q1243J60338O9231n7697r8916n3024r5841m4973J48703
$$ plain form
5874 1924840 1891259 1999833 1912801 1932107 2068713 2085184 1994060 2062979 2072703 2019957 2060395
5863 2060395 2008415 1899787 1798267 1892522 2077977 2150113 2058559 2200320 2214215 2096863
5853 2096863 2033180 2094009 2071482 2012193 2099787 2203002 2254845 2268935 2248256 2116806 2044077
5842 2044077 2082961 2210162 2301101 2235024 1968153 2019278 2219989 2333049 2229137 2304120
5832 2304120 2365160 2383488 2441440 2400177 2334061 2324448 2343035 2382366 2404290 2438868 2507261 2531368
5820 2531368 2611710 2670021 2647104 2543191 2587146 2760412 2758837 2698345 2660618 2689438 2772792
5809 2772792 2830519 2869408 2826901 2836336 2765601 2856805 2881480 2905019 2922118 3035891 3145613
5798 3145613 3252976 3287094 3284662 3344211 3497485 3418582 3459203 3466406 3585505 3710092 3722621
$$ packed form
5874A924840l3581J08574q7032J9306J36606J6471r1124O8919R724n2746M0438
5863B060395n1980j08628j01520R4255J85455P2136r1554J41761J3895j17352
5853B096863o3683O0829k2527n9289Q7594J03215N1843J4090k0679j31450p2729
5842B044077L8884J27201R0939o6077k66871N1125K00711J13060j03912P4983
5832B304120O1040J8328N7952m1263o6116r613J8587L9331K1924L4578O8393K4107
5820B531368Q0342N8311k2917j03913M3955J73266j575o0492l7727K8820Q3354
5809B772792N7727L8889m2507R435p0735R1204K4675K3539J7099J13773J09722
5798C145613J07363L4118k432N9549J53274p8903M0621P203J19099J24587J2529
$$ plain form
5787 3722621 3664141 3747341 3654714 3784680 3854609 3950262 4137213 4163602 4220145 4237935 4148567
5776 4148567 4494577 4752784 4692564 4739872 4768317 4903532 4946153 5082102 5143833 5162933 5244910
5765 5244910 5264997 5436405 5470364 5676925 5801572 5974725 5991653 6046851 6367482 6441107
5755 6441107 6591898 6598173 6779142 6846798 6930156 7067309 7260279 7339792 7285323 7397472 7589082
5744 7589082 7686595 7750589 7707788 7908446 8046352 8033898 8135200 8238504 8165666 8327968
5734 8327968 8399292 8341487 8405435 8422109 8456581 8611498 8663910 8687274 8790230 8798113 8900772
5723 8900772 9000605 9083092 9227252 9106152 9177769 9231410 9285123 9348243 9586720 9720824 9889404
5712 9889404 9966850 10042310 10123254 10295864 10392220 10484940 10512472 10523378 10603539 10748362 10815792
$$ packed form
5787C722621n8480Q3200r2627J29966O9929R5653J86951K6389N6543J7790q9368
5776D148567L46010K58207o0220M7308K8445J35215M2621J35949O1731J9100Q1977
5765E244910K0087J71408L3959K06561J24647J73153J6928N5198L20631P3625
5755F441107J50791O275J80969O7656Q3358J37153J92970P9513n4469J12149J91610
5744G589082R7513O3994m2801K00658J37906j2454J01302J03304p2838J62302
5734H327968P1324n7805O3948J6674L4472J54917N2412K3364J02956P883J02659
5723H900772R9833Q2487J44160j21100P1617N3641N3713O3120K38477J34104J68580
5712I889404P7446P5460Q0944J72610R6356R2720K7532J0906Q0161J44823O7430
$$ plain form
5701 10815792 11002297 11208148 11318927 11496654 11464045 11511469 11615833 11793051 11853120 12006088
5691 12006088 12096700 12046546 12159612 12298970 12317311 12321985 12380241 12307280 12246782 12318498 12311330
5680 12311330 12336415 12409842 12252145 12225664 12338863 12253684 12192681 12107672 12110531 12030944 12035261
5669 12035261 12097365 12124783 12166852 12079077 12127448 12040602 11979875 11974691 11830284 11927269 11989613
5658 11989613 12009286 11872086 11852844 11818806 11899142 11862573 11773325 11920372 12056619 11936516
5648 11936516 11958357 11990173 12037934 12011657 12057387 12219253 12229020 12178908 12297294 12390794 12534334
5637 12534334 12744978 12722472 12753247 12742573 12925884 13194771 13291815 13483190 13641855 13673924
5627 13673924 13909107 14144941 14124081 14281117 14549214 14736340 14928841 15237907 15432467 15628090
$$ packed form
5701A0815792J86505K05851J10779J77727l2609M7424J04364J77218O0069J52968
5691A2006088R0612n0154J13066J39358J8341M674N8256p2961o0498P1716p168
5680A2311330K5085P3427j57697k6481J13199q5179o1003q5009K859p9587M317
5669A2035261O2104K7418M2069q7775M8371q6846o0727n184j44407R6985O2344
5658A1989613J9673j37200j9242l4038Q0336l6569q9248J47047J36247j20103
5648A1936516K1841L1816M7761k6277M5730J61866R767n0112J18386R3500J43540
5637A2534334K10644k2506L0775j0674J83311K68887R7044J91375J58665L2069
5627A3673924K35183K35834k0860J57036K68097J87126J92501L09066J94560J95623
$$ plain form
5617 15628090 15800016 15962939 16154511 16407660 16769720 16963441 17237534 17437192 17666610
5608 17666610 17776845 18021040 18399599 18729683 19216074 19467113 19801535 20204299 20558316
5599 20558316 20966296 21283105 21724357 22300247 22786311 23204414 23673208 24054324 24674733
5590 24674733 25230396 25681954 26255413 26738806 27351583 28035137 28722975 29409601 30035166
5581 30035166 30688573 31335345 32149066 32810594 33683267 34620661 35414798 36383509 37228568
5572 37228568 38207788 39213986 40269164 41380607 42577014 43733577 44956525 46232816
5564 46232816 47503412 49036618 50572660 52121253 53815150 55541117 57354612 59122585
5556 59122585 61133538 63259782 65432388 67803109 70424732 73025410 75672666 78503838
$$ packed form
5617A5628090J71926J62923J91572K53149L62060J93721K74093J99658K29418
5608A7666610J10235K44195L78559L30084M86391K51039L34422M02764L54017
5599B0558316M07980L16809M41252N75890M86064M18103M68794L81116O20409
5590B4674733N55663M51558N73459M83393O12777O83554O87838O86626O25565
5581C0035166O53407O46772Q13721O61528Q72673R37394P94137R68711Q45059
5572C7228568R79220J006198J055178J111443J196407J156563J222948J276291
5564D6232816J270596J533206J536042J548593J693897J725967J813495J767973
5556E9122585K010953K126244K172606K370721K621623K600678K647256K831172
$$ plain form
5548 78503838 81404501 84533448 87895161 91578269 95388942 99469723 103749624 108245762
5540 108245762 113096031 118320326 123732119 129406317 135461054 141892230 148742571 155822684
5532 155822684 163170730 170975420 178992390 187330832 196154942 205053624 214101602 223312458
5524 223312458 232618821 241887719 250943481 259722299 268043194 275957675 283396804 289926351
5516 289926351 295706678 300460219 304129598 306714289 308176183 308440836 307474019 305191761
5508 305191761 302044480 297806636 292346218 285931248 278690869 271079100 262638593 253904837
5500 253904837 244709909 235356527 225892201 216533679 207210677 198104634 189064547 180280305
5492 180280305 171836690 163764263 155997509 148611417 141602636 134998441 128713788 122885742
$$ packed form
5548G8503838K900663L128947L361713L683108L810673M080781M279901M496138
5540A08245762M850269N224295N411793N674198O054737O431176O850341P080113
5532A55822684P348046P804690Q016970Q338442Q824110Q898682R047978R210856
5524B23312458R306363R268898R055762Q778818Q320895P914481P439129O529547
5516B89926351N780327M753541L669379K584691J461894K64653r66817k282258
5508C05191761l147281m237844n460418o414970p240379p611769q440507q733756
5500B53904837r194928r353382r464326r358522r323002r106043r040087q784242
5492A80280305q443615q072427p766754p386092p008781o604195o284653n828046
$$ plain form
5484 122885742 117484910 112170142 107151736 102547871 98203217 94089595 90160095 86361870
5476 86361870 82816588 79619472 76632160 73731133 71064429 68551948 66067073 63704196
5468 63704196 61724418 59605988 57671142 55792571 54007332 52252648 50636849 49077112
5460 49077112 47674141 46395429 45033248 43597636 42491627 41509989 40417874 39293252
5452 39293252 38143894 37103314 36207868 35228750 34382174 33692936 32947146 32159131 31277493
5443 31277493 30583318 29826055 29075580 28619391 28036507 27430673 26952717 26444932 26056774
5434 26056774 25537129 24932867 24681647 24245185 23662891 23197685 22742777 22403898 22112154
5425 22112154 21833419 21441890 21027067 20632251 20243427 19794703 19547061 19170945 18735220
$$ packed form
5484A22885742n400832n314768n018406m603865m344654m113622l929500l798225
5476H6361870l545282l197116k987312k901027k666704k512481k484875k362877
5468F3704196j979778k118430j934846j878571j785239j754684j615799j559737
5460D9077112j402971j278712j362181j435612j106009r81638j092115j124622
5452C9293252j149358j040580q95446r79118q46576o89238p45790p88015q81638
5443C1277493o94175p57263p50475m56189n82884o05834m77956n07785l88158
5434B6056774n19645o04262k51220m36462n82294m65206m54908l38879k91744
5425B2112154k78735l91529m14823l94816l88824m48724k47642l76116m35725
$$ plain form
5416 18735220 18373959 18035214 17837889 17615266 17352841 17044404 16830710 16515175 16297253
5407 16297253 15988293 15776988 15697676 15531073 15210730 14979956 14805207 14548937 14378043 14187619
5397 14187619 14081100 13868828 13718996 13456681 13223614 13088357 12909957 12605994 12418441
5388 12418441 12308406 12078033 11804906 11677275 11547844 11523818 11429616 11335355 11138363 11004904
5378 11004904 10927893 10823909 10703372 10465507 10394490 10343539 10161279 10089922 9839288 9841934
5368 9841934 9777157 9637924 9495674 9446820 9505979 9282151 9283591 9296636 9207884 9145706 9157403
5357 9157403 8937587 8842186 8782393 8830368 8904152 8938957 8890009 8869305 8749036 8684512 8654900
5346 8654900 8650275 8565163 8531294 8445783 8484220 8433233 8406096 8337837 8307189 8346238 8319872 8446703
$$ packed form
5416A8735220l61261l38745j97325k22623k62425l08437k13694l15535k17922
5407A6297253l08960k11305p9312j66603l20343k30774j74749k56270j70894j90424
5397A4187619j06519k12272j49832k62315k33067j35257j78400l03963j87553
5388A2418441j10035k30373k73127j27631j29431k4026r4202r4261j96992j33459
5378A1004904p7011j03984j20537k37865p1017n0951j82260p1357k50634K646
5368I841934o4777j39233j42250m8854N9159k23828J440J3045q8752o2178J1697
5357I157403k19816r5401n9793M7975P3784L4805m8948k0704j20269o4524k9612
5346H654900m625q5112l3869q5511L8437n0987k7137o8259l0648L9049k6366J26831
$$ plain form
5334 8446703 8345820 8239364 8343826 8406649 8309875 8124823 8160077 8292192 8206537 8105227
5324 8105227 8010151 8022286 8041997 8012089 8010185 7998843 8149488 8196551 8190553 8206434 8218782 8061857
5312 8061857 8031743 8129833 8170327 8041041 8139871 8199799 8143600 8221541 8267603 8201648 8188292
5301 8188292 8315629 8347859 8438333 8499979 8508568 8498216 8590667 8627561 8728741 8639619 8631081
5290 8631081 8684849 8870548 8896615 8894696 8952560 9124634 9200254 9311211 9447233 9643969 9739688
5279 9739688 9918496 10138035 10256863 10490254 10590373 10685893 10982873 11354897 11629467 11871330
5269 11871330 12054920 12158521 12539704 12821973 13044402 13211714 13519221 13873414 14229969
5260 14229969 14449599 14569880 14785112 15074676 15246566 15487226 15789845 15920290 16223145
$$ packed form
5334H446703j00883j06456J04462O2823r6774j85052L5254J32115q5655j01310
5324H105227r5076J2135J9711k9908j904j1342J50645M7063n998J5881J2348j56925
5312H061857l0114R8090M0494j29286R8830N9928n6199P7941M6062o5955j3356
5301H188292J27337L2230R0474O1646Q589j0352R2451L6894J01180q9122q538
5290H631081N3768J85699K6067j919N7864J72074P5620J10957J36022J96736R5719
5279I739688J78808K19539J18828K33391J00119R5520K96980L72024K74570K41863
5269A1871330J83590J03601L81183K82269K22429J67312L07507L54193L56555
5260A4229969K19630J20281K15232K89564J71890K40660L02619J30445L02855
$$ plain form
5251 16223145 16442680 16550244 16616907 16722387 16924813 17300125 17453585 17586085 17608157 17779808
5241 17779808 17980294 18085542 18222851 18422185 18586119 18754139 18880262 18929227 18996964 19022849
5231 19022849 19026184 18977420 19017793 18798339 18583660 18551888 18550378 18517369 18283287 18137595 17894669
5220 17894669 17828778 17535627 17304292 17225243 16926287 16643837 16541866 16430572 16191993 16069365
5210 16069365 15719017 15483397 15254403 15131131 14931866 14771861 14663338 14379351 14213128
5201 14213128 13988187 13653661 13441837 13345866 13023614 12903881 12742662 12594905 12472114 12202272
5191 12202272 11945044 11831559 11710735 11547960 11274121 11100214 11060575 10883695 10840923 10655197
5181 10655197 10562428 10552084 10438217 10151818 10085231 10039091 9859556 9966543 9938122 9780720
$$ packed form
5251A6223145K19535J07564O6663J05480K02426L75312J53460J32500K2072J71651
5241A7779808K00486J05248J37309J99334J63934J68020J26123M8965O7737K5885
5231A9022849L335m8764M0373k19454k14679l1772j510l3009k34082j45692k42926
5220A7894669o5891k93151k31335p9049k98956k82450j01971j11294k38579j22628
5210A6069365l50348k35620k28994j23272j99265j60005j08523k83987j66223
5201A4213128k24941l34526k11824r5971l22252j19733j61219j47757j22791k69842
5191A2202272k57228j13485j20824j62775k73839j73907l9639j76880m2772j85726
5181A0655197r2769j0344j13867k86399o6587m6140j79535J06987k8421j57402
$$ plain form
5171 9780720 9795823 9865578 9801616 9669134 9583431 9620983 9604203 9593431 9495779 9469309 9457498
5160 9457498 9523179 9610575 9630986 9567960 9582499 9482517 9478538 9599095 9651159 9632522 9623202 9689736
5148 9689736 9721814 9747298 9653403 9689737 9785609 9838771 9728248 9717529 9790087 9662299 9531440
5137 9531440 9674142 9676569 9707678 9773611 9876044 9830159 9866744 9821789 9794964 9777303 9918599
5126 9918599 9986626 9947266 10053395 10105323 9981503 9967803 9963443 10072655 10268526 10230082 10175487
5115 10175487 10195101 10306807 10487811 10463507 10446304 10472983 10460530 10526988 10607119 10657021 10644169
5104 10644169 10638067 10591994 10665825 10609809 10743700 10921863 10844805 10700601 10957896 11131771
5094 11131771 11084142 11021575 11057468 11162456 11176330 11086643 11071323 11186065 11211399 11112991 11204561
$$ packed form
5171I780720J5103O9755o3962j32482q5703L7552j6780j0772r7652k6470j1811
5160I457498O5681Q7396K0411o3026J4539r9982l979J20557N2064j8637r320O6534
5148I689736L2078K5484r3895L6334R5872N3162j10523j0719P2558j27788j30859
5137I531440J42702K427L1109O5933J02433m5885L6585m4955k6825j7661J41296
5126I918599O8027l9360J06129N1928j23820j3700m360J09212J95871l8444n4595
5115A0175487J9614J11706J81004k4304j7203K6679j2453O6458Q0131M9902j2852
5104A0644169o102m6073P3831n6016J33891J78163p7058j44204K57295J73875
5094A1131771m7629o2567L5893J04988J3874q9687j5320J14742K5334r8408R1570
$$ plain form
5083 11204561 11096938 11063831 11009845 10971785 10919251 10978728 10963916 10867905 10925788 10962831 10894526
5072 10894526 11008611 11080661 11081791 11156998 11056479 11040025 11035183 11022811 11195341 11288564 11251418
5061 11251418 11243684 11320958 11296105 11218250 11297713 11389615 11396721 11325856 11327055 11478430 11519719 11454385
5049 11454385 11339283 11324371 11544227 11567420 11581283 11655059 11696081 11842123 11911734 12107515
5039 12107515 12088260 12151874 12244986 12335868 12624487 12694780 12765913 12863206 13081419 13243265 13487183
5028 13487183 13633008 13768664 14044099 14239180 14550169 14955213 15299816 15776994 16163900
5019 16163900 16664720 17139237 17845395 18390943 19009548 19719106 20555110 21485499 22656753
5010 22656753 23562787 24603098 25693287 26974822 28334074 29682751 31136578 32579359
$$ packed form
5083A1204561j07623l3107n3986l8060n2534N9477j4812r6011N7883L7043o8305
5072A0894526J14085P2050J130P5207j00519j6454m842j2372J72530R3223l7146
5061A1251418p734P7274k4853p7855P9463R1902P106p0865J199J51375M1289o5334
5049A1454385j15102j4912K19856K3193J3863P3776M1022J46042O9611J95781
5039A2107515j9255O3614R3112R0882K88619P0293P1133R7293K18213J61846K43918
5028A3487183J45825J35656K75435J95081L10989M05044L44603M77178L86906
5019A6163900N00820M74517P06158N45548O18605P09558Q36004R30389J171254
5010B2656753R06034J040311J090189J281535J359252J348677J453827J442781
$$ plain form
5002 32579359 33994824 35314702 36450658 37709603 39025166 40082245 41097653 42064366
4994 42064366 42781663 43330592 43893153 44272631 44675724 44885587 44935229 45028558 45075472 44854367
4984 44854367 44515040 44100938 43671609 43032710 42207813 41528618 40819761 39791515 38773333
4975 38773333 37637683 36404374 35183739 34050998 32718465 31332281 29924321 28476219
4967 28476219 27091493 25714601 24488388 23228856 22033033 20995727 19781909 18661260
4959 18661260 17695738 16838313 15990847 15278498 14537668 13812277 13211121 12622193 11950754
4950 11950754 11396877 11016012 10689935 10519865 10283556 9865341 9677212 9519702 9264853
4941 9264853 9063314 8969423 8834711 8823956 8819835 8876583 8952906 9010264 8906065 8757489 8722961
$$ packed form
5002C2579359J415465J319878J135956J258945J315563J057079J015408R66713
4994D2064366P17297N48929N62561L79478M03093K09863M9642R3329M6914k21105
4984D4854367l39327m14102m29329o38899q24897o79195p08857j028246j018182
4975C8773333j135650j233309j220635j132741j332533j386184j407960j448102
4967B8476219j384726j376892j226213j259532j195823j037306j213818j120649
4959A8661260r65522q57425q47466p12349p40830p25391o01156n88928o71439
4950A1950754n53877l80865l26077j70070k36309m18215j88129j57510k54849
4941I264853k01539r3891j34712j0755m121N6748P6323N7358j04199j48576l4528
$$ plain form
4930 8722961 8723649 8635755 8504290 8374847 8172287 7950454 7745722 7556393 7378907 7218033
4920 7218033 6946416 6713587 6525327 6434740 6295233 6052680 5828922 5638581 5477831 5433852
4910 5433852 5481550 5343600 5292716 5317481 5159756 4994370 5054150 5027833 4935578 4857075 4736482
4899 4736482 4630623 4627612 4622001 4618716 4561195 4387019 4288537 4181937 4289161 4249141 4155352
4888 4155352 4048721 3980498 3908644 3917777 3947348 3884776 3790145 3724367 3659624 3573146 3617455
4877 3617455 3626750 3517985 3533544 3544624 3324963 3380613 3332026 3151118 3115118 3154002 3113084
4866 3113084 3060691 3041960 3038030 2972273 2937765 2966516 2929944 3014977 2792255 2706590 2570874
4855 2570874 2587523 2654521 2612292 2558419 2616441 2657816 2611763 2597076 2575606 2538506 2537563 2489128
$$ packed form
4930H722961O88q7894j31465j29443k02560k21833k04732j89329j77486j60874
4920G218033k71617k32829j88260r0587j39507k42553k23758j90341j60750m3979
4910E433852M7698j37950n0884K4765j57725j65386N9780k6317r2255p8503j20593
4899D736482j05859l011n611l285n7521j74176r8482j06600J07224m0020r3789
4888D155352j06631o8223p1854R133K9571o2572r4631o5778o4743q6478M4309
4877C617455R295j08765J5559J1080k19661N5650m8587j80908l6000L8884m0918
4866C113084n2393j8731l930o5757l4508K8751l6572Q5033k22722q5665j35716
4855B570874J6649O6998m2229n3873N8022M1375m6053j4687k1470l7100r43m8435
$$ plain form
4843 2489128 2500032 2382909 2428455 2447362 2370359 2280599 2222198 2349212 2350002 2421105 2333770
4832 2333770 2303915 2312077 2326573 2296677 2341626 2330785 2295816 2289584 2235675 2117338 2241104
4821 2241104 2249887 2196514 2206764 2052874 2090255 2156814 2122346 2056354 1999910 1945656 2088351
4810 2088351 2129221 2157396 2241350 2165158 2034897 2109620 2214565 2119175 2155635 2133194 2190495
4799 2190495 2279145 2430583 2459436 2414538 2400634 2589120 2716564 2783947 2965440 3126719
4789 3126719 3163328 3338286 3533776 3710628 3784188 3698163 3644731 3601841 3685295 3614624 3645687
4778 3645687 3474241 3327914 3251666 3204493 3121707 2889541 2651059 2426859 2243830 2175427
4768 2175427 2095725 2081037 1961892 1891991 1887071 1775114 1690790 1770715 1741425 1684981 1750346
$$ packed form
4843B489128J0904j17123M5546J8907p7003q9760n8401J27014P90P1103q7335
4832B333770k9855Q162J4496k9896M4949j0841l4969o232n3909j18337J23766
4821B241104Q783n3373J0250j53890L7381O6559l4468o5992n6444n4254J42695
4810B088351M0870K8175Q3954p6192j30261P4723J04945r5390L6460k2441N7301
4799B190495Q8650J51438K8853m4898j3904J88486J27444O7383J81493J61279
4789C126719L6609J74958J95490J76852P3560q6025n3432m2890Q3454p0671L1063
4778C645687j71446j46327p6248m7173q2786k32166k38482k24200j83029o8403
4768B175427p9702j4688j19145o9901m920j11957q4324P9925k9290n6444O5365
$$ plain form
4757 1750346 1811824 1855890 1826902 1741306 1757990 1801818 1782080 1707936 1719356 1758652 1646646
4746 1646646 1661958 1777522 1929967 1847762 1800168 1778296 1648011 1692945 1653792 1530684 1519975
4735 1519975 1431000 1488905 1492134 1532392 1529549 1540522 1554705 1590026 1565725 1571747 1517808 1497742
4723 1497742 1473907 1440716 1418206 1343118 1421617 1423162 1399209 1467951 1567813 1559882 1613143 1614020
4711 1614020 1611795 1620697 1618844 1602725 1737717 1633061 1557849 1629036 1516896 1604279 1621535
4700 1621535 1652230 1722182 1706561 1748481 1736381 1711522 1787279 1753608 1685129 1857525 1910652
4689 1910652 1943799 1882746 1884100 1995974 2041091 2039990 2021563 2064965 2033516 2086387 2074063 1918846
4677 1918846 2033085 2074292 2205583 2304377 2312952 2402511 2341997 2408051 2539594 2659689 2481131
$$ packed form
4757A750346O1478M4066k8988q5596J6684M3828j9738p4144J1420L9296j12006
4746A646646J5312J15564J52445q2205m7594k1872j30285M4934l9153j23108j0709
4735A519975q8975N7905L229M0258k843J0973J4183L5321k4301O022n3939k0066
4723A497742k3835l3191k2510p5088P8499J545k3953O8742R9862p931N3261Q77
4711A614020k225Q902j853j6119J34992j04656p5212P1187j12140Q7383J7256
4700A621535L0695O9952j5621M1920j2100k4859P5757l3671o8479J72396N3127
4689A910652L3147o1053J354J11874M5117j101j8427M3402l1449N2871j2324j55217
4677A918846J14239M1207J31291R8794Q575Q9559o0514O6054J31543J20095j78558
$$ plain form
4666 2481131 2405626 2398147 2399020 2497072 2586719 2637203 2778015 2840272 2833431 2840902 2903545 3005065
4654 3005065 2917639 3026265 3211434 3167357 3274186 3438467 3531690 3595003 3606102 3736429
4644 3736429 3856214 3925612 3872814 4146839 4288973 4529918 4977748 5077644 5352603 5711795
4634 5711795 6173286 6740139 7429979 8151766 8971405 10101854 11244585 12442224 13442453
4625 13442453 14200453 15136630 16108104 16973544 17657757 18382647 18728635 18795774 18765404 18556406
4615 18556406 18196500 17882256 17603812 17336156 17452752 17698693 18224780 18860136 19694423
4606 19694423 20639373 21841552 23277977 24991548 26887569 28906698 30997441 32923159
4598 32923159 35114001 37259652 39417902 41541105 43720704 45970620 47811144 49541831
$$ packed form
4666B481131p5505p479Q73R8052Q9647N0484J40812O2257o841P471O2643J01520
4654C005065q7426J08626J85169m4077J06829J64281R3223O3313J1099J30327
4644C736429J19785O9398n2798K74025J42134K40945M47830R9896K74959L59192
4634E711795M61491N66853O89840P21787Q19639J130449J142731J197639J000229
4625A3442453P58000R36177R71474Q65440O84213P24890L45988O7139l0370k08998
4615A8556406l59906l14244k78444k67656J16596K45941N26087O35356Q34287
4606A9694423R44950J202179J436425J713571J896021K019129K090743J925718
4598C2923159K190842K145651K158250K123203K179599K249916J840524J730687
$$ plain form
4590 49541831 50955404 52045734 52991190 53646011 54213838 54584193 54765675 54557676 53903772
4581 53903772 52908199 51627367 49988969 48354310 46599366 44639448 42758982 40758603
4573 40758603 38259783 35924525 33722546 31198072 28761982 26470845 24234772 22129565
4565 22129565 20093358 18093359 16324112 14452836 12831749 11459326 10224127 9116023
4557 9116023 8010672 7156049 6456088 5899754 5301066 4850330 4405272 4079735 3853569
4548 3853569 3625131 3419075 3114836 3051021 2809590 2780781 2698120 2543266 2448054 2293145
4538 2293145 2209783 2219532 2317885 2268432 2045495 2020528 1991910 2022303 1991795 1865328 1786342
4527 1786342 1855051 1812874 1695523 1667740 1599594 1681754 1665558 1579253 1528834 1558136 1395553
$$ packed form
4590D9541831J413573J090330R45456O54821N67827L70355J81482k07999o53904
4581E3903772r95573j280832j638398j634659j754944j959918j880466k000379
4573D0758603k498820k335258k201979k524474k436090k291137k236073k105207
4565B2129565k036207j999999j769247j871276j621087j372423j235199j108104
4557I116023j105351q54623o99961n56334n98688m50736m45058l25537k26166
4548C853569k28438k06056l04239o3815k41431k8809q2661j54854r5212j54909
4538B293145q3362R749R8353m9453k22937k4967k8618L0393l0508j26467p8986
4527A786342O8709m2177j17351k7783o8146Q2160j6196q6305n0419K9302j62583
$$ plain form
4516 1395553 1409007 1527824 1640996 1654944 1585035 1613992 1480999 1423083 1445964 1444891 1357597
4505 1357597 1429852 1503268 1384430 1353332 1407188 1287163 1321602 1516721 1583873 1529965 1499048
4494 1499048 1532587 1551696 1541095 1559543 1634529 1530077 1569255 1601768 1676401 1628422 1700766
4483 1700766 1695929 1513207 1508934 1495242 1598912 1561289 1505538 1492513 1516716 1338226 1385173
4472 1385173 1472659 1374137 1486857 1512429 1387966 1345885 1404968 1449501 1468866 1398323 1300595
4461 1300595 1321453 1352860 1349711 1353826 1300767 1366960 1262555 1171228 1204467 1282781 1287812 1245020
4449 1245020 1196218 1154843 1125825 1036139 1201829 1269326 1234115 1235243 1209854 1209358 1137735 1079693
4437 1079693 1153546 1090895 1212303 1105005 1084001 1226222 1091809 1145763 1228653 1272773 1186187
$$ packed form
4516A395553J3454J18817J13172J3948o9909K8957j32993n7916K2881j073q7294
4505A357597P2255P3416j18838l1098N3856j20025L4439J95119O7152n3908l0917
4494A499048L3539J9109j0601J8448P4986j04452L9178L2513P4633m7979P2344
4483A700766m837j82722m273j3692J03670l7623n5751j3025K4203j78490M6947
4472A385173Q7486r8522J12720K5572j24463m2081N9083M4533J9365p0543r7728
4461A300595K0858L1407l149M115n3059O6193j04405r1327L3239P8314N031m2792
4449A245020m8802m1375k9018q9686J65690O7497l5211J128k5389m96p1623n8042
4437A079693P3853o2651J21408j07298k1004J42221j34413N3954Q2890M4120q6586
$$ plain form
4426 1186187 1222391 1214519 1234098 1205001 1192231 1374998 1250957 1180183 1191850 995726 1068006
4415 1068006 1148962 1196616 1202150 1136913 1151424 1092773 1023829 1201093 1230895 1334215 1242611
4404 1242611 1132584 1031757 1134167 1142571 1065307 1294828 1278779 1325661 1323608 1270048 1340446
4393 1340446 1409845 1376418 1314321 1341824 1219966 1104551 1093387 986541 1177288 1196855 1158829
4382 1158829 1235041 1300804 1300264 1282459 1343241 1343097 1278725 1254465 1316165 1330164 1412863 1404419
4370 1404419 1369529 1344206 1451839 1456423 1511175 1462567 1472660 1619671 1698712 1436051 1473774
4359 1473774 1586089 1554500 1647089 1688198 1724369 1730303 1781221 1693067 1643460 1635141 1652837 1688167
4347 1688167 1715273 1844467 1904976 1964774 2008999 1948372 2016346 1950556 1987340 1971609 2032699
$$ packed form
4426A186187L6204p872J9579k9097j2770J82767j24041p0774J1667j96124P2280
4415A068006Q0956M7654N534o5237J4511n8651o8944J77264K9802J03320r1604
4404A242611j10027j00827J02410Q404p7264K29521j6049M6882k053n3560P0398
4393A340446O9399l3427o2097K7503j21858j15415j1164j06846J90747J9567l8026
4382A158829P6212O5763n40j7805O0782j44o4372k4260O1700J3999Q2699q444
4370A404419l4890k5323J07633M584N4752m8608J0093J47011P9041k62661L7723
4359A473774J12315l1589R2589M1109L6171N934N0918q8154m9607q319J7696L5330
4347A688167K7106J29194O0509N9798M4225o0627O7974o5790L6784j5731O1090
$$ plain form
4336 2032699 2124758 2199619 2250394 2266545 2347658 2392217 2373473 2261825 2289489 2331054 2350226
4325 2350226 2380847 2323177 2384820 2425188 2505338 2480244 2566455 2536449 2632310 2576707 2662563
4314 2662563 2559824 2587106 2673702 2742075 2684215 2742436 2912200 3030120 3048514 2992803 2896526
4303 2896526 3117057 3160931 3116376 3204608 3129350 3157749 3342459 3388300 3491973 3578746 3588686
4292 3588686 3617380 3561429 3691631 3745120 3951866 3844137 3938285 4096852 4103954 4129214 4298147
4281 4298147 4298214 4488005 4580846 4752194 4920810 4972962 5033196 5204965 5301776 5437164 5597949
4270 5597949 5723077 5726892 5769519 6010115 6175057 6321392 6383078 6436564 6646442 6904748
4260 6904748 7077682 7203160 7337392 7386123 7647982 8004770 8282903 8478827 8615244 8950392
$$ packed form
4336B032699R2059P4861N0775J6151Q1113M4559j8744j11648K7664M1565J9172
4325B350226L0621n7670O1643M0368Q0150k5094Q6211l0006R5861n5603Q5856
4314B662563j02739K7282Q6596O8373n7860N8221J69764J17920J8394n5711r6277
4303B896526K20531M3874m4555Q8232p5258K8399J84710M5841J03673Q6773R940
4292C588686K8694n5951J30202N3489K06746j07729R4148J58567P102K5260J68933
4281D298147O7J89791R2841J71348J68616N2152O0234J71769R6811J35388J60785
4270E597949J25128L815M2627K40596J64942J46335O1686N3486K09878K58306
4260F904748J72934J25478J34232M8731K61859L56788K78133J95924J36417L35148
$$ plain form
4250 8950392 9251173 9626408 10014077 10338381 10712202 11086713 11544714 11923061 12528273 13067317
4240 13067317 13623008 14279925 14780455 15406025 16048253 16766040 17561009 18474873 19434701
4231 19434701 20296230 21030506 21954905 23083324 24045033 25084139 26030231 27342179 28451448
4222 28451448 29511367 30928232 32230818 33767711 35366610 37411960 39600334 42079139
4214 42079139 44666227 47541832 50771344 54616125 59235796 64666296 71053451 77663152
4206 77663152 83226313 87862227 92078958 96016601 99029158 101775631 104601772 106280170
4198 106280170 105276109 102111423 97623109 92024213 86051544 79839127 73720575 67684216
4190 67684216 62281722 57405541 52988817 48679834 44734265 40973996 37810123 35214664
$$ packed form
4250H950392L00781L75235L87669L24304L73821L74511M58001L78347O05212N39044
4240A3067317N55691O56917N00530O25570O42228P17787P94969R13864R59828
4231A9434701Q61529P34276R24399J128419R61709J039106R46092J311948J109269
4222B8451448J059919J416865J302586J536893J598899K045350K188374K478805
4214D2079139K587088K875605L229512L844781M619671N430500O387155O609701
4206G7663152N563161M635914M216731L937643L012557K746473K826141J678398
4198A06280170j004061l164686m488314n598896n972669o212417o118552o036359
4190F7684216n402494m876181m416724m308983l945569l760269l163873k595459
$$ plain form
4182 35214664 33161083 31304016 29782269 28407423 27137564 25986128 24865475 23968917
4174 23968917 23171026 22295142 21341022 20497247 19683657 19000326 18289207 17524401 16899407
4165 16899407 16278338 15735527 15181670 14728664 14115002 13676887 13260627 12760820 12338783
4156 12338783 11875077 11583551 11240176 10728793 10446235 10202943 9835498 9593181 9272544
4147 9272544 9006151 8796437 8560482 8372441 8135947 8048904 7980361 7782672 7774119 7592287
4137 7592287 7395895 7495717 7590037 7607654 7598865 7502126 7386251 7419556 7473213 7530030 7586540
4126 7586540 7657067 7768014 7788751 7923411 8030200 8144358 8229141 8438763 8526928 8606802
4116 8606802 8787794 8871865 8890749 9132757 9263782 9530654 9640427 9819777 10137513 10249973
$$ packed form
4182C5214664k053581j857067j521747j374846j269859j151436j120653q96558
4174B3968917p97891q75884r54120q43775q13590o83331p11119p64806o24994
4165A6899407o21069n42811n53857m53006o13662m38115m16260m99807m22037
4156A2338783m63706k91526l43375n11383k82558k43292l67445k42317l20637
4147I272544k66393k09714k35955j88041k36494q7043o8543j97689q553j81832
4137G592287j96392R9822R4320J7617q789r6739j15875L3305N3657N6817N6510
4126G586540P0527J10947K0737J34660J06789J14158Q4783K09622Q8165P9874
4116H606802J80992Q4071J8884K42008J31025K66872J09773J79350L17736J12460
$$ plain form
4106 10249973 10372042 10664457 10863794 11126494 11338406 11738940 12066835 12332312 12709966
4097 12709966 13112789 13547787 13978460 14282093 14838156 15241603 15697588 16253362 16927158
4088 16927158 17598402 18435659 19326041 20118237 20998890 21915015 22991775 24324699 25562860
4079 25562860 26793304 28244175 29707881 31291387 32996905 34853801 36827703 38833557
4071 38833557 40652440 42796669 44817293 47003722 49296458 51388995 53516448 55525400
4063 55525400 57348168 59161641 60696518 62243411 63601396 64781434 65824682 66505845
4055 66505845 67177325 67675803 68007417 68144236 68154525 67979692 67500711 66924052 66062302 65052192
4045 65052192 63683310 62167164 60560616 59025317 57188104 54854922 52412248 49803356
$$ packed form
4106A0249973J22069K92415J99337K62700K11912M00534L27895K65477L77654
4097A2709966M02823M34998M30673L03633N56063M03447M55985N55774O73796
4088A6927158O71244Q37257Q90382P92196Q80653R16125J076760J332924J238161
4079B5562860J230444J450871J463706J583506J705518J856896J973902K005854
4071C8833557J818883K144229K020624K186429K292736K092537K127453K008952
4063E5525400J822768J813473J534877J546893J357985J180038J043248O81163
4055F6505845O71480M98478L31614J36819J0289j74833m78981n76659q61750j010110
4045F5052192j368882j516146j606548j535299j837213k333182k442674k608892
$$ plain form
4037 49803356 47048779 44242128 41672179 39287217 36788234 34433521 32186884 30150300
4029 30150300 28251856 26573970 24923414 23383647 21971430 20617325 19485887 18453043
4021 18453043 17473614 16574406 15851472 15257415 14521459 13676685 13016550 12532104 12046397
4012 12046397 11651602 11197679 10840637 10476559 10178780 9821678 9483988 9202523 8933847
4003 8933847 8774098 8531205 8325375 8237959 8012705 7776546 7690610 7466362 7301454 7230375
3993 7230375 7014455 6913590 6797288 6610410 6536065 6422649 6302910 6225956 6117032 6073007
3983 6073007 5979573 5842831 5826262 5778568 5672651 5738825 5722667 5649451 5652200 5726509 5636545
3972 5636545 5615920 5733325 5877164 5888584 5860056 5956656 6127905 6283531 6318930 6605474
$$ packed form
4037D9803356k754577k806651k569949k384962k498983k354713k246637k036584
4029C0150300j898444j677886j650556j539767j412217j354105j131438j032844
4021A8453043r79429q99208p22934n94057p35956q44774o60135m84446m85707
4012A2046397l94795m53923l57042l64078k97779l57102l37690k81465k68676
4003H933847j59749k42893k05830q7416k25254k36159q5936k24248j64908p1079
3993G230375k15920j00865j16302j86878p4345j13416j19739p6954j08924m4025
3983F073007r3434j36742j6569m7694j05917O6174j6158p3216K749P4309q9964
3972E636545k0625J17405J43839J1420k8528R6600J71249J55626L5399K86544
$$ plain form
3962 6605474 6854105 7091319 7359055 7648211 8033161 8573462 9125469 9584365 10169445 10935757
3952 10935757 11528866 12233785 13008602 13694985 14414932 15271386 15975182 16728321 17385650
3943 17385650 17974141 18540440 19084962 19409085 19636711 19921425 19996918 20167172 20166364 19920203
3933 19920203 19824046 19427756 18950366 18502079 18072290 17610790 17032099 16301753 15549096 14733808
3923 14733808 13937473 13246793 12485133 11616253 10885068 10279555 9573632 9017924 8440824
3914 8440824 7777901 7327265 6960905 6705828 6436206 6123212 5791706 5524531 5229631 5020713
3904 5020713 4881860 4687920 4609976 4420602 4402970 4407969 4314336 4212667 4217040 4356788 4201037
3893 4201037 4159813 4239691 4074889 3968465 4043702 4032404 4134587 4150373 4067086 4023522 4021934
$$ packed form
3962F605474K48631K37214K67736K89156L84950N40301N52007M58896N85080P66312
3952A0935757N93109P04919P74817O86383P19947Q56454P03796P53139O57329
3943A7385650N88491N66299N44522L24123K27626K84714P5493J70254q08k46161
3933A9920203r6157l96290m77390m48287m29789m61500n78691p30346p52657q15288
3923A4733808p96335o90680p61660q68880p31185o05513p05923n55708n77100
3914H440824o62923m50636l66360k55077k69622l12994l31506k67175k94900k08918
3904E020713j38853j93940p7944j89374j7632M999r3633j01669M373J39748j55751
3893D201037m1224P9878j64802j06424P5237j1298J02183J5786q3287m3564j588
$$ plain form
3882 4021934 4216793 4280478 4216290 4237074 4288695 4246467 4397480 4483681 4635456 4726481 4729787
3871 4729787 4701157 4760802 4791906 5011148 5168886 5204305 5401934 5590793 5721811 5934983
3861 5934983 6159648 6188542 6345731 6580705 6843387 7090395 7453016 7657124 7785277 8165257
3851 8165257 8506242 8762598 9079894 9231706 9418770 9842095 10210306 10560013 10834648 11073891
3841 11073891 11335261 11682727 11863542 12081602 12281280 12405568 12547917 12874194 12973913 13110946
3831 13110946 13321384 13376344 13512128 13567842 13664590 13628663 13618169 13484063 13492401 13378336 13319310
3820 13319310 13377386 13550192 13661236 13679704 13753884 13900388 13899622 13986391 14125932 14205827 14358281
3809 14358281 14653982 15062391 15408440 15725222 16253458 16911202 17367674 18079588 18812911
$$ packed form
3882D021934J94859O3685o4188K0784N1621m2228J51013Q6201J51775R1025L306
3871D729787k8630N9645L1104K19242J57738L5419J97629J88859J31018K13172
3861E934983K24665K8894J57189K34974K62682K47008L62621K04108J28153L79980
3851H165257L40985K56356L17296J51812J87064M23325L68211L49707K74635K39243
3841A1073891K61370L47466J80815K18060J99678J24288J42349L26277R9719J37033
3831A3110946K10438N4960J35784N5714R6748l5927j0494j34106Q338j14065n9026
3820A3319310N8076J72806J11044J8468P4180J46504p66Q6769J39541P9895J52454
3809A4358281K95701M08409L46049L16782N28236O57744M56472P11914P33323
$$ plain form
3800 18812911 19480750 20333155 21316572 22173901 23140768 24189177 25402482 26583016 27646396
3791 27646396 28954990 30136182 31275348 32527608 33550710 34836158 36093549 37124645
3783 37124645 38069216 39146266 40203756 40967703 41700463 42671403 43378323 43948172 44560152
3774 44560152 45113407 45672174 46162609 46487716 46665065 46793228 46880802 46976267 47118327 47202874
3764 47202874 47293784 47271698 47163337 47122744 46948645 46692000 46540849 46476681 46242641 46056513
3754 46056513 45931590 45735605 45427774 45140199 44795853 44390794 44030321 43499222 42972285
3745 42972285 42394757 41639420 41098100 40339678 39485845 38631774 37692919 36789782 35814040
3736 35814040 34776980 33712601 32655940 31521359 30284044 29005000 27900586 26783673
$$ packed form
3800A8812911O67839Q52405R83417Q57329R66867J048409J213305J180534J063380
3791B7646396J308594J181192J139166J252260J023102J285448J257391J031096
3783C7124645R44571J077050J057490P63947P32760R70940P06920N69849O11980
3774D4560152N53255N58767M90435L25107J77349J28163Q7574R5465J42060Q4547
3764D7202874R0910k2086j08361m0593j74099k56645j51151o4168k34040j86128
3754D6056513j24923j95985l07831k87575l44346m05059l60473n31099n26937
3745D2972285n77528p55337n41320p58422q53833q54071r38855r03137r75742
3736C5814040j037060j064379j056661j134581j237315j279044j104414j116913
$$ plain form
3728 26783673 25768332 24690673 23544755 22595424 21408108 20514322 19712261 18761399 17849190
3719 17849190 17070055 16439342 15803107 15169555 14594488 14067284 13600685 13257335 12916077
3710 12916077 12638972 12502663 12321880 11991640 11928557 11882458 11877628 11842730 11929688 11930798 11823433
3699 11823433 11849191 11727746 11687276 11739396 11759357 11724262 11590042 11460908 11562842 11433346
3689 11433346 11188556 11095351 10895912 10880686 10700495 10334546 10038759 9706511 9557092 9304068
3679 9304068 9009374 8758597 8480237 8307161 8106624 7701713 7259742 7013123 6786298 6469869
3669 6469869 6198521 5943931 5772561 5380601 5058658 4914920 4769219 4435090 4106618 3872143
3659 3872143 3944717 3892430 3687908 3617263 3538868 3238054 3139160 3043235 2944674 2947187 2801766
$$ packed form
3728B6783673j015341j077659j145918r49331j187316q93786q02061r50862r12209
3719A7849190p79135o30713o36235o33552n75067n27204m66599l43350l41258
3710A2916077k77105j36309j80783l30240o3083m6099m830l4898Q6958J110j07365
3699A1823433K5758j21445m0470N2120J9961l5095j34220j29134J01934j29496
3689A1433346k44790r3205j99439j5226j80191l65949k95787l32248j49419k53024
3679I304068k94694k50777k78360j73076k00537m04911m41971k46619k26825l16429
3669F469869k71348k54590j71370l91960l21943j43738j45701l34129l28472k34475
3659C872143P2574n2287k04522p0645p8395l00814r8894r5925r8561K513j45421
$$ plain form
3648 2801766 2820327 2678349 2650954 2645735 2500915 2343381 2321593 2251073 2274627 2145443 2116429
3637 2116429 2091194 2030879 1984824 1978816 1994371 2014596 1956565 1870077 1799681 1759517 1799624 1697724
3625 1697724 1640421 1552908 1610806 1512100 1602554 1550850 1542221 1499942 1533348 1471290 1427030 1536623
3613 1536623 1454006 1424318 1382935 1504161 1440420 1299531 1188379 1168811 1175940 1185432 1070335
3602 1070335 1062142 1175765 1129487 1096140 1036849 1161002 1306529 1243227 1059224 1108474 1226418
3591 1226418 1197718 1194139 1092274 1194823 1137390 1140521 1111104 1090568 1084540 1069647 912679
3580 912679 1006615 1135379 1104179 883956 775673 834494 824437 875545 855086 904949 799989
3569 799989 773893 821082 907312 983563 945939 722540 762975 888770 792158 811683 863161
$$ packed form
3648B801766J8561j41978k7395n219j44820j57534k1788p0520K3554j29184k9014
3637B116429k5235o0315m6055o008J5555K0225n8031q6488p0396m0164M0107j01900
3625A697724n7303q7513N7898r8706R0454n1704q629m2279L3406o2058m4260J09593
3613A536623q2617k9688m1383J21226o3741j40889j11152j9568P129R492j15097
3602A070335q193J13623m6278l3347n9291J24153J45527o3302j84003M9250J17944
3591A226418k8700l579j01865J02549n7433L131k9417k0536o028j4893j56968
3580I12679R3936J28764l1200k20223j08283N8821j0057N1108k0459M9863j04960
3569G99989k6096M7189Q6230P6251l7624k23399M0435J25795r6612J9525N1478
$$ plain form
3558 863161 914654 921620 782446 730945 679814 614678 612833 724981 717384 637096 808458 944148
3546 944148 855479 699678 656983 573382 631038 695214 743480 542234 667326 830651 710905
3535 710905 684931 567547 526577 602532 619432 576814 524466 585467 518547 606886 708409
3524 708409 715083 737848 527018 450679 457716 557912 562562 599450 604058 621618 739412 763610
3512 763610 668149 698088 708849 634035 636279 700890 675745 754120 828827 924020 906102 860365
3500 860365 656243 683435 746156 706644 659048 758790 894850 870430 771079 793904 826915
3489 826915 816722 732054 799391 733650 769795 762248 618373 744311 729843 741742 626262
3478 626262 735666 825898 933035 939622 870231 833958 802746 758216 757692 811806 810863 777900
$$ packed form
3558H63161N1493O966j39174n1501n1131o5136j845J12148p597q0288J71362J35690
3546I44148q8669j55801m2695q3601N7656O4176M8266k01246J25092J63325j19746
3535G10905k5974j17384m0970P5955J6900m2618n2348O1001o6920Q8339J01523
3524G08409O674K2765k10830p6339P037J00196M650L6888M608J7560J17794K4198
3512G63610r5461K9939J0761p4814K244O4611k5145P8375P4707R5193j7918m5737
3500H60365k04122K7192O2721l9512m7596R9742J36060k4420r9351K2825L3011
3489H26915j0193q4668O7337o5741L6145p547j43875J25938j4468J1899j15480
3478F26262J09404R0232J07137O587o9391l6273l1212m4530n24N4114r43l2963
$$ plain form
3466 777900 719061 682224 755597 847855 851844 696229 672014 820582 933974 840323 709202
3455 709202 564300 662491 579602 723621 785683 770161 759646 841732 881930 795567 781392
3444 781392 662887 685716 767514 758629 719544 633041 613580 681727 748934 888824 778282
3433 778282 828410 857614 812310 892728 916460 960281 921818 861583 804488 736458 838333
3422 838333 852971 806209 876292 844748 829385 921074 935599 947125 793335 865210 935988
3411 935988 892357 818725 777696 602465 594856 614942 675623 709478 699251 635808 483569
3400 483569 399893 421412 397861 438499 433333 569863 600234 645909 506056 342979 397660
3389 397660 363543 403928 416985 500600 520012 421152 400091 393995 431236 437642 474037 459071
$$ packed form
3466G77900n8839l6837P3373R2258L989j55615k4215J48568J13392r3651j31121
3455G09202j44902R8191q2889J44019O2062j5522j0515Q2086M0198q6363j4175
3444G81392j18505K2829Q1798q885l9085q6503j9461O8147O7207J39890j10542
3433G78282N0128K9204m5304Q0418K3732M3821l8463o0235n7095o8030J01875
3422H38333J4638m6762P0083l1544j5363R1689J4525J1526j53790P1875P0778
3411I35988m3631p3632m1029j75231p609K0086O0681L3855j0227o3443j52239
3400D83569q3676K1519k3551M0638n166J36530L0371M5675j39853j63077N4681
3389C97660l4117M0385J3057Q3615J9412r8860k1061o096L7241O406L6395j4966
$$ plain form
3377 459071 537068 436699 275813 322542 408271 506020 393446 378843 388155 439878 357930
3366 357930 307835 363973 412531 364940 261864 321164 353816 227202 295585 459767 627853
3355 627853 633613 579878 563209 474177 497819 643571 664950 663350 638990 798106 673122
3344 673122 694764 684008 596949 599148 718424 732249 473453 465899 503408 508166 545523 548848
3332 548848 468697 406960 439563 450888 421850 419351 407116 291900 256695 197599 282738 302095
3320 302095 279205 140992 242070 411782 333153 235097 214555 368074 300391 297574 315659
3309 315659 197657 277348 278029 272575 224554 217380 170815 230849 188252 142664 210087 207303
3297 207303 222087 141203 159559 184422 275838 236157 167525 165711 283170 280790 297616 231240
$$ packed form
3377D59071P7997j00369j60886M6729Q5729R7749j12574j4603R312N1723q1948
3366C57930n0095N6138M8558m7591j03076N9300L2652j26614O8383J64182J68086
3355F27853N760n3735j6669q9032K3642J45752K1379j600k4360J59116j24984
3344F73122K1642j0756q7059K199J19276J3825k58796p554L7509M758L7357L325
3332E48848q0151o1737L2603J1325k9038k499j2235j15216l5205n9096Q5139J9357
3320C02095k2890j38213J01078J69712p8629r8056k0542J53519o7683k817J8085
3309C15659j18002P9691O81n454m8021p174m6565O0034m2597m5588O7423k784
3297B07303J4784q0884J8356K4863R1416l9681o8632j814J17459k380J6826o6376
$$ plain form
3285 231240 190228 139058 137375 142600 48818 140142 199544 117399 137437 144088 297433 305239
3273 305239 238848 254060 101741 59747 221685 251194 258622 300550 359438 301772 344137
3262 344137 335086 287314 188349 92777 246672 430571 389310 279327 273585 295205 323624
3251 323624 319129 304886 450558 431614 213233 158946 186355 281204 443814 396080 425891
3240 425891 469014 320299 408314 347058 237940 368630 359263 299689 309829 355098 359616
3229 359616 375920 519991 480614 470321 566161 534050 513209 509000 491903 531877 379228
3218 379228 430570 431479 424711 559712 610731 594739 632753 765382 882275 1066184 1085336
3207 1085336 1070799 1039380 1061668 1036456 1116083 1120372 1162192 1223108 1229730 1316082 1282885 1179303
$$ packed form
3285B31240m1012n1170j683N225r3782R1324N9402q2145K0038O651J53345P806
3273C05239o6391J5212j52319m1994J61938K9509P428M1928N8888n7666M2365
3262C44137r051m7772r8965r5572J53895J83899m1261j09983n742K1620K8419
3251C23624m495j4243J45672j8944k18381n4287K7409R4849J62610m7734K9811
3240D25891M3123j48715Q8015o1256j09118J30690r367n9574J0140M5269M518
3229C59616J6304J44071l9377j0293R5840l2111k0841m209j7097L9974j52649
3218C79228N1342R09o768J35001N1019j5992L8014J32629J16893J83909J9152
3207A085336j4537l1419K2288k5212P9627M289M1820O0916O622Q6352l3197j03582
$$ plain form
3195 1179303 1188774 1259773 1384011 1401252 1122355 1070069 1167424 1329008 1291805 1332267 1452889
3184 1452889 1472929 1522699 1602683 1650910 1584064 1665776 1755025 1822565 1909234 1744169 1742664
3173 1742664 1789844 1708281 1684218 1558735 1473673 1535596 1475277 1483288 1450663 1424394 1431399 1382916
3161 1382916 1337906 1273285 1251187 1379249 1340602 1227457 1330010 1442169 1358359 1188773
3151 1188773 1223508 1260957 1347547 1164189 1097233 1150313 1158068 1105304 1051012 938375 789101
3140 789101 810892 910842 852092 680323 624403 661722 777789 820031 907245 728345 619826
3129 619826 634892 616636 646647 668271 642025 632998 523118 559368 547727 507184 664212
3118 664212 637251 658304 577029 565811 581597 485463 494312 610322 547488 595532 670739 694699
$$ packed form
3195A179303R471P0999J24238J7241k78897n2286R7355J61584l7203M0462J20622
3184A452889K0040M9770P9984M8227o6846Q1712Q9249O7540Q6669j65065j505
3173A742664M7180q1563k4063j25483q5062O1923o0319Q011l2625k6269P005m8483
3161A382916m5010o4621k2098J28062l8647j13145J02553J12159q3810j69586
3151A188773L4735L7449Q6590j83358o6956N3080P755n2764n4292j12637j49274
3140G89101K1791R9950n8750j71769n5920L7319J16067M2242Q7214j78900j08519
3129F19826J5066j8256L0011K1624k6246r027j09880L6250j1641m0543J57028
3118F64212k6961K1053q1275j1218J5786r6134Q849J16010o2834M8044P5207K3960
$$ plain form
3106 694699 615555 513345 627255 579874 477453 501121 503464 497912 555038 469228 467909 656821
3094 656821 785256 733431 550240 572911 623937 585644 624404 674119 665374 674225 637440 464554
3082 464554 461717 451846 502156 574770 491507 538109 513229 475738 488649 405355 386303 460018
3070 460018 447996 369899 471742 640390 533986 431817 411467 457299 528047 566240 420099
3059 420099 395383 452729 381805 442638 362122 365035 316733 394393 400510 324738 326208 237530
3047 237530 189612 218007 265980 244477 344450 347362 258881 365154 384756 338093 324193 255492
3035 255492 260740 281128 261281 210523 151625 174055 203386 143121 213205 208714 146878 175370
3023 175370 113190 92084 106103 -298 -87591 -39107 25624 21474 -17670 108617 205346
$$ packed form
3106F94699p9144j02210J13910m7381j02421K3668K343n552N7126q5810j319J88912
3094F56821J28435n1825j83191K2671N1026l8293L8760M9715q745Q851l6785j72886
3082D64554k837r871N0310P2614q3263M6602k4880l7491J2911q3294j9052P3715
3070D60018j2022p8097J01843J68648j06404j02169k0350M5832P0748L8193j46141
3059D20099k4716N7346p0924O0833q0516K913m8302P7660O117p5772J470q8678
3047B37530m7918K8395M7973k1503R9973K912q8481J06273J9602m6663j3900o8701
3035B55492N248K0388j9847n0758n8898K2430K9331o0265P0084m491o1836K8492
3023A75370o2180k1106J4019j06401q7293M8484O4731m150l9144J26287R6729
$$ plain form
3012 205346 172090 89081 133718 76366 -29856 -75628 -15074 106226 90942 41289 87746
3001 87746 30193 -73325 -1138 -18666 -11184 -25882 -90765 11736 48144 92394 -7540 29633
2989 29633 188802 201178 67720 11965 -50192 -127541 -120172 -36400 15576 -114516 -21109
2978 -21109 5590 14146 19994 90977 27500 55035 107762 55336 -35515 51392 -13747 -101819
2966 -101819 -22215 -25841 -56672 21167 460 -139670 -50362 -27955 -156555 -158666 -133173 -79088
2954 -79088 -62670 56227 127087 10139 8114 -70841 -137711 -139601 -103433 1266 14342 -23970
2942 -23970 -124048 -98097 -36685 18349 42730 191551 109838 108964 65873 90432 157117 -75533
2930 -75533 44213 86849 22782 -90479 -19888 25843 -46746 -24033 -47929 -14323 40900
$$ packed form
3012B05346l3256q3009M4637n7352j06222m5772O0554J21300j5284m9653M6457
3001H7746n7553j03518P2187j7528P482j4698o4883J02501L6408M4250r9934L7173
2989B9633J59169J2376j33458n5755o2157p7349P369Q3772N1976j30092R3407
2978b1109K6699Q556N848P0983o3477K7535N2727n2426r0851Q6907o5139q8072
2966a01819P9604l626l0831P7839k0707j40130Q9308K2407j28600k111K5493N4085
2954g9088J6418J18897P0860j16948k025p8955o6870j890L6168J04699J3076l8312
2942b3970j00078K5951O1412N5034K4381J48821q1713q74m3091K4559O6685k32650
2930g5533J19746M2636o4067j13261P0591M5731p2589K2713k3896L3606N5223
$$ plain form
2919 40900 6863 -77721 -162407 -13275 55178 33166 47647 109447 56824 75638 47546 30569
2907 30569 6349 34558 -1167 71838 119491 184324 237186 163415 -17634 115652 161510
2896 161510 3241 -67982 -67561 -27014 -61844 128195 160365 21025 -19369 -597 55294
2885 55294 -25015 -56460 23736 508 -79384 -190325 -47907 -12787 79933 -7053 -88084
2874 -88084 -73840 -118436 -153344 -22109 20203 13735 -72377 -14423 -40659 -110833 -79019 -18182
2862 -18182 -73216 -179643 -93783 103928 206523 156954 -4844 -50662 -9817 67423 123916
2851 123916 143146 178035 107985 97771 63364 23688 10071 -11192 -103595 -136877 -79842 -84261
2839 -84261 -84871 -36214 47396 -80517 -5026 58579 -71801 -59291 -56517 -9730 11090 -36720
$$ packed form
2919D0900l4037q4584q4686J49132O8453k2012J4481O1800n2623J8814k8092j6977
2907C0569k4220K8209l5725P3005M7653O4833N2862p3771j81049J33286M5858
2896A61510j58269p1223M21M0547l4830J90039L2170j39340m0394J8772N5891
2885E5294q0309l1445Q0196k3228p9892j10941J42418L5120R2720q6986q1031
2874h8084J4244m4596l4908J31235M2312o468q6112N7954k6236p0174L1814O0837
2862a8182n5034j06427Q5860J97711J02595m9569j61798m5818M0845P7240N6493
2851A23916J9230L4889p0050j0214l4407l9676j3617k1263r2403l3282N7035m419
2839h4261o10M8657Q3610j27913P5491O3605j30380J2510K774M6787K0820m7810
$$ plain form
2827 -36720 -49916 -145 -75298 -162604 -192328 35454 23144 -10301 -35364 -43005 -68483 -170467
2815 -170467 -177121 -103698 -53957 -27255 -86719 -162563 -93728 15504 57000 174337 -4702
2804 -4702 -39208 6143 -3015 -70592 -39389 -98919 -7654 56135 -41534 70767 58630 95321
2792 95321 52342 -31357 3283 2118 24943 -44986 -100593 -150629 -62346 -6873 -8669 -51030
2780 -51030 -85698 30064 -34920 -36849 14083 -601 -36529 -168174 -209844 -101894 -106692 -16021
2768 -16021 -2445 -159369 -57084 -38061 -11920 123884 137386 177722 60010 -96949 -61538
2757 -61538 -51413 -100458 -1963 -48297 -62744 -69177 27464 2607 -113258 -73996 -88467 -87449
2745 -87449 -25699 -95495 -16755 11715 96504 34158 -39913 1568 -19701 47729 -13648 -60125
$$ packed form
2827c6720j3196M9771p5153q7306k9724K27782j2310l3445k5063p641k5478j01984
2815a70467o654P3423M9741K6702n9464p5844O8835J09232M1496J17337j79039
2804d702l4506M5351r158o7577L1203n9530R1265O3789r7669J12301j2137L6691
2792I5321m2979q3699L4640j165K2825o9929n5607n0036Q8283N5473j796m2361
2780e1030l4668J15762o4984j929N0932j4684l5928j31645m1670J07950m798R0671
2768a6021J3576j56924J02285J9023K6141J35804J3502M0336j17712j56959L5411
2757f1538J0125m9045R8495m6334j4447o433R6641k4857j15865L9262j4471J018
2745h7449O1750o9796P8740K8470Q4789o2346p4071M1481k1269O7430o1377m6477
$$ plain form
2733 -60125 10151 -97916 -49074 -55959 -26515 77496 140529 -22999 -75636 -112196 2850
2722 2850 66633 -104468 -131009 47083 123535 64142 76062 -43336 -76950 -5435 102869
2711 102869 18059 -72923 -113930 -213660 -226557 -229647 -222133 -57160 -6428 -127136 -23871
2700 -23871 -47283 -9456 24111 -16638 -122267 -115542 -52461 -6122 26025 -988 25418 162099
2688 162099 80098 32055 76165 21867 -36432 -119770 -102638 -170464 -159412 -156732 -131213 -152802
2676 -152802 -131328 17326 59982 36587 66418 38741 -810 -41591 22639 74643 6462
2665 6462 21796 60875 8338 104759 35498 -54267 -8737 -29801 -127387 -116872 -101752 -2717
2653 -2717 -5148 8037 78680 109773 -49424 -140230 -156440 -83215 -52551 15193 -13992 52263
$$ packed form
2733f0125P0276j08067M8842o885K9444J04011O3033j63528n2637l6560J15046
2722B850O3783j71101k6541J78092P6452n9393J1920j19398l3614P1515J08304
2711A02869q4810r0982m1007r9730j2897l090P514J64973N0732j20708J03265
2700b3871k3412L7827L3567m0749j05629O725O3081M6339L2147k7013K6406J36681
2688A62099q2001m8043M4110n4298n8299q3338J7132o7826J1052K680K5519k1589
2676a52802K1474J48654M2656k3395K9831k7677l9551m0781O4230N2004o8181
2665F462J5334L9079n2537R6421o9261q9765M5530k1064r7586J0515J5120R9035
2653b717k431J3185P0643L1093j59197r0806j6210P3225L0664O7744k9185O6255
$$ plain form
2641 52263 -16876 -94901 -69060 -121515 -44596 11025 -80944 -101045 -118000 -146057 -136446 -30707
2629 -30707 2606 -68904 -218007 -152837 -142141 -109897 -69470 105485 26174 77333 -7327
2618 -7327 -155887 -162263 -130854 -193624 -149660 80479 68245 72333 -17432 -137317 -119976 58728
2606 58728 59885 289 -67007 -89506 -55363 33283 -43889 -4771 -93671 -48663 -29162 -16277
2594 -16277 -66814 -97746 -61899 -120951 -182356 -173925 -122448 -62960 -18433 -69086 -72174 54560
2582 54560 -26800 -79513 -80494 -26358 47920 93209 -31398 -53302 -28303 -61391 -68310 -33031
2570 -33031 -52360 -102576 -114087 -99877 -69838 -35292 54788 154075 2093 -33444 -70185 -74720
2558 -74720 -35288 32571 44862 -81146 -38433 -59745 -68399 -14931 -20628 59885 -140932 -120239
$$ packed form
2641E2263o9139p8025K5841n2455P6919N5621r1969k0101j6955k8057R611J05739
2629c0707L3313p1510j49103O5170J0696L2244M0427J74955p9311N1159q4660
2618g327j48560o376L1409o2770M3964K30139j2234M088q9765j19885J7341J78704
2606E8728J157n9596o7296k2499L4143Q8646p7172L9118q8900M5008J9501J2885
2594a6277n0537l0932L5847n9052o1405Q431N1477N9488M4527n0653l088J26734
2582E4560q1360n2713r81N4136P4278M5289j24607k1904K4999l3088o919L5279
2570c3031j9329n0216j1511J4210L0039L4546R0080R9287j51982l5537l6741m535
2558g4720L9432O7859J2291j26008M2713k1312q654N3468n697Q0513k00817K0693
$$ plain form
2546 -120239 -179149 -25456 34089 -56047 -97934 -150372 -33634 73560 84691 -47909 -52071
2535 -52071 -63929 -130110 -165911 -129960 2246 -48561 -144273 -184022 -191038 -92459 -60307 -103965
2523 -103965 -141430 -30760 3208 -10704 -109199 -111616 -173857 -151203 -101547 -65662 -39337 -53446
2511 -53446 -58814 -50345 19009 94308 42275 -64368 -137983 -129920 -22052 -31205 -80997 14967
$$ packed form
2546a20239n8910J53693N9545r0136m1887n2438J16738J07194J1131j32600m162
2535e2071j1858o6181l5801L5951J32206n0807r5712l9749p016R8579L2152m3658
2523a03965l7465J10670L3968j3912r8495k417o2241K2654M9656L5885K6325j4109
2511e3446n368Q469O9354P5299n2033j06643p3615Q063J07868r153m9792R5964
$$ [...]
##END NTUPLES=NMR SPECTRUM
##END=
