##TITLE=1H_EC-3378(2)X3(2)
 200.13Hz, CDCl3.
 8 sc
 
 29.4.2026
##JCAMPDX= 6.0         $$ Bruker NMR JCAMP-DX V2.0
##DATA TYPE= NMR SPECTRUM
##DATA CLASS= NTUPLES
##ORIGIN= UXNMR, Bruker Analytische Messtechnik GmbH
##OWNER= pz
$$ XWIN-NMR		Version 3.5
$$ Wed Apr 29 14:12:55 2026 Russian Standard Time (UT+4h)  she@DPX200
##.OBSERVE FREQUENCY= 200.1313
##.OBSERVE NUCLEUS= ^1H
##.ACQUISITION MODE= SIMULTANEOUS
##.ACQUISITION SCHEME= undefined
##.AVERAGES= 8
##.DIGITISER RES= 18
##SPECTROMETER/DATA SYSTEM= spect
##.PULSE SEQUENCE= zg30
##.SOLVENT NAME= CDCl3
##.SHIFT REFERENCE= (INTERNAL, CDCl3, 0, 15.4747)
##AUDIT TRAIL= $$ (NUMBER, WHEN, WHO, WHERE, WHAT)
$$ ##TITLE= Audit trail, XWIN-NMR		Version 3.5
$$ ##JCAMPDX= 5.01
$$ ##ORIGIN= Bruker BioSpin GmbH
$$ ##OWNER= she
$$ F:/spectra/data/she/nmr/H-C/1/pdata/1/auditp.txt
$$ ##AUDIT TRAIL=  $$ (NUMBER, WHEN, WHO, WHERE, WHAT)
(   1,<2026-04-29 14:11:06.45 +0400>,<she>,<DPX200>,
      <created by zg, POWCHK disabled, PULCHK disabled
       configuration hash MD5:
       00 E9 B6 7A A2 85 ED C7 34 08 36 98 17 FE 4E 26
       data hash MD5: 16K
       4B 64 E0 A5 9E 95 A3 D2 29 05 68 9D D9 66 F6 E8>)
(   2,<2026-04-29 14:11:09.98 +0400>,<she>,<DPX200>,
      <Start of raw data processing
       efp BC_mod = 2 LB = 0.25 FT_mod = 6 PKNL = 1 PHC0 = -4058.795 PHC1 = 9.39229 SI = 16K 
       data hash MD5: 16K
       C0 EB 10 8A 68 51 6D B5 D2 00 CA A3 C2 81 E8 9A>)
(   3,<2026-04-29 14:11:43.25 +0400>,<she>,<DPX200>,
      <pk PHC0 = -0.203181 PHC1 = -2.980232e-08 
       data hash MD5: 16K
       36 77 BC CF C6 8D A9 AA 57 2E 57 3F E4 BD 13 A9>)
(   4,<2026-04-29 14:11:48.35 +0400>,<she>,<DPX200>,
      <abs ABSG = 5 
       data hash MD5: 16K
       24 8B 21 D3 CC 89 FB 94 64 F9 38 E8 5D 68 5D C0>)
$$ ##END=
$$ 
$$ hash MD5
$$ EE BE DD EE 19 89 DA 47 FE A5 04 EB 7F 24 33 D8
##$RELAX= 
##$RELAX= 
##$RELAX= 
##$RELAX= 
##$RELAX= 
##$RELAX= 
$$ Bruker specific parameters
$$ --------------------------
##$DU= <F:/spectra>
##$EXPNO= 1
##$NAME= <H-C>
##$PROCNO= 1
##$TYPE= <nmr>
##$USER= <she>
##$AMP= (0..31)
100 100 100 100 100 100 100 100 100 100 100 100 100 100 100 100 100 100 
100 100 100 100 100 100 100 100 100 100 100 100 100 100 
##$AQSEQ= 0
##$AQ_mod= 1
##$AUNM= <au_zg>
##$AUTOPOS= <>
##$BF1= 200.13
##$BF2= 200.13
##$BF3= 200.13
##$BF4= 200.13
##$BF5= 200.13
##$BF6= 200.13
##$BF7= 200.13
##$BF8= 200.13
##$BYTORDA= 1
##$CFDGTYP= 0
##$CFRGTYP= 5
##$CHEMSTR= <none>
##$CNST= (0..31)
1 1 145 1 1 1 1 1 1 1 1 1 1 1 1 1 1 1 1 1 1 1 1 1 1 1 1 1 1 1 1 1 
##$CPDPRG= <>
##$CPDPRG1= <>
##$CPDPRG2= <>
##$CPDPRG3= <>
##$CPDPRG4= <mlev>
##$CPDPRG5= <mlev>
##$CPDPRG6= <mlev>
##$CPDPRG7= <mlev>
##$CPDPRG8= <mlev>
##$CPDPRGB= <>
##$CPDPRGT= <>
##$D= (0..31)
0 0.7 0 0 0 0 0 0 0 0 0 0.03 0 0 0 0 0 0 0 0 0 0 0 0 0 0 0 0 0 0 0 0 
##$DATE= 1777457465
##$DBL= (0..7)
120 120 120 120 120 120 120 120 
##$DBP= (0..7)
150 150 150 150 150 150 150 150 
##$DBP07= 0
##$DBPNAM0= <>
##$DBPNAM1= <>
##$DBPNAM2= <>
##$DBPNAM3= <>
$$ [...]
##$SUBNAM3= <"">
##$SUBNAM4= <"">
##$SUBNAM5= <"">
##$SUBNAM6= <"">
##$SUBNAM7= <"">
##$SUBNAM8= <"">
##$SUBNAM9= <"">
##$SW= 18.0517328524113
##$SWIBOX= (0..15)
0 0 2 0 0 0 0 0 0 0 0 0 0 0 0 0 
##$SW_h= 3612.71676300578
##$TD= 16384
##$TD0= 1
##$TE= 0
##$TE2= 300
##$TE3= 300
##$TEG= 300
##$TL= (0..7)
0 120 120 120 120 120 120 120 
##$TP= (0..7)
150 150 150 150 150 150 150 150 
##$TP07= 0
##$TPNAME0= <>
##$TPNAME1= <>
##$TPNAME2= <>
##$TPNAME3= <>
##$TPNAME4= <>
##$TPNAME5= <>
##$TPNAME6= <>
##$TPNAME7= <>
##$TPOAL= (0..7)
0.5 0.5 0.5 0.5 0.5 0.5 0.5 0.5 
##$TPOFFS= (0..7)
0 0 0 0 0 0 0 0 
##$TUNHIN= 0
##$TUNHOUT= 0
##$TUNXOUT= 0
##$USERA1= <user>
##$USERA2= <user>
##$USERA3= <user>
##$USERA4= <user>
##$USERA5= <user>
##$V9= 5
##$VALIST= <valist>
##$VCLIST= <CCCCCCCCCCCCCCC>
##$VD= 0
##$VDLIST= <DDDDDDDDDDDDDDD>
##$VPLIST= <PPPPPPPPPPPPPPP>
##$VTLIST= <TTTTTTTTTTTTTTT>
##$WBST= 1024
##$WBSW= 4
##$XGAIN= (0..3)
0 0 0 0 
##$XL= 0
##$YL= 0
##$YMAX_a= 356706
##$YMIN_a= -345999
##$ZGOPTNS= <>
##$ZL1= 120
##$ZL2= 120
##$ZL3= 120
##$ZL4= 120
##$ABSF1= 15.47915
##$ABSF2= -2.5727
##$ABSG= 5
##$ABSL= 3
##$ALPHA= 0
##$AQORDER= 0
##$ASSFAC= 0
##$ASSFACI= 0
##$ASSFACX= 0
##$ASSWID= 0
##$AUNMP= <proc_1d>
##$AZFE= 0.1
##$AZFW= 0.1
##$BCFW= 0
##$BC_mod= 2
##$BYTORDP= 0
##$COROFFS= 0
##$CY= -3
##$DATMOD= 1
##$DC= 0
##$DFILT= <>
##$DTYPP= 0
##$F1P= 0
##$F2P= 0
##$FCOR= 1
##$FTSIZE= 16384
##$FT_mod= 6
##$GAMMA= 0
##$GB= 0
##$INTBC= 1
##$INTSCL= 3.241238e-09
##$ISEN= 128
##$LB= 0.25
##$LEV0= 0
##$LPBIN= 0
##$MAXI= 10000
##$MC2= 0
##$MEAN= 0
##$ME_mod= 0
##$MI= 1.114404
##$NCOEF= 0
##$NC_proc= -7
##$NLEV= 6
##$NOISF1= 3.799351
##$NOISF2= 2.8
##$NSP= 0
##$NTH_PI= 0
##$NZP= 0
##$OFFSET= 15.47474
##$PC= 1
##$PHC0= -4058.998
##$PHC1= 9.39229
##$PH_mod= 1
##$PKNL= yes
##$PPARMOD= 0
##$PSCAL= 0
##$PSIGN= 0
##$REVERSE= no
##$SF= 200.130009397199
##$SI= 16384
##$SIGF1= 3
##$SIGF2= 2
##$SINO= 0.751879
##$SIOLD= 32768
##$SREGLST= <19F.Aceton>
##$SSB= 0
##$STSI= 16384
##$STSR= 0
##$SW_p= 3612.71676300578
##$SYMM= 0
##$S_DEV= 0
##$TDeff= 16384
##$TDoff= 0
##$TI= <>
##$TILT= no
##$TM1= 0
##$TM2= 0
##$TOPLEV= 0
##$USERP1= <user>
##$USERP2= <user>
##$USERP3= <user>
##$USERP4= <user>
##$USERP5= <user>
##$WDW= 1
##$XDIM= 16384
##$YMAX_p= 518435367
##$YMIN_p= -932867
$$ End of Bruker specific parameters
$$ ---------------------------------
##NTUPLES= NMR SPECTRUM
##VAR_NAME=  FREQUENCY,     SPECTRUM/REAL,   SPECTRUM/IMAG
##SYMBOL=    X,             R,               I
##VAR_TYPE=  INDEPENDENT,   DEPENDENT,       DEPENDENT
##VAR_FORM=  AFFN,          ASDF,            ASDF
##VAR_DIM=   16384,         16384,           16384
##UNITS=     HZ,            ARBITRARY UNITS, ARBITRARY UNITS
##FACTOR=    0.220516191357247, 1,           1
##FIRST=     3096.95986729917, 0,            0
##LAST=      -515.75689570661, 0,            0
##MIN=       -515.75689570661, -932867,      0
##MAX=       3096.95986729917, 518435367,    0
$$ Real data points
##PAGE= N=1
##DATA TABLE= (X++(R..R)), XYDATA
$$ [...]
6092I155132k96914j96757P5664j88846j79338j23947k56931l1532L94549J21804
$$ 9155132 8858218 8661461 8737125 8548279 8368941 8244994 7988063 7956531 8351080 8472884
6082H472884M9007L13742M89238N09842N50982L99407j21118o75936m27294o94727
$$ 8472884 8521891 8835633 9324871 9834713 10385695 10785102 10663984 9988048 9560754 8866027
6072H866027o73315m05457o10424l20998o23819m34507o36760n72526K37159P6939
$$ 8866027 8192712 7787255 7176831 6855833 6232014 5797507 5160747 4588221 4825380 4902319
6062D902319j49220j79393m08041L93939k91896K5812j21481k63225j41099O462
$$ 4902319 4753099 4573706 4165665 4559604 4267708 4293520 4172039 3908814 3767715 3774177
6052C774177j25576j4240j97808p5120R2273k42841k76225Q4094k28818P3664
$$ 3774177 3648601 3634361 3436553 3361433 3453706 3210865 2934640 3018734 2789916 2863580
6042B863580K7874k96327J23279J73367K8596j9483j21081l97290J79884k06458
$$ 2863580 2891454 2595127 2718406 2891773 2920369 2900886 2779805 2382515 2562399 2355941
6032B355941p3870J4014L47810l92744r9318Q2971n7698l52662K32879L8245K87274
$$ 2355941 2282071 2296085 2643895 2251151 2151833 2234804 2177106 1824444 2057323 2095568 2382842
6021B382842M5708J64458P8361k63830j65033k92691p1646j48818J08837J56091
$$ 2382842 2428550 2593008 2671369 2407539 2242506 1949815 1878169 1729351 1838188 1994279
6011A994279R6411m04420R6610p6137n6783k13790O7643J58522k33087p7523K35219
$$ 1994279 2090690 1686270 1782880 1706743 1649960 1436170 1503813 1662335 1429248 1351725 1586944
6000A586944J53444k9461j26383l1614q1527p8685O8843O1154k92705l12701M2519
$$ 1586944 1740388 1710927 1584544 1552930 1471403 1392718 1461561 1522715 1230010 917309 959828
5989I59828R3759L04192p675j58999l7898K32647J14290J50215R658r3384R0002
$$ 959828 1053587 1357779 1350104 1191105 1153207 1385854 1500144 1650359 1660017 1566633 1656635
5978A656635m43472l9996O80J15636k7543P296J92402q9766j60228N2427K49114
$$ 1656635 1213163 1173167 1173847 1289483 1261940 1269236 1461638 1371872 1211644 1264071 1513185
5967A513185o9732r2115J64112k67139Q7231p6540j82868p5626J19958j24895
$$ 1513185 1443453 1351338 1515450 1248311 1335542 1259002 1076134 1000508 1120466 995571
5957I95571L47254q2183j08902p5073J32110l6612l38391k02090L82121j39748
$$ 995571 1342825 1260642 1151740 1076667 1208777 1172165 833774 631684 1013805 874057
5947H74057j58112O4632J43160L63154L554o5416l66495J44732J9399k01354J35198
$$ 874057 715945 780577 923737 1286891 1290445 1225029 858534 1003266 1022665 821311 956509
5936I56509K69567J30479K23637K97103k05068l58223l46152p7701J5100M1325
$$ 956509 1226076 1356555 1580192 1877295 1672227 1314004 967852 890151 905251 946576
5926I46576J93206P6154m30634J51244L98089J65380k29778k69013K3501J19880
$$ 946576 1139782 1215936 785302 936546 1334635 1500015 1270237 1001224 1024725 1144605
5916A144605L69645m7177j33825J09127K81911o25306j4245J02923P4346O484
$$ 1144605 1514250 1467073 1333248 1442375 1724286 1098980 1084735 1187658 1262004 1268488
5906A268488j58650L47262p2756j97786J53797J6364O6458K26611n12934J53278
$$ 1268488 1109838 1457100 1384344 1186558 1340355 1356719 1423177 1649788 1136854 1290132
5896A290132M85873J49439P3487k62138J02549l58855j66530J53100K98646j10151
$$ 1290132 1776005 1925444 1998931 1736793 1839342 1480487 1313957 1467057 1765703 1655552
5886A655552q3662j3389L73325o1830k12571r9088k34725k72121P3250p0853J71779
$$ 1655552 1571890 1558501 1931826 1869996 1657425 1558337 1323612 1051491 1124741 1053888 1225667
5875A225667p6571J1391j40755J11510K59832r352o7358J86666k32403j34620
$$ 1225667 1149096 1160487 1019732 1131242 1391074 1381722 1314364 1501030 1268627 1134007
5865A134007k05242J56162K01533m3093j4830o5414J06599R6445J26862k16431
$$ 1134007 928765 1084927 1286460 1243367 1228537 1163123 1269722 1366167 1493029 1276598
5855A276598m6146J75451J66685j29840k36584l0573n21977K08250K64701M6120
$$ 1276598 1230452 1405903 1572588 1442748 1206164 1175591 653614 861864 1126565 1172685
5845A172685K48594j93308J09672j31067J42843j73371p6720J11831j12172Q9750
$$ 1172685 1421279 1227971 1337643 1206576 1349419 1176048 1099328 1211159 1098987 1188737
5835A188737q1215k94837Q6512K75446k37259k79828j95148J93990J60823j25479
$$ 1188737 1107522 812685 899197 1174643 937384 657556 462408 656398 817221 691742
5825F91742K59011N9938Q9715p5761m0943L3768q3009r3294j07983L7287J31343
$$ 691742 950753 1010691 1100406 1024645 983702 1017470 934461 841167 733184 770471 901814
5814I01814l32773N0548l8173j28773R0370K1892M3640M13831k02562j73546J47836
$$ 901814 569041 619589 581416 452643 543013 564905 608545 1022376 819814 646268 794104
5803G94104K53376j81020j4497k68096j80593J88350q3127L11364k20215n39904
$$ 794104 1047480 866460 851963 583867 403274 591624 508497 819861 599646 59742
5793E9742N43188J55189J79838j47429j91563N2362K55913P5359J8432p1166J11627
$$ 59742 602930 758119 937957 790528 598965 651327 907240 982599 1001031 929865 1041492
5782A041492k87380j47981m827M6738L1091k43764L46174m0006K54409J3037p548
$$ 1041492 754112 606131 601304 648042 679133 435369 781543 741537 995946 1008983 1001435
5771A001435L7153l56721j41114k8820l2318J13465K78908K35361k770J26909
$$ 1001435 1038588 681867 540753 511933 479615 593080 871988 1107349 1104579 1231488
5761A231488m2709O505j80592J10727p484p1244r8214K6995j06443K26055j88760
$$ 1231488 1188779 1195284 1014692 1125419 1117935 1046691 948477 975472 869029 1095084 906324
5750I06324K75286J17853L0230n0356J86506j43743N9299o1639M49473K21500
$$ 906324 1181610 1299463 1329693 1279337 1465843 1322100 1381399 1319760 1769233 1990733
5740A990733j38040N76467M23627P09337J040399R22347J459597J367617R9367
$$ 1990733 1852693 2429160 2852787 3562124 4602523 5524870 6984467 8352084 8451451
5731H451451n79766j120656r05348q66894o26911p89435n40245l89540J43089
$$ 8451451 7871685 6751029 5845681 4978787 4351876 3562441 3022196 2632656 2775745
5722B775745k43235l56843j04899J11651m3878R0852P6590O30882L97187j4968
$$ 2775745 2532510 2175667 2070768 2182419 2138541 2229393 2305983 2936865 3334052 3319084
5712C319084m1608J18794L13437N04778L84340J020466J382901J994408L042542
$$ 3319084 3277476 3396270 3709707 4214485 4598825 5619291 7002192 8996600 12039142
5703A2039142L763335M196889K995801O50150j931858l441091l445020k639745
$$ 12039142 15802477 19999366 22995167 23645317 21713459 18272368 14827348 12187603
5695A2187603j596515j626123j363318j088210p93579p05829l49608m10115l31318
$$ 12187603 10591088 8964965 7601647 6513437 5719858 5014029 4664421 4254306 3922988
5686C922988k94053j27925O2510K02066j1479j36783L7018N1552N60610N99586
$$ 3922988 3628935 3501010 3563520 3765586 3754107 3617324 3654342 3705894 4266504 4866090
5676D866090O54898O71447J494201J927443L648934M180830M705856K600000l76339
$$ 4866090 5520988 6192435 7686636 9614079 13263013 17443843 22149699 24749699 24373360
5667B4373360k645459l620759l140093k610469j906126k219688j741566o04465
$$ 24373360 21727901 18107142 14967049 12356580 10450454 8230766 6489200 5884735
5659E884735r01722o10245k51125l86443l49785o8814l14577k58063j33048K57855
$$ 5884735 4983013 4372768 4121643 3735200 3385415 3316601 3002024 2743961 2610913 2868768
5649B868768K69032l68482K24697N3745j49196P4275N01187M61532P76732J436443
$$ 2868768 3137800 2769318 2994015 3047760 2898564 2972839 3474026 3935558 4712290 6148733
5639F148733J437154J110431P56835p7879j031267j101357r69982r72074j148734
$$ 6148733 7585887 8696318 9453153 9375274 8344007 7242650 6272668 5300594 4151860
5630D151860q53372q4459l18889k78580l27482m29215l11850j51401Q0880K13498
$$ 4151860 3298488 3214029 2895140 2616560 2289078 1859863 1548013 1396612 1477492 1690990
5620A690990J98056j32386j74377j52318j16810r6833O1523J3924J36850J69135
$$ 1690990 1889046 1756660 1582283 1429965 1313155 1216322 1277845 1291769 1428619 1597754
5610A597754k18727k68978M32081m2298k18150K42110o0668P774J44524j74581
$$ 1597754 1379027 1110049 1542130 1499832 1281682 1523792 1463124 1470898 1615422 1440841
5600A440841j81202r7802j04147O8041L6213J17882J48288J6405J86559N5616
$$ 1440841 1259639 1161837 1057690 1125731 1161944 1279826 1428114 1444519 1631078 1686694
5590A686694m6384J08426l63878k56769m3264J99856n0911k88670l9952q2443
$$ 1686694 1640310 1748736 1384858 1128089 1084825 1284681 1233770 945100 905148 822705
5580H22705J99541K83258j99508R4583J56284J15283J31294o9955k15688q4134
$$ 822705 1022246 1305504 1105996 1200579 1356863 1472146 1603440 1533485 1317797 1233663
5570A233663M6310J39842o1879j35290k5439J58015J88234l59010j79911L8616
$$ 1233663 1279973 1419815 1357936 1222646 1197207 1355222 1543456 1184446 1004535 1043151
5560A043151Q0827J43708J11442j31510j30484r2946M7434j05111J49519J04311
$$ 1043151 1123978 1267686 1379128 1247618 1117134 1024188 1071622 966511 1116030 1220341
5550A220341j83173j21250K65477j43416k17658j4674j76500M62672L7393q7817
$$ 1220341 1037168 915918 1181395 1037979 820321 805647 629147 1091819 1129212 1041395
5540A041395K62075o3067l8175j4548M1787K79139j95122k69926J16963J5987
$$ 1041395 1303470 1240403 1202228 1187680 1229467 1508606 1313484 1043558 1160521 1176508
5530A176508j39267M20223P9000n6178K88618l15764j55220n9685K1222k76199
$$ 1176508 1037241 1457464 1536464 1480286 1768904 1453140 1297920 1238235 1259457 983258
5520I83258P8871K32217L6819r0561J86525j05689k47514K51968o8059J60984
$$ 983258 1062129 1294346 1331165 1240604 1427129 1321440 1073926 1325894 1257835 1418819
5510A418819j09910j46256q960J06313K2061J13669M5282J29497K37499l88683
$$ 1418819 1308909 1162653 1153693 1260006 1282067 1395736 1441018 1570515 1808014 1419331
5500A419331k90464M41927K34014P9363k66895K18439K4548m047j02239j6336
$$ 1419331 1128867 1570794 1804808 1884171 1617276 1835715 1860263 1856216 1753977 1737641
5490A737641K11345J34134l23030m69506J18980o8835O5254n3675j44753R4254
$$ 1737641 1948986 2083120 1760090 1290584 1409564 1340729 1405983 1352308 1207555 1301809
5480A301809k53807K5895M82884Q6051k48397K82427K5416p764j39110m25324
$$ 1301809 1048002 1073897 1556781 1642832 1394435 1676862 1702278 1694514 1555404 1130080
5470A130080J70254P4952k43690j81274l3981j56890P8392l3902q5903L55119
$$ 1130080 1300334 1375286 1131596 950322 916341 759451 837843 803941 718038 1073157
5460A073157J03468j09608q1056R8141J21787K88753k26758k43890J7810j55990
$$ 1073157 1176625 1067017 985961 1084102 1205889 1494642 1267884 1023994 1041804 885814
5450H85814N2928J26117J68056r3045n7096J00908L4850k25818k2794p6967J88424
$$ 885814 938742 1064859 1232915 1139870 1082774 1183682 1218532 992714 969920 892953 1081377
5439A081377j47203r3158K46543k70631R6708P1528m4483K97359p1413k16279
$$ 1081377 934174 841016 1087559 816928 913636 985164 940681 1238040 1166627 950348
5429I50348k71683j81566R0539L22769J23878M90332J26451j02985K49210k8168
$$ 950348 678665 497099 587638 910407 1034285 1524617 1651068 1548083 1797293 1769125
5419A769125j06717m1262J6582j05787o1590J89310J53995J5017m45624j37049
$$ 1769125 1662408 1621146 1637728 1531941 1470351 1659661 1813656 1828673 1383049 1246000
5409A246000j21825K57433k1183k8083Q0021n50245l80336L41608K22190L7504
$$ 1246000 1124175 1381608 1360425 1332342 1412363 862118 481782 823390 1045580 1083084
5399A083084M0472J25885L88143K62292K69778n19351J13762M28095k79970J77096
$$ 1083084 1123556 1249441 1637584 1899876 2169654 1650303 1764065 2192160 1912190 2089286
5389B089286r4621m548j90742J55171L38923j5251k88529m26686L3443k15692
$$ 2089286 1994665 1990117 1799375 1954546 2293469 2278218 1989689 1563003 1596446 1380754
5379A380754n2790L72217j90543r0046j47136k12219j74899K06506M31083j68654
$$ 1380754 1327964 1700181 1509638 1419592 1272456 1060237 885338 1091844 1522927 1354273
5369A354273J97354P8904J57794k18862K35595m745K7942K0634k10027J45725
$$ 1354273 1551627 1630531 1788325 1569463 1805058 1800313 1828255 1848889 1638862 1784587
5359A784587J67027M4374j31379O7723J80030j91679r7076m3557M2954p4766j73380
$$ 1784587 1951614 1995988 1864609 1932332 2112362 1920683 1823607 1780050 1823004 1748238 1574858
5348A574858K08225k26677n122K4054J64993J86241l4758k86323m9087R8219M0589
$$ 1574858 1783083 1556406 1551284 1575338 1740331 1926572 1891814 1605491 1556404 1654623 1695212
5337A695212J10702J35519r3910k57546M60745j05687J69795m9980m2223J49034
$$ 1695212 1805914 1941433 1847523 1589977 2050722 1945035 2114830 2064850 2022627 2171661
5327B171661P8444J23135m2491l1038J09233J47480L93381L54361k85499J20086
$$ 2171661 2250105 2373240 2330749 2299711 2408944 2556424 2949805 3304166 3018667 3138753
5317C138753J34011L2297l18316K96026O8810J27929L07159j10661j74534p8095
$$ 3138753 3272764 3305061 2986745 3282771 3351581 3479510 3786669 3676008 3501474 3423379
5307C423379J77983j2249L2936K16182L15480j59110P746J07655j54128n4542
$$ 3423379 3601362 3589113 3622049 3838231 4153711 3994601 4002347 4110002 3955874 3901332
5297C901332j7503L57827L0421N0555N30233K47217L92385L43280M38879K23898
$$ 3901332 3883829 4241656 4272077 4322632 4852865 5100082 5492467 5835747 6274626 6498524
5287F498524P33063P24969O53698Q50815R99279P25134N93592N19148K29658K43753
$$ 6498524 7231587 7956556 8610254 9461069 10460348 11185482 11779074 12298222 12527880 12771633
5277A2771633J41668K87966m9756R1344j61477L32333L00198N39161L97124p1112
$$ 12771633 12913301 13201267 13151511 13242855 13081378 13413711 13713909 14253070 14650194 14579082
5267A4579082k3915l4308k3804p48385p26090n89611p06013k08942o6227n78117
$$ 14579082 14555167 14520859 14497055 13748670 13022580 12432969 11726956 11518014 11451787 10873670
5257A0873670j94770j87855o3477j87277k88152J32643J45860k3949N51378L68032
$$ 10873670 10678900 10491045 10427568 10240291 9952139 10084782 10230642 10206693 10758071 11126103
5247A1126103J56800K57909J98605O40204N44179N17266N73335N53305J012090
$$ 11126103 11282903 11540812 11739417 12379621 12923800 13441066 14014401 14567706 15579796
5238A5579796J387215J598520J522397J751623K095787K678860K465261K299070
$$ 15579796 16967011 18565531 20087928 21839551 23935338 26614198 29079459 31378529
5230C1378529K042619J570664J197308R99360O25686N15009M80918K04427K55216
$$ 31378529 33421148 34991812 36189120 37188480 37814166 38329175 38810093 39014520 39269736
5221C9269736M63872M21984L56606P97810q9810q35461j178369j037493j547364
$$ 39269736 39733608 40155592 40512198 41310008 41220198 40384737 39206368 38168875 36621511
5212C6621511j999620k338093j810791j954246k156379k010453j428451j282057
$$ 36621511 34621891 32283798 30473007 28518761 26362382 24351929 22923478 21641421
5204B1641421j116665j106197j046077k88244j45694l00278l28788L37637M82080
$$ 21641421 20524756 19418559 18372482 18084238 17938544 17638266 17309478 17647115 18129195
5195A8129195O15402L09561L70702L30417O5347K24863J93083Q25522R83198M70050
$$ 18129195 18744597 19054158 19424860 19755277 19820624 20045487 20238570 21064092 22047290 22517340
5185B2517340P97955J308349Q60271J242702K116822K167586K129681K227140
$$ 22517340 23315295 24623644 25483915 26726617 28843439 31011025 33140706 35367846
5177C5367846K320828K274938J373150M09805J39214m94874r51949j284260r94573
$$ 35367846 37688674 39963612 41336762 41746567 41885781 41390907 40438958 39154698 38160125
5168C8160125o79558p08582q31322p2293N10806M15596L7529o97099j011772j405034
$$ 38160125 37480567 36771985 35940663 35868370 36379176 36794772 36832301 36135202 35123430 33718396
5158C3718396k017602j971379j572979j818563k020984j268379r35509j149252
$$ 33718396 31700794 29729415 28156436 26337873 24316889 23048510 22113001 20963749
5150B0963749p07342o65048j46414J44809q7903J55832L77855R38487J057753
$$ 20963749 20256407 19591359 19444945 19589754 19501851 19657683 20035538 20974025 22031778
5141B2031778R88377J363612J461538J608072J635609J480817J321312O61616
$$ 22031778 23020155 24383767 25845305 27453377 29088986 30569803 31891115 32552731
5133C2552731N54564L67706K48169k3874n8962O85013R08863Q90021P00048J447314
$$ 32552731 33107295 33475001 33723170 33699296 33640334 34325347 35234210 36124231 36824279 38271593
5123C8271593J118645J034659M64595j24367l74137j161703j201699k016584k440638
$$ 38271593 39390238 40424897 40889492 40765125 40390988 39229285 38027586 36011002 33570364
5114C3570364k225852k017395k000227j828484j839096j309012j535990q45856
$$ 33570364 31344512 29327117 27326890 25498406 23659310 22350298 20814308 19968452
5106A9968452n04478r66036m68807O4621j90421l78586m78941n53801j44061m76106
$$ 19968452 19463974 18497938 18029131 18093752 17903331 17524745 17045804 16492003 16347942 15871836
5096A5871836n22247J97340J12150l26542l27347l41848N3299J84899L80711K1746
$$ 15871836 15349589 15546929 15659079 15332537 15005190 14663342 14716641 14901540 15282251 15303997
5086A5303997P05068N48428Q60488O31806L83416R70266M39940K13361L01784
$$ 15303997 16009065 16557493 17417981 18049787 18433203 19403469 19843409 20056770 20358554
5077B0358554l33384o86721n63840n58635j038074n18110m26866j131043o93543
$$ 20358554 20025170 19338449 18774609 18215974 17177900 16659790 16232924 15101881 14408338
5068A4408338j90139k98862m1818k41233L0481j21245m66133o45601l29606m05955
$$ 14408338 14218199 13919337 13877519 13636286 13666767 13545522 13079389 12433788 12104182 11698227
5058A1698227l78801L10799r0455J53287N7907L64629O04806K04052L79373O96890
$$ 11698227 11319426 11630225 11539770 11693057 11750964 12115593 12720399 12924451 13303824 14000714
5048A4000714P07863P55135O15636L85299O10531m3608k03750j87203o14501m20092
$$ 14000714 14708577 15463712 16079348 16464647 17075178 17031570 16827820 16640617 16026116 15606024
5038A5606024j315845l22621n99573r15624o90992r8076q3527r8148j36555k57176
$$ 15606024 14290179 13967558 13367985 12452361 11761369 11663293 11579766 11481618 11345063 11087887
5028A1087887j48422M1194O327L573q8863M09698K4529k3697j89017J33558l31198
$$ 11087887 10939465 10980659 10986986 10990559 10901696 11311394 11335923 11312226 11123209 11256767 10925569
5017A0925569p79589k26905L0318M7438k1194j17336m3014L37681J89710N92335
$$ 10925569 10145980 9919075 9949393 9996831 9975637 9858301 9815287 10152968 10342678 10935013
5007A0935013Q25549N82150O78410P92563J022502Q67748O14176O81831M46260
$$ 10935013 11760562 12342712 13021122 13813685 14836187 15703935 16318111 16999942 17446202
4998A7446202P90256P64093K67229K8504k06780j36296M79452J62274J72309K11272
$$ 17446202 18236458 19000551 19267780 19296284 19089504 18953208 19432660 19594934 19767243 19978515
4988A9978515j43125l68213Q8425m15087p44674n69106r73631q12995q68746o98705
$$ 19978515 19835390 19467177 19555602 19140515 18395841 17826735 16853104 16040109 15171363 14472658
4978A4472658n68719q03905m52120l11895n05386l92613m93625m93352o28900
$$ 14472658 13903939 13100034 12647914 12336019 11830633 11438020 10944395 10451043 9822143
4969I822143k62687P845k67709l19866k93943Q5817j82535K38917n18924m1191
$$ 9822143 9559456 9567301 9299592 8979726 8685783 8771600 8589065 8827982 8309058 8267867
4959H267867o8525J68889N09994K89249L77578P14607O47166M81866P57937J040315
$$ 8267867 8199342 8368231 8878225 9167474 9545052 10259659 10906825 11388691 12146628 13186943
4949A3186943O84611R09398J269366J251195R93534R66700N93230K93661J86401
$$ 13186943 13871554 14780952 16050318 17301513 18295047 19261747 19854977 20148638 20335039
4940B0335039m8668j54510k03423K10346o3318L0529L76541P50954Q05120R77059
$$ 20335039 20286371 20131861 19928438 20138784 20075466 20105995 20482536 21233490 22038610 23015669
4930B3015669J549170J825903J714770J460150R06027O02076j37884o27175j605738
$$ 23015669 24564839 26390742 28105512 29565662 30471689 31073765 30935881 30308706 28702968
4921B8702968j839154j558402j618497j842624j863248j157642j424327j165308
$$ 28702968 26863814 25305412 23686915 21844291 19981043 18823401 17399074 16233766
4913A6233766j235169j031068n76627n36202k72052j16851j58073q5201P7744
$$ 16233766 14998597 13967529 13390902 12854700 12582648 12465797 12307724 12222523 12300267
4904A2300267J03879p4230l30226l14166k22639p092L96147M74902L03552L19360
$$ 12300267 12404146 12329916 11999690 11685524 11462885 11455793 11851940 12326842 12630394 12949754
4894A2949754M72808N98459M37545P87988J316982J003365J269860J612799J617291
$$ 12949754 13422562 14021021 14458566 15246554 16563536 17566901 18836761 20449560 22066851
4885B2066851J582930J505758K023735J456917R13483L21550K25870n56349k04308
$$ 22066851 23649781 25155539 27179274 28636191 29549674 29871224 30097094 29540745 29336437
4876B9336437l24466n97221l23889q3537n41468l87932P1598l00338j047646j154359
$$ 29336437 29011971 28414750 28090861 28007324 27465856 27077924 27149522 26849184 25801538 24647179
4866B4647179j086828k029992j620472j667600j558075j742683j102779j302348
$$ 24647179 23560351 21530359 19909887 18242287 16684212 14941529 13838750 12536402
4858A2536402o25038o43152o00639o53380q02048j68039l19739L3555j94652m3346
$$ 12536402 11911364 11268212 10667573 10014193 9212145 9044106 8724367 8757922 8563270 8519924
4848H519924J50850p5603o83204l17454j23926q5172L94576L40654j1501M9824
$$ 8519924 8670774 8595171 7911967 7594513 7470587 7385415 7779991 8120645 8109144 8158968
4838H158968j98526J05275J91509K79973M13309P49703N45753P97134J000841
$$ 8158968 7960442 8065717 8257226 8537199 8950508 9700211 10245964 11043098 12043939
4829A2043939J138974J578286J175293J318635R08913j1291n79775q42665j197401
$$ 12043939 13182913 14761199 15936492 17255127 18164040 18152749 17572974 16730309 15532908
4820A5532908j422938j143020j316199j196343j026575q87290q42404o39603n73341
$$ 15532908 14109970 12966950 11650751 10454408 9427833 8540543 7698139 7058536 6485195
4811F485195q84066l73502j22939k04594l01619n10235q5357m06703k12594j04350
$$ 6485195 5601129 5227627 5104688 4900094 4598475 4088240 4002883 3596180 3383586 3279236
4801C279236j54787J25954l29065j84897k76374J11539k07233J12853r9425j84108
$$ 3279236 3124449 3250403 2921338 2736441 2460067 2571606 2364373 2477226 2377801 2193693
4791B193693j27072j72356M9448J63979k829K1845L493j98182j70982l30001P9114
$$ 2193693 2066621 1894265 1943713 2107692 2104863 2126708 2130201 1932019 1761037 1431036 1510150
4780A510150J21958O3181K49650q6672q0373J01607m7568k67815m22371k7568
$$ 1510150 1632108 1695289 1944939 1858267 1777894 1879501 1831933 1564118 1141747 1114179
4770A114179J34415O458J09742K43109k46032O3264l8674n4007l7171J2037N3838
$$ 1114179 1248594 1255052 1364794 1607903 1361871 1425135 1386461 1332454 1295283 1307320 1361158
4759A361158k3728l52490j09497j86441o6597j85850j22217L08151M65796Q2061
$$ 1361158 1337430 984940 875443 689002 622405 436555 314338 622489 1088285 1170346
4749A170346q4961J58552l55090j01154R4995j79826K08690P1203l7294k18764
$$ 1170346 1085385 1243937 888847 787693 882688 702862 911552 982755 945461 726697
4739G26697J19206j22925Q938K96081J88228k46397l44239R4076N1714K44946
$$ 726697 845903 722978 731916 1027997 1216225 969828 625589 719665 771379 1016325
4729A016325k4375J97883m4188m3382l82927k70211r9737K71727L51055k02876
$$ 1016325 991950 1189833 1145645 1102263 719336 449125 349388 621115 972170 769294
4719G69294P5476K36192q7919o6075m32170J89288j77168K61811o6306k90638
$$ 769294 844770 1080962 993043 926968 494798 684086 506918 768729 702423 411785
4709D11785M21169O0191k90186J11004l56390k9257L43389j6019l12089l0347
$$ 411785 832954 893145 602959 713963 357573 328316 671705 655686 343597 313250
4699C13250J12450K07159K97460l87655J99840j47326p526K22332j02371J61831
$$ 313250 425700 632859 930319 542664 742504 595178 587652 809984 707613 869444
4689H69444J89411l08518j37633j01390j01952P7286J23281L76468k15470k8910
$$ 869444 1058855 750337 612704 511314 409362 486648 609929 986397 770927 742017
4679G42017J08627J46307j2569r9462j03186L07384m0716N8721j6257k70037J38082
$$ 742017 850644 996951 984382 884920 781734 1089118 1048402 1107123 1090866 820829 958911
4668I58911O7943K0653j69507J298O5939J1873K5938M45573J67228K47045j03019
$$ 958911 1026854 1047507 878000 879298 945237 957110 983048 1428621 1595849 1842894 1739875
4657A739875J91776j33864k71295R4633j31055j45448l2568J12910j59910K46560
$$ 1739875 1931651 1797787 1526492 1621125 1490070 1344622 1312054 1424964 1265054 1511614
4647A511614j75857k46899k0377k2222l5952J30884l73200J13368K73421k6419
$$ 1511614 1335757 1088858 1068481 1046259 1010307 1141191 767991 881359 1154780 1128361
4637A128361o6173j83808n9102l5043L14293r1553J39251o1902l67481O4757K62693
$$ 1128361 1062188 878380 819278 784235 1098528 1006975 1146226 1084324 716843 781600 1044293
4626A044293l83587n9999N16998N7350j54440L67025M91228J93950J03562k68939
$$ 1044293 660706 600707 1117705 1175055 1020615 1387640 1878868 2072818 2176380 1907441
4616A907441k94673Q3930j55750N41830J13283n6913N1242O1313j07881m41624
$$ 1907441 1612768 1696698 1540948 2082778 2196061 2139148 2190390 2251703 2143822 1702198
4606A702198o2922K18232l85766K91724j6715R2110l2669q7757J75206n6407k58662
$$ 1702198 1639276 1857508 1471742 1763466 1746751 1838861 1806192 1718435 1893641 1837234 1578572
4595A578572J22365M17259M08397R1011J14501K15036l03342j10337R1249K28832
$$ 1578572 1700937 2118196 2526593 2617604 2732105 2947141 2643799 2533462 2624711 2853543
4585B853543K02758N2785r1697Q4621k94581j29536l2737l91878k50625j46006
$$ 2853543 3056301 3109086 3017389 3102010 2807429 2677893 2645156 2253278 2002653 1856647
4575A856647K25173J50227r971K99943J92989l72282J00932L350m56637j0172
$$ 1856647 2081820 2232047 2222076 2522019 2715008 2342726 2443658 2447008 1990371 1980199
4565A980199O5678J61303K2282K78968N1526L80253j9667r3074L71347L57255
$$ 1980199 2045877 2207180 2229462 2508430 2559956 2940209 2920542 2827468 3198815 3556070
4555C556070j70250k9123L91746K44510j70097k67696J88122K51023M32353l0210
$$ 3556070 3385820 3356697 3748443 3992953 3822856 3555160 3743282 3994305 4426658 4396448
4545D396448j11571K95484J52402M66994J72430L23403K24178J1791L88913P65139
$$ 4396448 4284877 4580361 4732763 5199757 5372187 5695590 5919768 5931559 6320472 7085611
4535G085611P74830Q56691M63264J010926R80081J096750J280412J074755R50527
$$ 7085611 7860441 8717132 9180396 10191322 11171403 12268153 13548565 14623320 15573847
4526A5573847J405279J433512J869857J611828J890436K622915K909165L720588
$$ 15573847 16979126 18412638 20282495 21894323 23784759 26407674 29316839 33037427
4518C3037427M298754M959594N378354N746671M778845L865641K833657J955563
$$ 33037427 37336181 42295775 47674129 53420800 58199645 62065286 64898943 66854506
4510F6854506Q66137L68490M74227M20730n91686j488116k942616m167063m980841
$$ 66854506 67720643 68089133 68563360 68984090 68392404 66904288 63961672 59794609 54813768
4501E4813768n420070n743964n332139m404414m062155k607769k605122k459640
$$ 54813768 49393698 43649734 38317595 33913181 29851026 27243257 24638135 22178495
4493B2178495j867977j518627j059924j115478n84416k2572J34081J86136M39084
$$ 22178495 20310518 18791891 17731967 16616489 16032073 16009501 16143582 16329718 16768802
4484A6768802M62140N32974Q7767j8725M40443N49922m6308j12274p5308k3053
$$ 16768802 17230942 17763916 17851683 17832958 18273401 18823323 18777015 18664741 18589433 18566380
4474A8566380l26558m91130n62087r73937j273196r61628p40669q99812p46199
$$ 18566380 18239822 17748692 17186605 16212668 14939472 13977844 13237175 12337363 11591164
4465A1591164p93085p46119r27842m51192j66610l93717o10630m13875l33055
$$ 11591164 10798079 10051960 9124118 8672926 8506316 8112599 7501969 7088094 6755039
4456F755039k80314k04146j06564k63349j4504l17409m05940m16672q3719l61402
$$ 6755039 6474725 6270579 6164015 5900666 5886162 5568753 5162813 4746141 4662422 4301020
4446D301020l69928j67403j56143J71265o1282l10877j25761k56079m3532K29474
$$ 4301020 3931092 3763689 3607546 3778811 3717529 3406652 3280891 3024812 2981280 3210754
4436C210754r1441N8272j74559K0366j51658J63797P959l58897R4449K01245n467
$$ 3210754 3119313 3177585 3003026 3023392 2871734 3035531 3043490 2684593 2779042 2980287 2974820
4425B974820j55608q3755K23771n1129j65971j18973l30926j80533J42786l81828
$$ 2974820 2819212 2735457 2959228 2908099 2742128 2623155 2292229 2111696 2254482 1872654
4415A872654K79423j55958m25008J91258L16387Q9682J73047j04466j57574K63521
$$ 1872654 2152077 1996119 1571111 1762369 2078756 2168438 2341485 2237019 2079445 2342966
4405B342966O5091L63399n225k84206J7474M8944j07157L80824j92515j39070
$$ 2342966 2408057 2771456 2766231 2482025 2499499 2548443 2441286 2822110 2629595 2490525
4395B490525M60360L50434P24564M70876J52603k17680n37518k85363n08483l06133
$$ 2490525 2950885 3301319 4025883 4496759 4649362 4431682 3894164 3608801 3100318 2794185
4385B794185l8147q2451m755r5013l70727N7957K48840l3196j42500L28563K40987
$$ 2794185 2756038 2673587 2668832 2573819 2203092 2261049 2509889 2476693 2334193 2662756 2903743
4374B903743m737J1373j87399j23610J30475L14373L18254n128k2236J95454r0485
$$ 2903743 2899006 2910379 2722980 2599370 2729845 3044218 3362472 3357344 3335108 3530562 3440077
4363C440077m2969k17753J46328L73757L16821K0754L52381J30031J90453K71242
$$ 3440077 3397108 3179355 3325683 3699440 4016261 4037015 4389396 4519427 4709880 4981122
4353D981122N26049K64669M80049N60092Q29341Q30012Q51059P89834O86506J141763
$$ 4981122 5507171 5771840 6251889 6811981 7641322 8471334 9322393 10112227 10798733 11940496
4343A1940496J022119J257976J512899K028508J792495K297363K585590L076510
$$ 11940496 12962615 14220591 15733490 17761998 19554493 21851856 24437446 27513956
4335B7513956K864248K611966K470591J663625J373156O44984N02958K22610l78047
$$ 27513956 30378204 32990170 35460761 37124386 38497542 39142526 39645484 39868094 39490047
4326C9490047p69521j432239k168028k637978k835489k894776k820484k703276
$$ 39490047 38720526 37288287 35120259 32482281 29646792 26752016 23931532 21228256
4318B1228256k090927k429478j717084j488251j600157j042487j082106q52403
$$ 21228256 19137329 16707851 14990767 13502516 11902359 10859872 9777766 8925363
4310H925363n95864m21455n75230m01812n21011n08437o1743J4855j33990j38265
$$ 8925363 8329499 7908044 7332814 6931002 6409991 5901554 5839811 5854666 5720676 5582411
4300E582411R9386k69925n0454J9984k94105m68224J84213J63373m77985k40159
$$ 5582411 5681797 5411872 5361418 5381402 5087297 4619073 4803286 4966659 4488674 4248515
4290D248515J38085j07025J11548j14083m12972l64526L75085k71569m09021j6228
$$ 4248515 4386600 4279575 4391123 4277040 3864068 3499542 3874627 3603058 3194037 3177809
4280C177809o4679J41801q7155J1899J4992j89778m1920K349n61484R630R1249
$$ 3177809 3113130 3254931 3167776 3179675 3194667 3004889 2962969 2965318 2403834 2413464 2504713
4269B504713k12839j77735O0927J24149r2937j82389K46447j63106l8956K64701
$$ 2504713 2291874 2114139 2175066 2299215 2206278 2023889 2270336 2107230 2068274 2332975
4259B332975j17847K05702L6309j40886J01906N3371j41733L9057o8377j55620
$$ 2332975 2215128 2420830 2457139 2316253 2418159 2471530 2329797 2368854 2300477 2144857
4249B144857K8823M6508l20293j80024K70882j94407K65898O6595j33104K80584
$$ 2144857 2173680 2220188 1899895 1719871 1990753 1796346 2062244 2128839 1995735 2276319
4239B276319O0708J07976p4706l75844J513L7607M7141j8738Q7604k1747J39445
$$ 2276319 2337027 2445003 2370297 1994453 1995966 2033573 2080714 2061976 2149580 2127833 2267278
4228B267278m1425J01798J42310J08997K69740L40005j668k95555M3999J37803
$$ 2267278 2225853 2327651 2469961 2578958 2848698 3188703 3187035 2891480 2935479 3073282
4218C073282L50702j24980K75783N1440j27610K86649J97950k63154K37060M87942
$$ 3073282 3423984 3299004 3574787 3626227 3498617 3785266 3983216 3720062 3957122 4445064
4208D445064j02103J45415K16051k2451K02602L84474L24786M07228K75590n253
$$ 4445064 4342961 4488376 4704427 4681976 4884578 5269052 5593838 6001066 6276656 6271403
4198F271403N55080L93384K59578O35406M87588P72943J97167J69406L45598M47331
$$ 6271403 6826483 7219867 7479445 8114851 8602439 9375382 9572549 9741955 10087553 10534884
4188A0534884O98037P35503P43102K79070O95385O37612M98284Q32729O35973
$$ 10534884 11232921 11968424 12711526 12990596 13685981 14323593 14821877 15654606 16290579
4179A6290579P01339L59135M27056L49990R4925L35106O30558O30137M90350p7916
$$ 16290579 16991918 17351053 17778109 18128099 18223024 18558130 19188688 19818825 20309175 20231259
4169B0231259J36697J69064M65848J44237L83366L24390p5624N62733O98192M41408
$$ 20231259 20367956 20537020 21002868 21147105 21530471 21854861 21779237 22341970 23040162 23481570
4159B3481570O07072P81439J272005J369413J088228J946539K005170K306261
$$ 23481570 24088642 24870081 26142086 27511499 28599727 30546266 32551436 34857697
4151C4857697K950294K631053L101324K958524K712435K066191J653329J241238
$$ 34857697 37807991 40439044 43540368 46498892 49211327 51277518 52930847 54172085
4143E4172085N51748Q50205J83725n84787j563275j707223k165256k422347k268626
$$ 54172085 54723833 55574038 55757763 55172976 53609701 51902478 49737222 47314875 45046249
4134D5046249k595737k245403j844092j666134j164916q42912q36399j118195
$$ 45046249 42450512 40205109 38361017 36694883 35529967 34687055 33850656 32732461
4126C2732461l80105n37639n26118n36336o94800o03476l98909o08790n94505
$$ 32732461 32352356 31814717 31288599 30752263 30057463 29453987 29055078 28446288 27851783
4117B7851783r21323n79589n59787p45301k95363l53237l59566k44541o54501
$$ 27851783 26930460 26350871 25791084 25045783 24750420 24397183 24037617 23793076 23138575
4108B3138575k02007m3767k33837m32653l40216k39509o4339j27994k63236j37513
$$ 23138575 22936568 22892801 22658964 22226311 21886095 21646586 21582247 21454253 21191017 21053504
4098B1053504k92677n02229m31918o11367n95453m98071n78711n70644q51956
$$ 21053504 20760827 20258598 19826680 19215313 18619860 18121789 17543078 16972434 16120478
4089A6120478q49354j094947l14787l33996p92804p48085p14199n76617o15109
$$ 16120478 15271124 14176177 13861390 13527394 12734590 11986505 11272306 10695689 10080580
4080A0080580o02420k53278l10298j33744m01997m64441o19377k67248j41697
$$ 10080580 9478160 9224882 8914584 8780840 8378843 7914402 7295025 7027777 6886080
4071F886080k78404m54591j24621j1045p9199l06798m42379k55690M8830J0894
$$ 6886080 6607676 6153085 6028464 6017419 5938220 5631422 5189043 4933353 4982183 4993077
4061D993077l76725R5915J32899n65374j11931j90285r1365l42963k18718P366
$$ 4993077 4616352 4712267 4845166 4279792 4167861 3977576 3886211 3543248 3324530 3331896
4051C331896m1823l24909J69895J38234J28520L3047p1001k66930k26956N5379
$$ 3331896 3290073 2965164 3135059 3273293 3401813 3434860 3363859 3096929 2869973 2925352
4041B925352o9591J19696j75083J49379k64257L13053j5455j85509n2412J3636
$$ 2925352 2855761 2975457 2800374 2949753 2685496 2998549 2983094 2797585 2745173 2758809
4031B758809J2361L2582l24942q9719k23634O4214L07583J05254j11489l87736
$$ 2758809 2771170 2803752 2478810 2389091 2165457 2229671 2537254 2642508 2531019 2143283
4021B143283J03574L04503L24433L0665l7261m95387J2184K64848L53763L21305
$$ 2143283 2246857 2551360 2875793 2906458 2869197 2373810 2385994 2650842 3004605 3325910
4011C325910r9340l10241k69151J9149o4842p514n2805o3039M13386k36186j09809
$$ 3325910 3226570 2916329 2647178 2666327 2601485 2593971 2541166 2478127 2891513 2655327 2545518
4000B545518K65873j79577J79592M3683J19076J7861m2138K3843k74843j13109
$$ 2545518 2811391 2631814 2811406 2855089 2974165 2992026 2949888 2973731 2698888 2585779
3990B585779J17257O5189r2112J58143j57604j55510M26629K4615J7096n28864
$$ 2585779 2703036 2768225 2676113 2834256 2676652 2521142 2947771 2972386 2989482 2460618
3980B460618m3427N00515K29935M9988k25127N9400N8006O7898K3090l8281R6215
$$ 2460618 2417191 2917706 3147641 3197629 2972502 3031902 3089908 3157806 3180896 3142615 3238830
3969C238830K66586J58020J43508j3947l30485N7045L58089J05917K39602R7709
$$ 3238830 3505416 3663436 3806944 3792997 3462512 3519557 3877646 3983563 4223165 4320874
3959D320874K40080J69698j33346J95906L16774K32364P9624M54943J53864J68141
$$ 4320874 4560954 4730652 4597306 4793212 5109986 5342350 5421974 5876917 6030781 6198922
3949F198922P7808K87977p4068J84212R4806J72445J17245J36556p1665l8453
$$ 6198922 6276730 6564707 6490639 6674851 6769657 6942102 7059347 7195903 7124238 7085785
3939G085785q6656j05901o5001r0202J27088M50939J91845J30026K15095j14087
$$ 7085785 6999129 6893228 6828227 6738025 6865113 7316052 7507897 7637923 7853018 7738931
3929G738931K1295K04683P35465J20609K19788J4126L08963K73806O1986N27191
$$ 7738931 7760226 7964909 8700374 8820983 9040771 9054897 9363860 9637666 9699652 10226843
3919A0226843L71269L14228K53498L29511M02645k31646L15751M91889L71062
$$ 10226843 10598112 10912340 11165838 11495349 11897994 11666348 11982099 12473988 12845050
3910A2845050P90909K75964J19326J72946j35083L50398L5301K18649M17420K10303
$$ 12845050 13635959 13911923 14031249 14204195 14069112 14419510 14454811 14673460 15090880 15301183
3900A5301183J68734O50733K41091K20575L12354K19302N60296N56003N42386
$$ 15301183 15469917 16120650 16361741 16582316 16894670 17113972 17674268 18230271 18772657
3891A8772657P91835Q40381O21820R92843J240098J137834J124278J269389J332613
$$ 18772657 19564492 20404873 21026693 22019536 23259634 24397468 25521746 26791135 28123748
3882B8123748J281268J626749J400633J037171J374427J773953J579244J600981
$$ 28123748 29405016 31031765 32432398 33469569 34843996 36617949 38197193 39798174
3874C9798174J986754J923626K362753J837112J482778J428109O46146P52337
$$ 39798174 41784928 43708554 46071307 47908419 49391197 50819306 51465452 52217789
3866E2217789J63336o0453M6034L26746J59995j09497r2525m38260n98746p07878
$$ 52217789 52381125 52320672 52366706 52693452 52853447 52743950 52651425 52213165 51614419 50906541
3856E0906541j321737j077133p88292j611639j071344m26003o57269p23960n47202
$$ 50906541 49584804 48507671 47719379 46107740 45036396 44610393 43953124 43229164 42681962
3847D2681962p911K45277O65686R17500J644886J869712J526372J908708K288662
$$ 42681962 42674051 42919328 43585014 44502514 46147400 48017112 49543484 51452192 53740854
3838E3740854K273383K308451K180863K054425K540604K486155K688637K731722
$$ 53740854 56014237 58322688 60503551 62557976 65098580 67584735 70273372 73005094
3830G3005094K729560K735897K841321K848114K660372K527857K435285J620135
$$ 73005094 75734654 78470551 81311872 84159986 86820358 89348215 91783500 93403635
3822I3403635J487040J696793J787697J112775J097091J264577J221319J521423
$$ 93403635 94890675 96587468 98375165 99487940 100585031 101849608 103070927 104592350
3814A04592350J368621J164905Q44627P78495J588364R12451R55186R19759Q20323
$$ 104592350 105960971 107125876 107970503 108748998 110337362 111249813 112204999 113124758 113945081
3805A13945081J4873k53101r96219j492200k164740k362225k029086k377167k486345
$$ 113945081 113959954 113706853 112710634 111218434 109053694 106691469 104662383 102285216 99798871
3796I9798871k147688j708867j599374j069163r48388n41899o19858k40782l19339
$$ 99798871 97651183 95942316 94342942 93273779 92325391 91783492 91163634 90922852 90603513
3787I0603513o55429j186577j302978j832571j827240j729183k519056j998541
$$ 90603513 89948084 88761507 87458529 85625958 83798718 82069535 79550479 77551938
3779G7551938k196885k434947j420246j533041j547784j296821q45937j126358
$$ 77551938 75355053 72920106 71499860 69966819 68419035 67122214 66276277 65149919
3771F5149919j260482j017737k76711k50244p17964l68604j17518j34418n54873
$$ 65149919 63889437 62871700 62594989 62344745 61626781 61258177 61140659 61006241 60451368
3762F0451368o65435q85636p55016r32813j321140j273535j574320j432468j408511
$$ 60451368 59785933 58900297 58145281 57212468 55891328 54617793 53043473 51611005 50202494
3753E0202494j481904j863214j501404j605041j563701j319823j063429j173341
$$ 50202494 48720590 46857376 45355972 43750931 42187230 40867407 39803978 38630637
3745C8630637j453976r66487q97614q72056j337030j429140n50662p21082n84515
$$ 38630637 37176661 36210174 35312560 34440504 33103474 31674334 31123672 30402590 29818075
3736B9818075p26749n29916j38607n48555q19394m50766K82253L5293k9570L51067
$$ 29818075 29091326 28561410 28422803 27874248 27054854 26604088 26886341 26921634 26892064 27243131
3726B7243131l6500l4432K36826L41449J88744Q9127K93401J72087K85312N51930
$$ 27243131 27206631 27172199 27409025 27750474 27939218 28028345 28321746 28493833 28779145 29331075
3716B9331075P77359M06107Q36173J014299P83223R00672P91964J086411J211676
$$ 29331075 30108434 30514541 31350714 32365013 33148236 34048908 34840872 35927283 37138959
3707C7138959J040188J064529J065213J018223J220872J493971J317772J469337
$$ 37138959 38179147 39243676 40308889 41327112 42547984 44041955 45359727 46829064
3699D6829064P45870Q41494R43465P28362N19362N78216N38515M24859L5932K3766
$$ 46829064 47574934 48416428 49359893 50088255 50607617 51185833 51724348 52149207 52185139 52208905
3689E2208905j59713l33524j20914o32279r29349l35393j161781j209870p51922
$$ 52208905 52049192 51715668 51594754 50962475 50033126 49697733 48535952 47326082 46574160
3680D6574160q15457l74383n77849o64118o00544n289k43270J05581n6392K7846
$$ 46574160 45758703 45384320 44806471 44142353 43541809 43536520 43293250 43398831 43342439 43370285
3670D3370285O56407P80579R32594J203177J059876J406516J126902J052747J150017
$$ 43370285 44026692 44807271 45739865 46943042 48002918 49409434 50536336 51589083 52739100
3661E2739100J378974J124306P94299J051843J011044J294264R43894J091382
$$ 52739100 54118074 55242380 56036679 57088522 58099566 59393830 60337724 61429106
3653F1429106J146891Q25813Q58033J029357O22405P38907K5843K26013L12906
$$ 61429106 62575997 63401810 64259843 65289200 65911605 66650512 66676355 66902368 67215274
3644F7215274l93832p70034p34011p35156j633830j128694r24496p69631p50311
$$ 67215274 66821442 66051408 65317397 64582241 62948411 61819717 60895221 60125590 59375279
3635E9375279j153576q66675j090441j468501p13783q91683j257762j228394r89583
$$ 59375279 58221703 57355028 56264587 54796086 54082303 53190620 51932858 50704464 49714881
3626D9714881q47441j123845n13137m84551k1864N23726N13893J028093R40624
$$ 49714881 48867440 47743595 47230458 46745907 46724043 47247769 47761662 48789755 49730379
3617D9730379R48314J012298R34734M38277K51810n0894M18493P8395l23022J58992
$$ 49730379 50678693 51690991 52625725 53064002 53315812 53264918 53683411 53761806 53438784 53597776
3607E3597776O85616N23481L87236L58343Q18880J275775J110237J121931Q89930
$$ 53597776 54283392 54806873 55194109 55552452 56371332 57647107 58757344 59879275 60769205
3598F0769205R74192J152067N13636j17327K23325l69819p23141l45148j071743
$$ 60769205 61743397 62895464 63409100 63291773 63515098 63145279 62422138 62076990 61005247
3589F1005247j249601p55259q40633r55793q75969n67089r18315j48871q3174
$$ 61005247 59755646 59000387 58159754 57203961 56327992 55760903 54842588 54693717 54610543
3580E4610543J40609K68453J85712L11448K84581M09256K41281q1498K090r5483
$$ 54610543 54751152 55019605 55205317 55516765 55801346 56210602 56451883 56370385 56372475 56276992
3570E6276992l18758P1369K49136J14692k42058K40626K19806p42905k12223l5398
$$ 56276992 55958234 56029603 56278739 56393431 56151373 56391999 56611805 55868900 55656677 55621279
3560E5621279m78205o41777m25497q20816j020823r97676q48073j151235j261831
$$ 55621279 55143074 54501297 54075800 53254984 52234161 51236485 50388412 49237177 47975346
3551D7975346p33478r86523q92235o79896o25592k22814J47580J99852O18329
$$ 47975346 47241868 46255345 45363110 44683214 44057622 43834808 43982388 44182240 44800569
3542D4800569M56711Q97316K28835L5691j23336n64897n91489j487746j388857
$$ 44800569 45257280 46154596 46383431 46419122 46295786 45730889 45139400 43651654 42262797
3533D2262797j174638j117986j353165j137440n87275n89318o30361o39275l63010
$$ 42262797 41088159 39970173 38617008 37479568 36892293 36302975 35672614 35033339 34670329
3524C4670329j114393o40587n66561q19766r9289o769l41695j75521j18119m61221
$$ 34670329 33555936 32915349 32348788 31529022 31429733 31422964 31081269 30905748 30787629 30326408
3514C0326408l03283j43800L120M87688m9365k6202K78716M32202N97903J80909
$$ 30326408 30023125 29879325 29882445 30370133 30320768 30294566 30573282 31005484 31603387 31784296
3504C1784296M04572j55396k53101m01475l65722k28303j31097j93245l50298
$$ 31784296 32188868 32033472 31780371 31378896 31013174 30784871 30653774 30460529 30110231
3495C0110231j24534j15085P3476L75865J97330K9157L6323K14977k10018J45983
$$ 30110231 29985697 29870612 29944088 30319953 30517283 30546440 30582763 30797740 30587722 30733705
3485C0733705M2680M39857P41414J031413J385486J405066J684997J886990L142751
$$ 30733705 30776385 31216242 31957656 32989069 34374555 35779621 37464618 39351608 42494359
3476D2494359M021716L541722K074439k29504k927099m053476l902352l227627
$$ 42494359 46516075 50057797 52132236 51902732 48975633 44922157 41019805 37792178
3468C7792178k271385j769301j510514j122536n19127o79007m1857M64038O80222
$$ 37792178 35520793 33751492 32240978 31118442 30599315 29920308 29878451 30342489 31022711
3459C1022711Q59055J128608J145880J543640J988452K144097K060287L172551
$$ 31022711 31881766 33010374 34156254 35699894 37688346 39832443 41892730 45065281
3451D5065281L492280M524261N672666P120717R229451J1216396J4377586J4619972
$$ 45065281 48557561 53081822 58754488 65875205 75104656 86321052 100698638 115318610
3443A15318610J2236988N702917k027526q250849j0603931j0103783q555461p306023
$$ 115318610 127555598 133258515 131230989 122980140 112376209 102272426 93716965 86410942
3435H6410942o070461n188397l805019k716277j967968j391104j139639n56453
$$ 86410942 80340481 75152084 71347065 68630788 66662820 65271716 64132077 63575624
3427F3575624n92080J57273Q49457J655818K938717L999722M711782N369662P331878
$$ 63575624 62983544 63140817 63990274 65646092 68584809 72584531 77296313 82665975 89997853
3418H9997853Q475415R854084J0343131J1168809J1341690R934749P442341M006534
$$ 89997853 98473268 108327352 118670483 129839292 141180982 151115731 158558072 162564606
3410A62564606j376108p178417j0990665j2516777j2128730j1353905j0182158
$$ 162564606 161188498 154010081 143019416 130502639 118373909 107020004 96837846
3403I6837846q888065p529841o373862n479565m288546l421037k894324j924279
$$ 96837846 87949781 80419940 74046078 68566513 64277967 60856930 57962606 56038327
3395E6038327j944583j222746j034983r32724l98884l98751m54004m04285M3334
$$ 56038327 54093744 52870998 51836015 50903291 50504407 50105656 49651652 49247367 49290701
3386D9290701l48641k36775k29051J22243R0196Q8460L35946Q65992J308760J216171
$$ 49290701 48942060 48705285 48476234 48598477 48688673 48777133 49113079 49979071 51287831 52504002
3376E2504002J751648J648243K672215K767758K996970L707078L571148L631569
$$ 52504002 54255650 55903893 58576108 61343866 64340836 68047914 71619062 75250631
3368G5250631L238929K606642K234218J875204R77568J026976P8753m36000j098265
$$ 75250631 78489560 81096202 83330420 85205624 86183192 87210168 87288921 86852921 85754656
3359H5754656j931818k315744k959064k721091k376889j814448j433661o62663
$$ 85754656 83822838 81507094 78548030 75826939 73450050 71635602 70201941 69539278
3351F9539278o01847m74791M51870P17629J090291J514222J456248J873633K324218
$$ 69539278 68937431 68462640 68914510 69632139 70722430 72236652 73692900 75566533 77890751
3342G7890751K304364K402695L129936L116896L673490L662183M386228M983477
$$ 77890751 80195115 82597810 85727746 88844642 92518132 96180315 100566543 105550020
3334A05550020N353491N986499P504857Q945587R870675J1549189J4044235J6550627
$$ 105550020 110903511 116890010 124394867 133340454 143211129 154760318 168804553 185355180
3326A85355180J9457141K1668923K4064693K5377994K4692911K2698838J7856167
$$ 185355180 204812321 226481244 250545937 275923931 300616842 323315680 341171847
3319C41171847J0995255M001767k910295q415796j2151491j4205289j4303554
$$ 341171847 352167102 356168869 353258574 344842778 332691287 318485998 304182444
3312C04182444j3548785j1105599q254450m829157J83860N443567J1675476J7942980
$$ 304182444 290633659 279528060 271273610 266444453 266628313 272071880 283747356 301690336
3304C01690336K4203911K6801142K6421560J9442873P070808o542734j9185041
$$ 301690336 325894247 352695389 379116949 398559822 405630630 399087896 379902855
3297C79902855k6997838l0367175l0146393k7234683k3895951k0419854j6297392
$$ 379902855 352905017 322537842 292391449 265156766 241260815 220840961 204543569
3290B04543569j3486221j0636633p788928n146799l280042j733496l11176K123547
$$ 204543569 191057348 180420715 172631787 167484988 164204946 162471450 162160274 164283821
3282A64283821L511355N189649O329360P600439Q741759Q863598P518326N210589
$$ 164283821 167795176 172984825 179314185 186914624 195656383 204519981 212038307 217248896
3274B17248896K291501j095614m171285o618499q066404q934597q829683q477081
$$ 217248896 219540397 218444783 214273498 207654999 199588595 190653998 181824315 173347234
3266A73347234q383093q169212q056219p043899o451817n735527n110808m409093
$$ 173347234 164964141 156794929 148738710 141694811 135242994 129507467 124396659 119987566
3258A19987566m196816l565361l460768l133297k593343k632585k321265k105637
$$ 119987566 115790750 112225389 108764621 105631324 103037981 100405396 98084131 95978494
3250I5978494j591141j829977j184453l35433L4854P44429J430963K006256K789922
$$ 95978494 94387353 92557376 91372923 91037490 91072344 91816773 93247736 95253992 98043914
3241I8043914L314410L143314L935852M309626M557263M752189N320498N523975
$$ 98043914 101358324 104501638 108437490 112747116 117304379 122056568 127377066 132901041
3233A32901041O220010P243069Q169696J0074370J1824942J3697797J5546792
$$ 132901041 139121051 146364120 154533816 164608186 176433128 190130925 205677717
3226B05677717J6818818J7744302J7476593J6777426J4154430R671137M192528
$$ 205677717 222496535 240240837 257717430 274494856 288649286 298320423 302512951
3219C02512951j934304p647083j3094787j6410200j8692192j9093947j8254453
$$ 302512951 300578647 292931564 279836777 263426577 244734385 225640438 207385985
3212B07385985j8192611j6644184j4523834j3043349j1203242r603785q554063
$$ 207385985 189193374 172549190 158025356 144982007 133778765 124174980 115620917
3205A15620917p257082n608958n139268m226684l278856k939624k408148j930892
$$ 115620917 108363835 102754877 97615609 93388925 90110069 87170445 84762297 82831405
3197H2831405j221674r86028p31037m45290Q29P90984O28526J469040K252296
$$ 82831405 81609731 80623703 79892666 79447376 79448205 80239189 80867715 82336755 84589051
3188H4589051K618656L406151M306210N299477O440265P840941R355090J0469693
$$ 84589051 87207707 90613858 94920068 100219545 106659810 114500751 123855841 134325534
3180A34325534J1330269J1828814J1188710R355188N987183J619772k609124o892652
$$ 134325534 145655803 157484617 168673327 178028515 184015698 185635470 183026346 176133694
3172A76133694r948750j1593061j2022857j1877798j0585722r852779q666947
$$ 176133694 166184944 154591883 142569026 130691228 120105506 110252727 101585780
3165A01585780p080216o316689n598237l839503l150898k401599j756672j625522
$$ 101585780 94505564 88188875 82590638 78751135 75600237 73198638 71441966 69816444
3157F9816444n75388l62377L38706P26676K84906M14379J85956L62232q2935k94199
$$ 69816444 69241056 68878679 69217385 69944061 70228967 70643346 70829302 71191534 71108599 70814400
3147G0814400K79184M12387J667276K224496K901563L912173M159569L818897
$$ 70814400 71093584 71505971 73173247 75397743 78299306 82211479 86371048 90189945
3139I0189945L937000L787343L159743L604604L968593N140739O043194Q439020
$$ 90189945 94126945 97914288 101074031 104678635 108647228 113787967 119831161 128270181
3131A28270181J1545828J4391678J8939680K3293402K7531911L0386481K9338333
$$ 128270181 139816009 154207687 173147367 196440769 223972680 254359161 283697494
3124B83697494K4181667J5140730K985648r141851j8536824k4191597k6232451
$$ 283697494 307879161 323019891 326005539 316863688 298326864 274135267 247902816
3117B47902816k5675948k4054463k1544319j8661893j5290148j2606008j0343142
$$ 247902816 222226868 198172405 176628086 157966193 142676045 130070037 119726895
3110A19726895q703879p100991n670473m764087l578313k888551j292515o12656
$$ 119726895 111023016 103922025 98251552 93487465 89909152 87020601 85728086 85115430
3102H5115430j59224J508808K186378L737680N484320O605326P888176Q942498
$$ 85115430 84956206 86465014 88651392 92389072 97873392 104478718 112366894 121309392
3094A21309392Q675252P397121N082906K081117j248173m726489p218805q508301
$$ 121309392 129984644 137381765 142464671 144545788 143297615 138571126 131352321 122844020
3086A22844020r060365r069878r272358q401916p311903p161525o018099m923800
$$ 122844020 113783655 104713777 95441419 87039503 79727600 72566075 66547976 61624176
3078F1624176n082152l757713k998706k817713k071697j515646j411657j081860
$$ 61624176 56542024 52784311 49785605 46967892 44896195 43380549 41968892 40887032
3070D0887032m98001j75459k67553J8789j12487k13868m46164r14678j161896
$$ 40887032 40389031 40213572 39946019 39964808 39852321 39638453 39192289 38277611 37115715
3061C7115715j822125j997579j891269k325683j950337j630813j260066j279728
$$ 37115715 35293590 33296011 31404742 29079059 27128722 25497909 24237843 22958115
3053B2958115j310445o98529p62927m13612r82825m47614m38375o51672n43844
$$ 22958115 21647670 20949141 20186214 19772602 18789777 18342163 17903788 17252116 16708272
3044A6708272m44153m46188m10583j66482j74665n97857l63154k95842k48449
$$ 16708272 16264119 15817931 15407348 15240866 15066201 14468344 14105190 13809348 13560899
3035A3560899Q9167n53873o44872m48893l57692J41120j74631k45943j48647m23453
$$ 13560899 13650066 13096193 12451321 12002428 11644736 11785856 11611225 11365282 11216635 10793182
3025A0793182o28047k9807j9485R7157j4318k05452p1509J87798L0691k07329
$$ 10793182 10165135 10135328 10115843 10213000 10198682 9993230 9921721 10109519 10140210 9932881
3015I932881p9429n95624k94933R8646n60248L1230K7814m98454k71895j70585
$$ 9932881 9853452 9257828 8962895 9061541 8501293 8532523 8560337 8061883 7789988 7619403
3005G619403k60429j86256J66536j64801l15322J16943J03240k96716p2205r4315
$$ 7619403 7358974 7172718 7339254 7174453 6859131 6976074 7079314 6782598 6710393 6616078
2995F616078j79214m63477J28668j01578m7856K16519K8976P7408m48419k93074
$$ 6616078 6436864 5973387 6102055 6000477 5952621 6169140 6198116 6275524 5827105 5534031
2985E534031K34723j71291k57237l25159L99672J39746K80771l77972k90740l50100
$$ 5534031 5768754 5597463 5340226 5015067 5414739 5554485 5835256 5457284 5166544 4816444
2975D816444O0567k142l02696K50937M1961k46170n20885K40186O8380R8971m67454
$$ 4816444 4877011 4874869 4572173 4823110 4865071 4618901 4098016 4338202 4406582 4505553 4038099
2964D038099k16589N6522N9163L2393K13779k10770J74094p2032K925L4709R915
$$ 4038099 3821510 3878032 3937195 3969588 4183367 3972597 4146691 4074659 4077584 4112293 4122208
2953D122208J35658J41794K35228m73237j70359j42859J14840o106J07771k47495
$$ 4122208 4257866 4399660 4634888 4161651 3991292 3848433 3963273 3957167 4064938 3817443
2943C817443j86726K45902o4772P2959J02523k5430j12882J54970j2124j8808
$$ 3817443 3630717 3876619 3811847 3884806 3987329 3961899 3849017 4003987 3991863 3973055
2933C973055j08731p6259o2117j68236p3419L2487m37621l2738J13878p8381l43035
$$ 3973055 3864324 3788065 3725948 3557712 3484293 3516780 3079159 3046421 3160299 3081918 2738883
2922B738883q2045j04683o362j9971k26527o1165j12053J63812L92623M3162k15077
$$ 2738883 2656838 2552155 2545793 2525822 2299295 2238130 2126077 2289889 2682512 2725674 2510597
2911B510597j62616o9166K98277j16601j76544m3890j76531J28684J71518j43288
$$ 2510597 2347981 2278815 2577092 2460491 2283947 2240057 2063526 2192210 2363728 2220440
2901B220440q4295J26435J64885j54186k89588J1105J05709J47773K90838j53818
$$ 2220440 2136145 2262580 2427465 2273279 1983691 1994796 2100505 2248278 2539116 2385298
2891B385298n44588J46748J46376j31406L20661K6063k89883k55713K24748R9361
$$ 2385298 1840710 1987458 2133834 2002428 2323089 2349152 2059269 1803556 2028304 2127665
2881B127665M1288j38869l19428J68953J83995J66607j93564j82261l3421k50029
$$ 2127665 2168953 2030084 1710656 1879609 2063604 2230211 2036647 1854386 1820965 1570936
2871A570936J46557j31844j85072j15660L08325J02612j03380k89490J86282o0025
$$ 1570936 1717493 1585649 1400577 1284917 1593242 1695854 1592474 1302984 1489266 1429241
2861A429241J74763j4299m6449j36699L46141Q6229l51958J20273n0652j87824
$$ 1429241 1604004 1589705 1543256 1406557 1752698 1838927 1486969 1607242 1556590 1368766
2851A368766J45468J94067n3315j69863k66575J02469J90049K05015J27958j17757
$$ 1368766 1514234 1708301 1654986 1485123 1218548 1321017 1511066 1716081 1844039 1726282
2841A726282J93803L10064J12176L19534P2000k8420k52946j94177P1520m3575
$$ 1726282 1920085 2230149 2342325 2661859 2733859 2705439 2452493 2258316 2329836 2286261
2831B286261k94828k33413j17607j37941k28320K58586J22685q668k71296K18062
$$ 2286261 1991433 1758020 1640413 1502472 1274152 1532738 1655423 1646755 1375459 1593521
2821A593521K57968j03343J04702k08917k65159N3615k81270J28972o2728J12546
$$ 1593521 1851489 1748146 1852848 1643931 1378772 1432387 1151117 1280089 1217361 1329907
2811A329907M17204j18161O4061M16617k31227l75517L998k32936Q9565M44471
$$ 1329907 1747111 1628950 1693011 2109628 1878401 1502884 1506882 1273946 1363511 1807982
2801A807982l20676r2043n776K53017m50274k89117K00460n1427m00763J22700
$$ 1807982 1487306 1395263 1389487 1642504 1192230 903113 1103573 1052146 651383 774083
2791G74083K19698k32251Q3931l7283L9611K27254j46019k68506L5342P1004j91119
$$ 774083 993781 761530 845461 808178 847789 1075043 929024 660518 695860 766864 575745
2780E75745j2498K45112j68377k07950J67864M4177K9383Q9871k97914J48047
$$ 575745 563247 808359 639982 432032 599896 644073 673456 763327 465413 613460
2770F13460J76644J98220k76601J39330j21447k36212J04223N23458j54837o78065
$$ 613460 790104 988324 711723 851053 729606 493394 597617 1121075 966238 288173
2760B88173M5746j27010R1733K07578j18179k58261L91325n5948p1886K90834
$$ 288173 333919 206909 298642 506220 388041 129780 521105 465157 393271 684105
2750F84105k34574k02113j26448J53416J04817J38912n41733K09549N23148p5748
$$ 684105 449531 247418 120970 274386 379203 518115 -23618 185931 709079 633331
2740F33331j27989K30817J45411k98186q1579j13787o6643J34318R8488j67127
$$ 633331 505342 736159 881570 583384 501805 388018 321375 455693 554181 387054
2730C87054K79615K33233n3127j16242k10833l0045P804j74984K19273J21058
$$ 387054 666669 899902 846775 730533 519700 489655 497459 322475 541748 662806
2720F62806l5333q6881N5389q5310J85450J13321j56210l89699J30765K02092
$$ 662806 627473 540592 595981 510671 696121 809442 653232 263533 394298 596390
2710E96390j31071j0132J4408j15353k25530o2993J98537L34728k61880J88752
$$ 596390 465319 455187 469595 354242 128712 65719 264256 598984 337104 525856
2700E25856k46774J40963K48718j11660J44272L06324l29779n3592O5042l81724
$$ 525856 279082 420045 668763 557103 701375 1007699 677920 624328 689370 307646
2690C07646J33533N3640j48848J57636R5304j01401k74831j82231J26027L55313
$$ 307646 441179 494819 345971 503607 598911 497510 222679 40448 166475 521788
2680E21788K0456j03057k97412K98647J62878L2037n48275N4475L024p356K68077
$$ 521788 542244 439187 141775 440422 603300 635337 87062 141537 144561 137205 405282
2669D05282p8725M25225j07223j59174r9667J513j69837K30291K57484l67905
$$ 405282 326557 751782 644559 485385 385718 387231 217394 447685 705169 337264
2659C37264J9356K306j08219L9781k09210J1653o7903k04450J18130M30380K2987
$$ 337264 356620 358926 250707 290488 81278 92931 25028 -179422 -61292 369088 392075
2648C92075L68043k96093j62320J95100P3724n4472O2675l7213j16168J8933r9373
$$ 392075 760118 464025 301705 496805 570529 516057 578732 541519 425351 444284 344911
2637C44911p7844Q207j59222K00798K70431l51883p7669M50527j41269j49651
$$ 344911 267067 275274 116052 316850 587281 235398 157729 608256 466987 317336
2627C17336J49750l66889K22162p149k22767L45113k26102j71918m8013K09170
$$ 317336 467086 100197 322359 315210 92443 437556 211454 39536 -8477 200693
2617B00693j24290o9531O4958J92285L43377J63219K03425K6087N10743J55051
$$ 200693 76403 6872 71830 264115 607492 770711 974136 1000223 1510966 1666017
2607A666017j73082k27228k71562L31004k21440k67855k17045L18135n2664j61312
$$ 1666017 1492935 1265707 994145 1325149 1103709 835854 618809 936944 884280 722968
2597G22968J55263k85539j58148l88546K07835K87382J70561j53431N3301m5842
$$ 722968 878231 592692 434544 45998 253833 541215 711776 558345 611646 565804
2587E65804j5228K14887j83682J26690k6744j99229j04694J49818l64725p0843
$$ 565804 550576 765463 581781 708471 681727 482498 377804 527622 162897 92054
2577I2054L49392J92744L7262k55469J39239K0886n0245q7006n0534K03984L2973
$$ 92054 441446 634190 671452 415983 555222 576108 525863 438857 388323 592307 625280
2566F25280m79435j45802J17583K98502m25556o3374K38125O0027j66638L153
$$ 625280 145845 43 117626 416128 -9428 -72802 165323 225350 58712 61865
2556F1865K68666j56699J015m5407j36961J57476J41831j40234J20653K04461
$$ 61865 330531 173832 174847 129440 -7521 149955 291786 151552 272205 476666
2546D76666M2419l63053R4135R6431J06977l9655O4902J51126j06425J66750j33144
$$ 476666 519085 156032 250167 346598 453575 413920 478822 629948 523523 690273 557129
2535E57129j27362K7870k66057J74397L54530j13179J24974k2310k737k68653
$$ 557129 429767 457637 191580 365977 720507 607328 732302 709992 707255 438602
2525D38602J84766m0460l13915j1842k7039J747K19487J57535l299m46682O6521
$$ 438602 623368 582908 268993 257151 230112 231859 451346 608881 605582 158900 225421
2514B25421J25182m46733L79329j91239L2523L07978J9762k23379L8755O4646
$$ 225421 350603 -96130 283199 91960 124483 432461 452223 228844 267599 332245
2504C32245o1506K20516K99373k8295j41534J70438j58290l84961J92730L10948
$$ 332245 270739 491255 790628 762333 620799 791237 632947 247986 440716 751664
2494G51664k66848M4655K40941P4746p1035j35297J33688k09996r6905r4159O4859
$$ 751664 484816 529471 770412 845158 774123 638826 772514 562518 465613 371454 436313
2483D36313J12439k32259j04026N2738L25031R7432L5993k33237K1710k8925j99244
$$ 436313 548752 316493 212467 265205 590236 687668 723661 490424 512134 483209 283965
2472B83965k43270J02316R2142N40792q9422j14806K99095M5533k56135j34486
$$ 283965 40695 143011 235153 775945 686523 571717 870812 916345 660210 525724
2462E25724j70364j0605J69409j27572J29866L36008J43731j81506k26945l87450
$$ 525724 355360 344755 514164 386592 516458 852466 996197 814691 587746 200296
2452B00296L44158K82235j30265J09710K17586j53235k44790K62781K00976o5049
$$ 200296 544454 826689 696424 806134 1023720 870485 625695 888476 1089452 1024403
2442A024403M53j14762J09586n8254K76322J63073q5118J20761j92914j35141
$$ 1024403 1024856 910094 1019680 961426 1237748 1400821 1315703 1436464 1243550 1108409
2432A108409m28025J5803L36426L37808K69369m89523J16423r2216J9122K27033
$$ 1108409 680384 696187 1032613 1370421 1639790 1150267 1266690 1174474 1193596 1420629
2422A420629N2892k04509J87093K70940p6050O7124J3008l43442r4423N12261
$$ 1420629 1473521 1269012 1456105 1727045 1650995 1718119 1731127 1387685 1293262 1805523
2412A805523L28113j28339r74j16770O9182k2903Q8647j03995p7137K15664M901
$$ 1805523 2133636 2005297 2004323 1887553 1956735 1933832 2022479 1918484 1841347 2057011 2061912
2401B061912o8080M6405j21375K80177K6354R5563M61529k64919j6023L3119r9109
$$ 2061912 1993832 2040237 1918862 2199039 2225393 2320956 2782485 2517566 2501543 2534662 2435553
2390B435553P5351L14150L93299j02941J65730K25877K88883o8053k49052K63802
$$ 2435553 2510904 2825054 3218353 3115412 3281142 3507019 3795902 3727849 3478797 3742599
2380C742599J77935J24274L3015L48162j98404P3987K28630P8490N04584M92400
$$ 3742599 3920534 4044808 4077823 4425985 4227581 4301568 4530198 4608688 5113272 5605672
2370E605672J31919N20140o0147P5371K60672N91911L37596N08200Q96959J268065
$$ 5605672 5737591 6257731 6197584 6272955 6533627 7125538 7463134 7971334 8868293 10136358
2360A0136358J825641J992434K260478K883315K222868K097323J206280N90348
$$ 10136358 11961999 13954433 16214911 19098226 21321094 23418417 24624697 25215045
2352B5215045J028810J664263K991861M299524N924903Q845092J3609332K5312597
$$ 25215045 26243855 27908118 30899979 35199503 41124406 49969498 63578830 88891427
2344H8891427M3806080N8172336O1556829M1664081L330742l3164672m7750905
$$ 88891427 132697507 190869843 252426672 294090753 297421495 264256823 216505918
2337B16505918m4121626l5006748k6735969k2901539j8814896j4230819j0485704
$$ 216505918 172384292 137377544 110641575 87740036 68925140 54694321 44208617
2330D4208617o849127m239381k908906j965319j493694j701522j852368k476680
$$ 44208617 37359490 33120109 30211203 28245884 26752190 25050668 23198300 20721620
2322B0721620k424332j983228j438078j004069o64136q08739q25136r66825n80837
$$ 20721620 18297288 16314060 14875982 13871913 13207777 12399038 11573902 10607077 10026240
2313A0026240l12048l09750n65157p99100j05378j47780l31118m28736m8430k67647
$$ 10026240 9714192 9404442 8839285 8040185 7934807 7787027 7455909 7027173 6978743 6711096
2303F711096j91684o11612k43634M0290j09327m06174n10264j4003l2440j79269
$$ 6711096 6519412 5907800 5664166 5704456 5595129 5188955 4678691 4664688 4632248 4452979
2293D452979q3271k31944j39584N3456n8243k9089k01658j28907j3260J30003
$$ 4452979 4369708 4137764 3998180 4051636 3993393 3964304 3762646 3633739 3620479 3750482
2283C750482r2061j51093r7018k21229l04690l766O8118k75196K26437l59254
$$ 3750482 3658421 3507328 3410310 3189081 2884391 2880625 2948743 2673547 2899984 2540730
2273B540730R728K51797k36305k75932j98062J99022K19769m48567K19118N5121
$$ 2540730 2550458 2802255 2565950 2290018 2091956 2290978 2510747 2062180 2281298 2336419
2263B336419j52618m4480r6524J64231l95498O3641R3100K65282j28172l66311
$$ 2336419 2183801 2139321 2042797 2207028 1811530 1875171 1968271 2233553 2105381 1739070
2253A739070j61741R8197M12871k24867l14684j79714k60673J26849J02702N716
$$ 1739070 1577329 1675526 2088397 1863530 1548846 1369132 1108459 1235308 1338010 1343726
2243A343726j8315k18936j02686K20455j8392K41937l16339j43360Q8518R0402
$$ 1343726 1325411 1106475 1003789 1224244 1205852 1447789 1131450 988090 1076608 1167010
2233A167010R4334p5699k54100K67643K36491j79043k92060l19381K49767j07477
$$ 1167010 1261344 1185645 931545 1199188 1435679 1256636 964576 645195 894962 787485
2223G87485J04302k00907K75617J71466j84227K30972j35648J3463j99791Q6270
$$ 787485 891787 690880 966497 1137963 953736 1184708 1049060 1062523 862732 949002
2213I49002k0627J19534j32811m5855K5737R1105J37962m18366M86899j74522
$$ 949002 928375 1047909 915098 869243 894980 986085 1124047 705681 1192580 1018058
2203A018058k60724N3342m05155J75914N8894q3724J34341j02385j05785n0990
$$ 1018058 757334 810676 405521 581435 640329 556605 690946 588561 482776 431786
2193D31786Q2358m423l43160K0376K53894l57997o6226L15713j55806R2079o491
$$ 431786 514144 509721 166561 186937 440831 82834 16608 332321 176515 268594 262103
2182B62103P9589Q2584k30558N581k76805J22177J32934L39193k14016K39374
$$ 262103 341692 424276 193718 199299 -77506 44671 177605 516798 302782 542156
2172E42156p2283p4159l2334j6603Q5436k14405j49866K7536L95627k6608j95839
$$ 542156 469873 395714 363380 346777 432213 217808 67942 95478 491105 464497 268658
2161B68658k27820J59431P5499k4601J19256o9212L2890k2313k4535J55085j46159
$$ 268658 40838 200269 275768 251167 370423 301211 334101 311788 287253 442338 296179
2150B96179j98845L5522J00665l8658J63778N2110L4829J0337n5923j9196j04458
$$ 296179 97334 132856 233521 194863 358641 410751 445580 455917 399994 380798 276340
2139B76340j80118O7105m15305K68268L0032L76498M8859l44148k2380N3708n652
$$ 276340 96222 163327 -251978 16290 46322 422820 471679 127531 105151 158859 153207
2128A53207J01808K50995l1303n0965l99188l2152j34916K35279Q0322j68198
$$ 153207 255015 506010 474707 423742 24554 -7598 -142514 92765 173087 4889
2118D889L12589K70626L49789m80282M0766k9304p714k55822O2437Q5378m51863
$$ 4889 317478 588104 937893 457611 498377 469073 461359 205537 267974 353352 -98511
2107i8511J3685L09487L3130l43516J37210k30708K72227n9609J9525L8271L45441
$$ -98511 -84826 224661 257791 -85725 51485 -179223 93004 33395 52920 91191 436632
2096D36632R6533j15608k95761j10443J43978j78j80904J46949K31732p5114j01079
$$ 436632 533165 417557 121796 11353 155331 155153 -25751 121198 352930 277816 176737
2085A76737j42069l11123K09081K96278m6816j37649j80458K13620M6215M71668
$$ 176737 34668 -276455 -67374 228904 182088 44439 -136019 77601 123816 595484
2075E95484K22766K76019J55082J24250K07045j57637l0907j38911m79886k0842
$$ 595484 818250 1094269 1249351 1373601 1580646 1423009 1392102 1253191 773305 752463
2065G52463K88443l78893j43694R927O9561l9194j65276k164j91839r8505J03425
$$ 752463 1040906 662013 518319 528246 597807 558613 393337 391173 199334 100829 204254
2054B04254K5817o6135L1458l20993R628J62372K64566o1281P3428j44741k59942
$$ 204254 230071 163936 195394 -125599 -115971 46401 310967 249686 323114 178373 -81569
2043h1569K48313r8367k8978k15703L78710J68021L479l48096J72967k88037l04151
$$ -81569 166744 68377 39399 -176304 202406 370427 373906 25810 198777 -89260 -393411
2032c93411N7567K19200k229K10597P8482j1595Q7859j21044K3817j27572J35115
$$ -393411 -335844 -116644 -118873 91724 170206 158611 246470 125426 149243 21671 156786
2021A56786q6141J07237L5643k43639k0698L13748K2656r3797j34943q3337L97398
$$ 156786 70645 177882 213525 -30114 -50812 262936 285592 191795 56852 -26485 370913
2010C70913l7156m55563j21784k55252M24824J55047o0926R5020m8788l5594J08916
$$ 370913 333757 -121806 -243590 -498842 -74018 81029 20103 115123 66335 30741 139657
1999A39657J26481o3526l15537m7719M1893m9052k3398J79856R3042J25861j71530
$$ 139657 266138 202612 -112925 -160644 -118751 -167803 -191201 -11345 81697 207558 36028
1988C6028J40054j01802K28122j82463j6705l50557l5389J22868K83466J36244
$$ 36028 176082 74280 302402 119939 103234 -247323 -282712 -159844 123622 259866
1978B59866k32399j29277q9758K15398j43309j32079l370M6140R6642N1428J1466
$$ 259866 27467 -101810 -191568 23830 -119479 -251558 -254928 -208788 -112146 -60718 -49252
1967d9252M46875K26759k67928n61753K94948j68987K5859j965K37267N5076n3493
$$ -49252 397623 624382 356454 -205299 89649 -79338 -53479 -55444 181823 236899 183406
1956A83406J83477n2682l12664k1782j05270m8337J82928J90726K92103j86708
$$ 183406 366883 314201 1537 -20245 -125515 -173852 9076 199802 491905 305197
1946C05197j58903j72195J25500K67938M3628k23241l49939l3139K61244k11200
$$ 305197 146294 -25901 99599 367537 411165 187924 -162015 -195154 66090 -145110
1936a45110j42474L02821J07801j75055o3160o232P5303J41604J73464K33937
$$ -145110 -287584 15237 123038 -52017 -115177 -121409 -46106 95498 268962 502899
1926E02899j8946k8560m26005k09597L9916O1582K2442L62537j62195k16801J34255
$$ 502899 483953 455393 29388 -180209 -140293 -78711 -56269 306268 144073 -72728 61527
1915F1527K18905j68889j02502O3181q9196j0184q6739k34018L58605Q2544j49355
$$ 61527 280432 111543 9041 72222 -16974 -27158 -113897 -347915 10690 93234 -56121
1904e6121J11751K85605P1166n74438R889K5319P309K17430K00532k37550j42830
$$ -56121 55630 341235 412401 -162037 -152148 -126829 -119520 97910 298442 60892 -81938
1893h1938k51525J23075L57741k07912J99629J22733j21531j13836J59106j86963
$$ -81938 -333463 -210388 147353 -60559 139070 261803 140272 26436 185542 -1421
1883a421k35962l7447p3913J85678L74773J22017l30702j74542j62372J14537
$$ -1421 -237383 -274830 -348743 -163065 211708 333725 3023 -171519 -333891 -219354
1873b19354K63675r5939J16520L6216j87781J93793M0670L95880j73094j45412
$$ -219354 44321 -51618 64902 101118 -86663 107130 147800 543680 370586 225174
1863B25174k1019j07272j48600L0418J72041n8010q8029k9271j34407Q6408P7590
$$ 225174 204155 96883 -51717 -21299 150742 92732 4703 -24568 -158975 -72567 5023
1852E023l05109J47449M0341p3552J77620K7172k31973k76110K85261p3350K65872
$$ 5023 -300086 -152637 -112296 -185848 -8228 18944 -213029 -489139 -203878 -277228 -11356
1841a1356K28322k23615m30195K36685O964P8817J87615P5867o4494j71357J12570
$$ -11356 216966 -6649 -436844 -200159 -193195 -114378 73237 149104 84610 -86747 25823
1830B5823J08233j16033j35512K5846m88654J43699K19566k38138j37442K74311
$$ 25823 134056 18023 -117489 -91643 -580297 -436598 -217032 -455170 -592612 -318301
1820c18301Q0124k0653k2479R5944K55077J98189j16241O615K2618Q5604J02157
$$ -318301 -238177 -258830 -281309 -185365 69712 267901 151660 158275 180893 266497 368654
1809C68654l01353L5762J01473k26505J02848q2211K31911L26246j58486k80221
$$ 368654 67301 103063 204536 -21969 80879 -1332 230579 556825 398339 118118
1799A18118J24528j54576O4258k51375j60340J41652K73170J5642k03916J58738
$$ 118118 242646 88070 152328 -99047 -259387 -117735 155435 171077 -32839 125899
1789A25899j25429K04757J68774j41758n6876Q279k90584k02237L09819k41711
$$ 125899 470 205227 374001 232243 175367 183646 -106938 -309175 644 -241067
1779b41067r50J41068l89410J92117M42435Q8342r9654o2382k45780r6346P3994
$$ -241067 -242017 -100949 -490359 -298242 144193 232535 132881 70499 -175281 -271627 -197633
1768a97633L90543k4663k9829p6484k01195J22235j9027K4784J91449k97073J20954
$$ -197633 192910 168247 138418 61934 -139261 -17026 -36053 -11269 180180 -116893 4061
1757D061j56831l4415N8466P2925J8570J44934n2942k8671q2347l18643J63271
$$ 4061 -152770 -187185 -128719 -55794 -37224 107710 54768 26097 -56250 -374893 -211622
1746b11622P8784K52756k0119k60809j61530J85725K18060J03715l46587K46423
$$ -211622 -132838 119918 99799 -161010 -322540 -136815 81245 184960 -161627 84796
1736H4796P830j83751k26130M26481N7089k07735l058J20046M6256r1269L0783
$$ 84796 92626 -91125 -317255 109226 166315 -41420 -44478 75568 121824 30555 61338
1725F1338l7784o9474K24997J08565J76907j02857k63797Q4894m23584J05320
$$ 61338 23554 -45920 179077 287642 464549 361692 97895 182789 -240795 -135475
1715a35475M4129k5361O0247l21811q566K54745j53120J17993K25824n9450n01
$$ -135475 -91346 -116707 -56460 -378271 -386837 -132092 -285212 -167219 58605 -845 -1346
1704a346k26736P6133J31206o2606O5407r3776j62191j22595J16217J6863K02199
$$ -1346 -228082 -151949 -20743 -83349 -17942 -111718 -273909 -396504 -280287 -263424 -61225
1693f1225M2538K346N8812K56225j50040p7303j33569J18106k70400k85563K69692
$$ -61225 -18687 -16341 42471 298696 148656 71353 -62216 55890 -214510 -500073 -230381
1682b30381j59287M43637j52921J2663J10749j63497J25105J26834k59357N8791
$$ -230381 -389668 53969 -98952 -86289 24460 -139037 -13932 112902 -146455 -87664
1672h7664K00385l513k54473j72345J05115K50645k13245q6672J48507J89596
$$ -87664 112721 109208 -145265 -317610 -212495 38150 -175095 -261767 -113260 76336
1662G6336J7462p6071L1931k45254J68456l420J613J8942r2468J13853K32729
$$ 76336 93798 17727 49658 -195596 -27140 -30560 -28947 -10005 -102473 11380 244109
1651B44109m99020r2617j01228j7163K91138j29873k22815O8638M06842J0288
$$ 244109 -254911 -347528 -448756 -465919 -174781 -304654 -527469 -458831 -51989 -41701
1641d1701l3098K0778l4856k0203m1256L31174k89277P4469L73277r7714n3021
$$ -41701 -74799 -54021 -88877 -109080 -150336 180838 -108439 -33970 339307 241593 188572
1630A88572k12197k52465J50937O6970K1840k60960L6536J67468M8392J86859
$$ 188572 -23625 -276090 -125153 -58183 -36343 -297303 -260767 -93299 -44907 141952
1620A41952k0553k8938j53115m60730l7732J71532O81198Q0030k77587k06257
$$ 141952 121399 92461 -60654 -521384 -559116 -387584 293614 373644 96057 -110200
1610a10200K04580j68869n38250J51992M49296K35729J42664m3528j7658m6846
$$ -110200 94380 -74489 -612739 -460747 -11451 224278 366942 323414 305756 258910
1600B58910j47250j65310j62362O3834l7019J41168k12202K63662L8937O704K2928
$$ 258910 111660 -53650 -216012 -152178 -189197 -48029 -260231 3431 42368 49072 72000
1589G2000k02297R5754J09150k23754k2769j90477L07441K57295l4579l47191
$$ 72000 -130297 -34543 74607 -149147 -171916 -362393 -54952 202343 167764 -179427
1579a79427j02545M48350m6259n6212j88126N9827J37523l06666Q1300j24637
$$ -179427 -281972 166378 120119 63907 -124219 -64392 73131 -233535 -152235 -276872
1569b76872n285R4879m0887j25687L48541j96210O0386K76446N0795j74551j16010
$$ -276872 -282157 -187278 -228165 -353852 -5311 -201521 -141135 135311 186106 11555 -104455
1558a04455J2744K77956L390J5095J63558k57427L0982k04782o20N1502j99117
$$ -104455 -91711 186245 189635 204730 368288 110861 141843 -62939 -63559 -12057 -211174
1547b11174Q7950K3893o5070L40544K85508j01600j93877j34388L3345m0299k83424
$$ -211174 -123224 -99331 -164401 176143 461651 360051 166174 31786 65131 24832 -258592
1536b58592N5022k11914J03991K20519L643k02628o9104M41164k68796j98922
$$ -258592 -203570 -415484 -311493 -90974 -87331 -289959 -359063 82101 -186695 -385617
1526c85617L33479k6226K9619K21291L3820j93022l12932q8751J427M45941p6603
$$ -385617 -52138 -78364 -48745 172546 206366 13344 -299588 -388339 -386912 59029 -17574
1515a7574O4348N6494J32741p555m45095N0740O0015k79511k10637O8601j16696
$$ -17574 46774 103268 236009 228454 -216641 -165901 -105886 -385397 -596034 -527433 -644129
1504f44129K17362l4316k2566K07670R629J92319J93994N356L5765n4480j73504
$$ -644129 -426767 -461083 -483649 -275979 -266350 -74031 119963 125319 161084 106604 -66900
1493f6900M6881K53963Q9810q218n29403l8826j02767J82715K20153m9207m2954
$$ -66900 -20019 233944 323754 315536 -213867 -252693 -355460 -172745 47408 -1799 -44753
1482d4753j97924R1142L6150j16395L30726O8438n8657R0948j76023j82909j24410
$$ -44753 -242677 -151535 -115385 -231780 98946 167384 108727 199675 23652 -159257 -283667
1471b83667k13307j0411J43297J89919j27047J42150L1483p410k31244K58394
$$ -283667 -496974 -507385 -364088 -174169 -301216 -159066 -127583 -134993 -366237 -107843
1461a07843M0541J59854k59555j00254R9152o6303k5024R7854J05924l25805K01021
$$ -107843 -67302 92552 -167003 -267257 -168105 -234408 -259432 -161578 -55654 -381459 -180438
1450a80438k54359o8063L58626R3726n1511L05499r4339o1076j07605j37249J20801
$$ -180438 -434797 -502860 -144234 -50508 -102019 203480 109141 48065 -59540 -196789 -75988
1439g5988j05485j26114K75729k16131J09919Q0190j820k43498K61548n1989l51556
$$ -75988 -181473 -307587 -31858 -247989 -138070 -57880 -59700 -303198 -41650 -93639 -445195
1428d45195L53381O04063m56642j78745K30484k79450n6762j34138K44180J29320
$$ -445195 -91814 512249 55607 -123138 107346 -172104 -228866 -363004 -118824 10496
1418A0496k38525J94187j1442N3415O2968k43134k59321l9724J02600J85679O4787
$$ 10496 -228029 -33842 -45284 8131 71099 -172035 -431356 -471080 -368480 -182801 -118014
1407a18014M7327J15495l2524j18159k05761j01937K47750P9722k90119L04778
$$ -118014 -70687 44808 12284 -105875 -311636 -413573 -165823 -86101 -376220 -71442
1397g1442j05949P1835o6758J39572O6543r4835J28638j81577l19401L1879R4730
$$ -71442 -177391 -105556 -172314 -32742 33801 -61034 67604 -113973 -433374 -401495 -306765
1386c06765M51263J1869j01485k82121R5687j18015k55241L28850K77723J77523
$$ -306765 144498 156367 54882 -227239 -131552 -249567 -504808 -175958 101765 279288
1376B79288l94100n5576J17825K59817j69863q1834k32121k5641K68040k7305
$$ 279288 -114812 -170388 -52563 207254 37391 -44443 -276564 -302205 -34165 -61470
1366f1470L53292L9759J10236l49243l28092J38222L3775n5478R9764L84280l05621
$$ -61470 291822 331581 441817 92574 -235518 -97296 -63521 -118999 -19235 365045 59424
1355E9424M1081j60606j80098L73165M1870l48206r8002J94269P1787K17978M5289
$$ 59424 100505 -60101 -240199 132966 174836 -173370 -271372 -77103 -5316 212662 257951
1344B57951J01943r8786l88226P1829J9867J35245p1945J3489L15598k41741j24118
$$ 257951 359894 261108 -127118 -55289 -35422 99823 27878 41367 356965 115224 -8894
1333h894q9634k83092r3660K64866L18423O5235l98109k00921J75743r3402L04459
$$ -8894 -98528 -381620 -475280 -210414 108009 173244 -224865 -425786 -250043 -343445 -38986
1322c8986J33107Q0250j65600J5506j84287m797J76819k64924k24882q824K33516
$$ -38986 94121 174371 8771 24277 -160010 -164807 12012 -252912 -477794 -486618 -253102
1311b53102J60613k82388K787L04217n8907Q8023k83939j45064L17503K62947
$$ -253102 -92489 -374877 -372090 -67873 -126780 -38757 -322696 -467760 -150257 112690
1301A12690L23420j71833k32530K28624J39852q8945j70506P1318k12878n8022
$$ 112690 436110 264277 31747 260371 400223 311278 140772 212090 -788 -58810
1291e8810M3310J13212J89999k61566O0443K2349j76481j90159j23401N01284
$$ -58810 -15500 97712 287711 26145 86588 108937 -67544 -257703 -381104 120180
1281A20180K38611l78133j10259K62427J30486m4111k03058J34470J44058J51630
$$ 120180 358791 -19342 -129601 132826 263312 219201 16143 150613 294671 446301
1271D46301n3151l8035K70534k34510l32278j49624k43359M8295P6290Q6028q1821
$$ 446301 393150 355115 625649 391139 58861 -90763 -334122 -285827 -209537 -123509 -205330
1260b05330J78740K52463K5222m3324j45492l31478j2313L76667k9014N5223n3963
$$ -205330 -26590 225873 251095 207771 62279 -269199 -281512 95155 66141 121364 67401
1249F7401L1813J38643r0870q9654m56233r3678k08086k0366j2424K76021N50954
$$ 67401 99214 237857 146987 57333 -398900 -492578 -700664 -721030 -733454 -457433 93521
1238I3521J65267K00103m31746l59600J56225J11059M0081J75923j57340L74986
$$ 93521 258788 458891 27145 -332455 -176230 -65171 -25090 150833 -6507 368479
1228C68479K15396J5152j75216N2614k91938k52306Q5289K8781L54260k05067
$$ 368479 583875 599027 423811 476425 184487 -67819 17470 46251 400511 195444
1218A95444j51199o5177k31032r3119J39598J2150K73096k78337N7487L2275k76000
$$ 195444 44245 -20932 -251964 -345083 -205485 -193335 79761 -198576 -141089 -108814 -384814
1207c84814K99648J98199N0192p0729j4791j71662n972N0722n78L53088J47462
$$ -384814 -85166 113033 163225 92496 77705 -93957 -99929 -49207 -49785 303303 450765
1196D50765k24415l13305j70539K93942M9745r5193J1497o914l96600J74331q548
$$ 450765 226350 -86955 -257494 36448 86193 -9000 2497 -4417 -401017 -226686 -235234
1185b35234n3555K3800J9744k6203K08463M14199p0874J67228k23304k45123m9725
$$ -235234 -288789 -264989 -245245 -271448 -62985 351214 280340 447568 224264 -20859 -70584
1174g0584R3807K53316k66685J23176J07805k76560k07645n5326J7125k71810
$$ -70584 23223 276539 9854 133030 240835 -35725 -243370 -298696 -281571 -553381
1164e53381K86537L32103L0280j00148k20525L04799K06865l38498K537n583j02894
$$ -553381 -266844 65259 95539 -4609 -225134 79665 286530 -51968 -49431 -55014 -157908
1153a57908M4373J13100Q2376L97201l2522r0661l15963K5979K85492j2863j32750
$$ -157908 -113535 -435 81941 479142 446620 355959 39996 65975 351467 338604 205854
1142B05854J69860k3925j82678J44840j05679j99090j37187J71665P9392L8217
$$ 205854 375714 351789 169111 313951 208272 9182 -128005 43660 123052 161269
1132A61269l2386r0494J02430Q0099k16502r1104M5507J05533j63433j84979N11728
$$ 161269 128883 38389 140819 220918 4416 -86688 -41181 64352 -99081 -284060 227668
1121B27668k37944l2657j74041j80893K00087j84633K88178P7403J6169j17108
$$ 227668 -10276 -42933 -216974 -397867 -197780 -382413 -94235 -16832 -663 -117771
1111a17771J0325J05139L6576m1330j50379J43J77910J51389j35014l1748j7315
$$ -117771 -107446 -2307 34269 -7061 -157440 -157297 20613 172002 36988 5240 -12075
1100a2075J61989p4732j70552j7144j72812J08582J34253J01717L15852J06244
$$ -12075 149914 75182 -95370 -112514 -285326 -176744 -42491 59226 375078 481322
1090D81322l41671k95502l0867J77647K03070o0737N7701m15163l44767L53581
$$ 481322 139651 -155851 -186718 -9071 193999 133262 190963 -224200 -568967 -215386
1080b15386J59075l52130j54890N7452L94789K7046J21263n0253N977J13762k28344
$$ -215386 -56311 -408441 -563331 -505879 -111090 -84044 37219 -13034 -7057 106705 -121639
1069a21639P0911j94348P0239k68356J70835n7959N11753j7246L8546J99966j51928
$$ -121639 -50728 -245076 -174837 -443193 -272358 -330317 181436 164190 202736 402702 250774
1058B50774j00670l64521j48182L55153k1498k78265m8053O04949R2450n1055
$$ 250774 150104 -214417 -362599 -7446 -28944 -307209 -355262 249687 342137 291082
1048B91082j79589m9331K60929j24773l12258J15448K56276j02863j29123J29733
$$ 291082 111493 62162 323091 198318 -113940 1508 257784 154921 25798 155531
1038A55531J56956J5009L6033j85240K01374k94997m68233Q0386L2222j33454
$$ 155531 312487 327496 363529 178289 379663 84666 -383567 -303181 -270959 -404413
1028d04413L89645q7984j73241l2414J33590K53646O9222j35404j35378j09663
$$ -404413 -14768 -102752 -275993 -308407 -174817 78829 148051 12647 -122731 -232394
1018b32394L58334m1935k933J24036J62494k74081k50298m4870J25592P7861k46463
$$ -232394 125940 84005 81072 205108 367602 93521 -156777 -201647 -76055 1806 -244657
1007b44657M09851K46690r5537k62899j02182K12700k27044J2535P0083k82673
$$ -244657 165194 411884 316347 53448 -48734 163966 -63078 -50543 19540 -263133
997b63133r8585J73502J28770j99050L3477J92251j52147k74780K61575L35477
$$ -263133 -361718 -188216 -59446 -258496 -225019 -32768 -184915 -459695 -198120 137357
987A37357l61124J01750P6979k80554J05673J30461L73444J41778l90125l13609
$$ 137357 -223767 -122017 -45038 -325592 -219919 -89458 283986 425764 35639 -277970
977b77970M60966r2220J07196Q9648k26153L13164L1963o3682l14015K9578Q2927
$$ -277970 182996 90776 197972 287620 61467 374631 406594 342912 28897 58475 141402
966A41402k04159j09254J04164K42439O8353k08834J22772K614m8089J53962l4067
$$ 141402 -62757 -172011 -67847 174592 242945 34111 156883 159497 111408 265370 231303
955B31303j00233M9759N8704k43249J53460L34861k78925j20094J45272m42157
$$ 231303 131070 180829 239533 -3716 149744 484605 205680 85586 230858 -211299
945b11299n1218J33917L5481r0880M3487J96427j34936r8830R8467L37554k01893
$$ -211299 -262517 -128600 -93119 -183999 -140512 55915 -79021 -177851 -79384 258170 56277
934E6277j5868j55144j37720L75316J55821n4723j40457k88975j94752K96336
$$ 56277 40409 -114735 -252455 122861 278682 223959 83502 -205473 -400225 -103889
924a03889K02427J50428m2573l39987K9288k46085J43967q1735L2032J28681q3518
$$ -103889 98538 248966 206393 -133594 -104306 -350391 -206424 -288159 -256127 -127446 -210964
913b10964J21094j10626J92952q5916j3652o5929K81176k73189J26725p6125k65717
$$ -210964 -89870 -200496 -7544 -93460 -107112 -173041 108135 -165054 -38329 -114454 -380171
902c80171K71362k08241J42261j27584Q6802L41561j93210q8667m9504k0066P4731
$$ -380171 -108809 -317050 -174789 -302373 -215571 125990 -67220 -155887 -205391 -225457 -150726
891a50726r7925Q4532k8721R4888J281J20993P7003L95059k79069m5504O1842
$$ -150726 -248651 -164119 -192840 -97952 -96671 24322 101325 496384 217315 171811 233653
880B33653q6931q0696j83895J63771j04628Q7560n4235j43436L5323J90649k19046
$$ 233653 146722 66026 -117869 45902 -58726 28834 -25401 -168837 -133514 57135 -161911
869a61911J33248K71008p1062j08753k982p2373k17818J19717P0019j45089J90921
$$ -161911 -28663 242345 171283 62530 59548 -12825 -230643 -110926 -40907 -185996 4925
858D925k0075k81865k1324K35603K79655j04037k70299O3080k63732J15423K09257
$$ 4925 -15150 -297015 -318339 -82736 196919 92882 -177417 -114337 -378069 -262646 -53389
847e3389L9176j62245k1588L817k4489J2958Q6824J74735j60893J9600j92630
$$ -53389 -14213 -176458 -198046 -194229 -218718 -205760 -118936 55799 -105094 -85494 -278124
836b78124R4476Q0035n2622J71749J08008k9053k03399J90027M0305q1340k66763
$$ -278124 -183648 -103613 -156235 15514 123522 94469 -108930 81097 121402 40062 -226701
825b26701K19092j55544J86839j96172o168K17699N4066r7649J67981K03011m29392
$$ -226701 -7609 -163153 23686 -172486 -178654 39045 93111 -4538 163443 366454 -62938
814f2938L25503o716J6611j38386p0732J8476o1932J90255Q3266j49509o8665
$$ -62938 262565 255849 272460 134074 63342 81818 19886 210141 293407 143898 75233
803G5233J42021k51564N6144K6275m2788J5844l62277K93770K17336n7076l5765
$$ 75233 217254 -34310 21834 48109 5321 21165 -341112 -47342 169994 112918 77153
792G7153J98808J86321m83080l33955K51894l990L40583j49634j35190l09427
$$ 77153 275961 462282 -20798 -354753 -102859 -106849 233734 84100 -51090 -360517
782c60517K3535K76300j37788J91832J2148J92069J16488K46062m20664k0713
$$ -360517 -336982 -60682 -198470 -6638 5510 197579 314067 560129 139465 118752
772A18752k51809J75778N8774n0628R1702k24791k8037k61834K84103J30077L06197
$$ 118752 -133057 42721 101495 50867 142569 -82222 -110259 -372093 -87990 42087 348284
761C48284k62899j25871j81232M51543L95017q261l81387l77234n4392o7469P8197
$$ 348284 85385 -40486 -221718 229825 624842 616581 235194 -142040 -196432 -263901 -185704
750a85704K00592k1985j45394j67239M04718M3020q1310j91676j8533J51768k6874
$$ -185704 14888 -7097 -152491 -319730 84988 128008 46698 -144978 -163511 -11743 -38617
739c8617r31q0226J67590q5968j47865K44204N228l32905J30160K4103j10979
$$ -38617 -39548 -119774 47816 -38152 -186017 58187 63415 -269490 -139330 -115227 -226206
728b26206K50544K60854K2329k6833m0649j01637l8274J61662j48496M8167j80196
$$ -226206 24338 285192 307521 280688 240039 138402 100128 261790 113294 161461 -18735
717a8735J19417j73314q7297M46923p6356j46773J57963j29745M1155N0367l15935
$$ -18735 100682 -72632 -159929 286994 210638 63865 221828 92083 133238 183605 -132330
706a32330l7878J82901j05948j81220K09015l4465k89584q4291K83613N7031o2540
$$ -132330 -170208 12693 -93255 -274475 -65460 -99925 -389509 -473800 -190187 -133156 -195696
695a95696J79246n153k19555l05342m8753L31324J31289R7570L16062j47118k28610
$$ -195696 -16450 -21603 -241158 -546500 -595253 -263929 -132640 -35070 280992 133874 -94736
684i4736R4273k02217R7588N2917o3363j4858N6967j74874j092L25944R674P4767
$$ -94736 -463 -202680 -105092 -52175 -115538 -130396 -73429 -248303 -249395 76549 86223 160990
672A60990j82558l29299K2043J68865M37781j78023k33409K87021j69831J86296
$$ 160990 -21568 -350867 -328824 -159959 277822 99799 -133610 153411 -16420 169876
662A69876k02222k4224K31401J1656J0977K12801J0172l44078m6616l16532j07262
$$ 169876 -32346 -56570 174831 186487 197464 410265 420437 76359 29743 -286789 -394051
651c94051J4363J06377K31456j37704L6743r7317J73606N2769j35996j31024K81859
$$ -394051 -379688 -273311 -41855 -179559 -142816 -240133 -66527 -13758 -149754 -280778 1081
640A081J83200L01938K69775j51197k38218k23114R950k11970J18863l5152J88848
$$ 1081 184281 486219 755994 604797 366579 143465 153415 -58555 60308 25156 214004
629B14004m8245L3282j92323q1969L79326k06379m2184O6717j25485j94280n6560
$$ 214004 165759 199041 6718 -75251 304075 97696 55512 122229 -3256 -197536 -254096
618b54096L04206J34686k68401j08482J01306j55030k36008J68190N60713J79832
$$ -254096 50110 184796 -83605 -192087 -90781 -245811 -481819 -313629 247084 426916
608D26916J05110k6135m39719J5801o4732j47185j92168L24008J04708j68610
$$ 426916 532026 505891 66172 81973 17241 -129944 -322112 1896 106604 -62006
598f2006j00908L2159K3606q0152K36820P4992O8245j14347q1190J09999J71243
$$ -62006 -162914 -130755 -107149 -187301 49519 124511 192756 78409 -2781 107218 278461
587B78461N4484n06847K34925j32710l12200J62764k9164J51087M59841m11336
$$ 278461 332945 -173902 61023 -71687 -383887 -221123 -250287 -99200 360641 -50695
577e0695N978J31573M3959o1580j74421j15106Q7787l7243J02195L67839Q1778
$$ -50695 -44717 86856 130815 69235 -105186 -220292 -132505 -169748 -67553 300286 382064
566C82064k96477j05113q2751J05500J04925J59619l7344j01612J32419M4323
$$ 382064 85587 -19526 -102277 3223 108148 267767 230423 128811 261230 305553
556C05553N4317k85841N0694J05146K1972m06034J41557L75563J45063j67973
$$ 305553 359870 74029 124723 229869 251841 -154193 -12636 362927 507990 340017
546C40017l23882m39773j47679K76664L32151l05937r6411M11452J36443j92978
$$ 340017 16135 -423638 -571317 -294653 37498 -268439 -364850 46602 183045 -9933
536i933j56881J01752K6163j16488J21217j66074K51981L1159L49761k09081m04823
$$ -9933 -166814 -65062 -38899 -155387 -34170 -200244 51737 82896 432657 223576 -181247
525a81247K7043K62097l2664J55396j54978l13135O2975L22561K46889n93863
$$ -181247 -154204 107893 75229 230625 75647 -237488 -174513 148048 394937 -198926
515a98926r916N2498r3689K10831k4842K04277m5550j98920k67305M5990J96266
$$ -198926 -208842 -156344 -250033 -39202 -64044 140233 94683 -104237 -371542 -325552 -129286
504a29286K5661p1369J29773J50196R5272q2781J98350k82019j86984K1584K01443
$$ -129286 -103625 -174994 -45221 104975 200247 117466 315816 33797 -153187 -131603 69840
493F9840m327k92056j0591J88923R0647q626M947j79233J95200O6323l85300L23057
$$ 69840 65513 -226543 -237134 -48211 42436 33810 38757 -140476 54724 121047 -264253 58804
481E8804k92466J47590q5537k91663K22283K91822j11343j00473R2317O4787o3782
$$ 58804 -233662 -86072 -171609 -463272 -240989 50833 -60510 -160983 -68666 -3879 -67661
470f7661k9506J08172k98995J70323N6894m2783n9686N5175K91589M10866j73994
$$ -67661 -97167 11005 -287990 -117667 -60773 -103556 -163242 -108067 183522 594388 420394
459D20394K95318o26639m07255m9221K81861J4678K10745q7638J48391J21174
$$ 420394 715712 89073 -318182 -367403 -85542 -70864 139881 52243 200634 321808
449C21808r3510J0247J30663r3326L4423k23489m6773J48060j63687j08200M94084
$$ 321808 228298 238545 369208 275882 310305 86816 40043 188103 24416 -83784 410300
438D10300j8322l19202k52176P9464J04442K44114L37852l59106j81832q9169
$$ 410300 391978 72776 -179400 -99936 4506 248620 586472 227366 45534 -43635
428d3635j74160J87423J02523j39397K77565r8292o0740J56017j62515j16107
$$ -43635 -217795 -30372 72151 -67246 210319 112027 51287 207304 44789 -71318
418g1318k0075J43042J6362K47706l02702M9827m4418n005q2198j14623q7810
$$ -71318 -91393 51649 68011 315717 13015 62842 18424 13419 -68779 -183402 -271212
407b71212k7729K41458m0909l03058M04753Q4877k83914J18562j84237j14427
$$ -271212 -298941 -57483 -98392 -401450 3303 88180 -195734 -77172 -261409 -375836
397c75836J40605J63094J24152K83579j31842q9662j54308N2599r8229r9056N0063
$$ -375836 -235231 -72137 52015 335594 203752 114090 -40218 12381 -85848 -184904 -134841
386a34841J11976j35134k47366N42811K43096n25579M9303j93944j23829J07981
$$ -134841 -22865 -157999 -405365 137446 380542 -145037 -95734 -289678 -413507 -305526
376c05526J99898K74208k00629L5284L94709k3016l21568k62731J93608J40020
$$ -305526 -105628 168580 -32049 3235 397944 374928 53360 -209371 -15763 124257
366A24257k31019q8502L09206K31332k29941k29173n4222K28789j07768k93571
$$ 124257 -106762 -195264 113942 345274 115333 -113840 -168062 60727 -47041 -340612
356c40612J7181J39058K56097l19693J04824J74264M1297l42709q5975j42696
$$ -340612 -323431 -184373 71724 -247969 -143145 31119 72416 -270293 -356268 -498964
346d98964K14414j15198j15645j37184n3922L03609J40390k0114L8905K98599
$$ -498964 -284550 -399748 -515393 -652577 -706499 -402890 -262500 -282614 -243709 54890
336E4890n259M4127J09900k9921k2027j88909q6766k47951L47073K3334M5854
$$ 54890 49631 93758 203658 173737 151710 -37199 -123965 -371916 -24843 -1509 44345
325D4345N2259m724K9448R8867k23566k8205k5834P7840K2176j58632o03J24361
$$ 44345 96604 91880 121328 220195 -3371 -31576 -57410 20430 42606 -116026 -116629 7732
$$ [...]
##END NTUPLES=NMR SPECTRUM
##END=
