##TITLE=1H_EC-3365(22)X
 200.13MHz,CDCl3,
 8 sc
 
 11.11.2025
##JCAMPDX= 6.0         $$ Bruker NMR JCAMP-DX V2.0
##DATA TYPE= NMR SPECTRUM
##DATA CLASS= NTUPLES
##ORIGIN= UXNMR, Bruker Analytische Messtechnik GmbH
##OWNER= pz
$$ XWIN-NMR		Version 3.5
$$ Tue Nov 11 15:39:38 2025 Russian Standard Time (UT+4h)  she@DPX200
##.OBSERVE FREQUENCY= 200.1325
##.OBSERVE NUCLEUS= ^1H
##.ACQUISITION MODE= SIMULTANEOUS
##.ACQUISITION SCHEME= undefined
##.AVERAGES= 8
##.DIGITISER RES= 18
##SPECTROMETER/DATA SYSTEM= spect
##.PULSE SEQUENCE= zg30
##.SOLVENT NAME= CDCl3
##.SHIFT REFERENCE= (INTERNAL, CDCl3, 0, 21.5127)
##AUDIT TRAIL= $$ (NUMBER, WHEN, WHO, WHERE, WHAT)
$$ ##TITLE= Audit trail, XWIN-NMR		Version 3.5
$$ ##JCAMPDX= 5.01
$$ ##ORIGIN= Bruker BioSpin GmbH
$$ ##OWNER= she
$$ F:/spectra/data/she/nmr/H-C/1/pdata/1/auditp.txt
$$ ##AUDIT TRAIL=  $$ (NUMBER, WHEN, WHO, WHERE, WHAT)
(   1,<2025-11-11 15:38:25.42 +0400>,<she>,<DPX200>,
      <created by zg, POWCHK disabled, PULCHK disabled
       configuration hash MD5:
       00 E9 B6 7A A2 85 ED C7 34 08 36 98 17 FE 4E 26
       data hash MD5: 16K
       86 22 34 EE CA D3 FA 27 BF 0F EC 3E E8 4B DB AB>)
(   2,<2025-11-11 15:38:28.79 +0400>,<she>,<DPX200>,
      <Start of raw data processing
       efp BC_mod = 2 LB = 0.25 FT_mod = 6 PKNL = 1 PHC0 = -2618.286 PHC1 = 0.3923607 SI = 16K 
       data hash MD5: 16K
       99 A2 65 02 66 4E 2B 6D E4 43 F5 EE 76 87 CA FA>)
$$ ##END=
$$ 
$$ hash MD5
$$ 58 53 13 5B 31 C8 46 99 BD 06 A4 28 B4 83 27 DA
##$RELAX= 
##$RELAX= 
##$RELAX= 
##$RELAX= 
##$RELAX= 
##$RELAX= 
$$ Bruker specific parameters
$$ --------------------------
##$DU= <F:/spectra>
##$EXPNO= 1
##$NAME= <H-C>
##$PROCNO= 1
##$TYPE= <nmr>
##$USER= <she>
##$AMP= (0..31)
100 100 100 100 100 100 100 100 100 100 100 100 100 100 100 100 100 100 
100 100 100 100 100 100 100 100 100 100 100 100 100 100 
##$AQSEQ= 0
##$AQ_mod= 1
##$AUNM= <au_zg>
##$AUTOPOS= <>
##$BF1= 200.13
##$BF2= 200.13
##$BF3= 200.13
##$BF4= 200.13
##$BF5= 200.13
##$BF6= 200.13
##$BF7= 200.13
##$BF8= 200.13
##$BYTORDA= 1
##$CFDGTYP= 0
##$CFRGTYP= 5
##$CHEMSTR= <none>
##$CNST= (0..31)
1 1 145 1 1 1 1 1 1 1 1 1 1 1 1 1 1 1 1 1 1 1 1 1 1 1 1 1 1 1 1 1 
##$CPDPRG= <>
##$CPDPRG1= <>
##$CPDPRG2= <>
##$CPDPRG3= <>
##$CPDPRG4= <mlev>
##$CPDPRG5= <mlev>
##$CPDPRG6= <mlev>
##$CPDPRG7= <mlev>
##$CPDPRG8= <mlev>
##$CPDPRGB= <>
##$CPDPRGT= <>
##$D= (0..31)
0 0.7 0 0 0 0 0 0 0 0 0 0.03 0 0 0 0 0 0 0 0 0 0 0 0 0 0 0 0 0 0 0 0 
##$DATE= 1762861104
##$DBL= (0..7)
120 120 120 120 120 120 120 120 
##$DBP= (0..7)
150 150 150 150 150 150 150 150 
##$DBP07= 0
##$DBPNAM0= <>
##$DBPNAM1= <>
##$DBPNAM2= <>
##$DBPNAM3= <>
##$DBPNAM4= <>
##$DBPNAM5= <>
##$DBPNAM6= <>
##$DBPNAM7= <>
##$DBPOAL= (0..7)
0.5 0.5 0.5 0.5 0.5 0.5 0.5 0.5 
##$DBPOFFS= (0..7)
0 0 0 0 0 0 0 0 
##$DE= 6
##$DECBNUC= <off>
##$DECIM= 32
##$DECNUC= <off>
##$DECSTAT= 4
##$DIGMOD= 1
##$DIGTYP= 9
##$DL= (0..7)
0 120 120 120 120 120 120 120 
##$DP= (0..7)
150 150 150 150 150 150 150 150 
##$DP07= 0
$$ [...]
##$SUBNAM2= <"">
##$SUBNAM3= <"">
##$SUBNAM4= <"">
##$SUBNAM5= <"">
##$SUBNAM6= <"">
##$SUBNAM7= <"">
##$SUBNAM8= <"">
##$SUBNAM9= <"">
##$SW= 18.0516246137223
##$SWIBOX= (0..15)
0 0 2 0 0 0 0 0 0 0 0 0 0 0 0 0 
##$SW_h= 3612.71676300578
##$TD= 16384
##$TD0= 1
##$TE= 0
##$TE2= 300
##$TE3= 300
##$TEG= 300
##$TL= (0..7)
0 120 120 120 120 120 120 120 
##$TP= (0..7)
150 150 150 150 150 150 150 150 
##$TP07= 0
##$TPNAME0= <>
##$TPNAME1= <>
##$TPNAME2= <>
##$TPNAME3= <>
##$TPNAME4= <>
##$TPNAME5= <>
##$TPNAME6= <>
##$TPNAME7= <>
##$TPOAL= (0..7)
0.5 0.5 0.5 0.5 0.5 0.5 0.5 0.5 
##$TPOFFS= (0..7)
0 0 0 0 0 0 0 0 
##$TUNHIN= 0
##$TUNHOUT= 0
##$TUNXOUT= 0
##$USERA1= <user>
##$USERA2= <user>
##$USERA3= <user>
##$USERA4= <user>
##$USERA5= <user>
##$V9= 5
##$VALIST= <valist>
##$VCLIST= <CCCCCCCCCCCCCCC>
##$VD= 0
##$VDLIST= <DDDDDDDDDDDDDDD>
##$VPLIST= <PPPPPPPPPPPPPPP>
##$VTLIST= <TTTTTTTTTTTTTTT>
##$WBST= 1024
##$WBSW= 4
##$XGAIN= (0..3)
0 0 0 0 
##$XL= 0
##$YL= 0
##$YMAX_a= 170372
##$YMIN_a= -216904
##$ZGOPTNS= <>
##$ZL1= 120
##$ZL2= 120
##$ZL3= 120
##$ZL4= 120
##$ABSF1= 0
##$ABSF2= 0
##$ABSG= 0
##$ABSL= 0
##$ALPHA= 0
##$AQORDER= 0
##$ASSFAC= 0
##$ASSFACI= 0
##$ASSFACX= 0
##$ASSWID= 0
##$AUNMP= <proc_1d>
##$AZFE= 0.1
##$AZFW= 0.1
##$BCFW= 0
##$BC_mod= 2
##$BYTORDP= 0
##$COROFFS= 0
##$CY= -3
##$DATMOD= 1
##$DC= 0
##$DFILT= <>
##$DTYPP= 0
##$F1P= 0
##$F2P= 0
##$FCOR= 1
##$FTSIZE= 16384
##$FT_mod= 6
##$GAMMA= 0
##$GB= 0
##$INTBC= 1
##$INTSCL= 3.241238e-09
##$ISEN= 128
##$LB= 0.25
##$LEV0= 0
##$LPBIN= 0
##$MAXI= 10000
##$MC2= 0
##$MEAN= 0
##$ME_mod= 0
##$MI= 1.114404
##$NCOEF= 0
##$NC_proc= -10
##$NLEV= 6
##$NOISF1= 3.799351
##$NOISF2= 2.8
##$NSP= 0
##$NTH_PI= 0
##$NZP= 0
##$OFFSET= 21.51272
##$PC= 1
##$PHC0= -2618.286
##$PHC1= 0.3923607
##$PH_mod= 1
##$PKNL= yes
##$PPARMOD= 0
##$PSCAL= 0
##$PSIGN= 0
##$REVERSE= no
##$SF= 200.130001017984
##$SI= 16384
##$SIGF1= 3
##$SIGF2= 2
##$SINO= 0.751879
##$SIOLD= 32768
##$SREGLST= <19F.Aceton>
##$SSB= 0
##$STSI= 16384
##$STSR= 0
##$SW_p= 3612.71676300578
##$SYMM= 0
##$S_DEV= 0
##$TDeff= 16384
##$TDoff= 0
##$TI= <>
##$TILT= no
##$TM1= 0
##$TM2= 0
##$TOPLEV= 0
##$USERP1= <user>
##$USERP2= <user>
##$USERP3= <user>
##$USERP4= <user>
##$USERP5= <user>
##$WDW= 1
##$XDIM= 16384
##$YMAX_p= 486035543
##$YMIN_p= -6625671
$$ End of Bruker specific parameters
$$ ---------------------------------
##NTUPLES= NMR SPECTRUM
##VAR_NAME=  FREQUENCY,     SPECTRUM/REAL,   SPECTRUM/IMAG
##SYMBOL=    X,             R,               I
##VAR_TYPE=  INDEPENDENT,   DEPENDENT,       DEPENDENT
##VAR_FORM=  AFFN,          ASDF,            ASDF
##VAR_DIM=   16384,         16384,           16384
##UNITS=     HZ,            ARBITRARY UNITS, ARBITRARY UNITS
##FACTOR=    0.220516191357247, 1,           1
##FIRST=     4305.34069712009, 0,            0
##LAST=      692.623934114315, 0,            0
##MIN=       692.623934114315, -6625671,     0
##MAX=       4305.34069712009, 486035543,    0
$$ Real data points
##PAGE= N=1
##DATA TABLE= (X++(R..R)), XYDATA
$$ [...]
5464I4664663K496201K321742P16028j297158N52774K826764J042193j317057
$$ 94664663 97160864 99482606 100198634 98901476 99454250 102281014 103323207 102006150
5456A02006150J697055J282826J861340J212603J213481j035112O12055O61808
$$ 102006150 103703205 104986031 106847371 108059974 109273455 108238343 108850398 109512206
5448A09512206J303023K535011P22521K277498p78708K327123J693330l82623
$$ 109512206 110815229 113350240 114072761 116350259 115571551 117898674 119592004 119209381
5440A19209381p71257J153380J397008k40254K152698K70842J218725j132913
$$ 119209381 118438124 119591504 120988512 120748258 122900956 123171798 124390523 123257610
5432A23257610j637575N43784L053935J479257J761442K723187n98683L95947
$$ 123257610 121620035 122163819 125217754 126697011 128458453 131181640 130582957 130978904
5424A30978904j696752L052871J174832k73081J078214k227134M65075J413062
$$ 130978904 129282152 132335023 133509855 133236774 134314988 132087854 132552929 133965991
5416A33965991O93715O88962P37624R06956K209377L86126j740390K559898L55743
$$ 133965991 134659706 135348668 136086292 136993248 139202625 139588751 137848361 140408259 140764002
5407A40764002k50341J329924N76519J252700M09495L44416Q66222j06387j746
$$ 140764002 140513661 141843585 142420104 143672804 144082299 144426715 145292937 145186550 145184804
5398A45184804J136648Q33152j505974j121627K15908L247726L500985j300482
$$ 145184804 146321452 147154604 145648630 144527003 144742911 147990637 151491622 150191140
5390A50191140L33553j72582P29721j162592l64096K182790N11405p83103q83137
$$ 150191140 150524693 150352111 151081832 149919240 149555144 151737934 152249339 151466236 150583099
5381A50583099J00852N91974q8490j288818R59958J4965p96593K441667l351086
$$ 150583099 150683951 151275925 151187435 149898617 150858575 150873540 150076947 152518614 149167528
5372A49167528Q63258j267289J568127K395562r05282n48843n94894M95877j40991
$$ 149167528 150030786 148763497 150331624 152727186 151821904 151273061 150678167 151174044 151033053
5363A51033053j80686K49014J497797L41878j32654J034382o42758o61155j714570
$$ 151033053 150852367 151101381 152599178 152941056 152808402 153842784 153200026 152538871 150824301
5354A50824301R66262P28196j040910J205326j486639j302002q1368J472402o52506
$$ 150824301 151790563 152518759 151477849 152683175 151196536 149894534 149813166 151285568 150633062
5345A50633062J222436p72960p56016l65434n23804K352147o4535j822569k638369
$$ 150633062 151855498 151082538 150326522 149961088 149437284 151789431 151724896 149902327 147263958
5336A47263958j607182M89406k15172l57603j210966K147886n49006j326167j456910
$$ 147263958 145656776 146146182 145931010 145573407 144362441 146510327 145961321 144635154 143178244
5327A43178244p8637R48125m12663k320206L17004R58415J424480l13511k476565
$$ 143178244 143099607 144047732 143635069 141314863 141631867 142590282 144014762 143701251 141224686
5318A41224686Q0891P99375k708615R67243k259184o25804m53596J070903j933886
$$ 141224686 141305577 142104952 139396337 140363580 138104396 137478592 137024996 138095899 136162013
5309A36162013j840587K080752j207908L47408k859723J430295l55663P91066
$$ 136162013 134321426 136402178 135194270 135541678 132681955 134112250 133756587 134547653
5301A34547653m18309k295421k68573l3981K050660k88689j916974j870946j75875
$$ 134547653 134129344 131833923 131565350 131531369 133582029 133293340 131376366 129505420 129329545
5292A29329545j74592k594981k473826r11689J178964j596119j270263K092449
$$ 129329545 129154953 126559972 124086146 123174457 124353421 122757302 121487039 123579488
5284A23579488k08063j40965j873466M74970p31354r26330j33874j660600L17609
$$ 123579488 123371425 123230460 121356994 121831964 121100610 120174280 120040406 118379806 118697415
5275A18697415j841027n95838j575632k70938O48965n56086q55469O75701K8821
$$ 118697415 116856388 116260550 114684918 114413980 115062945 114506859 113651390 114327091 114355912
5266A14355912j647642M3567q66216j289156j409782M91714j758475j48751J185831
$$ 114355912 112708270 112751837 111885621 110596465 109186683 109678397 107919922 107771171 108957002
5257A08957002l032707k8501K036880O06545j304026j768824j018239J685978
$$ 108957002 105924295 105895794 107932674 108539219 107235193 105466369 104448130 106134108
5249A06134108j464873j611012o99587j23110J94996n52193l412295J485029J255402
$$ 106134108 104669235 103058223 102358636 102235526 102430522 101878329 98466034 99951063 101206465
5240A01206465k679470r76423O11280N60882J172908J122233q35788k036594l205690
$$ 101206465 98526995 97550572 98161852 98722734 99895642 101017875 100182087 98145493 94939803
5231I4939803O01228J155530j419712j258175J167750K786361k183444j245421
$$ 94939803 95541031 96696561 95276849 94018674 95186424 97972785 95789341 94543920
5223I4543920J194278j128333J136053j751763r98246m4021M48931k164309j233023
$$ 94543920 95738198 94609865 95745918 93994155 92995909 92951888 93400819 91236510 90003487
5214I0003487K173128j370601j10220R78947j46538J576807J609265j008190j713245
$$ 90003487 92176615 90806014 90695794 91674741 91528203 93105010 94714275 93706085 91992840
5205I1992840j89208j424320K145579k509085k272870L11033K488314J760514
$$ 91992840 91803632 90379312 92524891 90015806 87742936 88053969 90542283 92302797
5197I2302797m706o40856K019263P86784l171997l68141l676177R27120J808511
$$ 92302797 92298091 91657235 93676498 94463282 91291285 90923144 87246967 88174087 89982598
5188H9982598J11746p19651l1052J344116J161978P85304k362219m87987J012774
$$ 89982598 90094344 89374693 89343641 90687757 91849735 92635039 90272820 89784833 90797607
5179I0797607P4358K71403M7114K58322k109790K80630O68662J841133k181226
$$ 90797607 90871965 91143368 91190482 91448804 89339014 89619644 90288306 92129439 89948213
5170H9948213j079497L248335J751799j018065n95032J88177R48036O82158J315390
$$ 89948213 88868716 92117051 93868850 92850785 92255753 92443930 93391966 94074124 95389514
5161I5389514J42651p46276o29403l21661J342230M16018m3634J033731R0729
$$ 95389514 95532165 94785889 94156486 93834825 95177055 95593073 95549439 96583170 96673899
5152I6673899p24633J114152l83373k73974J587941j547150o51534j062642L96626
$$ 96673899 95949266 97063418 96680045 96406071 97994012 96446862 95795328 94732686 95129312
5143I5129312k639590K72818J760725J489373m7627J93783K514502j210172P55505
$$ 95129312 92489722 92762540 94523265 96012638 95965011 96158794 98673296 97463124 98218629
5134I8218629j338827K685558K308182O00314k20445l468751q04756j148630J21071
$$ 98218629 96879802 99565360 101873542 102473856 102253411 98784660 97979904 96831274 96952345
5125I6952345j56813j08412J319406j011485j813744N69124K061941M89717K505672
$$ 96952345 96795532 96687120 98006526 96995041 95181297 95750421 97812362 98302079 100807751
5116A00807751j038937j094690J56839l83859J068645m96268q99878j174026J134638
$$ 100807751 99768814 98674124 98830963 98447104 99515749 99019481 98119603 96945577 98080215
5107I8080215J847207Q51685J75929j776821K938069p76971k035805j743675j326148
$$ 98080215 99927422 100779107 100955036 99178215 102116284 101339313 99303508 97559833 96233685
5098I6233685J551423Q79696K79564J12156j246198p39977K255505K8766N88129
$$ 96233685 97785108 98664804 98944368 99056524 97810326 97070349 99325854 99354620 99942749
5089I9942749m46160k786210J79642R16818j128212j056313K007824m2790N12525
$$ 99942749 99496589 96710379 96890021 97806839 96678627 95622314 97630138 97587348 98099873
5080I8099873j821009k63695l58546P87692P3215o34540P29366J693875l95228
$$ 98099873 96278864 96015169 95656623 96444315 96517530 95882990 96612356 98306231 97911003
5071I7911003L46262k132393j893747r93265J896369L149491m487688J462017
$$ 97911003 98257265 96124872 94231125 93237860 95134229 98283720 93796032 95258049
5063I5258049K345212o28100k370966q82006Q01707J382483j885075J908249L20258
$$ 95258049 97603261 96975161 94604195 93722189 94523896 95906379 94021304 95929553 96249811
5054I6249811q51423j092024j22990N5517j901864j356380N51163Q95574J290592
$$ 96249811 95398388 94306364 94183374 94238891 92337027 90980647 91531810 92427384 93717976
5045I3717976j39353k297448r53949j404274K214129J497558O58519m416800q13433
$$ 93717976 93578623 91281175 90327226 88922952 91137081 92634639 93293158 88876358 88062925
5036H8062925J424048Q54990q93407j425911Q11211j676691k387254J841160M10431
$$ 88062925 89486973 90341963 89448556 88022645 88833856 87157165 84769911 86611071 87021502
5027H7021502J340927J52042j03313j967336o9662n86341j495705k051319m30422
$$ 87021502 88362429 88514471 88411158 86443822 86374160 85787819 84292114 82240795 81810373
5018H1810373q25171K622173M024996k938861J001610m06672m36418j219619J029294
$$ 81810373 80985202 83607375 87632371 84693510 85695120 85288448 84852030 83632411 84661705
5009H4661705j087838j725921M3612j45791M8568q35708R92020m82847k13180
$$ 84661705 83573867 81847946 81891558 81745767 81794335 80958627 81950647 81467800 81254620
5000H1254620J917889k144989J448598J52057N20372j254416k147520Q51968N26991
$$ 81254620 83172509 81027520 82476118 82628175 83148547 81894131 79746611 80598579 81125570
4991H1125570O0270q43986J482668r83343l69200r9290k478794r06956j4750J410449
$$ 81125570 81185840 80341854 81824522 80841179 80471979 80372689 77893895 76986939 76972189 78382638
4981G8382638j026775K320375l72560R2898N34443l91241J116978p52431q8250
$$ 78382638 77355863 79676238 79303678 79396576 79931019 79539778 80656756 79904325 79816075
4972G9816075r80106J38616N47280p75129k93846r46634q55017K65640Q43219
$$ 79816075 78835969 78974585 79521865 78746736 78452890 77506256 76651239 76916879 77760098
4963G7760098o75857J312849K67287l84877J855004n91510Q6640P71748r36441
$$ 77760098 77084241 78397090 78664377 78279500 80134504 79542994 79629634 80401382 79464941
4954G9464941J033147j874843j165347J698607j84473j378819J347565J694167
$$ 79464941 80498088 78623245 77457898 79156505 78972032 77593213 78940778 80634945
4946H0634945q87748k68947P16747P90070j635422L92242R24638j270394j49767
$$ 80634945 79747197 79478250 80194997 80985067 79349645 79741887 80666525 79396131 79246364
4937G9246364K62684J638118K115151j54475j110349P99157J487399O44263k34231
$$ 79246364 79509048 81147166 83262317 83107842 81997493 82796650 84284049 84928312 84694081
4928H4694081l557689j306507N8069J862346K158201P14093j914292j837699K597700
$$ 84694081 81136392 79829885 79887954 81750300 83908501 84622594 82708302 80870603 83468303
4919H3468303J383698k77567o34666K134511o828J108179q7913j158349p65724
$$ 83468303 84852001 84574434 83939768 86074279 86067451 87175630 87087717 85929368 85163644
4910H5163644j951760L3018l47366J558728P31574K023931J846885j058906K000463
$$ 85163644 83211884 83244902 82897536 84456264 85187838 87211769 89058654 87999748 90000211
4901I0000211P73520O03854j386551O63984M26339k2427M78626k72667K51679
$$ 90000211 90773731 91377585 89991034 90655018 91081357 91058930 91537556 91264889 91516568
4892I1516568J528618m22051j870864K238465L30873Q61340Q29833p34149J300882
$$ 91516568 93045186 92623135 90752271 92990736 93321609 94182949 95012782 94278633 95579515
4883I5579515P29065j123423J954108j334686p55790R1372J392613r2003K350419
$$ 95579515 96308580 95185157 97139265 95804579 95048789 95140161 96532774 96440771 98791190
4874I8791190k509964J980799J846968j024504k21575k361Q11254J604573K790944
$$ 98791190 96281226 98262025 100108993 99084489 98862914 98860553 99671807 101276380 104067324
4865A04067324J9167k558009K983215J403515J055187l336712l27764M155087
$$ 104067324 104086491 101528482 104511697 105915212 106970399 103633687 103305923 107461010
4857A07461010J131605Q59687n97188K64859j095428J02601j701890J641254N39393
$$ 107461010 108592615 109452302 108855114 109119973 108024545 108127146 106425256 108066510 108605903
4848A08605903K019806J694126k881230J52480Q02885N85524k14916L30760J272336
$$ 108605903 110625709 112319835 109438605 109591085 110393970 110979494 110764578 111095338 112367674
4839A12367674J052318J214815L32831M08637q42797L48215K94023q52569l64578
$$ 112367674 113419992 114634807 114967638 115376275 114533478 114881693 115175716 114323147 113958569
4830A13958569J714410N56323J162231K620752j147939j100840R81288O84700
$$ 113958569 115672979 116229302 117391533 120012285 118864346 117763506 118744794 119429494
4822A19429494K20961j724395K207033m94326o15429m42324J095102K218037L53932
$$ 119429494 119650455 117926060 120133093 119638767 119023338 118581014 119676116 121894153 122248085
4813A22248085r11563n6046M183988P61286j173072M6719J45852n68047p69282
$$ 122248085 121336522 121280476 125464464 126225750 125052678 125099397 125245249 124677202 123907920
4804A23907920J038981q17380j263070J237313o40704L173849J14526r18359J145009
$$ 123907920 124946901 124129521 122866451 124103764 123463060 126636909 126751435 125833076 126978085
4795A26978085n02416O20366j076072J246904M91056O34256j625501j358995M02587
$$ 126978085 126475669 127096035 126019963 127266867 127757923 128392179 126766678 125407683 125810270
4786A25810270L187083j686637k219549N26928K553698o35134j374546J910387
$$ 125810270 128997353 127310716 125091167 125618095 128171793 127536659 126162113 128072500
4778A28072500J382394j39749O29962p2110j578380j034907J471465M68007Q71759
$$ 128072500 129454894 129315145 129945107 129872997 128294617 127259710 128731175 129199182 130070941
4769A30070941L66127k131143M1086p86310p41751j225629Q10036J642183J890111
$$ 130070941 130437068 128305925 128347011 127560701 126818950 125593321 126403357 128045540 129935651
4760A29935651J644799r59264k885038m65559J018548j113583l025027J162064
$$ 129935651 131580450 130621186 127736148 127270589 128289137 127175554 124150527 125312591
4752A25312591j62389K801032K237739l192162j031903J488264L13277R09205
$$ 125312591 125150202 127951234 130188973 126996811 125964908 127453172 127766449 128675654
4744A28675654L9952p89689k51212K7992P29451j506967k233707M15116J148141
$$ 128675654 128715606 127925917 127674705 127702697 128432148 126925181 124691474 125106590 126254731
4735A26254731m26870Q42796M30333l95299o89470q27136R1747j755621j637051
$$ 126254731 125827861 126670657 127100990 126705691 126016221 125189085 125280832 123525211 121888160
4726A21888160J167720K830585M68493o89582l20158k626430K305421J360147
$$ 121888160 123055880 125886465 126354958 125665376 125345218 122718788 125024209 126384356
4718A26384356j94831O31915j345380J193378j605012l279655j59494Q42947r60094
$$ 126384356 126189525 126821440 125476060 126669438 125064426 121784771 121625277 122468224 121508130
4709A21508130j68134J171324j82250l1684P93724J41353k210288J12549N56460
$$ 121508130 121339996 122511320 122329070 122297386 123091110 123232463 121022175 121134724 121691184
4700A21691184J956382J413954j322712J334709r7707j448848j217819k659179
$$ 121691184 123647566 125061520 123738808 125073517 124975810 123526962 122309143 119649964
4692A19649964J261813J20304P62041K53432J188549n3069l2086J595790r59993
$$ 119649964 120911777 121032081 121794122 122047554 123236103 123183034 123150948 124746738 123786745
4683A23786745j500193k412911J652189J05830l6578m73092J082438J894214J548709
$$ 123786745 122286552 119873641 121525830 121631660 121595082 121121990 122204428 124098642 125647351
4674A25647351R22264K61193O47125j570991k43209j668167o14093j029801K373053
$$ 125647351 126569615 126830808 127477933 125906942 125663733 123995566 123381473 122351672 124724725
4665A24724725n49814k415163K299630j45880l08139j061210J136950K961677
$$ 124724725 124174911 121759748 124059378 123913498 123605359 122544149 123681099 126642776
4657A26642776J728359m92178p64510l006272j631313n72463P168m74897K186343
$$ 126642776 128371135 127878957 127114447 124108175 122476862 121904399 121911567 121436670 123623013
4648A23623013K098490J523078l02860k021065j119062L085668J831567R11931
$$ 123623013 125721503 127244581 126941721 124920656 123801594 126887262 128718829 129630760
4640A29630760J42837O59083j776929j626069m4220P83287J73912J033715J352811
$$ 129630760 129773597 130432680 128655751 127029682 126985462 127768749 127942661 128976376 130329187
4631A30329187k416451n33186Q29198P45522j205493o93483J415429J167780o16833
$$ 130329187 127912736 127379550 128208748 128954270 127748777 127055294 128470723 129638503 129021670
4622A29021670j147661p50156J828843Q41685Q25506J445064k110566j459856
$$ 129021670 127874009 127123853 128952696 129794381 130619887 132064951 129954385 128494529
4614A28494529P90537J997810k89690j129450O22626k93003Q67147O0237q82498
$$ 128494529 129285066 131282876 130993186 129863736 130486362 130193359 131060506 131120743 130238245
4605A30238245k41261N192407K75575k549977R18190l03981J3100k047147N5381
$$ 130238245 129996984 135189391 135464966 132914989 133833179 133529198 133542298 131495151 131550532
4596A31550532N31758p91204J985080j515552r69035J22959K076509r58328M01549
$$ 131550532 132082290 131291086 133276166 131760614 130791579 130914538 132991047 132032719 132434268
4587A32434268k026077J25861J313344N6383j274276P3785q2017K04526J981488
$$ 132434268 130408191 130534052 131847396 131903779 130629503 130703288 130621271 130825797 132807285
4578A32807285k206188l04823k82002j092685O25807J35103j205245o02746k73574
$$ 132807285 130601097 130296274 130014272 128921587 129547394 129682497 128477252 127874506 127600932
4569A27600932O62223K002702M02554j084884j137809p40624J87212q3947J168165
$$ 127600932 128263155 130265857 130668411 129583527 128445718 127705094 127892306 127808359 128976524
4560A28976524K26170L95169j869094M5606j152590j25836l393869J611106Q31773
$$ 128976524 129202694 129597863 127728769 127774375 126621785 126495949 123102080 124713186 125544959
4551A25544959j162251O13292n90969R35637r29878K679054P31006O06378r45254
$$ 125544959 124382708 124996000 124405031 125340668 124410790 127089844 127820850 128427228 127481974
4542A27481974k334713k45861r50733J00198q43527o17817Q80511k22112o97980
$$ 127481974 125147261 124901400 123950667 124050865 123207338 122589521 123470032 123247920 122549940
4533A22549940J298901l19158j294401k17235q25378J121059J0579J556688K84881
$$ 122549940 123848841 123529683 122235282 122018047 121192669 122313728 122324307 123880995 124165876
4524A24165876p91631M70854n77482O01536P89527j079728l711296J765402K742826
$$ 124165876 123374245 123845099 123267617 123869153 124658680 123578952 119867656 121633058 124375884
4515A24375884P31107j585729j729545r704q83124K838511p10650n58377o71583
$$ 124375884 125106991 123521262 121791717 121782013 120898889 123737400 123026750 122468373 121796790
4506A21796790K264349Q59919k457899j608417J286591L248053r33870j883280
$$ 121796790 124061139 124921058 122463159 120854742 122141333 125389386 124455516 122572236
4498A22572236j088428J38087R96846J709108M78279k069861j746200L812135
$$ 122572236 121483808 121621895 122618741 124327849 124806128 122736267 120990067 124802202
4490A24802202J997197l429658L32964Q48434p96126j519130r3761p95942Q59516
$$ 124802202 126799399 123369741 123702705 124551139 123755013 122235883 122142122 121346180 122205696
4481A22205696J958287R33679p44127j456985J398743Q36242J151970j00494l93036
$$ 122205696 124163983 125097662 124353535 122896550 124295293 125131535 126283505 126183011 125789975
4472A25789975o62798N35595M51555j577922m00734M50620p17559O24713J105342
$$ 125789975 125127177 125662772 126114327 124536405 124135671 124586291 123868732 124493445 125598787
4463A25598787J142558j394668j090231p70196n24998J052535K957158q88553
$$ 125598787 126741345 125346677 124256446 123486250 122961252 124013787 126970945 126082392
4455A26082392j516614M64970q89954J643452m42085J184633J430397k421985
$$ 126082392 124565778 125030748 124140794 125784246 125342161 126526794 127957191 125535206
4447A25535206o45875R81741k347802O54771J519356N58202J190151l89935J100322
$$ 125535206 124889331 125871072 123523270 124178041 125697397 126255599 127445750 127055815 128156137
4438A28156137J304757o41735k525033Q87583m48940L56788O64455j395897j150106
$$ 128156137 129460894 128819159 126294126 127181709 126732769 127089557 127754012 126358115 125208009
4429A25208009r40103R27843k99864K700532J360139k406312J315345k15350k822999
$$ 125208009 124267906 125195749 124895885 127596417 128956556 126550244 127865589 127650239 124827240
4420A24827240l50061J082669j165048l92617Q47070K30637J071501j152864q14177
$$ 124827240 124477179 125559848 124394800 124002183 124849253 125079890 126151391 124998527 124184350
4411A24184350r33870K615892J50190j096756p64634P02895L917486k137109k697532
$$ 124184350 123250480 125866372 126016562 124919806 124155172 124858067 128775553 126638444 123940912
4402A23940912j801760J008700J568950k01658k648851j288850K748162J790724
$$ 123940912 122139152 123147852 124716802 124515144 121866293 120577443 123325605 125116329
4394A25116329J308029m96651j011960l74919J657624p34756j926668k276314
$$ 125116329 126424358 125927707 124915747 124540828 126198452 125463696 123537028 121260714
4386A21260714M6631K197410O72106l33201k301941J253833j11617L76113l34599
$$ 121260714 121307345 123504755 124176861 123843660 121541719 122795552 122683935 123060048 122725449
4377A22725449k156846O27238j62735r16379j123562j501976R15294M6973m68979
$$ 122725449 120568603 121195841 121033106 120116727 118993165 117491189 118406483 118453456 117984477
4368A17984477J83095J66879K545850J102624j541516p20462j844602r82865J281609
$$ 117984477 118167572 118334451 120880301 121982925 120441409 119720947 117876345 116893480 118175089
4359A18175089J970360j107297j087635n51435J144941j674369K49792O36877
$$ 118175089 120145449 119038152 117950517 117399082 118544023 116869654 117119446 117756323
4351A17756323Q7393j658166r59231K74299m96161N51544j582182O9771K275685
$$ 117756323 117843716 116185550 115226319 115500618 115004457 115556001 113973819 114043590 116319275
4342A16319275K226329j855668j525613K18346J006859r00559o1236j956301P24356
$$ 116319275 118545604 116689936 115164323 115382669 116389528 115488969 115427733 113471432 114195788
4333A14195788L21590n1155J777374p36145n84722R51043k53121j035212l882060
$$ 114195788 114517378 114466223 116243597 115507452 114922730 115873773 115620652 114585440 110703380
4324A10703380j208790J380463J412844o32741J3472K432284Q10965j176118q13920
$$ 110703380 109494590 110875053 112287897 111655156 111668628 114100912 114911877 113735759 112921839
4315A12921839K36760R93143R1503p10791R68767K00541l024197j941800R73093
$$ 112921839 113158599 114151742 114243245 113532454 114501221 114701762 111677565 109735765 110708858
4306A10708858R529j032797J431750J41970K252690J972718k428911m22841n76397
$$ 110708858 110718387 109685590 111117340 111259310 113512000 115484718 113055807 112632966 112056569
4297A12056569J744278J630330j446265k779346j395044J61284K178002K098106
$$ 112056569 113800847 115431177 113984912 111205566 109810522 109971806 112149808 114247914
4289A14247914m77635J859146j115069k4315O10696r48551M52937k535034l66013
$$ 114247914 113770279 115629425 114514356 114490041 115100737 114152186 114605123 112070089 111704076
4280A11704076K324996p58220j106989q10506L29262L927155J163685j176152
$$ 111704076 114029072 113270852 112163863 111353357 111682619 115609774 116773459 115597307
4272A15597307k42950K963111n17492j254907J310459j837254j028330J113909
$$ 115597307 115354357 118317468 117799976 116545069 117855528 116018274 114989944 116103853
4264A16103853k87892J634234j091998J194638J153474J597743N02067j697566
$$ 116103853 115815961 117450195 116358197 117552835 118706309 120304052 120806119 119108553
4256A19108553J386392o16448M85566j222808j960712K259783J913957O36045
$$ 119108553 120494945 119878497 120364063 119141255 117180543 119440326 121354283 121990328
4248A21990328j345938M72865P34449O22978j006012K009040L535214k64036m15200
$$ 121990328 120644390 121117255 121851704 122474682 121468670 123477710 127012924 126748888 126333688
4239A26333688m02269P21501J101129j11246K25226K246998j462140J39232J155054
$$ 126333688 125931419 126652920 127754049 127642803 127868029 130115027 128652887 128792119 129947173
4230A29947173Q49763l59963l01595p77118m79182K064106L169003j24613k314426
$$ 129947173 130796936 130436973 130135378 129358260 128879078 130943184 134112187 133987574 131673148
4221A31673148J324781M825436P07722r29501M05773N93033L002201N93100j029086
$$ 131673148 132997929 137823365 138531087 137601586 138007359 138600392 141602593 142195693 141166607
4212A41166607k10717J934961K945298n53940l096924P94614M016743L066997
$$ 141166607 140955890 142890851 145836149 145282209 142185285 142979899 146996642 150063639
4204A50063639N27750j348366k253523N14281K766559J343639j805792M70172
$$ 150063639 150591389 149243023 146989500 147503781 150270340 151613979 149808187 150278359
4196A50278359K319931K033969J490151M3298J401763K88248K893472Q94488j39800
$$ 150278359 152598290 154632259 156122410 156165708 157567471 157855719 160749191 161643679 161503879
4187A61503879r7638N95898K062388J022785j768189n57217K506755L344712o0508
$$ 161503879 161406241 162002139 164064527 165087312 163319123 162761906 165268661 168613373 168552865
4178A68552865j331897J039974J157041K081026J131798m67251k83142L652231
$$ 168552865 167220968 168260942 169417983 171499009 172630807 172163556 171880414 175532645
4170A75532645J565172l746223M27981K692848P30905o1180L53421M16172R82638
$$ 175532645 177097817 173351594 173779575 176472423 177203328 177142148 177495569 177911741 178894379
4161A78894379K907693j110447j048591Q96514J619665K238309N41758K81219
$$ 178894379 181802072 180691625 179643034 180539548 182159213 184397522 184939280 185220499
4153A85220499K703830j134960J114674Q90954o98674K38298K679524n45493k998295
$$ 185220499 187924329 186789369 187904043 188794997 188096323 188334621 191014145 190468652 187470357
4144A87470357K21733K302874J634487j23613l62016j521147R27851L062671Q33524
$$ 187470357 187692090 189994964 191629451 191505838 191143822 189622675 190550526 193613197 194446721
4135A94446721j358723J187266J590148o7615j179700M33930O62598J651665k611246
$$ 194446721 193087998 194275264 195865412 195797797 194618097 195052027 195714625 197366290 194755044
4126A94755044q3716r22825K601065K480304k89814k06488J61026J204971K68385
$$ 194755044 194671328 193748503 196349568 198829872 198540058 198333570 198494596 199699567 199967952
4117A99967952j207618P38221p73664j734211M55926K25480P81380P49952J159793
$$ 199967952 198760334 199498555 198724891 196990680 197446606 197672086 198453466 199203418 200363211
4108B00363211j938499J223674L11629o62586N08900J275713k141934J285088
$$ 200363211 198424712 199648386 199960015 199297429 199806329 201082042 198940108 200225196
4100B00225196l97734P07234K45273k180483j383138J625034P45289q74616J383032
$$ 200225196 199827462 200534696 200779969 198599486 197216348 198841382 199586671 198712055 200095087
4091B00095087M8774L9832j406328P47431j498326k1430J65435Q53851J458040
$$ 200095087 200143861 200183693 198777365 199524796 198026470 198005040 198170475 199024326 200482366
4082B00482366M90519J363252k468907J75105j403641Q12682Q85481J687594N72706
$$ 200482366 200972885 202336137 199867230 200042335 198638694 199451376 200336857 202024451 202597157
4073B02597157n44393q32473j986165K36178L97894J90195n23827N44263L94840
$$ 202597157 202052764 201220291 199234126 199470304 199868198 200058393 199534566 200078829 200473669
4064B00473669j145427Q8778J33074j852674J647941P78627m48522L81821M99027
$$ 200473669 199328242 199417020 199550094 197697420 199345361 200123988 199675466 200057287 200556314
4055B00556314O21651J43633J337118p35694j431803l27443Q21328l6467j624616
$$ 200556314 201177965 201321598 202658716 201923022 200491219 200163776 200985104 200948637 199324021
4046A99324021K336315J888211j67550n00663j982435j60922J298282K63224j562116
$$ 199324021 201660336 203548547 203380997 202880334 200897899 200736977 202035259 202298483 200736367
4037B00736367j12837Q67089j357511K875528L67311J281119M72073j326837j625331
$$ 200736367 200623530 201490619 200133108 203008636 203375947 204657066 205129139 203802302 202176971
4028B02176971p16323J37666M64990J397549L018606n37441r56612J709247J035775
$$ 202176971 201460648 201598314 202063304 203460853 206479459 205942018 204985406 206694653 207730428
4019B07730428j331242M21431O16674j040175L09379K382723J40391j532863K308459
$$ 207730428 206399186 206820617 207437291 206397116 206706495 209089218 209229609 207696746 210005205
4010B10005205J362628j314055J666305J168313K512613N75616J42997Q57943
$$ 210005205 211367833 210053778 211720083 212888396 215401009 215976625 216119622 216977565
4002B16977565k301062P71687j93088J082814P48321o12380K924207R45184J886396
$$ 216977565 214676503 215448190 215255102 216337916 217086237 216473857 219398064 220343248 222229644
3993B22229644M44763p67889J772381P89918m55333l81543K183112L74883J940246
$$ 222229644 222674407 221906518 223678899 224468817 224013484 223631941 225815053 226189936 228130182
3984B28130182j490255J955703K743828J940520J273569L63021M40707J105135
$$ 228130182 226639927 228595630 231339458 233279978 234553547 234916568 235357275 236462410
3976B36462410K845534N31590n74599j061504J482443L955443L326084p41974
$$ 236462410 239307944 239839534 239264935 238203431 239685874 243641317 246967401 246225427
3968B46225427K047308J783499Q24373J257095q55188K428941J755857J530192
$$ 246225427 248272735 250056234 250880607 252137702 251282514 253711455 255467312 256997504
3960B56997504J364782P6644L070106J681917K58649J357175K080595l55925R41393
$$ 256997504 258362286 258438930 261509036 263190953 263449602 264806777 266887372 266531447 267472840
3951B67472840M420117J095927j969023K004340K324456l33868P60777R72834
$$ 267472840 271892957 272988884 271019861 273024201 275348657 275014789 275775566 276748400
3943B76748400K942079K969024K699701K011925J390914j98958n86969J123424
$$ 276748400 279690479 282659503 285359204 287371129 288762043 288563085 287976116 289099540
3935B89099540L783644K798574l36621N67220J123603K137665K359621K023849
$$ 289099540 292883184 295681758 295345137 295912357 297035960 299173625 301533246 303557095
3927C03557095J792507L459992L247839k432705l342786J419829L190413J413268
$$ 303557095 305349602 308809594 312057433 309624728 306281942 307701771 310892184 312305452
3919C12305452P96827n47866J554118J275410L69357K188289K656518K278672
$$ 312305452 313102279 312554413 314108531 315383941 315753298 317941587 320598105 322876777
3911C22876777J260727K8543m75773l017132K34598J504911M00699J117236P5004
$$ 322876777 324137504 324166047 323690274 320673142 320907740 322412651 322813350 323930586 324005590
3902C24005590o20495J35766M37993k354975K69830P62299j480720m43192l018619
$$ 324005590 323385095 323520861 323958854 321603879 321873709 322636008 321155288 320712096 317693477
3893C17693477M57866J088823M87350N130j04916j156823q94338l551223p43880
$$ 317693477 318151343 319240166 319727516 319732646 319627730 318470907 317576569 314025346 313281466
3884C13281466q74410j127748J066501j498567j240227p98115k448888l437522
$$ 313281466 312407056 311279308 312345809 310847242 309607015 308808900 306360012 302922490
3876C02922490m523093j414522J009691k53492j238828l978669M40525k375884
$$ 302922490 298399397 296984875 297994566 297741074 296502246 292523577 292964102 290588218
3868B90588218j348271j528113L6746q18984l142347j428828k188208o35252j51821
$$ 290588218 289239947 287711834 287748580 286929596 283787249 282358421 280170213 279534961 279383140
3859B79383140q90107j873608l771131k059839m61785j306798k285381n187718
$$ 279383140 278493033 276619425 272848294 270788455 270326670 269019872 266734491 261546773
3851B61546773j432046N62921J096341k423480m194323Q28871j148099l460637
$$ 261546773 260114727 260677648 261773989 259350509 255156186 255985057 254836958 251376321
3843B51376321j951819k504044j469461j99599j187361p14365k686583R4616N77580
$$ 251376321 249424502 246920458 245450997 245251398 244064037 243349672 240663089 240757705 241335285
3834B41335285k794316l413705l949351j592261k375539j072374n06274J00270
$$ 241335285 238540969 235127264 231177913 229585652 227210113 226137739 225631465 225731735
3826B25731735k287400l490175O12835k876595j547221l22444k19723k905647
$$ 225731735 223444335 219954160 220566995 217690400 216143179 215820735 215601012 212695365
3818B12695365k691233j452449j724614l142494l330999j401152J242266j738646
$$ 212695365 210004132 208551683 206827069 203684575 200353576 198952424 200194690 198456044
3810A98456044j376469k823935j722497P18909j147242k192952j123541k912692
$$ 198456044 197079575 194255640 192533143 193252052 192104810 189911858 188788317 185875625
3802A85875625R17087k626052m428360l458230j684015O79980J140336l087914
$$ 185875625 186792712 184166660 179738300 176280070 174596055 175276035 176416371 173328457
3794A73328457l707975N36960n54153l84522j79281k670999l133115j422037k577116
$$ 173328457 169620482 170157442 169603289 169218767 169039486 166368487 163235372 161813335 159236219
3785A59236219j810424j958864k226503j029939N57247Q47908j509799p60165
$$ 159236219 157425795 155466931 153240428 152210489 152767736 153615644 152105845 151345680
3777A51345680R21978L07720j442122k633464k987461k170464j313546n78326
$$ 151345680 152267658 152575378 151133256 148499792 145512331 143341867 142028321 141449995
3769A41449995l44704j015960k047342l283070J674437j228521j684542j437340
$$ 141449995 141105291 140089331 138041989 134758919 136433356 135204835 133520293 132082953
3761A32082953j900607n53886o53432l04366k260086k118078L68642q16247j24862
$$ 132082953 130182346 129628460 128975028 128670662 126410576 124292498 124661140 123844893 123720031
3752A23720031j861390l99180K02002n16408j814763l092141K72370l155736M69777
$$ 123720031 121858641 121459461 121661463 121145055 119330292 116238151 116510521 113354785 113824562
3743A13824562J002826m197398m52143n5953m98411l276573q69994M22299J559373
$$ 113824562 114827388 110629990 110177847 110121894 109623483 106346910 105476916 105899215 107458588
3734A07458588k694766j951921J30533q99100K87060O05336l629442k414302K036010
$$ 107458588 104763822 102811901 102942434 102043334 102330394 102935730 99306288 96891986 98927996
3725I8927996L214579P57127j441913k650857l504648r05010j568330k995141
$$ 98927996 102142575 102899702 101457789 98806932 95302284 94397274 92828944 89833803
3717H9833803K237179J667808k54935p03790l60011j51534j095430p2969q24657
$$ 89833803 92070982 93738790 93483855 92780065 92420054 92268520 91173090 91100121 90275464
3708I0275464n30856O28047r60968j347165M78736k74182k994501J037024J486948
$$ 90275464 89744608 90372655 89411687 88064522 88543258 88269076 85274575 86311599 87798547
3699H7798547o86986k936350j093077K027140l175403k200836k857061K529167
$$ 87798547 87111561 84175211 83082134 85109274 81933871 79733035 76875974 79405141
3691G9405141q64848l341582L639724K42934q04259J47820j650096R21936K299902
$$ 79405141 78540293 75198711 78838435 79081369 78277110 78424930 76774834 77696770 79996672
3682G9996672k446523j615057m26489k756208J100323J88879l418851J511611
$$ 79996672 77550149 75935092 75508603 72752395 73852718 74041597 70622746 72134357
3674G2134357L77674r41993J449223P01321k226215J155512j682059j438381k00970
$$ 72134357 72512031 71570038 73019261 73720582 71494367 72649879 70967820 69529439 69328469
3665F9328469k75355l99224Q77889k84607j215399j489564r52800K316915j220387
$$ 69328469 69053114 68653890 69531779 69247172 68031773 66542209 65589409 67906324 66685937
3656F6685937J467050J667909J529748m425569k076268j097009j250197K293713
$$ 66685937 68152987 69820896 71350644 66925075 64848807 63751798 62501601 64795314
3648F4795314j468519R38490Q36149O97238k4703k601068j65825N0876Q3984k938397
$$ 64795314 63326795 64265285 65101434 65798672 65773969 63172901 63007076 63057952 63141936 60203539
3638F0203539K351660l91960j531675k0543J66254N26683n22185m66022k05548
$$ 60203539 62555199 62163239 60631564 60611021 60777275 61303958 60781773 60315751 60110203
3629F0110203j616935P90303J870601m22985j044288j712331j146688O14760j84967
$$ 60110203 58493268 59283571 61154172 60731187 59686899 57974568 56827880 57442640 57257673
3620E7257673J635968J412960J032202j827957k032686M52553j532139q26459
$$ 57257673 58893641 60306601 61338803 59510846 57478160 57930713 56398574 55572115
3612E5572115K084503J110945O20211n63683O1011J084793J5094k566246k576636
$$ 55572115 57656618 58767563 59387774 58824091 58885102 59969895 59984989 57418743 54842107
3603E4842107K37852J011250o69161K872332K563354k146491Q73137k419639q79580
$$ 54842107 55079959 56091209 55422048 58294380 60857734 58711243 59584380 57164741 56285161
3594E6285161J772552q26623J243115R94035k48245r77454L34988n36403j912593
$$ 56285161 58057713 57231090 58474205 59468240 59219995 58242541 58577529 58041126 56128533
3585E6128533l048275M44362L680641J313197j82397j772983j526345P92327r13593
$$ 56128533 53080258 53524620 57205261 58518458 58336061 56563078 55036733 55829060 54915467
3576E4915467J257755m50689m53618K073524j16688j062051j345952O46516K950594
$$ 54915467 56173222 55722533 55268915 57342439 57225751 56163700 54817748 55464264 58414858
3567E8414858J518747o21779J897489m68542j154679k354836K149339j30058l67577
$$ 58414858 59933605 59311826 61209315 60740773 59586094 57231258 59380597 59250539 58882962
3558E8882962M0472K88399o43530k325003j341842J559250J428058J459186L36409
$$ 58882962 58923434 59211833 58568303 56243300 54901458 56460708 57888766 59347952 59684361
3549E9684361P45716j047388k453450J657690K139531j414537O67669J69759K02148
$$ 59684361 60430077 59382689 56929239 58586929 60726460 59311923 59979592 60149351 60351499
3540F0351499K064093r09698j250219m52683J842552K027427m40931L06462O58909
$$ 60351499 62415592 61505894 60255675 59802992 61645544 63672971 63232040 63538502 64197411
3531F4197411N68103j498945k43623J915711j236578J40745r32914j237641M77432
$$ 64197411 64765514 63266569 63022946 64938657 63702079 63842824 62909910 61672269 62149701
3522F2149701n53983M086274J128957p43295Q58240J835152j28495O5207M24256
$$ 62149701 61595718 65681992 66810949 66067654 66925894 68761046 68632551 68697758 69122014
3513F9122014O34257j162481k270274J078296j50107N15253J364892P14110q47679
$$ 69122014 69756271 68593790 66323516 67401812 67251705 67766958 69131850 69845960 68998281
3504F8998281M27218J160224k93408j342283J700566J684778J011418j20978N30276
$$ 68998281 69425499 70585723 70292315 68950032 70650598 72335376 73346794 73225816 73756092
3495G3756092Q36740O473m86116n76453m06258L68337j603593K729916n67891
$$ 73756092 74592832 74599305 74113189 73536736 73130478 73498815 71895222 74625138 74057247
3486G4057247o83803J14291P62506J874726j60770q87567m65136K073924M08768
$$ 74057247 73373444 73487735 74250241 76124967 75964197 75076630 74611494 76685418 77094186
3477G7094186J075809j521521L0885O86982M12126k674963P83553J125987j619475
$$ 77094186 78169995 76648474 76679359 77366341 77778467 75103504 75887057 77013044 75393569
3468G5393569J166321j283126Q63786m23058l020616M12277J360084J184120K75219
$$ 75393569 76559890 75276764 76140550 75717492 72696876 73109153 74469237 75653357 75928576
3459G5928576K62806p49580n88330K56917m28700j883478j080228K098067K5038
$$ 75928576 76191382 75441802 74853472 75110389 74681689 72798211 71717983 73816050 73841088
3450G3841088j593569m74180K70646j015778q68867J644185J010059j254072l942862
$$ 73841088 72247519 71773339 72043985 71028207 70159340 71803525 72813584 71559512 67616650
3441F7616650J957870J91401j879138j10829J590200q74056j938500j332436J202262
$$ 67616650 69574520 69765921 67886783 67775954 69366154 68492098 66553598 65221162 66423424
3432F6423424J762770M85138n78476j162837M35099Q30897P41522k133419j805761
$$ 66423424 68186194 68671332 68092856 66930019 67365118 68196015 68937537 66804118 64998357
3423F4998357R96522N96140j447239O4495L49158J223228L2990K039474m4187
$$ 64998357 65994879 66591019 65143780 65208275 65557433 66780661 66813651 68853125 68808938
3414F8808938k753403j727543J288151J086354r73872n21531j14924K766707Q27210
$$ 68808938 66055535 64327992 65616143 66702497 65728625 65207094 65092170 67858877 68686087
3405F8686087k133857j753155n19687K166057L35035j323232k745546j852680
$$ 68686087 66552230 64799075 64279388 66445445 66780480 65457248 62711702 60859022
3397F0859022o29617Q25429j53674J530031k98858N33500J285837q68691j481941
$$ 60859022 60229405 61054834 60901160 62431191 62132333 62665833 63951670 63082979 61601038
3388F1601038J949694k48041n64322p1157m48889m99502J312590j922146j83000
$$ 61601038 63550732 63302691 62738369 62667212 62218323 61718821 63031411 61109265 60926265
3379F0926265J213459j033824r06176k13915J380229k068710J60744K313974j216378
$$ 60926265 62139724 61105900 60199724 59985809 61366038 59297328 59458072 61772046 60555668
3370F0555668p98449r89088K89190J580796J406238J471686k843037m48806J246305
$$ 60555668 59757219 58768131 59057321 60638117 62044355 63516041 60673004 60224198 61470503
3361F1470503j70618k352861J931289J262426p92109o33276q31926K348689P01002
$$ 61470503 61299885 58947024 60878313 62140739 61348630 60715354 59883428 62232117 62933119
3352F2933119l22108j042160L42676j011206m91943L97877k021782P72303R07847
$$ 62933119 62611011 61568851 61911527 60900321 60408378 60806255 58784473 59556776 60464623
3343F0464623o0461q50794n1400r71588J40728K400460L64965l66021J827040
$$ 60464623 60404162 59553368 59501968 58530380 58671108 61071568 61436533 61070512 62897552
3334F2897552j584018l111192l3075L69001K342017P9005j272080j004384J954227
$$ 62897552 61313534 58202342 58169267 58538268 60880285 60959290 59687210 58682826 60637053
3325F0637053o89115J740214O65531m91593j14257O28047j380828q52614J588774
$$ 60637053 59947938 61688152 62353683 61862090 61747833 62375880 60995052 60142438 61731212
3316F1731212J40474O47790j082439M210283o74836J279880j168576r73788j3821
$$ 61731212 61871686 62519476 61437037 65647320 64972484 66252364 65083788 64110000 64096179
3307F4096179M17811j275577P69042R30668m64377r90879m41142J298540K683480
$$ 64096179 64513990 63238413 64007455 64938123 64473746 63482867 63041725 64340265 67023745
3298F7023745M06132l79533k469240P06786O02570J740665L788368k702844l196483
$$ 67023745 67429877 67050344 64581104 65287890 65890460 67631125 71419493 68716649 65520166
3289F5520166M74859N00177J350067J804412l37800J562400K501638k915533k125496
$$ 65520166 65995025 66495202 67845269 69649681 69311881 70874281 73375919 70460386 68334890
3280F8334890N87488L8497L07982J356946K525459o98835K40470j853863J411382
$$ 68334890 68922378 68960875 69268857 70625803 73151262 72452427 72692897 70839034 72250416
3271G2250416r1659J298628J284770K363086j687882l481243J287072o09735K916562
$$ 72250416 72158757 73457385 74742155 77105241 75417359 71936116 73223188 72613453 75530015
3262G5530015K049480r02249j5854J032754J996881K851514j535803N35666j352954
$$ 75530015 77579495 76677246 76661392 77694146 79691027 82542541 81006738 81542404 80189450
3253H0189450o93575K098097l0784K138726m91915j222137J509172J409357J023760
$$ 80189450 79495875 81593972 81563188 83701914 83209999 81987862 83497034 84906391 85930151
3244H5930151p31447j701837K376552J885256J292869k620529k33410K222398
$$ 85930151 85198704 83496867 85873419 87758675 89051544 86431015 86197605 88420003
3236H8420003p24767J823485j02773J448979M17469M59507K75538j759872R56507
$$ 88420003 87695236 89518721 89415948 90864927 91282396 91741903 92017441 90257569 91214076
3227I1214076K576624Q98533m96452J015081J247535K626203J529376j578183
$$ 91214076 93790700 94689233 94192781 95207862 96455397 99081600 100610976 99032793
3219I9032793p87690J683911J340169l55973L214028J17829l31927R60779L42840
$$ 99032793 98245103 99929014 101269183 100913210 104127238 104245067 103913140 104873919 105216759
3210A05216759R04004K98252J772901J391775L3331j295057J543008J970615J074450
$$ 105216759 106120763 106419015 108191916 109583691 109617022 108321965 109864973 111835588 112910038
3201A12910038J912230J652280J275542N33299M50512J589556Q43776K364797
$$ 112910038 114822268 116474548 117750090 118283389 118733901 120323457 121167233 123532030
3193A23532030J682787J472595p10800J760479L14369J707418K393385K58972
$$ 123532030 125214817 126687412 125976612 127737091 128051460 129758878 132152263 132411235
3185A32411235Q94590L126367J411043J599398Q98517J602444K573611M361703
$$ 132411235 133305825 136432192 137843235 139442633 140341150 141943594 144517205 148878908
3177A48878908j055332J167010J843698J552131J793431P99882O48446L823075
$$ 148878908 147823576 148990586 150834284 152386415 154179846 154979728 155628174 159451249
3169A59451249L047302J297644L383152j688755M083278L790558k5950L270554
$$ 159451249 162498551 163796195 167179347 165490592 169573870 173364428 173338478 176609032
3161A76609032L251488k04095L68918R59553M216367J199021L468030K694380
$$ 176609032 179860520 179656425 180025343 180984896 185201263 186400284 189868314 192562694
3153A92562694L033005J395642J980289M975629J221934j429202J352260M682714
$$ 192562694 195595699 196991341 198971630 203947259 205169193 203739991 205092251 209774965
3145B09774965L822729K932172L353887J360416K291660R13674J270487O184646
$$ 209774965 213597694 216529866 219883753 221244169 223535829 224449503 225719990 231904636
3137B31904636L012487M159886M057967L229433J710815L671087L078182M951513
$$ 231904636 234917123 239077009 243134976 246364409 248075224 251746311 254824493 259776006
3129B59776006K360648K885896L643752M716904N557180K265123K021640N590687
$$ 259776006 262136654 265022550 268666302 273383206 278940386 281205509 283227149 288817836
3121B88817836M973491J026192L765006L710836M875024J773878K271699M410140
$$ 288817836 293791327 294817519 298582525 302293361 307168385 308942263 311213962 315624102
3113C15624102L367145M621198N513314J637512J525032P335778P908598M625482
$$ 315624102 318991247 323612445 329125759 330763271 332288303 339624081 347532679 352158161
3105C52158161J201190J053504M268650M391406N461835M698849N114314M820204
$$ 352158161 353359351 354412855 358681505 363072911 368534746 373233595 378347909 383168113
3097C83168113K725845R17822L131850K551550K841967L177445L064907L249477
$$ 383168113 385893958 386811780 389943630 392495180 395337147 398514592 401579499 404828976
3089D04828976L082257L122877J378760L957394L928974L199484M410786L442269
$$ 404828976 407911233 411034110 412412870 416370264 420299238 423498722 427909508 431351777
3081D31351777L304166L241090M793802K659297K927159L422078J597530L459613
$$ 431351777 434655943 437897033 442690835 445350132 448277291 451699369 453296899 456756512
3073D56756512J371773m30130J494079J233853L878479J858381J442316o73326
$$ 456756512 458128285 457698155 459192234 460426087 464304566 466162947 467605263 466931937
3065D66931937n28547J563994J360433K012441r67945M81554J890982m57132K664942
$$ 466931937 466403390 467967384 469327817 471340258 470372313 470853867 472744849 472287717 474952659
3056D74952659J31851k061651p56296j944198j468439J758548l53227j381174
$$ 474952659 475084510 473022859 472266563 470322365 468853926 470612474 470259247 468878073
3048D68878073K79185K278551j128735j434770Q73265q46507K019335K352347
$$ 468878073 469157258 471435809 470307074 468872304 469745569 468899062 470918397 473270744
3040D73270744L29309j248355o76033K685993p7285j011891k624864K975961L555948
$$ 473270744 473600053 472351698 471675665 474361658 474284373 473272482 470647618 473623579 477179527
3031D77179527J137212J190486r98222K528366l93720K56466K81890j184771k054481
$$ 477179527 478316739 479507225 478509003 481037369 480643649 480900115 481182005 479997234 477942753
3022D77942753K051053K190870j241433o90135J006548m99059J098058j05132
$$ 477942753 479993806 482184676 480943243 480253108 481259656 480760597 481858655 481753523
3014D81753523j221668o5370J616948J486152k484472j849198r01591K008142
$$ 481753523 480531855 480466485 482083433 483569585 481085113 479235915 478334324 480342466
3006D80342466p10691k32942K776569k317060J557347L114480j157682k51762
$$ 480342466 479631775 479398833 482175402 479858342 481415689 484530169 483372487 483120725
2998D83120725J05197p90449r97914q14970J725571N31742j304711j953645l34169
$$ 483120725 483225922 482435473 481437559 480622589 482348160 482879902 481575191 479621546 479287377
2989D79287377K48436R64795J218290O43293J269311M67124M85991J450926k380760
$$ 479287377 479535813 480500608 481718898 482362191 483631502 484098626 484584617 486035543 483654783
2980D83654783r95757O3798p48906n77195j864181M14066l92083j267148Q38366
$$ 483654783 482659026 482722824 481973918 481396723 479532542 479946608 479554525 478287377 479125743
2971D79125743j042880q13400j055903l27670j923771j989529m83726L14996l762442
$$ 479125743 478082863 477269463 476213560 475885890 473962119 471972590 471488864 471803860 468041418
2962D68041418j243605m2950j340093l343020j301000j372182k28024j216120
$$ 468041418 466797813 466754863 465414770 462071750 460770750 459398568 459170544 457954424
2954D57954424k700218k083506l780999j343288J088200k961433k552534j951051
$$ 457954424 455254206 453170700 449389701 448046413 449134613 446173180 443620646 441669595
2946D41669595l768696K79765k302019k844036k618672l224043l650175n41642
$$ 441669595 437900899 438180664 435878645 433034609 430415937 427191894 423541719 423000077
2938D23000077k190022n171387k976539k588662j578887l399286l348236M61575
$$ 423000077 420810055 415638668 412662129 410073467 408494580 405095294 401747058 402208633
2930D02208633l341339l950390j869546m029659j850247n062647n987221j889518
$$ 402208633 398867294 394916904 393047358 389017699 387167452 382104805 376117584 374228066
2922C74228066j348329n09389k907281k605300j962820k351872m004454j360517
$$ 374228066 372879737 372370348 369463067 366857767 364894947 362543075 358538621 357178104
2914C57178104l365295n130603k125688o33959r38710l896704l102965k172408
$$ 357178104 353812809 348682206 346556518 345922559 344983849 341087145 337984180 335811772
2906C35811772j211766k025468l397110l172861j812174l401090k059561m352601
$$ 335811772 334600006 332574538 329177428 326004567 324192393 320791303 318731742 314379141
2898C14379141l705090m48856l313841o26319j694587p46864m52207k081779l009270
$$ 314379141 310674051 310225195 306911354 306285035 304590448 303843584 303391377 301309598 298300328
2889B98300328k156764k907l450688n879984j655287k843076j472854l724171
$$ 298300328 296143564 296140657 292689969 286809985 285154698 282311622 280838768 277114597
2881B77114597j842755r92672k343099l891834j054891k515688j680458m98047
$$ 277114597 275271842 274279170 271936071 268044237 266989346 264473658 262793200 262295153
2873B62295153j711766k332444l719992j030553j776609j880959k517898j716277
$$ 262295153 260583387 258250943 254530951 253500398 251723789 249842830 247324932 245608655
2865B45608655k215462o33300r76878k824187n91907k326052l430392m524460
$$ 245608655 243393193 242759893 241783015 238958828 238366921 236040869 232610477 228086017
2857B28086017r86123r08186j426167o28780k373422l210598o22941j729633k346601
$$ 228086017 227099894 226191708 224765541 224136761 221763339 218552741 217929800 216200167 213853566
2848B13853566j971130j134584L3876n92815k708950m259033j311064J689304
$$ 213853566 211882436 210747852 210781728 210188913 207479963 203220930 201909866 203599170
2840B03599170j716323j974621o44568k554134j721895r47900j05948k061243
$$ 203599170 201882847 199908226 199263658 196709524 194987629 194039729 193933781 191872538
2832A91872538l074407k569913J269016j651012l165986J197139n37530j76558
$$ 191872538 188798131 186228218 187497234 185846222 182680236 183877375 183339845 183163287
2824A83163287k477421k200604j910011j213260j451101j769468K53590n20977
$$ 183163287 180685866 178485262 176575251 175361991 173910890 172141422 172395012 171874035
2816A71874035R62826k832003p84906j082611J394449j68169k074986p28757p40154
$$ 171874035 172836861 170004858 169219952 168137341 169531790 169363621 167288635 166559878 165819724
2807A65819724p30404k685740n65237j31425k55395K31465j125889j436944j209852
$$ 165819724 165089320 162403580 161838343 161706918 161451523 161682988 160557099 159120155 157910303
2798A57910303j536286p08918J409647q8726K97075j071938j721871m85629l04860
$$ 157910303 156374017 155665099 157074746 156986020 157283095 156211157 154489286 154003657 153698797
2789A53698797j647101j53045L0368j055174N86943K711L90005m2245J07821Q94549
$$ 153698797 152051696 151898651 151929019 150873845 151460788 151463499 151853504 151811259 151919080 152813629
2779A52813629j615677J418027r08215j482353N7605J157464Q2854p70255J65225
$$ 152813629 151197952 152615979 151707764 150225411 150283016 151440480 151523334 150753079 150918304
2770A50918304K755564l30596q36646q35081n01911K4077L12575O95267j235473
$$ 150918304 153673868 153343272 152506626 151671545 151169634 151193711 151506286 152201553 150966080
2761A50966080r69968K821797q59803m66150J404806j016982j571690q24953K622789
$$ 150966080 149996112 152817909 151958106 151491956 152896762 151879780 150308090 149483137 152105926
2752A52105926q99326N31620J546497N8360l68197K17398L11507J845760L5239
$$ 152105926 151206600 151738220 153284717 153343077 152974880 153192278 153503785 155349545 155384784
2743A55384784Q88111m7064J577823L4682J092696J962933R81795j687983Q75583
$$ 155384784 156272895 156225831 157803654 157838336 158931032 160893965 161875760 160187777 161063360
2734A61063360N57384l3491L000959J097987J529743J117766j584575J681437
$$ 161063360 161620744 161587253 164588212 165686199 167215942 168333708 166749133 168430570
2726A68430570M361016o24407p62056J419978K684528K103897O05897o16826J805825
$$ 168430570 172791586 172167179 171405123 172825101 175509629 177613526 178219423 177602597 179408422
2717A79408422J874917J178232j587903P25066J545946J587290K708190J317534
$$ 179408422 181283339 182461571 180873668 181598734 183144680 184731970 187440160 188757694
2709A88757694r19714N02262L158464L803440O86693m9505R92092M143119j438312
$$ 188757694 187837980 188340242 191498706 195302146 195988839 195939334 196931426 201074545 199636233
2700A99636233K31531J459654L552251M664492J88129J337832J273207J341856
$$ 199636233 199867764 201327418 204879669 209544161 209732290 211070122 212343329 213685185
2692B13685185P08049M39872J756379J613652R13825M346939J363034K159574
$$ 213685185 214393234 214833106 216589485 218203137 219116962 223463901 224826935 226986509
2684B26986509J593496K572219J590879P40315Q98049J381344L072627K402491
$$ 226986509 228580005 231152224 232743103 233483418 234381467 235762811 238835438 241237929
2676B41237929J87931J086020K685005K988267J322835J876218J295668L316030
$$ 241237929 241425860 242511880 245196885 248185152 249507987 251384205 252679873 255995903
2668B55995903M99025P09163J903698Q24562K206685L604101R36800J239568K304050
$$ 255995903 256494928 257204091 259107789 259932351 262139036 265743137 266679937 267919505 270223555
2659B70223555K257023K002660O89695k53969L690561K291465N57969L405578
$$ 270223555 272480578 274483238 275172933 274918964 278609525 280900990 281458959 284864537
2651B84864537n13385J212364L203016J064018M52817J51606L052579L731882
$$ 284864537 284351152 285563516 288766532 289830550 290283367 290434973 293487552 297219434
2643B97219434J220391r75035M09343L226122J802769N00841j8603J173975K7285
$$ 297219434 298439825 297464790 297874133 301100255 302903024 303403865 303385262 304559237 304586522
2634C04586522J035473J163762Q48611J658079J248185K849197q84241J254245
$$ 304586522 305621995 306785757 307634368 309292447 310540632 313389829 312505588 313759833
2626C13759833l64794J631078j089691j153511J153809j405740p68948J528634
$$ 313759833 313395039 315026117 313936426 312782915 313936724 312530984 311762036 313290670
2618C13290670O87186j253833J051703P52358K15645m47652j08584j557003j387052
$$ 313290670 313977856 312724023 313775726 314528084 314743729 314296077 314187493 312630490 311243438
2609C11243438O94846q64177j007239j329294k488045K034396O84620L33400j915238
$$ 311243438 311938284 311074107 310066868 308737574 306249529 308283925 308968545 309301945 307386707
2600C07386707l536144k775832o72394K07192l6952j052481M02969R5636j153175
$$ 307386707 303850563 301074731 300402337 300609529 300572577 299520096 299923065 300018701 298865526
2591B98865526l41996l795340k265433M86553j429221o80274j523369k548772
$$ 298865526 298523530 294728190 292462757 292949310 291520089 290839815 289316446 286767674
2583B86767674k5202o6548m048909j908977m154592j84032j97710l642243o89666
$$ 286767674 286742472 286675924 282627015 280718038 276563446 276379414 276181704 272539461 271849795
2574B71849795k156040q90725j2251j914863k471974j687963j889886k725760
$$ 271849795 269693755 268803030 268790779 266875916 264403942 262715979 260826093 258100333
2566B58100333l861836J100467k11497k817273m52360j792647k007713k250900
$$ 258100333 254238497 255338964 255127467 252310194 251857834 250065187 248057474 245806574
2558B45806574p9554l576599k719114j245775r36639j561396k610885r77076p91837
$$ 245806574 245727020 242150421 239431307 238185532 237248893 235687497 233076612 232099536 231307699
2549B31307699j160308r68741m400701j610970j717425j252760j545105k538021
$$ 231307699 230147391 229178650 224777949 223166979 221449554 220196794 218651689 216113668
2541B16113668k359752m69037K87884k653081m812410j728224j315675j671682
$$ 216113668 213753916 213284879 213572763 210919682 206107272 204379048 203063373 201391691
2533B01391691L03768k604890m503317j908149m58019j812294l298173l199080
$$ 201391691 201695459 199090569 194587252 192679103 192221084 190408790 187110617 183911537
2525A83911537M48594L15509j683165o47805l107700j891496k169063j154327
$$ 183911537 184360131 184675640 182992475 182344670 179236970 177345474 175176411 174022084
2517A74022084j488153j452365k159064l993970O82571j905846k222322l591123
$$ 174022084 172533931 171081566 168922502 164928532 165611103 163705257 161482935 157891812
2509A57891812k169429q39182L08094j860178j704999k217792p13804P97968k340802
$$ 157891812 155722383 154883201 155191295 153331117 151626118 149408326 148694522 149492490 147151688
2500A47151688k751682j579824j747757j470718k626235L61358n8657k525879
$$ 147151688 144400006 142820182 141072425 139601707 136975472 137336830 137278173 134752294
2492A34752294j725591j03654j486586k43771j565499k233635j361586j642866
$$ 134752294 133026703 132923049 131436463 131192692 129627193 127393558 126031972 124389106
2484A24389106k870551j428949O24048j035336k987977l18670n00200K13475j296867
$$ 124389106 121518555 120089606 120713654 119678318 116690341 116371671 115871471 116084946 114788079
2475A14788079j522289K26661j66208l103982k920064p7036O75171j611542j438784
$$ 114788079 113265790 113492451 113326243 110222261 107302197 107225161 107900332 106288790 104850006
2466A04850006q05260k085794q4844p93570k232995m309196l8073L89148r24858
$$ 104850006 104044746 101958952 101874108 101080538 98847543 94538347 94500274 94889422 93964564
2457I3964564r4779k664151l22384K60121j715726q25716j215120L201586k103727
$$ 93964564 93869785 91205634 90883250 91143371 89427645 88601929 87386809 90588395 88484668
2448H8484668k118128K301842k552664k453080j229969j718187j517767k516731
$$ 88484668 86366540 88668382 86115718 83662638 82432669 80714482 79196715 76679984
2440G6679984N09415J468815n1158p34314n90418j263720j117434r50365k074825
$$ 76679984 77189399 78658214 78607056 77872742 77282324 76018604 74901170 73950805 71875980
2431G1875980Q60177J44999k198340j192055K37079j670862K04007K56155n07467
$$ 71875980 72736157 72881156 70682816 69490761 69727840 68056978 68260985 68517140 68009673
2422F8009673j226597j556124N69211K0126q68112j399798P02195J160715j775099
$$ 68009673 66783076 65226952 65796163 65816289 64948177 63548379 64250574 65411289 63636190
2413F3636190j166698j287737j195972r91152J046913O13269m78254K7154j530921
$$ 63636190 62469492 61181755 59985783 58994631 60041544 60654813 60176559 60203713 58672792
2404E8672792k248930j538022m28640K74593J510876r4360Q33042k11383j818275
$$ 58672792 56423862 54885840 54457200 54731793 56242669 56148309 56981351 56769968 54951693
2395E4951693M0942k128731L45054J593732N89253l167519j002413J283476L37293
$$ 54951693 54992635 52863904 53208958 54802690 55391943 52224424 51222011 52505487 52842780
2386E2842780k144127l355920J417599J467282K524240n84236j610670k165809
$$ 52842780 50698653 47342733 48760332 50227614 52751854 52167618 50556948 48391139
2378D8391139k447802k061183k046079j505888J812136L218114K458116j539100
$$ 48391139 45943337 43882154 41836075 40330187 42142323 45360437 47818553 46279453
2370D6279453K50042j173540O91620Q08276l247060r66066J134829N09276j031681
$$ 46279453 46529495 45355955 46047575 46855851 43608791 42642725 43777554 44286830 43255149
2361D3255149J08029j33045K68475J487524j281788k621577l19177L149842J671506
$$ 43255149 43363178 43230133 43498608 44986132 43704344 41082767 40763590 43913432 45584938
2352D5584938r56918l450698j702138L94811M13321J90653l562341Q31682K590283
$$ 45584938 44628020 41177322 39475184 39869995 40283316 40473969 36911628 37743310 40333593
2343D0333593K06672m88835r32921J959368J59016n58764k275211N05637o31367
$$ 40333593 40540265 40051430 39118509 41077877 41236893 40678129 38402918 38908555 38277188
2334C8277188N9727l38562j163698n91367J114978J856371k962395l10868m12883
$$ 38277188 38336915 37998353 36834655 36243288 37358266 39214637 36252242 35941374 35528491
2325C5528491Q2689J321875l59415J709867n79192j356910m1046k229936j604240
$$ 35528491 35611180 36933055 36573640 38283507 37704315 36347405 36306359 34076423 32472183
2316C2472183J265307K476012R39615j74978k129093J78751k201611P37436k396600
$$ 32472183 33737490 36213502 37153117 36978139 34849046 35027797 32826186 33563622 31167022
2307C1167022P62605K215655J841804m14388q99987J589132l98659k628424j247299
$$ 31167022 31929627 34145282 35987086 35572698 34672711 36261843 35863184 33234760 31987461
2298C1987461n34124r47268p21909J757545j05585j407591J883411J424481j51786
$$ 31987461 31453337 30506069 29784160 31541705 31436120 30028529 31911940 33336421 33184635
2289C3184635n84112R82635J23843Q768l066710q40881R07621n62323k672472
$$ 33184635 32600523 33583158 33707001 33715769 30649059 29808178 30715799 30153476 27481004
2280B7481004m3621J825388J616330r17548k838033J39563L319558j331195j81013
$$ 27481004 27437383 29262771 30879101 29961553 27123520 27263083 30582641 29251446 29070433
2271B9070433N87205J92294r60038Q04719Q67114j987581j36333K151459j692503
$$ 29070433 29657638 29849932 28889894 29694613 30561727 28574146 28437813 30589272 28896769
2262B8896769j130811p56465O7251K618879M40996J177432j428342j387210n49839
$$ 28896769 27765958 27009493 27076744 29695623 30136619 31314051 29885709 28498499 27948660
2253B7948660K866802l28614k411307k566640K642901K561520j925876j013331
$$ 27948660 30815462 30486848 28075541 25508901 28151802 30713322 28787446 27774115
2245B7774115O80742j275862J93991n20163J48111J023744O41208k21151l37874
$$ 27774115 28454857 27178995 27372986 26852823 27000934 28024678 28665886 28444735 28106861
2236B8106861j790290L92034j109796K282919P52641k087741q89574P56441K95390
$$ 28106861 26316571 26708605 25598809 27881728 28634369 26546628 25657054 26413495 26708885
2227B6708885j397627K22459k052224O99601R93448K411913m31826K697599j149665
$$ 26708885 25311258 25533717 23481493 24181094 25174542 27586455 27154629 29852228 28702563
2218B8702563l466242M43045r06717j293297L03026m85592K79252R33809n56926
$$ 28702563 25236321 25679366 24772649 23479352 23782378 23296786 23576038 24509847 23952921
2209B3952921k661136J924999K56547R65333J214845j663174p94882M16918J900934
$$ 23952921 21291785 23216784 23473331 24438664 25653509 23990335 23195453 23612371 25513305
2200B5513305R42398j952284l25652P11246l456512n02412K164067J255650o20289
$$ 25513305 26455703 24503419 24177767 24889013 21432501 20930089 23094156 24349806 23729517
2191B3729517j597382P15709R83705m39259m26899j219371r73545o36225K851714
$$ 23729517 22132135 22847844 23831549 23392290 22965391 21746020 20772475 20136250 22987964
2182B2987964K064349l365368j010942J579674m70346j435413M41190k69222J172046
$$ 22987964 25052313 21686945 20676003 22255677 21785331 20349918 20791108 20521886 21693932
2173B1693932K699225J472015j644177k547246K832262n03944M59537l22927j751335
$$ 21693932 24393157 25865172 24220995 21673749 24506011 24002067 24461604 24138677 22387342
2164B2387342M14787J518050j492873l195041m98747J337956R6698J088265j2470
$$ 22387342 22802129 24320179 22827306 19632265 19133518 20471474 20568172 21656437 21643967
2155B1643967j759137N40908J672717O19186j700976j463162j66673N7101j975643
$$ 21643967 19884830 20425738 22098455 22717641 21016665 19553503 19386830 19443931 17468288
2146A7468288l45584J638481K057193K75082j013298P88838O00218j122973M363
$$ 17468288 17122704 18761185 20818378 21093460 20080162 20869000 21469218 20346245 20350608
2137B0350608p29431P77614P6085m99593p42899L07221j291311J958637J683277
$$ 20350608 19621177 20398791 20474876 19975283 19232384 19539605 18248294 20206931 21890208
2128B1890208j10288J046705J156914m51370N32R02941j022629j712271j666488
$$ 21890208 21779920 22826625 23983539 23532169 23532701 24435642 23413013 21700742 20034254
2119B0034254J502250o0609k47933P6200J9293O08035j102355n69998N70672J80905
$$ 20034254 21536504 21475895 21227962 21304162 21323455 21931490 20829135 20259137 20829809 21010714
2109B1010714p19499l60905r84854j683343K263528M56251q30279J163201R46435
$$ 21010714 20291215 19930310 18945456 17262113 19525641 19981892 19151613 20314814 21261249
2100B1261249L00678P14868L29868j371367j177597k26242K000438R98008k993000
$$ 21261249 21561927 22276795 22606663 21235296 20057699 19831457 21831895 22829903 19836903
2091A9836903l148638q4020M286773Q42096R57178R54512k68611j668406L44193
$$ 19836903 16688265 16604245 20891018 21733114 22690292 23644804 23376193 21707787 22051980
2082B2051980J52314k200745p47964J244087K119015J107300j017654r22778J486491
$$ 22051980 22204294 20003549 19255585 20499672 22618687 23725987 22708333 21785555 23272046
2073B3272046j502495p08443j063161p04836j24720N83407J931707M95002k75070
$$ 23272046 21769551 21061108 19997947 19293111 19168391 19751798 21683505 22178507 21903437
2064B1903437J60143k350375k51909l91625o0184L9460L198519n50681N87277
$$ 21903437 22063580 19713205 19461296 19069671 19009487 19048947 22247466 21696785 22284062
2055B2284062j060162j714140q11971n66884K217146J248971k416553J21993K785370
$$ 22284062 21223900 19509760 18697789 18130905 20348051 21597022 19180469 19302462 22087832
2046B2087832k683406k81449n31554J845357j11171r33463l60204N1541R63320
$$ 22087832 19404426 19122977 18591423 20436780 20325609 19392146 19031942 19083483 20046803
2037B0046803j174041j794145O73721r81556K926451m85358K34316K066052J03952
$$ 20046803 18872762 17078617 17752338 16770782 19697233 19211875 19446191 21512243 21616195
2028B1616195j886088l42150k249004J95555j50584j326073J010969J295374j221263
$$ 21616195 19730107 19387957 17138953 17334508 17183924 15857851 16868820 18164194 16942931
2019A6942931Q33739n19688k418027J067493M61789k63751R66477K19363K59043
$$ 16942931 17776670 17256982 14838955 15906448 16368237 16104486 17070963 17290326 17549369
2010A7549369p54872m10823J021352j643688O6838K051525j91642m851490J513126
$$ 17549369 16794497 16383674 17405026 15761338 15828176 17879701 17688059 12836569 14349695
2001A4349695J972881J335352m55605M77163j120531r39506j721360P49693k40506
$$ 14349695 16322576 17657928 17202323 17679486 16558955 15619449 13898089 14647782 14407276
1992A4407276r5372M51746k215034Q18338J280824L91921k173699N74069n9052
$$ 14407276 14311904 14763650 12548616 13366954 14647778 15039699 12866000 13440069 13381017
1983A3381017Q69013M89741J11408q44860o24030J928108j323829M80638J17132
$$ 13381017 14250030 14739771 14851179 14006319 13382289 15310397 13986568 14467206 14584338
1974A4584338j021355K53293p05169J0681l99668K261182R9335l99027R198k153470
$$ 14584338 13562983 13816276 13111107 13121788 12722120 14983302 15082637 14683610 14692808 12539338
1964A2539338J330700L06959o40695k664216k7574k24800J080753j193500O93779
$$ 12539338 13870038 14176997 13536302 10872086 10844512 10619712 11700465 10506965 11200744
1955A1200744K70402l2172J684264j674703m28038m40871O41279K588160J302003
$$ 11200744 11471146 11438974 13123238 11448535 11020497 10579626 11220905 13809065 15111068
1946A5111068n93882m416605l38113P58883K30843q53033l42368P19206n06496
$$ 15111068 14517186 10100581 9762468 10521351 10752194 9899161 9556793 10275999 9769503
1937I769503J097378J81084p07382k52004N40052K71990j40196k418721J049084
$$ 9769503 10866881 11047965 10340583 10088579 10628631 10900621 10760425 8341704 9390788
1928I390788o99085K246852j682516M68700O96772P1562p60790k304639J396742
$$ 9390788 8691703 10938555 9256039 9724739 10421511 10493073 9732283 7427644 8824386
1919H824386K30619M80949L38553O56246J213893o20060k069614j377167q79143
$$ 8824386 9055005 9535954 9874507 10530753 11744646 11124586 9054972 7677805 6798662
1910F798662J625630R08144j338094k93936Q08167L08256l04525j041567m40761
$$ 6798662 8424292 9332436 7994342 7700406 8508573 8816829 8512304 7470737 7029976
1901G029976J128908K278647j948842j686903Q07596k68403j334906j887989J587276
$$ 7029976 8158884 10437531 8488689 6801786 7609382 7340979 6006073 4118084 5705360
1892E705360l1535J210097p91124J664896K392141k737475J357271J554581l18812
$$ 5705360 5673825 6883922 6092798 7757694 10149835 7412360 8769631 10324212 10005400
1883A0005400k457947k483138l15986K055051j081401p22108J036380J311799
$$ 10005400 7547453 5064315 4748329 6803380 5721979 4999871 6036251 7348050
1875G348050j102509k67108K150063O12205j696900r69277k139855K09795K058936
$$ 7348050 6245541 5978433 8128496 8740701 7043801 6074524 3934669 4144464 6203400
1866F203400j073234o67222J032712r8082N16516k695400o75749L210823J73755
$$ 6203400 5130166 4462944 5495656 5397574 5914090 3218690 2542941 5753764 5927519
1857E927519J204770j47085l86711j156103Q05806k30428J58928J247640k55016
$$ 5927519 7132289 6985204 6598493 5442390 6248196 6017768 6176696 7424336 7169320
1848G169320J241959j732653k584520o20364L07585K511356j682422N63507j310052
$$ 7169320 8411279 6678626 4094106 3473742 3781327 6292683 4610261 5173768 3863716
1839C863716m88172N48109R48019j031580k591752K144396L260854R79946j029620
$$ 3863716 3375544 3923653 4871672 3840092 1248340 3392736 6653590 7633536 6603916
1830F603916n20539J121624K70562J042332j716968k492605m6429k90408P44392
$$ 6603916 6083377 7205001 7475563 8517895 6800927 4308322 4261893 3971485 4715877
1821D715877j47886n86872j076737L870790R70952k198986J66322L63786p54502
$$ 4715877 4567991 3981119 2904382 6775172 7746124 5547138 5713460 6077246 5322744
1812E322744P28367j142089q97820p9616j006610q21898J932520l40875K978719
$$ 5322744 6051111 4909022 4011202 3931586 2924976 2103078 4035598 3694723 6673442
1803F673442p32108j82331k284309m783398K444701K797676P8740n41322K958223
$$ 6673442 5941334 5759003 3474694 -1308704 1135997 3933673 4012413 3471091 6429314
1794F429314k142127R4600J26603Q22815j246470o97124K37653J09608J988486
$$ 6429314 4287187 4381787 4508390 5331205 4084735 3387611 3625264 3734872 5723358
1785E723358p01972q60086Q30249j234721n40235J266279O91407N4457k63914
$$ 5723358 5021386 4161300 4991549 3756828 3216593 4482872 5174279 5228736 4964822
1776D964822o58775k01296J62240O62920J6961k145460j42908J687839L09109
$$ 4964822 4306047 4104751 4266991 4929911 4946872 2801412 2658504 4346343 4655452
1767D655452J895366j202280j543161L51415K90763p73702j769509J20792J523861
$$ 4655452 6550818 5348538 3805377 4156792 4447555 3673853 1904344 2025136 3548997
1758C548997K749782j257964n70922J337539J735851M66589k930613l735693l384
$$ 3548997 6298779 5040815 4469893 5807432 7543283 8009872 5079259 1343566 1340182
1749A340182L054586j714327n5296j304559M23473O45646L09405Q67393j157787
$$ 1340182 4394768 2680441 2625145 1320586 1744059 2389705 2699110 3566503 2408716
1740B408716J642368O35532K978735K66760k395975k075983J417000k834335k269317
$$ 2408716 4051084 4686616 7665351 7932111 5536136 3460153 4877153 2042818 -226499
1731b26499J415373J181460K181174j043633j927675J546693L63937r30390j430166
$$ -226499 1188874 2370334 4551508 3507875 1580200 3126893 3490830 2560440 1130274
1722A130274J872131L8393J252949J056187j36724k655390R35121K919010K65727
$$ 1130274 3002405 3040798 4293747 5349934 5213210 2557820 3492941 6411951 6677678
1713F677678l671824j226360N50632Q35076k89648k817177J6344R45913J239437
$$ 6677678 3005854 1779494 2330126 3165202 2875554 58377 74721 1020634 2260071
1704B260071J48390j8579j009973J601484J053731n58234k196052J605249J589718
$$ 2260071 2408461 2389882 1379909 2981393 4035124 3476890 1280838 2886087 4475805
1695D475805M45159j361226k33994O02579k58362m33654L453J413155N15297l628846
$$ 4475805 4920964 3559738 3325744 3928323 3669961 3236307 3239760 4652915 5168212 1539366
1685A539366j078061j638248j30306K214745K174290P85296m00066j899220J001693
$$ 1539366 461305 -1176943 -1307249 907496 3081786 3867082 3467016 1567796 2569489
1676B569489J07823j457761n56900Q32262J470604k246017J813825o41225m39868
$$ 2569489 2677312 1219551 662651 1494913 2965517 719500 2533325 1892100 1452232
1667A452232N57023J213576j172820P44108l566Q04609K49658k101993k27814
$$ 1452232 2009255 3222831 2050011 2794119 2790553 3595162 3844820 1742827 1515013
1658A515013K535873J643592k717937k971902j321110J430358J265165k91277
$$ 1515013 4050886 5694478 2976541 4639 -1316471 113887 1379052 1087775
1650A087775k052427K612931K600952j51191p16407j710236r59920Q96811p97807
$$ 1087775 -964652 1648279 4249231 4098040 3381633 1671397 711477 1608288 810481
1641H10481L58855Q9194o9266R74207K005573j090015P58465p38400O17867k371101
$$ 810481 1169336 1258530 1189264 2163471 4169044 3079029 3837494 3099094 3716961 1345860
1631A345860m76611m99742J96814p71069R17560J193417k051753M01453M015605
$$ 1345860 869249 369507 566321 -204748 712812 1906229 -145524 255929 4271534
1622D271534K055186j854130j211185n95530j17034j89679P9392J222093n98846
$$ 4271534 6326720 4472590 3261405 2665875 2548841 2359162 2438554 3660647 3061801
1613C061801l405123K57389J472354J383577j237062o04830N20222R56378n97941
$$ 3061801 -343322 -85933 1386421 2769998 1532936 928106 1448328 2404706 1806765
1604A806765k3211j106535J446005K53686j077809k743302j78485L62619O40389
$$ 1806765 1783554 677019 2123024 2376710 1298901 -1444401 -1622886 -1260267 -619878
1595f19878Q45460J009032k043266J375770J645345O28794j842649j884368K350588
$$ -619878 225582 1234614 -808652 567118 2212463 2841257 998608 -885760 1464828
1586A464828j41605j04725j021363n03055Q27411j818459P47609J755085N33768
$$ 1464828 1323223 1218498 197135 -305920 521491 -1296968 -549359 1205726 1739494
1577A739494k017209K147841j2587r71443r63952K260818J275082l789774J028950
$$ 1739494 -277715 1870126 1857539 886096 -77856 2182962 3458044 -331730 697220
1568F97220L885645J450505l654577N05767Q12657p30082l221421j347299J155107
$$ 697220 4582865 6033370 2378793 2884560 3697217 2967135 -254286 -1601585 -446478
1559d46478M53819J698692p24669J571329N3782k70970J294020k157074p52793
$$ -446478 7341 1706033 981364 2552693 2606475 2335505 3629525 1472451 719658
1550G19658L01407L703900k731509j581634j645019P54205O39236j758916o99421
$$ 719658 1021065 4724965 1993456 411822 -1233197 -478992 160244 -1598672 -2298093
1541b298093K944426J396347M9525K07830j431566K08405J990610l72020j909547
$$ -2298093 646333 2042680 2092205 2300035 868469 1076874 3067484 2695464 785917
1532G85917l06968m6228n36491Q06739q35514j495032K527917J329707j630983
$$ 785917 478949 432721 -103770 702969 -132545 -1627577 900340 2230047 599064
1523E99064p46719O18814J686238j186846j193097J597345k64156L90495p61744
$$ 599064 -147655 471159 2157397 970551 -222546 1374799 1110643 1501138 739394
1514G39394J80727k217940K048941J453233J851625R33123q97054j75135J654362
$$ 739394 920121 -1297819 751122 2204355 4055980 4989103 4092049 3916914 5571276
1505E571276o85514l632191n13277J740565J974607j172554j543305K91952O41249
$$ 5571276 4885762 1253571 740294 2480859 4455466 3282912 1739607 2031559 2672808
1496B672808R34461r60657j923428m12637J202044L4533k46432k147344M22852
$$ 2672808 3607269 2646612 723184 310547 1512591 1547124 1300692 -846652 -423800
1487d23800J486844L14288m52481j321166M36040K67488J502012j041210k873758
$$ -423800 1063044 1377332 924851 -396315 39725 307213 1809225 768015 -2105743
1478b105743K33673K718157n36200j792445J274913J218648O75946K369671p82120
$$ -2105743 -1872070 846087 309887 -1482558 -207645 1011003 1686949 4056620 3274500
1469C274500j724380j546598J315020J407470l901737k019275J624824J37235
$$ 3274500 1550120 3522 1318542 2726012 -1175725 -3195000 -1570176 -1432941
1461a432941k58495L228522N38560J458313O46461k375102J582194l99782j635410
$$ -1432941 -1691436 1537086 2075646 3533959 4180420 1805318 3387512 2987730 1352320
1452A352320p88203J056086r84733j687073j463337K223224J554182J270972Q15236
$$ 1352320 564117 1620203 635470 -1051603 -2514940 -291716 1262466 2533438 3348674
1443C348674N99229r47196j516288l71902o5734j06926k040544k12242L61621
$$ 3348674 3947903 3000707 1484419 1112517 1046783 939857 -1100687 -1312929 -951308
1434i51308M89119O80425J52282r73528K888637J686049J507091k763046j203740
$$ -951308 -462189 218236 370518 -603010 2285627 3971676 5478767 2715721 1511981
1425A511981j46329j826620j402606q88641J991882j44575j589404O98898M113701
$$ 1511981 1365652 -460968 -1863574 -2752215 -760333 -904908 -2494312 -1795414 2318287
1416B318287l46629k09650j014339j28022J269434M30391o77447m54303J169589
$$ 2318287 1971658 1762008 747669 619647 1889081 2319472 1642025 1187722 2357311
1407B357311j066870l204866J821401j206105j773005K198328L443568J661881
$$ 2357311 1290441 -1914425 -93024 -1299129 -3072134 -873806 2569762 4231643
1399D231643l552384N32301L25705P75511j140640k433517J012136M5096N01568
$$ 4231643 679259 1211560 1537265 2312776 1172136 -1261381 -249245 -204149 297419
1390B97419j016068m55878K047182L45743J320215j69843O64732j192305l55661
$$ 297419 -718649 -1174527 872655 1218398 2538613 2368770 3033502 1841197 1485536
1381A485536J153318o20316q72465j392148Q51697j427842m9311m84878P81851
$$ 1485536 2638854 2018538 1146073 -246075 605622 -822220 -871531 -1356409 -574558
1372e74558J781751J515032j152650j73876j988901k75644L355537l61981j294834
$$ -574558 1207193 2722225 1569575 1395699 -593202 -868846 2486691 2124710 829876
1363H29876j353727k69531q0046J491442J103849M40622j259986l90459J195131
$$ 829876 -523851 -793382 -873428 618014 1721863 2162485 902499 512040 1707171
1354A707171j173038P68210j455923L4207J258699o77800n56083r67252K157350
$$ 1707171 534133 1302343 -153580 -119373 1139326 461526 -94557 -1061809 1095541
1345A095541q58637q81495r78063L816782R67259J591062j915878j670073r77792
$$ 1095541 236904 -644591 -1622654 2194128 3161387 4752449 2836571 1166498 188706
1336A88706J099070J761554l636950j29193N73293n6213n38230O72582K116676
$$ 188706 1287776 3049330 -587620 -716813 -143520 -199733 -737963 -65381 2051295
1327B051295j530699j007222R91311q50820o61410n59283R10881n89427J851330
$$ 2051295 520596 -486626 504685 -346135 -1007545 -1566828 -655947 -1245374 605956
1318F05956J038413k489804M42694K80648M4551L56364k48630J934719J761891
$$ 605956 1644369 -845435 -402741 -122093 -77542 278822 30192 1964911 3726802
1309C726802k078309j100614J270233n14089k56697K795829q62964r89864M37385
$$ 3726802 1648493 547879 1818112 1304023 1047326 3843155 2980191 1990327 2427712
1300B427712J62934k068333j190735K073937k208222J347264J315349o39824J865124
$$ 2427712 2590646 522313 -668422 1405515 -802707 544557 1859906 1220082 3085206
1291C085206j430212L75222P97472L45177k161410j994241q50343J107125R457
$$ 3085206 1654994 2030216 2827688 3172865 1011455 -982786 -1833129 -726004 -716547
1282g16547p78989J613150J020944L60846p91441J449887R6348k026170k29405
$$ -716547 -1495536 117614 1138558 1499404 707963 2157850 2254198 228028 -1377
1273a377J075143j476376j43378L5119P25744k68328j120741j039911Q85609J218553
$$ -1377 1073766 -402610 -545988 -510869 214875 -53453 -1174194 -2214105 -1328496 -109943
1263a09943L39933l70585J078528j146889j605771J052293k220263k74208K588428
$$ -109943 229990 -140595 937933 -208956 -1814727 -762434 -2982697 -3256905 -668477
1254f68477k87086n21177J535846M51594J670341m92871j587621O76350J51065
$$ -668477 -955563 -1476740 59106 510700 2181041 1688170 100549 776899 927964
1245I27964J371022l213672j126650N27316L70422j927041J872563j622526l09790
$$ 927964 2298986 -914686 -2041336 -1514020 -1143598 -3070639 -1198076 -2820602 -3130392
1236c130392J968330K781865K541572J62133k372376j739794L38753j468621j691042
$$ -3130392 -1162062 1619803 4161375 4323508 1951132 211338 550091 -918530 -2609572
1227b609572K34664J042986K072835Q31279j218538N89185j909369J058974l467299
$$ -2609572 -2374908 -1331922 740913 1572192 353654 942839 -966530 92444 -3374855
1218c374855J012538j75273R28215J748169N87300j453257j025078M567392j090343
$$ -3374855 -2362317 -2537590 -1609375 138794 726094 -727163 -1752241 2815151 1724808
1209A724808N57757o81913J283784j621541k888662J235397M16857q7021j158544
$$ 1724808 2282565 1600652 2884436 1262895 -1625767 -390370 26487 -60534 -1219078
1200a219078K478191l02563k533642r82100J186075J994000j333698P49314m19207
$$ -1219078 1259113 956550 -1577092 -2559192 -1373117 620883 -712815 36499 -382708
1191c82708J019746O59957o75654o48798J72594n56427Q65329K004885j503050
$$ -382708 637038 1296995 621341 -27457 145137 -411290 454039 2458924 955874
1182I55874k41319p21744O22652L01483m09839n16796l13599j80585O87411k316700
$$ 955874 714555 -7189 615463 916946 507107 -9689 -323288 -503873 183538 -2133162
1172b133162Q89680J428024J122150k736545K899857K285943k268981j308285
$$ -2133162 -1243482 184542 1306692 -1429853 1470004 3755947 1486966 178681
1164A78681J957662j425233r90363O69390J692988j423918k948853L764990q44747
$$ 178681 2136343 711110 -279253 390137 2083125 659207 -2289646 1475344 630597
1155F30597j928851J461921J149817j014768J296924J580479j316199m560161
$$ 630597 -1298254 163667 1313484 298716 1595640 3176119 1859920 -2700241
1147b700241Q80595J777552N01062k872927l727019L155907L816751K454722j506315
$$ -2700241 -1819646 -42094 458968 -2413959 -6140978 -2985071 831680 3286402 1780087
1138A780087j396305r67001J675490P29931k994727n55344m78914K460070m77793
$$ 1780087 383782 -583219 1092271 1822202 -1172525 -1727869 -2206783 253287 -224506
1129b24506J713257l48851R74316n17743j343342k48501J20702K29371l27279
$$ -224506 1488751 1139900 2114216 1596473 253131 4630 125332 354703 27424
1120B7424L071611j080569k04274j375388p3387R54910L84072N05347j415595
$$ 27424 3099035 2018466 1814192 438804 365417 1320327 1704399 2209746 794151
1111G94151J975130N1548j964779k570317J08731J006813j354047K17281J094123
$$ 794151 2769281 2820829 856050 -1714267 -1605536 -598723 -1952770 -1735489 -641366
1102f41366J922192J667324q18869K07207q96161o77207k35403Q57179R96142
$$ -641366 1280826 2948150 2129281 2336488 1440327 763120 527717 1384896 2381038
1093B381038n66986j653090L56082J824809j149249o92696K292401J265059j580700
$$ 2381038 1814052 160962 517044 2341853 1192604 499908 2792309 4057368 2476668
1084B476668j103643n06963J334871k705415j804867J451100O0312L63482K17947
$$ 2476668 1373025 866062 2200933 -504482 -2309349 -858249 -797937 -434455 -216508
1075b16508j210221Q38560J479436J812463K43284O60666k221106R31103k221485
$$ -216508 -1426729 -588169 891267 2703730 2947014 3607680 1386574 2317677 96192
1066I6192j433742o94761r0723J035601N94616J815253K045586l78852j308915
$$ 96192 -1337550 -2032311 -2123034 -1087433 -492817 1322436 3368022 2989170 1680255
1057A680255m21919K74766m31971j733807r5026K264808J122098j986069r65031
$$ 1680255 1258336 1533102 1101131 -632676 -727702 1537106 2659204 673135 -291896
1048b91896r53698j84961j07267L222130L91627K327374n18334o05157m68440
$$ -291896 -1245594 -1430555 -1537822 1684308 2075935 4403309 3884975 3279818 2811378
1039B811378k27809j569072k192720J265982L27038j762006L69161P37265J619459
$$ 2811378 2583569 1014497 -1178223 87759 414797 -1347209 -978048 -240783 1378676
1030A378676l93400j60944j710743Q71446J188190J611169O00977k965723P6005
$$ 1378676 985276 824332 -886411 -14965 1173225 2784394 3385371 419648 495653
1021D95653q86217M82986r92293o36811K551025M31931r36106J296535o60963
$$ 495653 -390564 92422 -899871 -1536682 1014343 1446274 510168 1806703 1145740
1012A145740P1866j106395q01641r29989j058293L80778J210391L489411J32244
$$ 1145740 1217606 111211 -690430 -1620419 -2678712 -2297934 -1087543 2401868 2534112
1003B534112k976560J024787J030977j595278m17001Q24834J974673j898671k99882
$$ 2534112 -442448 582339 1613316 18038 -398963 425871 2400544 501873 201991
994B01991J110733j428030J367893j553936K08784K474313j244236p85466j59030
$$ 201991 1312724 -115306 1252587 -301349 -92565 2381748 1137512 352046 193016
985A93016j43607m01026J293171K94917O17982j158192j144241P11255J068038
$$ 193016 49409 -351617 941554 1236471 1854453 696261 -447980 263275 1331313
976A331313M49026k4856j535022k002820M59640J341056J832277k767316k302336
$$ 1331313 1780339 1755483 220461 -1782359 -1322719 18337 1850614 -916702 -3219038
967c219038R83867r40461P21965K212849J702127p84574j691647m37499n3780
$$ -3219038 -2235171 -3175632 -2453667 -240818 1461309 676735 -1014912 -1452411 -1506191
958a506191P79308r65170L019915l63748j993570k265J207484J749992q73897
$$ -1506191 -726883 -1692053 1327862 964114 -1029456 -1031721 175763 1925755 1051858
949A051858j97215J659421J626k179247q56793N49161J6805q9054j214400J462448
$$ 1051858 854643 2514064 2515690 336443 -520350 28811 45616 -43438 -1257838 204610
939B04610k73959j01918l71056j44397M639238o45340j66775k658066k348606
$$ 204610 -69349 -171267 -542323 -686720 3952518 3307178 3140403 482337 -1866269
930a866269m73236K408398O70599N63908K738723J216342p21206k731983n27128
$$ -1866269 -2339505 68893 739492 1303400 4042123 5258465 4537259 1805276 1278148
921A278148Q83373K027137k340710m362687J528869L130284k248796j679692Q70785
$$ 1278148 2161521 4188658 1847948 -2514739 -985870 2144414 -104382 -1784074 -913289
912i13289J256099j244218j55379N1500o88380K041178K698384K02393j717164
$$ -913289 342810 -901408 -1056787 -1005287 -1693667 347511 3045895 3248288 1531124
903A531124j496243k328389J980756J398175j986856K53434k69126L89893N58635
$$ 1531124 34881 -2293508 -312752 1085423 -901433 -647999 -917125 -527232 31403
894C1403J269317j337288q5342K298674k47565r33717j417743M9560N7732K680559
$$ 31403 1300720 -36568 -121910 2176764 1929199 995482 -422261 -372701 -314969 2365590
884B365590q81793j451742O51265j48079q08000N32271M83865r95940K39990o26980
$$ 2365590 1483797 32055 683320 535241 -272759 259512 743377 -252563 -12573 -639553
874f39553J002979J048086J734860L1838n42796j669906m18919M56239J437535
$$ -639553 363426 1411512 3146372 3178210 2635414 965508 546589 1002828 2440363
865B440363o39345j067197L27480J505687J994275j071418l590037J36898K489630
$$ 2440363 1801018 733821 1061301 2566988 4561263 3489845 -100192 36706 2526336
856B526336q46162j450381J220640o70841j245864P0059k67562O24164P63841
$$ 2526336 1680174 229793 1450433 779592 -466272 -396213 -663775 -39611 724230
847G24230P14058K039779j508140j376785l6473n37961M77497q56359J071862
$$ 724230 1438288 3478067 1969927 593142 556669 18708 496205 -360154 711708
838G11708M2715j685463k101290J96006K666042j05319P85724J783149K8476r77425
$$ 711708 754423 -931040 -3032330 -2836324 -170282 -275601 510123 2293272 2321748 1344323
828A344323Q21286m47223p81753Q5885N86788j007120j078052L403387Q37523
$$ 1344323 2165609 1718386 936633 1022518 1609306 602186 -475866 2927521 3765044
819C765044r17683l612312l732488M224932K106388k838005n81310J835477P30244
$$ 3765044 2847361 -764951 -4497439 -272507 1833881 -1004124 -1585434 250043 980287
810I80287q90260k698354j221191K782800K419655p38309p52890m29220n52651
$$ 980287 90027 -2608327 -3829518 -1046718 1372937 634628 -118262 -547482 -1100133
801a100133k36235M13762q90435k821252M087352K442581r22422l056912J579649
$$ -1100133 -1336368 -922606 -1813041 -4634293 -546941 1895640 973218 -2083694 -504045
792e04045p66010Q42084J147612o89946j53529K488901K36496n84419K58695j739207
$$ -504045 -1270055 -427971 719641 29695 -123834 2365067 2601563 2017144 2275839 536632
782E36632k71764J223043j698506N90991K096977k26403n33941L68726j320481
$$ 536632 264868 1487911 -210595 380396 2477373 2250970 1717029 2085755 765274
773G65274J09245k59505q7626J605138j184363l12589M19410L28088J613383l31790
$$ 765274 874519 615014 527388 2132526 948163 635574 1054984 1383072 2996455 2664665
763B664665l21033j563924J67786K24106l140046N87621p32058k199983L55676
$$ 2664665 2343632 779708 947494 1171600 -1968446 -1380825 -2112883 -4312866 -3957190
754c957190L702699J311926m25456J648062J179263o96191k714145k805746K33635
$$ -3957190 -254491 1057435 631979 2280041 3459304 2763113 48968 -2756778 -2523143
745b523143K485585j018114K422368Q08555Q70615k081117j17847K308989r63390
$$ -2523143 -37558 -1055672 1366696 2175251 3045866 964749 846902 3155891 2192501
736B192501n01808k323148j95202j053610j538720J404539J701932j69266m6755
$$ 2192501 1690693 -632455 -827657 -1881267 -3419987 -2015448 -313516 -482782 -529537
727e29537R52453L188030r25586j577774m69708j869756o95994J383776j25999
$$ -529537 422916 3610946 2685360 1107586 637878 -1231878 -1927872 -544096 -670095
718f70095K375689q25446j542028O04195k96963j073592J469990J289825j044676
$$ -670095 1705594 880148 -661880 -57685 -354648 -1428240 41750 1331575 286899
709B86899j569238J189367j304433J314565o12053m58547R47774K142525o92403
$$ 286899 -1282339 -92972 -1397405 -82840 -694893 -1153440 -205666 1936859 1244456
700A244456l5942q79187j353499J446784K253889J46785k14156k89662R336j330384
$$ 1244456 1208514 329327 -1024172 422612 2676501 2823286 2609130 2319468 2328804 998420
690I98420m4321j757906J339034L86973k548764k24373K206372K84924N54063
$$ 998420 954099 -803807 535227 922200 -1626564 -1850937 355435 640359 1194422
681A194422P76163K99128r71212r49802J04263r51521J062204o36638p12724P68108
$$ 1194422 1970585 2269713 1298501 348699 452962 -498559 563645 -72993 -785717 -17609
671a7609J052204k36117k117523j8751n11707R29154K050204l50316Q1243j025654
$$ -17609 1034595 798478 -1319045 -1337796 -1849503 -920349 1129855 779539 860782 -164872
661a64872J028039l40966p71718M40558q18445J477863j779521O84364m07010
$$ -164872 863167 522201 -249517 191041 -627404 850459 -929062 -244698 -651708
652f51708k166102O50632k28608J806036j262755J157148p90549K736214o60660
$$ -651708 -2817810 -2167178 -2395786 -589750 -1852505 -695357 -1485906 1250308 589648
643E89648j514136p81110J689752J338773o94384k115026K98673l67157J668054
$$ 589648 -924488 -1705598 -15846 1322927 628543 -1486483 -1187810 -1554967 113087
634A13087K94323K249960o61829j634244K372661J090834j631908k736875p69390
$$ 113087 407410 2657370 1995541 361297 2733958 3824792 2192884 -543991 -1313381
625a313381P52669J500519j598101O95319L033861J7479r72964j276543o21584
$$ -1313381 -560712 939807 -658294 37025 3070886 3088365 2115401 838858 217274
616B17274Q21565K13860j412302p35241m79472K267388j017797k182669p92544
$$ 217274 1038839 1252699 -159603 -894844 -1374316 893072 -124725 -2307394 -3099938
607c099938L778672J062465L15655j203789k242067J701880m1822J53276k087156
$$ -3099938 678734 1741199 2056854 853065 -1389002 312878 271056 424332 -1662824
598a662824j109911J780271P12501L96300N69222J155188K320381J03133j204235
$$ -1662824 -2772735 -992464 -279963 116337 685559 1840747 4161128 4264261 3060026
589C060026j978238j506340O25876M50443m92021r04339J226080J129215j427599
$$ 3060026 1081788 -424552 201324 651767 159746 -744593 481487 1610702 183103
580A83103r3218J729733j241492J134923J536978j414169J156018j130728l099681
$$ 183103 89885 1819618 578126 1713049 3250027 1835858 2991876 1861148 -1238533
571a238533O34799J034185j733448K275396M53690m32127R03931J109635j836609
$$ -1238533 -603734 430451 -1302997 972399 1426089 993962 1897893 3007528 1170919
562A170919o99911j389209J032990J774154r50011j811829l55701M367968j502286
$$ 1170919 471008 -918201 114789 1888943 938932 -872897 -1228598 3139370 1637084
553A637084j083325m65299J683434J970883M49047n78405n515028q80859J302339
$$ 1637084 553759 88460 1771894 3742777 4191824 3613419 -1901609 -2782468 -1480129
544a480129K7710k021209J560545J470310R90628j299863J114314j520649J540012
$$ -1480129 -1452419 -3473628 -1913083 -442773 547855 -752008 362306 -1158343 381669
535C81669R66874n72224K21560j981362p15956J527962n42603R31775N05058j522544
$$ 381669 1348543 776319 997879 -983483 -1699439 -171477 -714080 217695 722753 -799791
525g99791K417562j862542j465697n36670Q76788K79840j436821K12368R04840
$$ -799791 1617771 -244771 -1710468 -2247138 -1370350 -1090510 -2527331 -2314963 -1410123
516a410123K173329j930744N97840J046612J755667j168279j122053J152149j952426
$$ -1410123 763206 -1167538 -569698 476914 2232581 1064302 -57751 1094398 -858028
507h58028k82085L161153K414818k73367j257157p5726K97928o90171N46780l336705
$$ -858028 -1140113 2021040 4435858 4162491 2905334 2829608 3127536 2437365 2984145 -352560
497c52560J157392K003491k532324J507622J371632l892414q58551L084193J031124
$$ -352560 804832 2808323 275999 1783621 3155253 -737161 -1595712 1488481 2519605
488B519605M9402O91979k843515m28496O87508p86251L07557M6292Q46563o51882
$$ 2519605 2569007 3260986 417471 -11025 676483 -109768 197789 244081 1090644 438762
478D38762k119966j257170O46147L062984J532857k423733j841226L821579K48866
$$ 438762 -1681204 -2938374 -2292227 770757 2303614 -120119 -1961345 1860234 2109100
469B109100q88198q76597k83650J970964j566108P32126J841292j595448k901496
$$ 2109100 1220902 344305 60655 2031619 465511 1197637 3038929 1443481 -1458015
460a458015N99351N92409R86381M71566k354607R5297K447025j29916k293150
$$ -1458015 -858664 -266255 720126 1191692 -1162915 -1067618 1379407 1249491 -1043659
451a043659J867055l52623j769511J499348m7878L09542J719983R02504L79509
$$ -1043659 823396 470773 -1298738 200610 152732 462274 2182257 3084761 3464270
442C464270p02573k253696k14748J546723j405250k222259K46727M081890j4966
$$ 3464270 2761697 508001 293253 1839976 434726 -1787533 -1540806 2541084 2526118
433B526118L89911r53193n14488m09245R11744n55196k06250p13498l01838N92355
$$ 2526118 2916029 1962836 1448348 1039103 1950847 1395651 1189401 475903 174065 766420
423G66420o24247j109635N14894J239243m53591N43475q88384K41869j591226
$$ 766420 142173 -967462 -452568 786675 333084 876559 -11825 230044 -1361182
$$ [...]
##END NTUPLES=NMR SPECTRUM
##END=
