##TITLE=1H_CG-1231-1
 200.13MHz,DMSO-d6.
 8 sc
 
 29.1.2026
##JCAMPDX= 6.0         $$ Bruker NMR JCAMP-DX V2.0
##DATA TYPE= NMR FID
##DATA CLASS= NTUPLES
##ORIGIN= UXNMR, Bruker Analytische Messtechnik GmbH
##OWNER= pz
$$ XWIN-NMR		Version 3.5
$$ Thu Jan 29 13:35:09 2026 Russian Standard Time (UT+4h)  she@DPX200
##.OBSERVE FREQUENCY= 200.1313
##.OBSERVE NUCLEUS= ^1H
##.DELAY= (6, 6)
##.ACQUISITION MODE= SIMULTANEOUS
##.ACQUISITION SCHEME= undefined
##.AVERAGES= 8
##.DIGITISER RES= 18
##SPECTROMETER/DATA SYSTEM= spect
##.PULSE SEQUENCE= zg30
##.SOLVENT NAME= DMSO
##.SHIFT REFERENCE= (INTERNAL, DMSO, 0, 14.3821)
##AUDIT TRAIL= $$ (NUMBER, WHEN, WHO, WHERE, WHAT)
$$ ##TITLE= Audit trail, XWIN-NMR		Version 3.5
$$ ##JCAMPDX= 5.01
$$ ##ORIGIN= Bruker BioSpin GmbH
$$ ##OWNER= she
$$ F:/spectra/data/she/nmr/H-C/1/audita.txt
$$ ##AUDIT TRAIL=  $$ (NUMBER, WHEN, WHO, WHERE, WHAT)
(   1,<2026-01-29 13:32:29.09 +0400>,<she>,<DPX200>,
      <created by zg, POWCHK disabled, PULCHK disabled
       configuration hash MD5:
       00 E9 B6 7A A2 85 ED C7 34 08 36 98 17 FE 4E 26
       data hash MD5: 16K
       E5 79 6D 27 32 20 46 CF 43 1B 5A B1 E1 7D 0F 1E>)
$$ ##END=
$$ 
$$ hash MD5
$$ 70 AC 27 73 DA 71 87 F9 7E FD 32 CB 0F D1 B0 3B
##$RELAX= 
##$RELAX= 
##$RELAX= 
##$RELAX= 
##$RELAX= 
##$RELAX= 
$$ Bruker specific parameters
$$ --------------------------
##$DU= <F:/spectra>
##$EXPNO= 1
##$NAME= <H-C>
##$PROCNO= 1
##$TYPE= <nmr>
##$USER= <she>
##$AMP= (0..31)
100 100 100 100 100 100 100 100 100 100 100 100 100 100 100 100 100 100 
100 100 100 100 100 100 100 100 100 100 100 100 100 100 
##$AQSEQ= 0
##$AQ_mod= 1
##$AUNM= <au_zg>
##$AUTOPOS= <>
##$BF1= 200.13
##$BF2= 200.13
##$BF3= 200.13
##$BF4= 200.13
##$BF5= 200.13
##$BF6= 200.13
##$BF7= 200.13
##$BF8= 200.13
##$BYTORDA= 1
##$CFDGTYP= 0
##$CFRGTYP= 5
##$CHEMSTR= <none>
##$CNST= (0..31)
1 1 145 1 1 1 1 1 1 1 1 1 1 1 1 1 1 1 1 1 1 1 1 1 1 1 1 1 1 1 1 1 
##$CPDPRG= <>
##$CPDPRG1= <>
##$CPDPRG2= <>
##$CPDPRG3= <>
##$CPDPRG4= <mlev>
##$CPDPRG5= <mlev>
##$CPDPRG6= <mlev>
##$CPDPRG7= <mlev>
##$CPDPRG8= <mlev>
##$CPDPRGB= <>
##$CPDPRGT= <>
##$D= (0..31)
0 0.7 0 0 0 0 0 0 0 0 0 0.03 0 0 0 0 0 0 0 0 0 0 0 0 0 0 0 0 0 0 0 0 
##$DATE= 1769679148
##$DBL= (0..7)
120 120 120 120 120 120 120 120 
##$DBP= (0..7)
150 150 150 150 150 150 150 150 
##$DBP07= 0
##$DBPNAM0= <>
##$DBPNAM1= <>
##$DBPNAM2= <>
##$DBPNAM3= <>
##$DBPNAM4= <>
##$DBPNAM5= <>
##$DBPNAM6= <>
##$DBPNAM7= <>
##$DBPOAL= (0..7)
0.5 0.5 0.5 0.5 0.5 0.5 0.5 0.5 
##$DBPOFFS= (0..7)
0 0 0 0 0 0 0 0 
##$DE= 6
##$DECBNUC= <off>
##$DECIM= 32
##$DECNUC= <off>
##$DECSTAT= 4
##$DIGMOD= 1
##$DIGTYP= 9
##$DL= (0..7)
0 120 120 120 120 120 120 120 
##$DP= (0..7)
150 150 150 150 150 150 150 150 
##$DP07= 0
##$DPNAME0= <>
##$DPNAME1= <>
##$DPNAME2= <>
##$DPNAME3= <>
##$DPNAME4= <>
##$DPNAME5= <>
##$DPNAME6= <>
##$DPNAME7= <>
##$DPOAL= (0..7)
0.5 0.5 0.5 0.5 0.5 0.5 0.5 0.5 
##$DPOFFS= (0..7)
0 0 0 0 0 0 0 0 
##$DQDMODE= 0
##$DR= 18
##$DS= 0
##$DSLIST= <SSSSSSSSSSSSSSS>
$$ [...]
##$SUBNAM0= <"">
##$SUBNAM1= <"">
##$SUBNAM2= <"">
##$SUBNAM3= <"">
##$SUBNAM4= <"">
##$SUBNAM5= <"">
##$SUBNAM6= <"">
##$SUBNAM7= <"">
##$SUBNAM8= <"">
##$SUBNAM9= <"">
##$SW= 18.0517328524113
##$SWIBOX= (0..15)
0 0 2 0 0 0 0 0 0 0 0 0 0 0 0 0 
##$SW_h= 3612.71676300578
##$TD= 16384
##$TD0= 1
##$TE= 0
##$TE2= 300
##$TE3= 300
##$TEG= 300
##$TL= (0..7)
0 120 120 120 120 120 120 120 
##$TP= (0..7)
150 150 150 150 150 150 150 150 
##$TP07= 0
##$TPNAME0= <>
##$TPNAME1= <>
##$TPNAME2= <>
##$TPNAME3= <>
##$TPNAME4= <>
##$TPNAME5= <>
##$TPNAME6= <>
##$TPNAME7= <>
##$TPOAL= (0..7)
0.5 0.5 0.5 0.5 0.5 0.5 0.5 0.5 
##$TPOFFS= (0..7)
0 0 0 0 0 0 0 0 
##$TUNHIN= 0
##$TUNHOUT= 0
##$TUNXOUT= 0
##$USERA1= <user>
##$USERA2= <user>
##$USERA3= <user>
##$USERA4= <user>
##$USERA5= <user>
##$V9= 5
##$VALIST= <valist>
##$VCLIST= <CCCCCCCCCCCCCCC>
##$VD= 0
##$VDLIST= <DDDDDDDDDDDDDDD>
##$VPLIST= <PPPPPPPPPPPPPPP>
##$VTLIST= <TTTTTTTTTTTTTTT>
##$WBST= 1024
##$WBSW= 4
##$XGAIN= (0..3)
0 0 0 0 
##$XL= 0
##$YL= 0
##$YMAX_a= 285478
##$YMIN_a= -421589
##$ZGOPTNS= <>
##$ZL1= 120
##$ZL2= 120
##$ZL3= 120
##$ZL4= 120
##$ABSF1= 10
##$ABSF2= 0
##$ABSG= 5
##$ABSL= 3
##$ALPHA= 0
##$AQORDER= 0
##$ASSFAC= 0
##$ASSFACI= 0
##$ASSFACX= 0
##$ASSWID= 0
##$AUNMP= <proc_1d>
##$AZFE= 0.1
##$AZFW= 0.1
##$BCFW= 1
##$BC_mod= 2
##$BYTORDP= 1
##$COROFFS= 0
##$CY= -3
##$DATMOD= 1
##$DC= 2
##$DFILT= <>
##$DTYPP= 0
##$F1P= 0
##$F2P= 0
##$FCOR= 0.5
##$FTSIZE= 0
##$FT_mod= 4
##$GAMMA= 1
##$GB= 0.15
##$INTBC= 1
##$INTSCL= 1
##$ISEN= 128
##$LB= 0.25
##$LEV0= 0
##$LPBIN= 0
##$MAXI= 10000
##$MC2= 0
##$MEAN= 0
##$ME_mod= 0
##$MI= 1.114404
##$NCOEF= 0
##$NC_proc= 0
##$NLEV= 6
##$NOISF1= 3.799351
##$NOISF2= 2.8
##$NSP= 1
##$NTH_PI= 0
##$NZP= 0
##$OFFSET= 14.38212
##$PC= 1
##$PHC0= -3703.033
##$PHC1= 10.79231
##$PH_mod= 1
##$PKNL= yes
##$PPARMOD= 0
##$PSCAL= 0
##$PSIGN= 0
##$REVERSE= no
##$SF= 200.129724274929
##$SI= 16384
##$SIGF1= 3
##$SIGF2= 2
##$SINO= 400
##$SIOLD= 16384
##$SREGLST= <1H.CDCl3>
##$SSB= 0
##$STSI= 0
##$STSR= 0
##$SW_p= 3205.1282051282
##$SYMM= 0
##$S_DEV= 0
##$TDeff= 0
##$TDoff= 0
##$TI= <>
##$TILT= no
##$TM1= 0
##$TM2= 0
##$TOPLEV= 0
##$USERP1= <user>
##$USERP2= <user>
##$USERP3= <user>
##$USERP4= <user>
##$USERP5= <user>
##$WDW= 1
##$XDIM= 8192
##$YMAX_p= 0
##$YMIN_p= 0
$$ End of Bruker specific parameters
$$ ---------------------------------
##NTUPLES= NMR FID
##VAR_NAME=  TIME,          FID/REAL,        FID/IMAG
##SYMBOL=    X,             R,               I
##VAR_TYPE=  INDEPENDENT,   DEPENDENT,       DEPENDENT
##VAR_FORM=  AFFN,          ASDF,            ASDF
##VAR_DIM=   8192,          8192,            8192
##UNITS=     SECONDS,       ARBITRARY UNITS, ARBITRARY UNITS
##FACTOR=    0.0002768,     1,               1
##FIRST=     0,             0,               0
##LAST=      2.2672688,     0,               0
##MIN=       0,             -421589,         0
##MAX=       2.2672688,     285478,          0
$$ Real data points
##PAGE= N=1
##DATA TABLE= (X++(R..R)), XYDATA
$$ [...]
$$ plain form
2149 -475 -18 2224 -361 898 1448 -1414 1204 1254 -1091 944 -1260 -1664 1957 -909 -1279 608 -2461
2166 -2461 -246 406 -2341 894 981 -503 1713 -495 -1227 2676 895 936 2160 -1426 794 2158
2182 2158 -888 733 505 -1318 1608 -89 -1679 967 -742 -273 1497 -1424 225 2412 -107
2197 -107 1836 640 -1545 2268 1808 492 2154 -828 -479 1705 -1630 -640 262 -2013 254 -657
2213 -657 -3849 -928 -1360 -1701 600 -2248 -1997 1029 -1118 -227 596 -1548 1777 1868 -770 1207 245
2230 245 -175 2616 -265 -946 1204 -868 129 573 -2406 118 48 -1982 614 -805 -1538 1534 -659
2247 -659 -1005 1255 -771 1208 2378 -819 854 1006 -528 2293 938 -859 1288 -240 -523 1497
2263 1497 -979 -32 1307 -1498 -30 172 -1715 1389 512 -1185 1159 -914 -329 1925 -149 505
$$ packed form
2149d75M57K242k585J259N50k862K618N0k345K035k204m04L621k866l70J887l069
2166b461K215O52k747L235Q7j484K216k208p32L903j781M1J224l586K220J364
2182B158l046J621k28j823K926j697j590K646j709M69J770k921J649K187k519
2197a07J943j196k185L813m60j316J662k982L49K184l335R90R02k275K267r11
2213f57l192K921m32l41K301k848K51L026k147Q91Q23k144L325R1k638J977r62
2230B45m20K791k881o81K150k072R97M44k979K524p0k030K596j419p33L072k193
2247f59l46K260k026J979J170l197J673J52j534K821j355j797K147j528k83K020
2263A497k476R47J339k805J468K02j887L104q77j697K344k073N85K254k074O54
$$ plain form
2279 505 937 -2071 593 1182 -899 1129 127 -1680 1311 -1057 -546 1606 -1009 -183 795 -1770
2295 -1770 800 1607 -1121 1122 624 -1995 2086 -619 -472 1333 -869 -539 943 -2315 -364 -66
2311 -66 -2017 488 -985 -2181 591 -687 -1303 408 -1238 -418 1333 -1075 936 1181 -990 1107
2327 1107 202 -866 1839 22 -275 1594 -882 -156 1254 -1084 592 850 -1406 460 54 -1208
2343 -1208 1492 -419 -706 1417 -478 142 1450 -1099 694 991 -1070 915 133 -1174 1316 -313
2359 -313 -1109 576 -1338 -383 1021 -1505 -303 468 -1317 559 -35 -1173 1385 275 5 1524
2375 1524 -822 517 2111 -320 515 1110 -873 1512 213 -1198 1041 -199 -305 887 -1394 -1064
2391 -1064 763 -1353 -312 -283 -1932 492 179 -1442 423 -499 -555 1118 -1186 -501 1176 -661 139
$$ packed form
2279E05M32l008K664N89k081K028j002j807K991k368N11K152k615Q26R78k565
2295a770K570Q07k728K243m98k619M081k705J47J805k202L30J482l258J951K98
2311f6j951K505j473j196K772j278o16J711j646Q20J751k408K011K45k171K097
2327A107r05j068K705j817k97J869k476P26J410k338J676K58k256J866m06j262
2343a208K700j911k87K123j895O20J308k549J793K97k061J985p82j307K490j629
2359c13p96J685j914R55J404k526J202P71j785J876n94j138K558j110k70J519
2375A524k346J339J594k431Q35N95j983K385j299j411K239j240j06J192k281L30
2391a064J827k116J041K9j649K424l13j621J865r22n6J673k304O85J677j837Q00
$$ plain form
2408 139 421 -1932 427 456 -1201 665 -1116 -1383 699 -1245 -1006 604 -1067 156 376 -1699 719
2425 719 943 -84 1449 -187 -402 2096 623 508 1890 -148 930 1088 -851 1394 1140 -490
2441 -490 625 -725 -1175 1332 -197 -606 238 -2011 -390 713 -1465 766 228 -1112 705 -448
2457 -448 -625 2129 426 38 1271 -718 525 1889 -127 1001 171 -1087 788 -76 -584 1211
2473 1211 -1111 -1158 -51 -1622 -271 740 -1438 -213 -601 -1729 696 -256 -1226 389 -1336 -1042
2489 -1042 431 -1221 -326 813 -1245 -175 -67 -1107 1232 -22 -805 776 -583 13 1584 -523
2505 -523 500 1107 -323 1127 816 -282 1859 787 -219 1136 -162 149 1565 -553 292 561
2521 561 -917 640 399 -1225 668 122 -679 951 -449 -580 1187 -542 727 957 -643 806
$$ packed form
2408A39K82k353K359K9j657J866j781k67K082j944K39J610j671J223K20k075K418
2425G19K24j027J533j636k15K498j473j15J382k038J078J58j939K245k54j630
2441d90J115j350m50K507j529m09Q44k249J621J103k178K231n38j340J817j153
2457d48j77K754j703l88J233j989J243J364k016J128q30j258J875q64n08J795
2473A211k322m7J107j571J351J011k178J225l88j128K425r52r70J615j725K94
2489a042J473j652Q95J139k058J070J08j040K339j254p83J581j359N96J571k107
2505e23J023O07j430J450l11j098K141j072j006J355j298L11J416k118Q45K69
2521E61j478J557k41j624J893n46q01J630j400j31J767j729J269K30j600J449
$$ plain form
2537 806 986 -464 968 564 -431 871 -848 -672 787 -598 305 444 -1071 -68 -145 -1426 474
2554 474 -200 -1853 724 -1289 -739 -335 -1434 -712 347 -1009 -393 -95 -820 305 14 -1219 428
2571 428 -630 510 812 -609 62 810 -540 357 525 -452 756 66 -774 542 -227 -242 1125 -914
2589 -914 -542 464 -909 440 334 -1063 494 266 -153 945 -4 128 1566 -62 474 1060 -104
2606 -104 1308 1394 -209 841 670 -117 1476 -14 -205 847 -352 -237 328 -931 420 334 -1062
2623 -1062 282 -349 -872 1087 -167 -695 713 -610 -99 689 -1137 77 296 -1478 -94 -366 -1431
2640 -1431 182 -793 -1350 -239 -1398 -636 673 -857 -176 -62 -956 659 702 -33 1366 224 -392
2657 -392 1044 -45 460 1198 -651 -198 307 -1187 299 309 -659 15 -862 -670 721 -298 245 265
$$ packed form
2537H06J80j450J432m04r95J302j719J76J459j385R03J39j515J003p7j281J900
2554D74o74j653K577k013N50M04j099P22J059j356O16K98p25J125k91j233J647
2571D28j058J140L02j421O71P48j350Q97J68r77J208o90q40J316p69j5J367k039
2589i14L72J006j373J349j06j397J557k28m19J098r49J32J438j628N36N86j164
2606a04J412Q6j603J050j71p87J593j490j91J052j199J15N65j259J351q6j396
2623a062J344o31n23J959j254n28J408j323N11P88j826J214K19j774J384k72j065
2640a431J613r75n57J111j159P62J309j530O81J14q94J615M3p35J399j142o16
2657c92J436j089N05P38j849M53N05j494J486J0r68O74q77J92J391j019N43K0
$$ plain form
2675 265 -1268 53 634 -53 1304 222 -348 1366 100 586 1721 411 511 569 -379 185 611 -464
2693 -464 347 -264 -1519 390 -228 -990 631 -1169 -101 795 -721 268 203 -743 695 289 -668 605
2711 605 -6 -373 908 -526 -448 479 -902 69 -22 -1206 281 123 -969 -120 -648 -637 716 -767
2729 -767 -614 371 -751 387 862 -629 494 452 -467 649 -234 -627 956 -36 -307 367 -1116 152
2747 152 872 -596 379 198 -638 1067 289 -393 722 22 131 1090 -239 541 751 -556 215 -106
2765 -106 -523 947 263 -729 344 -565 -391 525 -328 -15 690 -487 439 63 -455 772 257 -159 756
2784 756 -352 -206 1130 -394 1 388 -724 192 484 -928 314 -301 -519 421 -698 -444 364 -719
2802 -719 -114 83 -992 30 36 -977 196 -298 -1005 705 -622 -185 443 -478 -185 380 -715 109
$$ packed form
2675B65j533J321N81o87J357j082n70J714j266M86J135j310J00N8r48N64M26j075
2693d64Q11o11j255J909o18p62J621j800J068Q96j516R89o5r46J438m06r57J273
2711F05o11l67J281j434P8R27j381R71r1j184J487j58j092Q49n28J1J353j483
2729g67J53R85j122J138M75j491J123m2r19J116q83l93J583r92k71O74j483J268
2747A52P20j468R75j81q36J705p78o82J115p00J09R59j329P80K10j307P71l21
2765a06m17J470o84r92J073r09J74R16q53L13P05j177R26l76n18J227n15m16R15
2784G56j108J46J336j524L95L87j112R16K92j412J242o15k18R40j119K54Q08j083
2802g19O05J97j075J022Oj013J173m94p07J710j327M37O28r21K93N65j095Q24
$$ plain form
2820 109 313 -445 800 351 -431 783 33 155 1114 -204 373 679 -444 419 660 -298 633 -17 -649
2839 -649 321 -181 -384 480 -661 -310 291 -880 114 307 -695 309 -215 -743 776 264 187 861 -245
2858 -245 94 916 -108 650 804 -273 429 148 -180 838 -78 -123 420 -1029 -188 517 -481 188 -74
2877 -74 -633 339 24 -840 383 -267 -383 671 -631 -415 644 -833 -41 -36 -873 222 -70 -710 192
2896 192 -572 -644 366 -727 -504 192 -651 255 103 -750 81 296 -227 504 9 2 772 9 450 450 -492
2917 -492 135 429 -843 201 50 -206 696 -42 -602 374 -248 -150 563 -392 184 538 -692 343 490
2936 490 -29 1149 -216 -534 695 78 435 737 269 398 267 -74 503 464 -384 98 -421 -880 225
2955 225 -385 81 495 -321 -575 503 -27 666 -61 -823 734 -456 56 539 116 490 234 -1019 30
$$ packed form
2820A09K04p58J245m49p82J214p50J22R59j318N77L06j123Q63K41r58R31o50o32
2839f49R70n02k03Q64j141L51O01j171R94J93j002J004n24n28J519n12p7O74j106
2858b45L39Q22j024P58J54j077P02k81l28J018r16m5N43j449Q41P05r98O69k62
2877g4n59R72l15q64J223o50j16J054j302K16J059j477P92Nq37J095k92o40R02
2896A92p64p2J010j093K23O96q43R06j52q53Q31K15n23P31m95pP70p63M41%r42
2917d92O27K94j272J044j51k56R02p38n60R76o22R8P13r55N76L54j230J035J47
2936D90n19J178j365l18J229o17L57L02m68J29j31l41N77l9q48M82n19m59J105
2955B25o10M66M14q16k54J078n30O93p27p62J557j190N12M83m23L74k56j253J049
$$ plain form
2974 30 200 -532 317 -377 -771 30 -639 -501 74 -507 -418 256 -1085 -27 434 -337 237 31 -480 727
2994 727 379 -105 790 -208 41 607 -308 282 683 -154 159 101 -625 418 -74 -208 648 -189 -339 432
3014 432 -318 -173 481 -295 361 170 -235 632 236 -278 443 -170 5 712 -238 51 582 -375 366 217
3034 217 -497 532 162 -163 651 -359 -179 437 -370 318 -67 -755 134 -114 -587 295 -367 -803 46
3053 46 -828 -526 347 -704 -202 89 -601 3 132 -721 711 105 -491 286 -254 -364 581 -312 44 332
3073 332 -264 399 202 -421 474 249 -246 763 -345 -127 753 -24 51 474 -148 462 349 -408 379 22
3093 22 -324 620 -205 -147 767 -54 144 260 -532 86 334 -66 577 82 -394 627 -128 -301 888 -242
3113 -242 130 321 -569 -63 473 -435 183 -268 -776 226 -115 -750 123 -626 -534 -74 -937 -175 349 -397
$$ packed form
2974C0J70p32Q49o94l94Q01o69J38N75n81Q9O74j341J058M61p71N74k06n11J207
2994G27l48m84Q95r98K49N66r15N90M01q37L13n8p26J043m92j34Q56q37j50P71
3014D32p50J45O54p76O56j91m05Q67l96n14P21o13J75P07r50K89N31r57P41j49
3034B17p14J029l70l25Q14j010J80O16q07O88l85o88Q89k48m73Q82o62m36Q49
3053D6q74L02Q73j051N02K91o90O04J29q53J432o06n96P77n40j10R45q93L56K88
3073C32n96O63j97o23Q95k25m95J009j108K18Q80p77P5M23o22O10j13p57P87l57
3093B2l46R44q25N8R14q21J98J16p92O18K48m00O43m95m76J021p55j73J189j130
3113b42L72J91q90N06N36r08O18m51n08J002l41o35Q73p49R2M60q63P62N24p46
$$ plain form
3133 -397 -106 -603 -609 702 367 463 117 -876 -202 604 -416 132 100 -617 29 -229 -460 364 -98 -154 423
3154 423 -441 -119 464 -213 113 241 -434 -5 264 -200 461 -392 -779 480 -18 420 367 -546 -36 683
3174 683 -410 30 448 -625 773 -285 -42 117 -89 385 709 76 -25 307 -710 230 357 -553
3192 -553 458 -160 -263 550 -95 -369 467 -368 -163 301 -248 648 120 -786 201 -1029 -895 425 -614
3211 -614 -519 306 -306 -196 -115 -630 -68 -29 -485 -5 -280 -481 471 -325 -167 391 -518 -211 411 -511 250
3232 250 84 -345 391 -339 -520 513 111 -12 364 -366 247 412 -21 433 58 -68 441 -623 340
3251 340 500 -508 -696 409 -293 -69 518 -396 270 117 -529 354 -130 -195 452 -335 -171 406 -266 44
3271 44 327 -435 231 321 -544 397 103 -156 479 -224 -180 301 -261 192 218 -477 68 254 -489 258 -102
$$ packed form
3133c97K91m97oJ311l35R6l46r93O74Q06j020N48l2p17O46k58k31Q24m62n6N77
3154D23q64L22N83o77L26J28o75M29K69m64O61q53l87J259m98M38n3r13N10P19
3174F83j093M40M18j073J398j058K43J59k06M74L24o33j01L32j017R40J27r10
3192e53J011o18j03Q13o45k74Q36q35K05M64n49Q96n28r06R87j230J34J320j039
3211f14R5Q25o12J10Q1n15N62L9m56M80k75k01R52p96J58N58r09L07O22r22P61
3232B50j66m29P36p30j81J033m02j23L76p30O13J65m33M54l75j26N09j064R63
3251C40J60j008j88J105p02K24N87r14O66j53o46Q83m84o5O47p87J64N77o72L10
3271D4K83p62O66R0q65R41k94k59O35p03M4M81n62M53K6o95N45J86p43P47l60
$$ plain form
3292 -102 -374 194 -542 -455 263 -461 -137 198 -504 -79 15 -593 151 126 -345 562 -264 -139 423 -36 94
3313 94 394 -372 -88 78 -309 668 -184 -90 352 48 -623 44 -393 243 506 -461 -69 1 -290 392 272
3334 272 -587 216 -398 -129 477 -157 -100 323 -365 239 346 -311 356 61 -283 428 147 -103 147 -20
3354 -20 -232 271 -322 285 305 -273 442 175 -162 428 -85 -336 512 -626 -72 61 -318 379 -146 -197 105
3375 105 -185 -424 218 -196 -441 176 -418 -76 123 -386 385 249 -598 161 -85 -359 370 -248 -98 179
3395 179 -241 -101 333 -555 101 394 -227 112 31 -223 249 -205 -211 290 -461 -128 196 -463 77 197 -381
3416 -381 133 123 -191 467 -31 -167 376 -318 90 474 -233 297 212 -413 243 3 -285 528 -135 -200 127
3437 127 -606 178 685 -461 19 294 -36 254 -55 -38 248 -7 -94 356 -255 -51 485 -257 -17 114
$$ packed form
3292a02k72N68p36Q7P18p24L24L35p02M25R4o08P44k5m71R07q26J25N62m59J30
3313I4L00p66K84J66l87R77q52R4M42l04o71O67m37O36K63r67L92P0k91O82j20
3334B72q59Q03o14K69O06o34N7M23o88O04J07o57O67k95l44P11k81k50K50j67
3354b0k12N03n93O07K0n78P15k67l37N90n13k51Q48j138N54J33l79O97n25n1L02
3375A05k90k39O42m14k45O17n94L42J99n09P71j36q47P59k46k74P29o18J50K77
3395A79m20J40M34q88O56K93o21L39q1k54M72m54oN01p51L33L24o59N40J20n78
3416c81N14j0l14O58m98j36N43o94M08L84p07N30q5o25O56k40k88Q13o63o5L27
3437A27p33P84N07j146M80K75l30K90l09J7K86k55q7M50o11K04N36p42K40J31
$$ plain form
3457 114 -546 374 -195 -276 649 165 -809 679 -79 -295 223 -323 31 190 -429 206 106 -280 258 -31
3477 -31 -369 363 -255 -168 272 -313 -50 240 -205 110 158 -431 355 -252 -408 289 -189 -113 438 -156 63
3498 63 208 -161 499 279 -298 409 206 -279 267 -28 21 368 -347 155 301 -164 -28 35 -539 179 237
3519 237 0 539 -314 26 399 -150 21 232 -116 180 317 -386 303 171 -144 242 -251 -147 198 -334
3539 -334 -36 -66 -533 -202 61 -532 10 -157 -357 28 -423 -22 443 -163 -202 59 -284 81 325 -488 76
3560 76 -115 -337 371 -66 -183 261 -256 -29 216 -300 211 124 -441 173 -144 -179 202 -107 22 225 -254
3581 -254 0 381 -151 86 422 17 -116 -13 -165 239 -314 265 255 -720 240 130 -291 -78 4 -55 393
3602 393 99 -32 161 17 -149 239 -115 -211 165 -450 -115 -70 -335 292 -136 -466 37 88 -157 -67 -383
$$ packed form
3457A14o60R20n69q1R25m84r74J488p58k16N18n46L54J59o19O35j00l86N38k89
3477c1l38P32o18Q7M40n85K63K90m45L15M8n89P86o07j56O97m78P6N51n94K19
3498F3J45l69O60k20n77P07k03m85N46k95M9L47p15N02J46m65J36O3n74P18N8
3519B37k37N39q53L40L73n49J71K11l48K96J37p03O89j32l15L86m93J04L45n32
3539c34K98l0m67L31K63n93N42j67k00L85m51M01M65o06l9K61l43L65K44q13N64
3560G6j91k22P08m37j17M44n17K27K45n16N11q7n65O14l17l5L81l09J29K03m79
3581b54K54L81n32K37L36m05j33J03j52M04n53N79j0r75R60j10m21K13Q2n9M48
3602C93k94j31J93j44j66L88l54r6L76o15L35M5k65O27m28l30N03N1k45R0l16
$$ plain form
3623 -383 -79 187 -552 -145 123 -352 209 -511 -176 -93 76 102 145 -313 -302 269 -208 35 190 -286 46
3644 46 242 -302 258 -574 134 147 -876 -12 158 -200 167 -16 -381 417 -2 -136 335 -73 -64 260 -171
3665 -171 -46 151 -235 -7 345 -327 302 164 -308 386 -159 -274 388 -268 9 453 101 -9 140 -517
3685 -517 14 370 -545 247 -548 -250 -109 -434 -4 -360 -224 -18 -153 -648 -56 205 -204 285 -149 -299
3705 -299 210 -276 -106 94 -113 -184 123 -395 160 -426 -402 -11 -167 -476 -315 -59 -15 314 -775 9 245
3726 245 -221 34 81 -193 327 -136 -306 236 -301 439 321 557 169 -640 -1559 -229 -369 160 180 278 -131
3747 -131 132 -36 -114 82 -343 209 351 -156 188 102 -404 292 -147 -162 228 -26 104 14 -297 -291 -23 -391
3769 -391 -183 89 -212 146 -71 -15 163 -246 -228 271 -221 -27 123 -187 132 273 -256 23 -61 -71 214
$$ packed form
3623c83L04K66p39M07K68m75N61p20L35Q3J69K6M3m58J1N71m77K43J55m76L32
3644D6J96n44N60q32P08J3j023Q64J70l58L67j83l65P98m19j34M71m08RL24m31
3665a71J25J97l86K28L52o72O29j38m72O94n45j15O62o56K77M44l52j10J49o57
3685e17N31L56r15P92p95K98J41l25M30l56J36K06j35m95N92K61m09M89m34j50
3705b99N09m86J70K00k07p1L07n18N55n86K4L91j56l09J61K56M4L29j089P84K36
3726B45m66K55M7k74N20m63j70N42n37P40j18K36l88q09r19J330j40N29K0R8m09
3747a31K63j68p8J96m25N52J42n07L44q6n06O96m39j5L90k54J30r0l11OK68l68
3769c91K08K72l01L58k17N6J78m09J8M99m92J94J50l10L19J41n29K79q4j0K85
$$ plain form
3790 214 -196 -107 125 -316 -157 -83 32 -415 -242 -497 10 -52 -273 265 -88 45 82 -173 -35 305 -205
3811 -205 -61 -16 -206 230 43 -156 82 -58 -107 240 -46 -58 -109 -307 60 -256 -147 206 -181 -332 227
3832 227 -155 -64 337 -32 -43 -125 -108 266 97 -211 202 61 -184 -47 12 29 203 9 -111 306 -12 3
3854 3 -25 -129 89 99 -195 83 7 -83 -59 -172 56 130 -86 354 66 -128 3 162 -77 580 -302 -117 243
3877 243 -1081 -920 249 -297 -546 132 -553 296 -67 -40 117 -62 -150 64 -78 -115 35 -123 88 211
3897 211 -246 232 -163 201 185 -5 52 -5 -213 -164 24 -149 452 65 -206 -251 -276 -1 101 221 207 -135
3919 -135 -37 24 60 -61 381 132 -195 113 96 -57 335 244 128 241 146 310 -208 1 74 -13 -218 -114 163
3942 163 -141 54 -112 -168 229 -268 -376 402 -109 27 9 82 82 -31 -226 227 -191 60 -54 -111 -157 200
$$ packed form
3790B14m10Q9K32m41J59P4J15m47J73k55N07o2k21N38l53J33L7k55J38L40n10
3811b05J44M5j90M36j87j99K38j40m9L47k86j2n1j98L67l16J09L53l87j51N59
3832B27l82R1M01l69j1q2J7L74j69l08M13j41k45J37N9J7J74j94j20M17l18J5
3854Ck8j04K18J0k94K78p6r0K4j13K28P4k16M40k88j94J31J59k39O57q82J85L60
3877B43j324J61J169n46k49O78o85Q49l63K7J57j79q8K14j42l7J50j58K11J23
3897B11m57M78l95L64j6j90N7n7k08M9J88j73O01l87k71m5k5K75J02J20j4l42
3919a35R8O1L6j21M42k49l27L08j7j53L92r1j16J13r5J64n18K09P3q7k05J04K77
3942A63l04J95j66n6L97m97j08P78n11J36j8P3%j13j95M53m18K51j14n7m6L57
$$ plain form
3964 200 -260 7 81 -309 78 182 -194 154 127 45 301 181 49 214 36 28 29 92 -196 -65 -293 180 -164
3987 -164 -150 134 -326 105 405 129 -267 27 -122 191 235 -186 72 -64 -220 316 -27 -110 216 8 84
4008 84 417 -13 -12 24 27 185 -125 11 178 -336 24 217 -349 30 192 -8 273 82 -195 346 -162 -58
4030 -58 225 23 200 285 -175 9 74 -86 27 -143 -261 -94 -695 -425 137 -350 136 -188 -268 -430 13
4051 13 -26 209 63 -243 177 -130 -181 222 3 20 260 -103 -131 -140 -183 36 45 -156 142 11 -65 106 -321 -310
4075 -310 43 -3 315 187 -353 246 -854 -107 231 112 -74 285 -124 -107 88 -187 0 230 -12 150
4095 150 -114 -269 50 64 11 73 -52 -175 72 -284 79 129 -85 195 118 -209 -90 172 -170 92 -286 -148
4117 -148 255 -223 -113 126 -270 31 -34 132 -110 -117 11 -30 -125 -32 185 -156 151 257 -119 68 -31 -68 231
$$ packed form
3964B00m60K67P4l90L87J04l76L48k7q2K56j20j32J65j78qJO3k88J31k28M73l44
3987a64J4K84m60M31L00k76l96K94j49L13M4m21K58j36j56N36l43q3L26k08P6
4008H4L33m30JL6LJ58l10J36J67n14L60J93n66L79J62k00K81j91k77N41n08J04
4030e8K83k02J77Q5m60J84O5j60J13j70j18J67o01K70N62m87M86l24q0j62M43
4051A3l9K35j46l06M20l07n1M03k19J7K40l63k8rm3K19Rk01K98j31p6J71m27J1
4075c10L53m6L18j28n40N99j100P47L38j19j86L59m09J7J95k75J87K30k42J62
4095A50k64j55L19J4n3O2j25j23K47l56L63N0k14K80p7l27J19K62l42K62l78J38
4117a48M03m78J10K39l96L01o5J66k42pJ28m1r5R3K17l41L07J06l76J87r9l7K99
$$ plain form
4140 231 90 84 30 263 152 17 164 137 -10 156 -170 123 100 214 -110 -100 -113 111 13 244 -306 288 -79
4163 -79 -24 123 104 -241 209 14 -241 -81 -13 4 82 -131 155 39 -9 131 223 129 85 247 -166 360 -16
4186 -16 58 38 23 -110 191 -219 15 4 119 129 37 3 339 -142 41 2 -155 171 77 157 38 32 -232 250
4210 250 -133 39 68 -97 -119 -22 92 -22 83 -67 42 128 1 171 -7 116 10 -64 81 123 -142 -61
4232 -61 79 -40 -13 -166 -132 184 123 -141 129 186 -75 49 -131 34 -73 -39 -3 206 -102 81 -47 128
4254 128 228 -99 -74 18 3 48 144 -150 281 -109 13 -41 -137 31 -189 83 -94 197 164 -39 295 -178 -94
4277 -94 51 -119 153 135 172 204 -1 -133 39 20 105 -45 -130 69 31 -260 321 -20 -110 231 -9 -19 358
4300 358 -39 110 -50 -62 22 62 -182 -148 64 58 147 175 -75 104 -144 24 61 99 -182 73 -11 -10 -26 -40 -139
$$ packed form
4140B31j41on4K33j11j35J47k7j47J66l26K93k3J14l24J0j3K24r8K31n50N94l67
4163g9N5J47j9l45M50j95k55J60O8J7P8k13K86j16m8J40R2r4m4J62m13N26l76
4186a6P4k0j5j33L01m10K34j1J15J0r2l4L36m81J83l9j57L26r4Q0j19ok64M82
4210B50l83J72K9j65k2R7J14j14J05j50J09Q6j27J70j78J23j06p4J45M2k65Q1
4232f1J40j19K7j53L4L16o1k64K70N7k61J24j80J65j07L4L6K09l08J83j28J75
4254A28J00l27K5R2j5M5R6k94M31l90J22n4r6J68k20K72j77K91l3k03L34m73Q4
4277i4J45j70K72j8L7L2k05j32J72j9Q5j50q5J99l8k91N81l41r0L41k40j0L77
4300C58l97J49j60j2Q4M0k44L4K12oQ9K8k50J79k48J68L7L8k81K55q4Jj6j4r9
$$ plain form
4325 -139 -96 208 266 -65 -109 155 124 25 39 -198 193 -142 -180 47 -57 7 259 62 -219 -98 -195 262 119
4348 119 -19 -9 118 -88 67 -69 15 -26 91 -132 -14 -79 38 -56 86 -23 2 28 42 63 19 258 38
4371 38 -118 -122 -80 -121 -47 -85 -93 -136 13 121 -217 -30 60 -223 91 -111 -37 79 227 -283 -32 -50 9 166 -16
4396 -16 118 180 28 32 -18 -1 180 -130 -31 -32 39 -128 12 -114 -99 122 24 46 -235 -153 18 124 43 -47 -175
4421 -175 46 5 -72 25 -8 138 101 -124 11 47 9 -153 12 110 -145 -69 -55 44 141 94 -47 14 2 57 187
4446 187 73 -77 201 74 -96 152 77 81 209 -42 42 -74 5 -148 -105 183 -85 53 -148 116 -48 128
4468 128 -42 -67 -55 -77 24 40 -42 35 121 17 44 97 74 -16 29 -57 94 -36 78 53 -61 164 113 -121 82
4493 82 -325 -85 -60 -105 -22 43 60 -276 -16 -197 -26 94 -9 37 92 35 70 15 224 168 -37 161 33 209
$$ packed form
4325a39M3L04N8l31m4K64l1r9J4k37L91l35l8K27j04O4K52j97k81J21r7M57j43
4348A19j38J0J27k06J55j36Q4m1J17k23J18o5J17r4J42j09K5K6J4K1m4K39k20
4371C8j56mM2m1P4l8qm3J49J08l38J87R0k83L14k02P4J16J48n10K51j8N9J57j82
4396a6J34O2j52Mn0J7J81l10R9jP1j67J40j26J5K21r8K2k81Q2J71J06q1r0j28
4421a75K21m1p7R7l3J46l7k25J35L6l8j62J65R8k55P6J4R9R7m7j41O1j2N5J30
4446A87j14j50K78j27j70K48p5MJ28k51Q4j16P9j53M3K88k68J38k01K64j64J76
4468A28j70k5J2k2J01J6q2P7Q6j04K7N3k3r0M5q6J51j30J14k5j14K25n1k34K03
4493H2m07K40K5m5Q3O5J7l36K60j81J71J20j03M6N5n7L5n5K09n6k05J98j28J76
$$ plain form
4517 209 88 -166 -128 165 -1 -56 -91 -288 -315 -104 121 7 -161 3 20 -211 132 8 -97 1 -61 92
4539 92 -11 -85 -39 -56 125 23 217 -154 56 12 54 -93 -53 -240 -111 43 -111 71 -136 -86 136 54 -201
4562 -201 -155 42 53 29 -88 98 -15 -16 0 -218 -19 -27 -109 9 89 -33 108 74 126 -1 -88 -79 -125 15 -187
4587 -187 -68 -190 -17 -61 77 -79 106 54 -85 25 -135 -81 -109 -232 8 41 214 218 -102 49 169 80 -226
4610 -226 -101 -80 85 -154 -24 -519 200 -100 174 188 -211 217 -28 -24 218 -25 20 -75 -175 -87 104 -117
4632 -117 -5 124 -453 107 66 -18 28 137 -201 -114 -157 80 42 -30 -80 234 113 9 37 -128 -46 21 -204 138
4656 138 -18 23 -84 153 208 -27 207 -62 243 -144 -63 -262 373 83 -312 316 199 346 -90 -98 -307 -70
4678 -70 -146 -65 52 10 -127 -97 50 201 -35 -153 -99 54 -87 -56 -49 -39 19 126 -58 -17 38 -75 132 97 -40
$$ packed form
4517B09j21k54L8K93j66n5l5j97k7K11K25j14j68J64J7k31L43j24j05R8o2J53
4539I2j03p4M6j7J81j02J94l71K10m4M2j47M0j87J29J54j54J82k07N0K22q2k55
4562b01M6J97J1k4j17J86j13jJ6k18J99qq2J18Q0j22J41l4N2j27q7Rm6J40k02
4587a87J19j22J73m4J38j56J85n2j39J10j60N4k8j23K40L3J73Ml20J51J20q9l06
4610b26J25K1J65k39J30m95P19l00K74J4l99M28k45MK42k43M5r5j00Q8J91k21
4632a17J12J29n77N60m1q4M6J09l38Q7m3K37l8p2n0L14j21j04K8j65Q2O7k25L42
4656A38j56M1j07K37N5k35K34k69L05l87Q1j99O35k90l95O28j17J47m36qk09K37
4678g0p6Q1J17m2j37L0J47J51k36j18N4J53j41L1PJ0N8J07j84M1N5j13K07l5j37
$$ plain form
4703 -40 83 -47 -251 -85 38 54 53 -216 -99 -100 20 -122 -34 24 76 -66 -59 12 5 14 38 12 -239 61 -81 214
4729 214 -118 -20 130 -58 142 4 295 -221 456 -41 -146 -381 -121 -80 73 525 -852 -510 -267 -13
4749 -13 -14 -169 -805 45 228 -140 111 -264 -417 143 -278 261 79 -82 22 203 -91 116 34 -132 -55 61
4771 61 -56 -38 -111 106 150 147 82 30 220 -66 55 86 -121 91 110 190 41 -88 -22 -73 145 156 -274 175 33
4796 33 119 171 34 5 213 157 20 -138 -77 -240 -49 134 58 -99 -102 -344 103 187 82 166 145 -21 -186 25
4820 25 368 -286 -253 -224 -60 146 -238 -188 52 -53 -232 166 583 -287 -283 -113 139 -443 510 -397 53 29
4842 29 71 279 -90 -26 37 352 -239 61 -79 -155 -182 41 -101 -112 -214 166 -79 -78 133 59 337 210 58
4865 58 -31 -184 497 -254 59 -34 -109 72 -144 178 -489 130 -281 73 144 250 -18 -572 -137 126 -417 -482
$$ packed form
4703d0J23j30k04J66J23J6jk69J17jJ20j42Q8N8N2j42PP1pRK4k6k51L00j42K95
4729B14l32R8J50j88K00j38K91n16O77m97j05k35K60M1J53M52j377L42K43K54
4749a3jj55o36Q50J83l68K51l75j53N60m21N39j82j61J04J81k94K07q2j66P7J16
4771F1j17J8p3K17M4lo5n2J90k86J21L1k07K12J9Q0j49j29O6n1K18J1m30M49j42
4796C3Q6N2j37k9K08n6j37j58O1j63J91J83p6j57lk42M47Q4j05Q4k1j66j65K11
4820B5L43o54L3K9J64K06l84N0K40j05j79L98M17q70MJ70K52n82R53r07M50k4
4842B9M2K08l69O4O3L15n91L00j40p6k7K23j42j1j02L80k45JK11p4K78j27j52
4865E8q9j53O81p51L13r3p5J81k16L22o67O19m11L54P1J06k68n54M35K63n43o5
$$ plain form
4887 -482 -192 -375 -273 -111 -3 149 -270 -77 -178 218 -196 -439 -133 -117 -101 -64 -456 341 85 691 9
4908 9 263 -107 -431 -106 10 108 1 -168 -201 -48 33 -453 -144 245 -704 283 157 -14 426 -257 104 -53
4930 -53 183 -131 -294 395 231 -181 -73 -2 -95 237 -450 -45 -90 -270 -173 254 130 -113 372 -387 -171 -229
4952 -229 -390 -166 -494 -161 23 -274 155 439 440 -394 -417 175 251 -172 589 -604 408 -450 -779 -823 372
4973 372 529 -260 -388 -359 -303 468 -564 -92 345 500 -447 -274 -162 771 448 -180 -994 561 -712 -238
4993 -238 -247 -293 77 -323 -44 55 488 -255 268 -199 201 -141 34 234 -41 198 -38 -183 321 24 -224
5014 -224 -92 -160 103 -427 -117 -503 -384 -188 460 -125 735 178 64 236 369 117 -355 231 45 148
5034 148 -113 -30 218 105 63 -102 213 -95 -69 -67 -401 -560 105 -132 254 277 -231 187 564 -248 56 76
$$ packed form
4887d82K90j83J02J62J08J52m19J93j01L96m14k43L06J6J6L7l92P97k56O06o82
4908IK54l70l24L25J16R8j07j69l3J53Q1m86L09L89r49R87j26j71M40o83L61j57
4930e3K36l14j63O89j64m12J08P1r3L32o87M05m5j80R7M27j24k43M85p59K16n8
4952b29j61K24l28L33J84k97M29K84Jq34k3N92P6m23P61j193J012q58l29m4J195
4973C72J57p89j28K9N6P71j032M72M37J55r47J73J12R33l23o28q14J555j273M74
4993b38rm6L70m00K79R9M33p43N23m67M00l42J75K00k75K39k36j45N04k97k48
5014b24J32o8K63n30L10l86J19J96O48n85Q60n57j14J72J33k52m72N86j86J03
5034A48k61Q3K48j13m2j65L15l08K6Kl34j59O65k37L86K3n08M18L77q12L04K0
$$ plain form
5056 76 -50 387 -103 -29 -69 -183 492 -166 81 152 314 -278 -209 239 -617 360 -123 -177 839 742 316 -491
5078 -491 -293 788 -423 -411 188 -205 -10 -543 -247 257 -510 424 -34 -108 135 126 23 182 85 -327 543
5099 543 168 79 389 -46 -276 -45 -193 -109 85 96 10 116 -142 14 1 -12 -21 33 237 -108 -575 512 33
5122 33 -1 235 332 181 -498 299 70 -117 405 -138 -652 -363 -536 -351 -292 -17 462 235 -196 -5 -16 234
5144 234 -116 -94 -159 157 72 -90 13 26 61 77 60 -145 183 52 -211 -339 265 -601 -77 -9 -708 71 321
5167 321 -52 -597 670 -83 748 671 291 588 96 287 -457 220 190 18 132 -96 -23 -7 -132 258 -17
5188 -17 -124 4 293 -81 -293 -56 62 188 -97 4 -19 -106 4 47 35 35 1 -166 179 -59 -247 231 14
5211 14 -86 78 16 -154 -20 -103 -68 -106 -92 -109 -8 92 -20 -175 -89 -80 -32 -67 -124 25 -71 -201 177 17 60
$$ packed form
5056G6j26M37m90P4m0j14O75o58K47P1J62n92O9M48q56R77m83n4J016r7m26q07
5078d91J98J081j211J2N99l93J95n33K96N04p67R34m58p4K43rj03J59r7m12Q70
5099E43l75q9L10m35k30K31j48Q4J94J1q6J06k58J56j3j3rN4K04l45m67J087m79
5122C3l4K36R7j51o79P97k29j87N22n43n14K89j73J85N9K75M79k27m31J91j1K50
5144B34l50K2o5L16q5j62J03J3L5J6j7k05L28j31k63j28O04q66N24O8o99P79K50
5167C21l73n45J267p53Q31p7l80K97m92J91p44O77l0j72J14k28P3J6j25L90k75
5188a7j07J28K89l74k12K37J18J26k85J01k3q7J10M3j2%l4j67L45k38j88M78k17
5211A4j00J64o2j70J34q3L5l8J4j7J01J00j12j55Q6RM8l5n7J49r6j30L78j60M3
$$ plain form
5236 60 260 -255 153 20 -95 51 65 -207 77 70 -116 110 -110 39 131 8 126 106 143 -219 199 -142
5258 -142 368 261 -152 74 -144 187 -7 38 -116 211 -72 -24 -139 17 13 89 -706 350 388 -62 365 316
5280 316 19 -177 254 -74 151 -92 108 80 -122 243 318 -60 -73 86 71 151 345 324 -386 -292 -519 -279
5302 -279 -16 340 -267 -237 186 -322 -316 -247 -316 -180 146 255 183 -2 -221 23 -243 -414 -358 -151 308 206
5324 206 273 60 233 -595 -25 -416 161 350 54 -83 -312 107 88 589 -22 329 -487 60 306 551 -322
5345 -322 -861 -121 92 -735 -227 -443 -207 39 -123 246 417 575 -732 -24 -141 143 -355 -261 -48 -157
5365 -157 -167 48 -78 84 451 -369 -332 -300 -150 -74 -464 352 -124 -73 311 -234 24 125 -535 388 -315 -619
5387 -619 87 -378 -340 -17 286 -96 -1 15 325 466 109 -360 146 -130 662 482 544 -458 -133 -604 685
$$ packed form
5236F0K00n15M08j33j15J46J4k72K84pj86K26k20J49R2j23J18k0L7l62M18l41
5258a42N10j07m13K26k18L31j94M5j54L27k83M8j15J56mP6p95J056L8m50M27m9
5280C16k97j96M31l28K25k43K00k8k02L65P5l78j3J59j5Q0J94k1p10R4k27K40
5302b79K63L56o07L0M23n08OO9o9J36L26J09p2j85k19K44k66j71N6K07M59j02
5324B06O7k13J73q28N70l91N77J89k96j37k29M19j9N01o11L51q16N47K46K45q73
5345c22n39P40K13q27N08k16K36K46j62L69J71J58j307P08j17K84m98R4K13j09
5365a57j0K15j26J62L67q20L7L2J50P6l90Q16m76N1L84n45K58J01o60R23p03l04
5387f19P06m65L8L23L03l82R5J6L10J41l57m69N06k76P92j80O2j002L25m71J289
$$ plain form
5408 685 300 -425 365 23 450 -442 154 -112 1 -84 -680 104 46 -123 141 -137 78 -116 -166 -129 94
5429 94 -87 61 287 350 -90 -262 228 74 222 30 164 -8 -78 -91 52 -24 83 154 70 -27 -48 127 -63
5452 -63 164 -116 -58 -178 -244 112 -208 254 -91 89 132 21 -7 -181 271 -431 97 1 179 -38 39 158
5474 158 85 221 20 101 103 37 259 -102 -237 299 -7 -104 81 97 -82 -64 -213 94 202 -470 96 116 -10
5497 -10 -150 -105 -125 177 -80 82 -92 319 180 -47 -34 171 134 6 136 -33 15 9 9 174 -69 208 605
5520 605 323 101 -199 -6 72 -114 -63 -183 104 122 132 -45 -71 -33 -24 -308 192 -172 48 105 -2 168 -151
5543 -151 -121 54 132 104 -98 47 144 145 143 -224 -43 -7 64 125 -128 163 -14 92 58 -7 88 169 -39 123 64
5568 64 -45 -92 50 125 46 2 -187 194 228 -150 155 -82 45 118 -166 -176 65 178 -18 200 -3 -183 157
$$ packed form
5408F85l85p25P90l42M27q92N96k66J13q5n96P84n8j69K64k78K15j94n0L7K23
5429I4j81J48K26O3m40j72M90j54J48j92J34j72p0j3J43p6J07P1q4r7k1J75j90
5452f3K27k80N8j20o6L56l20M62l45J80M3j11k8j74M52p02N28r6J78k17P7J19
5474A58p3J36k01Q1Ko6K22l61j35N36l06r7J85J6j79J8j49L07J08o72N66K0j26
5497a0j40M5k0L02k57J62j74M11j39k27J3K05l7j28J30j69M8o%J65k43K77L97
5520F05k82k22l00J93P8j86N1j20K87J8J0j77k6L8Rk84N00l64K20N7j07J70l19
5543a51L0J75P8k8k02J45R7Jkl67J81L6P1O1k53K91j77J06l4o5R5Q1k08J62n9
5568F4j09m7J42P5p9m4j89L81L4l78L05k37J27P3k84j0K41J13j96K18k03j80L40
$$ plain form
5591 157 -74 68 220 -102 115 -17 -56 40 69 87 169 9 -17 80 -137 201 82 19 104 -33 -208 124 -67
5614 -67 -256 -84 -10 -32 -25 109 -17 82 121 68 -5 -128 91 -80 34 53 -20 69 -106 12 98 -116 135 17
5638 17 -161 170 -61 -127 -40 -28 -172 -102 116 127 -188 -57 -64 117 -78 -73 92 -50 -108 -35 78 -34 24 -139
5662 -139 152 -158 156 184 -178 -228 59 29 45 209 25 -225 38 67 74 285 -48 198 -71 -3 30 -21 160
5685 160 -83 -48 109 54 19 -106 -252 -84 -90 -264 -80 44 -110 176 15 -181 27 1 106 -16 20 -59 159
5708 159 -124 -101 -196 31 -21 111 -101 93 -9 -215 98 -85 -88 -37 45 -8 172 -157 95 9 37 49 -52 -14
5732 -14 211 61 229 -64 32 -166 48 -96 -193 14 51 218 -144 59 -133 43 -66 178 -54 171 116 -232
5754 -232 136 230 -9 455 84 -11 220 127 -204 261 -10 96 -50 -72 -120 -40 188 8 -154 -36 -2 35 -33
$$ packed form
5591A57k31J42J52l22K17j32l9R6K9J8Q2j60k6R7k17L38j19o3Q5j37j75L32j91
5614f7j89J72P4k2PJ34j26R9L9n3p3j23K19j71J14J9p3Q9j75J18Q6k14K51j18
5638A7j78L31k31o6Q7J2j44P0K18J1l15J31pJ81j95NJ65j42n8P3J13j12N8j63
5662a39K91l10L14K8l62n0K87l0J6J64j84k50K63K9PK11l33K46k69O8L3n1J81
5685A60k43L5J57n5l5j25j46J68oj74J84J24j54K86j61j96K08k6J05j22L6p9K18
5708A59k83K3r5K27n2J32k12J94j02k06L13j83lN1Q2n3J80l29K52q6K8J2j01L8
5732a4K25j50J68k93R6j98K14j44r7K07L7J67l62K03j92J76j09K44k32K25n5l48
5754b32L68R4k39M64l71r5K31r3l31M65k71J06j46k2m8Q0K28j80j62J18L4L7o8
$$ plain form
5777 -33 -32 -65 -125 43 88 221 79 218 210 13 63 147 88 -23 107 -59 -176 -56 20 164 -241 -273 95 138 -216
5802 -216 -62 -91 -118 249 -209 -118 -79 22 3 -174 -130 -32 31 -106 18 142 -4 -50 76 262 164 -242 145
5825 145 20 -8 53 129 -43 26 -130 -80 137 92 203 -4 -94 181 -233 -96 61 15 -137 -184 -20 -89 130
5848 130 95 32 -93 -128 156 130 -143 -35 99 96 311 -48 29 120 -83 23 -65 127 27 -84 87 -167 62
5871 62 51 61 98 -29 259 -26 -55 148 -272 213 -115 -22 -83 172 -53 -82 40 35 187 -55 -63 104 -9 -209
5895 -209 16 147 96 150 111 143 112 200 147 -20 -27 108 -53 -37 138 -40 -27 -78 -5 35 46 -79 24 -63 -225
5920 -225 2 -49 266 210 16 -49 -42 -146 36 -65 -121 147 -46 -117 95 57 32 -75 -209 -30 53 62 72 -110
5944 -110 -80 219 0 -6 180 -51 75 24 -357 -36 -22 -102 -4 -142 74 -2 -77 41 71 -230 267 -79 -24 251
$$ packed form
5777c3Jl3o0J68M5J33j42J39qj97N0Q4n9j11J30j66j17J20P6J44m05l2L68M3l54
5802b16J54k9k7L67m58R1L9J01j9j77M4R8O3j37J24J24j46m6J26J86r8m06L87
5825A45j25k8O1P6j72O9j56N0K17m5J11k07r0K75m14J37J57m6j52m7J64o9K19
5848A30l5o3j25l5K84k6k73J08J34lK15l59P7R1k03J06q8J92j00j11J71k54K29
5871F2j1J0L7j27K88k85k9K03m20M85l28R3o1K55k25k9J22nJ52k42qJ67j13k00
5895b09K25J31n1N4l9L2l1Q8n3j67pJ35j61J6J75j78J3n1P3M0J1j25J03q7j62
5920b25K27n1L15n6j94o5Pj04J82j01n6K68j93p1K12l8k5j07j34J79Q3RJ0j82
5944a10L0K99k19oJ86k31J26n1l81L21J4q0R8j38K16p6p5J18L0l01M97l46N5K75
$$ plain form
5968 251 -68 -94 -13 -106 -272 71 154 47 158 23 143 269 10 149 -28 -5 203 81 -119 168 -90 118
5990 118 -17 102 -124 95 -45 -52 220 -141 -23 85 -94 -46 -115 -25 -120 -160 -157 -36 -114 123 9 -90 237 16
6014 16 -213 117 -4 -227 143 -98 181 214 -31 -14 -52 -83 147 -50 125 78 -191 -268 -36 57 253 -17 -43
6037 -43 -88 -114 -37 -173 47 148 97 -69 -291 -6 -68 150 118 -118 -88 -41 -240 -78 190 -111 -156 -56 -33 27
6061 27 -38 -56 151 79 167 -57 -132 59 -1 99 83 -80 -12 77 -208 187 273 -144 26 -85 -141 -42 -161 106
6085 106 -24 -104 -98 13 85 178 34 -129 55 -39 -82 -54 -88 -62 44 -21 18 233 -111 134 166 -60 80 121 -117
6110 -117 87 27 -6 31 -66 -3 -50 92 -42 94 -224 126 168 -217 -18 -120 106 100 -166 42 57 -36 -7 -80
6134 -80 -152 -38 -143 -282 155 -39 130 247 29 -126 -62 111 -96 -35 -4 67 338 -205 109 276 33 -1
$$ packed form
5968B51l19k6Q1r3j66L43Q3j07J11j35J20J26k59J39j77K3K08j22k00K87k58K08
5990A18j35J19k26K19j40pK72l61J18J08j79M8o9R0r5m0LJ21p8K37j14r9L27k21
6014A6k29L30j21k23L70k41K79L3k45J7l8l1K30j97J75m7k69p7K32R3J96k70k6
6037d3m5k6P7j36K20J01n1j66k22K85o2K18l2k36L0M7j99J62K68l01m5J00K3O0
6061B7o5j8K07p2Q8k24p5J91o0J00j6j63O8Q9k85L95Q6m17J70j11n6R9j19K67
6085A06j30q0OJ11P2R3j44j63J84r4m3K8l4K6J06o5L9K15l44K45L2k26J40M1k38
6110a17K04o0l3L7r7O3m7J42j34J36l18L50M2l85J99j02K26ok66K08J5r3K9p3
6134h0p2J14j05j39M37j94J69J17k18j55O4J73k07O1L1P1K71n43L14J67k43l4
$$ plain form
6156 -1 53 50 80 -125 127 44 -150 62 73 44 80 209 -47 -157 -9 -140 51 -1 -94 193 -125 42 97 -53
6180 -53 -238 92 43 -3 -36 -37 13 -196 203 20 -24 77 -110 10 101 29 -80 10 59 -5 -92 -36 59 41 5 47
6206 47 20 -53 74 11 66 -191 29 40 126 102 2 57 141 84 46 -66 39 67 -48 18 124 -5 218 -155 -115
6231 -115 223 -63 136 8 -78 -6 70 157 -4 53 -134 165 -38 68 79 -79 -8 163 -34 14 -244 96 110
6254 110 -3 -91 -77 178 80 7 85 -8 118 -127 174 -233 -212 -109 -271 -47 171 57 -173 -94 -152 -10 86
6277 86 -106 -19 109 -209 212 22 -2 -51 58 30 -186 -149 16 292 -32 44 -229 -123 -34 -141 -215 91 120
6300 120 -166 60 -165 -87 43 -260 53 157 -177 47 -8 142 -58 -50 -502 -283 -608 406 -554 217 435
6321 435 13 -311 -100 -358 302 -92 194 -86 -106 119 218 179 -60 57 93 7 98 -302 6 126 50 -106
$$ packed form
6156aN4lL0k05K52q3j94K12J1k9L6J29k56j10J48j31J91n2r3K87l18J67N5j50
6180e3j85L30m9m6l3jN0k09L99j83m4J01j87J20R1p2j09R0M9o4q7N6R5j8l6M2
6206D7k7p3J27o3N5k57K20J1Q6k4j00N5Q4n7l8j12J05K8j15O6J06j29K23l73M0
6231a15L38k86J99j28q6P2P6Q7j61N7j87K99k03J06J1j58P1J71j97M8k58L40J4
6254A10j13q8J4K55r8p3P8r3J26k45L01m07K1J03j62K24K18j14k30P9n8J42R6
6277H6j92Q7J28l18M21j90k4m9J09k8k16L7J65K76l24P6k73J06Q9j07p4L06K9
6300A20k86K26k25P8J30l03L13J04l34K24n5J50k00Qm52K19l25J014r60P71K18
6321D35m22l24K11k58O60l94K86k80k0K25R9l9k39J17L6q6R1m00L08J20p6j56
$$ plain form
6343 -106 -190 30 102 2 16 -43 11 -20 -31 144 -274 -7 -40 -8 -205 -133 -83 99 -158 164 93 60 -71 -55 -257
6368 -257 15 -119 -27 121 -34 -90 150 -175 -227 161 110 18 197 -95 -71 -45 -110 -38 -68 -134 94 -169 -3 91
6392 91 134 -201 -138 -277 18 48 -205 90 107 117 202 -24 11 63 -91 -3 122 29 -233 191 -128 100 -172 -64
6416 -64 69 -258 -35 -173 -62 -3 80 -57 73 180 52 315 -87 121 140 -199 -104 8 -190 145 211 -88
6438 -88 -10 52 1 98 108 95 163 -224 284 176 -130 107 -193 -127 -7 76 159 112 -263 -20 140 -54 -125 58
6462 58 -49 -279 -60 -31 221 163 -96 60 -180 -78 149 -277 239 309 -100 -9 -70 170 122 -14 -102 -176 -213
6485 -213 7 252 -241 46 -147 -25 30 114 -157 76 99 -74 351 -210 19 58 -19 7 93 -87 273 -124
6507 -124 15 294 -163 -101 191 -199 23 -306 148 -684 -180 -47 445 -353 -417 -145 -257 -191 160 61 185
$$ packed form
6343a06q4K20P2j00J4n9N4l1j1J75m18K67l3L2j97P2N0J82k57L22p1l3j31J6k02
6368b57K72j34R2J48j55n6K40l25n2L88n1r2J79k92K4K6o5P2l0o6K28k63J66R4
6392I1M3l35O3j39K95L0k53K95J7J0Q5k26L5N2j54Q8J25r3k62M24l19K28k72J08
6416f4J33l27K23j38J11N9Q3j37J30J07j28K63m02K08J9l39R5J12j98L35O6k99
6438h8P8O2n1R7J0j3O8l87N08j08l06K37l00O6J20Q3Q3m7l75K43J60j94p1J83
6462E8j07k30K19K9K52n8k59J56k40J02K27m26N16P0m09R1o1K40m8j36q8p4l7
6485b13K20K45m93K87j93J22N5Q4k71K33K3j73M25n61K29L9p7K6Q6j80L60l97
6507a24J39K79m57O2K92l90K22l29M54q32N04J33M92p98o4K72j12O6L51r9J24
$$ plain form
6528 185 197 621 -84 -765 221 444 215 -305 203 180 -168 -94 78 -62 -39 -325 -32 -44 -125 252 139 -26
6550 -26 157 123 -34 85 152 -85 209 110 281 70 129 -106 -107 106 131 118 -99 -152 -183 7 -95 -88 -382 -166
6574 -166 -81 26 13 68 57 -121 50 188 -44 53 -32 143 67 -471 698 54 -706 -92 448 373 217 -113
6596 -113 -50 -516 -308 -509 -263 560 -271 5 516 -58 -676 -766 317 -48 262 -455 357 253 -218 -40
6616 -40 546 768 -674 -152 152 54 -7 116 265 63 252 -186 465 340 -274 49 222 -231 451 -106 -66
6637 -66 185 -306 96 24 -144 -34 4 372 -117 -180 302 -76 -375 18 -48 190 48 395 -39 167 149 144 365
6660 365 121 48 306 -122 738 581 523 1054 -189 -707 -709 3 269 398 276 -54 453 260 -64 -104 -200 -233
6682 -233 188 -124 45 24 -12 201 -266 -126 118 105 -193 129 -87 -99 -27 -25 28 145 -64 215 -29 -74 44
$$ packed form
6528A85J2M24p05o81R86K23k29n20N08k3l48P4J72j40K3k86K93j2q1L77j13j65
6550b6J83l4j57J19O7k37K94r9J71k11N9k35jK13K5j3k17n3l1J90j02Pk94K16
6574a66Q5J07j3N5j1j78J71J38k32R7q5J75p6n38J169o44p60O14N40p5j56l30
6596a13O3m66K08k01K46Q23q31K76N11n74o18r0J083l65L10p17Q12j04m71J78
6616d0N86K22j442N22L04r8o1J23J49k02J89m38O51j25o14L23J73m53O82n57M0
6637f6K51m91M02p2j68J10L8L68m89o3M82l78k99L93o6K38j42L47m34K06j8nK21
6660C65k44p3K58m28Q60j57n8N31j243n18kP12K66J29j22l30N07j93l24m0r6l3
6682b33M21l12J69k1l6K13m67J40K44j3k98L22k16j2P2KN3J17k09K79k44m5J18
$$ plain form
6705 44 69 -209 -99 303 70 89 69 -24 161 -135 308 -64 -656 718 -42 -55 189 -80 -22 317 -409 48
6727 48 -2 188 118 169 -184 -5 9 97 32 128 -139 175 22 -131 130 -208 146 -57 -191 93 -28 37 131
6750 131 85 -218 113 -57 116 0 39 109 90 -85 57 54 14 -93 -97 70 69 31 -107 -65 -152 -76 51 81 -43
6775 -43 -110 -66 215 -160 62 219 -361 -35 351 -62 100 356 31 150 23 -144 -69 207 -86 -17 -176 -226
6797 -226 -17 -112 -82 -66 -205 244 104 -135 81 135 -259 -1 -151 -14 -5 -48 -134 55 -31 21 -139 48 83 116
6821 116 57 -92 -416 68 173 -37 296 -84 149 -36 123 -379 139 128 186 138 -70 -18 543 -269 266 -658
6843 -658 -218 490 -170 -17 62 191 -181 563 -279 8 -5 -138 -31 -44 -264 -10 335 -284 -79 322 -471
6864 -471 648 -92 13 158 -349 30 102 -122 -7 209 78 50 143 118 -54 107 -59 67 44 71 -13 -55
$$ packed form
6705D4K5k78J10M02k33J9k0r3J85k96M43l72n92J374p60j3K44k69N8L39p26M57
6727D8n0J90p0N1l53J79J4Q8o5R6k67L14j53j53K61l38L54k03j34K84j21O5R4
6750A31m6l03L31j70J73j16L9P0j9j75J42lm0j07mJ67jl8j38M2q7P6J27L0j24
6775d3o7M4K81l75K22J57n80L26L86m13J62K56l25J19j27j67P5K76k93O9j59n0
6797b26K09r5L0J6j39M49j40k39K16N4l94K58j50J37Rm3q6J89q6N2j60J87L5L3
6821A16n9j49l24M84J05k10L33l80K33j85J59n02N18j1N8m8k08N2N61q12N35r24
6843f58M40P08o60J53P9J29l72P44q42K87j3j33J07j3k20K54L45o19K05M01p93
6864d71J119p40J05J45n07L79P2k24J15K16j31k8R3k5j72J61j66J26k3K7q4m2
$$ plain form
6886 -55 -2 29 -148 41 71 -85 9 -170 38 54 41 -200 -8 -62 4 -68 66 148 -319 -66 116 90 -13 -20 -110
6911 -110 -196 -36 -40 202 -57 -107 -96 -41 -253 51 41 -109 118 64 296 -147 -205 -58 -44 94 166 -131 -70 74
6935 74 59 146 -29 7 35 -31 208 -330 -193 -195 -310 34 -499 194 -284 312 -51 65 67 -154 -46 90 154 138
6959 138 384 -15 173 -120 -19 -119 99 59 -28 118 -110 79 -17 -81 162 -79 160 -48 -61 156 53 -87
6981 -87 -8 110 -106 122 -92 -41 88 -6 -117 16 0 -9 -15 162 101 2 51 135 -222 -201 127 134 -26 69 113 11
7007 11 37 39 -14 -31 -149 101 -131 96 255 164 2 -9 -51 -45 133 -87 -27 151 -251 -179 -100 -183 124 -12 -154
7032 -154 -11 -12 56 133 -152 136 -47 -84 185 512 68 -179 -359 -289 -27 265 205 145 -201 -38 90 -256 -128
7055 -128 109 -54 -24 19 -172 -135 -117 154 174 22 -42 34 -77 20 -45 -3 300 -15 -172 72 -162 -46 194
$$ packed form
6886e5N3L1j77J89L0j56R4j79K08J6j3k41J92n4O6p2J34Q2m67K53J82k6j03pr0
6911a10q6J60mK42k59n0J1N5k12L04j0j50K27n4K32m43n8J47J4J38P2k97O1J44
6935G4j5Q7j75L6K8o6K39n38J37kj15L44n33O93m78N96l63J16Kk21J08J36O4j6
6959A38K46l99J88k93J01j00K18m0q7J46k28J89r6o4K43k41K39k08j3K17j03j40
6981h7P9J18k16K28k14N1J29r4j11J33j6roJ77o1r9M9Q4l57K1L28Pj60R5M4j02
7007A1K6Kn3j7j18K50k32K27J59r1j62j1m2OJ78k20O0J78m02P2P9q3L07j36j42
7032a54J43jO8P7k85K88j83l7K69L27m44k47j80P0K62K92o0o0l46J63J28l46J28
7055a28K37j63L0M3j91L7J8K71K0j52o4P6j11R7o5M2L03l15j57K44k34J16K40
$$ plain form
7078 194 -142 142 139 -98 192 -66 -236 171 130 87 -55 -46 2 273 -160 -187 58 -52 114 -258 -79 -44 -124
7101 -124 -117 147 103 -37 216 -231 -28 -12 -134 -76 -33 68 94 7 -131 -52 -89 48 -5 -46 -243 74 -243 -22
7125 -22 139 662 650 576 -111 506 455 229 -544 264 232 -25 117 -194 507 -291 1 113 51 -191 -108 -95 69
7148 69 -54 218 116 -130 -111 33 -153 138 -53 -8 87 120 20 5 -176 -4 96 -63 112 -37 -27 -25 -63
7171 -63 -109 166 -178 -148 -102 106 -92 65 -27 -109 75 -58 56 -303 -153 44 189 -160 151 54 -52 -61 -175
7194 -175 -66 170 -63 35 91 34 -53 -167 -25 38 -117 -166 69 216 73 81 -144 -47 -27 -112 56 35 207 66
7218 66 -85 -114 -61 -4 52 18 166 -218 -158 -3 235 48 158 109 106 -135 30 199 14 160 -78 308 -226
7241 -226 -42 -44 61 -90 158 -66 207 219 12 177 -384 -63 54 89 200 176 18 -23 -94 -307 -94 132
$$ packed form
7078A94l36K84lk37K90k58j70M07m1m3j42RM8K71m33k7K45j10J66l72J79L5q0
7101a24PK64m4j40K53m47K03J6j22N8M3J01K6q7j38P9l7J37n3m1j97L17l17K21
7125b2J61N23j2p4o87O17n1k26p73Q08l2k57J42l11P01p98K92J12o2k42Q3J3J64
7148F9j23K72j02k46J9J44j86K91j91M5R5L3j00j5j81J72J00j59J75j49J0Kl8
7171f3m6K75l44L0M6K08j98J57r2q2J84j33J14l59J50J97J45l49L11r7j06rj14
7194a75J09K36k33R8N6n7q7j14J42O3j55m9K35J47j43Qk25R7K0q5J68k1J72j41
7218F6j51k9N3N7N6l4J48l84O0J55K38j87J10m9lk41J65J69j85J46k38L86n34
7241b26J84kJ05j51K48k24K73J2k07J65n61L21J17L5J11k4j58m1p1k13K13K26
$$ plain form
7263 132 -62 227 207 -377 316 -184 -74 -148 -379 -102 4 -202 -82 400 162 -147 -183 4 -92 109 -89
7284 -89 2 -74 -132 -467 15 293 -177 -287 133 -100 40 164 0 293 128 -89 -83 98 -182 -92 172 30
7306 30 -101 58 -187 85 -93 402 -431 -124 333 493 -52 312 -19 123 -145 186 -375 220 71 -2 286
7327 286 -108 -86 19 156 10 -30 120 -242 103 -263 70 799 99 -182 -202 -107 39 -164 -196 108 -131 31
7349 31 83 -24 -56 -32 -139 -88 -12 -162 -36 -214 38 -32 -53 -26 -2 -131 -34 -58 -223 47 -109 15 109 -64
7373 -64 468 -84 -412 -531 265 -4 196 -170 -461 181 -407 133 100 -97 -116 164 -132 -96 22 -6 24 180
7395 180 -168 46 -23 -66 -26 -142 -16 266 -340 30 -148 250 -70 183 -416 89 -160 -95 -158 -771 253
7416 253 -30 -194 -427 198 -101 152 17 -92 -21 158 -25 94 -105 -23 248 -87 -15 43 -264 210 -95
$$ packed form
7263A32j94K89k0n84O93n00J10p4k31K77J06k06J20M82k38l09l6J87r6K01j98
7284h9R1p6n8l35M82K78m70j10M20k33J40J24j64K93j65k17OJ81k80R0K64j42
7306C0j31J59k45K72j78M95q33L07M57J60n45L64l31J42k68L31n61N95j49p3K88
7327B86l94K2J05J37j46m0J50l62L45l66L33P29p00k81k0R5J46k03l2L04k39J62
7349C1N2j07l2K4j07N1P6j50J26j78K52p0k1K7K4j29R7k4j65K70j56J24R4j73
7373f4N32n52l28j19P96k69K00l66k91O42n88N40l3j97j9K80k96L6J18k8L0J56
7395A80l48K14o9m3M0j16J26K82o06L70j78L98l20K53n99N05k49O5o3o13J024
7416B53k83j64k33O25k99K53j35j09P1J79j83J19j99Q2K71l35P2N8l07M74l05
$$ plain form
7437 -95 158 -129 -213 -219 516 117 42 -202 361 230 329 320 -162 211 197 303 622 450 -421 250 172 -102 -442
7460 -442 -517 225 224 397 -246 -184 -57 8 -170 -130 261 279 -568 322 -606 120 62 -27 660 -251 616 -297 579
7483 579 -318 268 -310 -33 -39 109 -111 -211 66 -78 152 196 90 -68 -57 6 194 -217 17 58 126 -133
7505 -133 -54 -140 37 30 -243 58 81 -49 -12 97 -82 -39 55 -29 -414 -296 -328 655 55 -231 -111 -255 161
7528 161 46 -87 -75 169 404 168 252 -144 -407 319 -285 200 265 33 170 -31 -130 11 70 -18 -180 118
7550 118 -10 -60 -259 152 -191 -20 -43 -134 -214 -62 -127 -22 108 -68 -44 103 -91 176 57 -166 318 -83
7572 -83 -178 81 -13 -33 18 58 113 131 13 190 -94 -206 61 39 -89 27 115 -133 100 -86 -36 10 -33 181
7596 181 -132 32 9 81 86 -164 38 -21 -129 -63 116 28 -57 -76 2 -110 172 -141 152 302 97 -10 188
$$ packed form
7437i5K53k87q4oP35l99p5k44N63j31R9rm82L73j4J06L19j72q71O71p8k74l40
7460d42p5P42jJ73o43O2J27O5j78M0L91J8q47Q90r28P26n8q9O87r11Q67r13Q76
7483E79q97N86n78K77oJ48k20j00K77j44K30M4j06j58J1O3J88m11K34M1O8k59
7505a33P9q6J77pk73L01K3j30L7J09j79M3R4q4l85J18l2R83o00k86J20j44M16
7528A61j15j33J2K44K35k36Q4l96k63P26o04M85O5k32J37k01r9J41N9q8j62K98
7550A18j28n0j99M11l43J71k3r1q0J52o5J05J30j76K4J47j94K67j19k23M84m01
7572h3r5K59r4k0N1M0N5J8j18J77k84j12K67k2j28J16Q8k48K33j86N0M6m3K14
7596A81l13J64k3P2Nk50K02n9j08O6J79q8q5j9P8j12K82l13K93J50k05j07J98
$$ plain form
7619 188 29 -44 74 152 184 -36 -132 73 117 104 222 -45 -115 52 17 109 114 -8 -11 60 -172 33 76 157 171 -111
7645 -111 51 52 -60 216 -40 -127 212 -135 128 137 -319 -112 24 90 -84 22 -177 -249 -54 -3 9 161 -25
7668 -25 -114 -35 84 -57 121 113 59 -196 53 147 -185 51 -70 -186 -28 -131 -129 76 -184 -117 139 -7 -28 -98
7692 -98 -43 38 -125 164 -36 13 42 5 -187 -21 -20 43 -256 -177 -261 -262 15 -7 -127 -233 -169 -142 130 -4 140
7717 140 -68 344 57 -26 -107 -63 -35 231 -82 -8 333 -153 -106 -10 -111 -39 -26 -19 -12 65 101 -236 -96 -275 227
7742 227 160 79 113 -42 64 153 -96 145 -190 -36 196 75 69 101 -166 -33 33 125 59 31 -14 -68 -347 50
7766 50 68 228 140 -97 -134 60 186 -87 85 165 151 -167 257 -18 -26 -144 52 201 116 186 -141 -203 -143 -4
7790 -4 -103 33 -45 -154 82 -172 -104 43 -128 66 386 -139 94 -129 -119 -134 -179 -115 -92 187 275 15 -518 193
$$ packed form
7619A88j59p3J18P8L2k20r6K05M4j3J18k67p0J67l5R2Nj22lP1k32K05M3Q1J4k82
7645a11J62Jj12K76k56q7L39l47K63Rm56K07J36O6j74J06j99p2J95N1J2J52j86
7668b5q9P9J19j41J78qn4k55K49R4l32K36j21j16J58j03KK05k60O7K56j46k1p0
7692i8N5Q1j63K89k00M9K9l7j92J66JO3k99P9q4jK77k2j20j06O4K7K72j34J44
7717A40k08M12k87q3q1M4K8K66l13P4L41m86M7R6j01P2J3PPP7L6l37J40j79N02
7742B27o7q1L4j55J06Q9k49K41l35J54K32j21oL2k67J33O6R2o6k8m5n4k79L97
7766E0J8J60q8k37l7J94J26k73J72Q0j4l18M24k75qj18J96J49q5P0l27o2O0J39
7790dr9J36p8j09K36k54O8J47j71J94L20n25K33k23J0j5m5O4K3K79Q8k60n33P11
$$ plain form
7814 193 649 203 -101 357 -343 704 106 -153 -26 -681 373 -570 -66 83 287 -694 285 170 352
7833 352 -416 -129 376 -476 -223 248 64 -95 415 96 -9 244 487 -133 1105 263 -119 447 -539 377
7853 377 848 218 -124 149 223 30 513 -530 329 419 181 -93 -309 -70 120 -15 -240 214 71 163 130
7874 130 -178 106 -43 372 195 34 -225 64 -521 -427 -684 -770 -488 302 86 337 829 352 -328 -452 -541
7895 -541 18 146 -318 -71 41 184 -165 -2 -239 414 68 237 617 264 -13 -287 -38 -356 52 -114
7915 -114 108 52 224 -165 -249 138 -71 -3 32 95 -193 189 -3 125 -195 -151 -34 -47 6 322 117 -49 37
7938 37 14 -115 86 -72 33 62 -124 42 -74 -2 -114 83 58 -96 -40 94 152 -177 -33 -66 33 -51 -119 39
7962 39 173 -29 9 42 1 96 177 -173 -37 -41 -129 -61 -158 -71 -61 186 -211 47 -85 17 36 26 218 -372 41
$$ packed form
7814A93M56m46l04M58p00J047n98k59J27o55J054r43N04J49K04r81R79j15J82
7833C52p68K87N05q52K53M71j84j59N10l19j05K53K43o20J238q42l82N66r86R16
7853C77M71o30l42K73P4j93M83j043Q59R0k38k74k16K39J90j35k25M54j43R2l3
7874A30l08K84j49M15j77j61k59K89n85R4k57q6K82P90k16K51M92m77o80j24q9
7895e41N59J28m64K47J12J43l49J63k37O53l46J69L80l53k77k74K49l18M08j66
7915a14K22n6J72l89q4L87k09O8L5O3k88L82j92J28l20M4J17j3N3L16k05j66Q6
7938C7k3j29K01j58J05K9j86J66j16P2j12J97k5j54N6J34N8l29J44l3R9q4o8J58
7962C9J34k02L8L3m1R5Q1l50J36mq8O8r7Q7J0K47l97K58j32J02J9j0J92n90M13
$$ plain form
7987 41 88 -143 -77 196 -154 -274 -104 -315 -67 223 91 -123 -181 -277 116 -322 -570 274 271 710 393 -446
8009 -446 -197 406 221 -73 241 -372 150 -2 67 531 -47 -126 108 -179 -309 -189 -130 328 -67 -416 89
8030 89 -221 -343 -90 160 -142 -581 -81 73 230 -29 475 160 166 104 301 -155 -173 -65 143 166 187 154 -5
8053 -5 -70 54 110 -263 163 204 50 202 -93 339 -65 152 -58 38 -465 16 78 -172 80 380 -114 22
8075 22 719 45 27 -262 -45 -10 -150 121 -187 -267 -6 12 87 -56 65 -82 2 -112 201 133 28 -135 -33
8098 -33 -165 -58 -26 -28 169 -223 -85 82 -166 -279 26 -26 26 290 -103 -41 -8 -12 139 9 -164 -55 29 -27
8122 -27 3 64 -56 6 -236 -37 -15 -143 18 45 276 -39 54 -9 -29 -157 70 -134 -130 -31 143 -218 133 202
8146 202 -49 -149 -16 -34 33 157 9 74 28 112 -17 -111 57 -76 -144 70 -106 5 -76 0 -149 7 -43
$$ packed form
7987D1M7k31O6K73l50j20J70k11K48K90j32k14n8r6L93m38k48Q44lM39l17q39
8009d46K49O03j85k94L14o13N22j52O9M64n78p9K34k87j30J20N9M58l95l49N05
8030H9l10j22K53K50l02m39N00J54J57k59N04l15Oo2J97m56j8J08K08K3K1l3j59
8053eo5J24N6l73M26M1j54J52k95M32m04K17k10R6n03M81O2k50K52L00m94J36
8075B2O97o74j8k89K17L5j40K71l08q0K61J8P5j43J21j47Q4j14L13o8j05j63J02
8098c3j32J07L2kJ97l92J38J67k48j13L05n2N2K64l93O2L3mJ51j30j73J09Q4n6
8122b7L0O1j20O2k42J99K2j28J61K7K31l15R3o3k0j28K27k04MR9J74l61L51O9
8146B02k51j00J33j8O7J24j48O5m6Q4j29r4J68j33o8K14j76J11q1P6j49J56n0
$$ plain form
8169 -43 44 -30 146 51 87 19 24 167 -22 136 71 135 19 46 94 -4 79 169 153 335 55 -71
$$ packed form
8169d3Q7p4J76r5L6o8NJ43j89J58o5O4j16K7M8r8Q3R0j6J82k80j26
8191g1
$$ Imaginary data points
##PAGE= N=2
##DATA TABLE= (X++(I..I)), XYDATA
$$ plain form
0 0 0 0 0 0 0 0 0 0 0 0 8 -8 8 -15 16 -20 24 -31 39 -47 54 -63 77 -88 103 -124 142 -165 188 -218 250 -282
32 -282 320 -363 410 -462 519 -581 652 -724 806 -896 994 -1102 1220 -1346 1486 -1639 1805
49 1805 -1988 2191 -2411 2662 -2936 3245 -3593 3989 -4443 4971 -5596 6346 -7269 8429
63 8429 -9952 12034 -15078 19969 -29148 52493 -246447 -421589 -117465 -136342 -150128 -282331
75 -282331 -213645 -69270 -52078 -71807 -11579 20369 169877 196016 102226 111889 136516 131773
87 131773 181692 113862 99931 162064 105761 44665 14033 -47070 18348 38881 -29941 -10415
99 -10415 -24206 -65466 -34184 -76517 -64694 41995 55456 55658 17572 -91355 -44966 40874
111 40874 58927 101565 46257 -24346 31415 24508 -4342 -2878 -56126 -2350 89190 56876
$$ packed form
0@%%%%%%%%%%Qj6J6k3L1l6M4n5P0q6J01j17J40j65J91k27K66l07L53m06M68n32
32b82O02o83P73q72R81j100J233j376J530j702J890k096K322k566K832l125L444
49A805l793M179m602N073n598O181o838P582q432R414j0567J1942j3615J5698
63H429j8381K1986k7112L5047m9117Q1641k98940j75142L04124j8877j3786j32203
75b82331O8686J44375J7192j9729O0228L1948J49508K6139r3790R663K4627m743
87A31773M9919o7830j3931O2133n6303o1096l0632o1103O5418K0533o8822J9526
99a0415j3791m1260L1282m2333J1823J06689J3461K02l8086j08927M6389Q5840
111D0874J8053M2638n5308p0603N5761o907k8850J464n3248N3776R1540l2314
$$ plain form
123 56876 37701 -8162 -61754 25417 66063 43907 80904 59961 64834 104904 27954 -1414
135 -1414 30356 22508 73467 61809 -37670 -34950 -45974 -72349 -35437 -73376 -92915 -47508 -86122
148 -86122 -100513 -89791 -119699 -51518 -9102 -53224 -21313 -8796 -14648 31164 -7711 -16362
160 -16362 71518 88936 92469 62923 -31575 -4245 48671 20254 23879 -12162 -35383 25803
172 25803 -16993 -89411 -87464 -100741 -46863 2446 -59176 -58589 -39740 -57509 -13447 -24506 -49746
185 -49746 21503 37499 34086 58009 11191 20367 63767 34892 61722 77586 34859 59229
197 59229 44908 6809 46967 36541 29148 58092 1506 -15569 11769 -15436 11254 21796
209 21796 -22916 10766 12661 -21959 -2815 -32854 -34048 28220 10706 2312 11362 -30283 -1572
$$ packed form
123E6876j9175m5863n3592Q7171M0646k2156L6997k0943M873M0070p6950k9368
135a414L1770p848N0959j1658r9479K720j1024k6375L6912l7939j9539M5407l8614
148h6122j4391J0722k9908O8181M2416m4122L1911J2517n852M5812l8875q651
160a6362Q7880J7418L533k9546r4498K7330N2916k8417L625l6041k3221O1186
172B5803m2796p2418J947j3277N3878M9309o1622N87J8849j7769M4062j1059k5240
185d9746P1249J5996l413K3923m6818R176M3400k8875K6830J5864m2727K4370
197E9229j4321l8099M0158j0426p393K8944n6586j7075K7338k7205K6690J0542
209B1796m4712L3682J895l4620J9144l0039j194O2268j7514q394R050m1645K8711
$$ plain form
222 -1572 14955 -34793 -13012 331 -2771 41898 4709 -37543 -13261 -33059 -15148 20438
234 20438 -19459 -6168 7162 -30072 -6221 -9037 -32712 11124 -2054 -22693 6689 -21851
246 -21851 -10910 26400 -10545 -3238 8080 -22574 13665 13662 -18617 17460 8733 -2924 26657
259 26657 -9465 -8672 26157 -8916 -2560 8812 -13642 31694 33590 -14301 -1031 -15655 -14015
272 -14015 31666 2951 -4308 22685 -9354 0 5750 -30764 505 7917 -20220 6485 -7686
285 -7686 -17487 17740 -13211 -20759 5580 -21146 -3596 13718 -16886 11586 12482 -18312 9501
298 9501 -2924 -12598 22351 -4010 -5836 20664 -8991 6069 19008 -18206 2635 4232 -18743
311 -18743 15995 4244 -11105 20809 -4887 -8546 14364 -20034 -6024 15645 -9956 14710
$$ packed form
222a572J6527m9748K1781J3343l102M4669l7189m2252K4282j9798J7911L5586
234B0438l9897J3291J3330l7234K3851k816k3675M3836j3178k0639K9382k8540
246b1851J0941L7310l6945P307J1318l0654L6239ll2279L6077q727j1657K9581
259B6657l6122P93L4829l5073O356J1372k2454M5336J896m7891J3270j4624J640
272a4015M5681k8715p259K6993l2039R354N750l6514L1269P412k8137K6705j4171
285g686r801L5227l0951p548K6339k6726J7550J7314l0604K8472Q96l0794K7813
298I501j2425r674L4949k6361j826K6500k9655J5060J2939l7214K0841J597k2975
311a8743L4738j1751j5349L1914k5696l659K2910l4398J4010K1669k5601K4666
$$ plain form
323 14710 13760 -14605 14691 1253 -14441 18526 -2418 -3588 20747 -10577 1758 20950 -12652
336 -12652 2173 -507 -24740 10758 2759 -14199 13624 -10724 -15729 6008 -25809 -11983 9416
349 9416 -17059 1415 1334 -21267 13895 7193 -10368 16657 -4037 -2036 29769 5867 20410
362 20410 37951 3379 18622 19275 -2742 29243 18668 -1562 23678 -367 -4142 18482 -16668
375 -16668 -12948 496 -28085 -7017 -3346 -26929 1191 -11095 -31687 -4474 -22454 -18569 14918
388 14918 -8127 286 13599 -15466 7872 15032 -9135 16246 8902 -4913 21038 -3893 -10750
401 -10750 14879 -11744 -9152 -3072 -37069 -16912 -10013 -35932 -15757 -25754 -37239 -6949 -31217
414 -31217 -40581 -13076 -27737 -9890 7720 -19428 4090 18374 91 20444 10392 3310
$$ packed form
323A4710r50k8365K9296j3438j5694L2967k0944j170K4335l1324J2335J9192l3602
336a2652J4825k680k4233L5498p999j6958K7823k4348n005K1737l1817J3826K1399
349I416k6475J8474q1k2601L5162o702j7561K7025k0694K001L1805k3902J4543
362B0410J7541l4572J5243O53k2017L1985j0575k0230K5240k4045l775K2624l5150
375a6668L720J3444k8581K1068L671k3583K8120j2286k0592K7213j7980L885L3487
388A4918k3045Q413J3313k9065K3338P160k4167K5381p344j3815K5951k4931o857
401a0750K5629k6623K592O080l3997K0157O899k5919K0175r997j1485L0290k4268
414c1217r364K7505j4661J7847J7610k7148K3518J4284j8283K0353j0052p082
$$ plain form
426 3310 47366 41106 36514 52016 20647 28353 44603 14113 31594 40385 19272 37100 13136
439 13136 -16485 7385 -5022 -6487 10729 -25023 -23259 -3110 -25585 -11502 -12390 -33754 447
452 447 1310 -14983 6316 -9125 -3926 28103 4414 7467 27724 10835 28644 20442 -14851
465 -14851 13257 25484 19555 34343 -1472 -17035 8556 -10803 -8335 4269 -15792 8735
477 8735 11335 -28255 -22386 -27241 -27291 5035 -15386 -30806 -6659 -25096 -24796 -22164 -56727 -34450
491 -34450 -11843 -25958 -11679 -31297 -49071 -12414 -17902 -21691 3003 -8546 9965 29401
503 29401 -1629 9237 23829 19190 51542 42039 15646 34926 20903 12706 24913 -4882 1900
516 1900 24257 -4724 -12494 -28594 -56510 -25565 -16656 -25907 -2489 -18441 -23546 1181 -16856
$$ packed form
426C310M4056o260m592J5502l1369P706J6250l0490J7481Q791k1113J7828k3964
439A3136k9621K3870j2407j465J7216l5752J764K0149k2475J4083q88k1364L4201
452D47Q63j6293K1299j5441N199L2029k3689L053K0257j6889J7809q202l5293
465a4851K8108J2227n929J4788l5815j5563K5591j9359K468J2604k0061K4527
477H735K600l9590N869m855n0L2326k0421j5420K4147j8437L00K632l4563K2277
491c4450K2607j4115J4279j9618j7774L6657n488l789K4694j1549J8511J9436
503B9401l1030J0866J4592m639L2352r503k6393J9280j4023q197J2207k9795O782
516A900K2357k8981p770j6100k7916L0945Q909r251K3418j5952n105K4727j8037
$$ plain form
529 -16856 -6585 26277 27350 57471 64161 33327 49718 53254 48004 73156 54145 41889 64834
542 64834 44445 32689 21802 -20543 -6225 12062 -8697 -6306 -29961 -52797 -27486 -42610
554 -42610 -56889 -31210 -33014 -15397 -8305 -55043 -51825 -24002 -13630 14165 -4791 -34103 -4937
567 -4937 -7960 -21644 -15158 -33665 -11085 20799 -10249 -20971 -24457 -31621 4174 -109 -24991
580 -24991 5382 18830 24411 28559 -14851 -14146 26918 29943 41089 32511 2090 21496 16332
593 16332 -13950 -4378 -9377 779 24141 -16814 -43162 -33031 -36471 -10050 -4938 -33453 -13840
606 -13840 -4030 -11878 6781 -8037 -6557 35183 33633 33453 38485 15204 32617 43930 19208
619 19208 31250 34080 26870 44421 15099 -15182 -4428 -12479 2931 21532 -9541 -11413 -8557
$$ packed form
529a6856J0271L2862J073L0121O690l0834J6391L536n250K5152j9011j2256K2945
542F4834k0389j1756j0887m2345J4318J8287k0759K391k3655k2836K5311j5124
554d2610j4279K5679j804J7617P092m6738L218K7823J0372K7795j8956k9312K9166
567d937l023j3684O486j8507K2580L1884l1048j0722l486p164L5795m283k4882
580b4991L0373J3448N581M148m3410P05M1064L025J1146q578l0421J9406n164
593A6332l0282R572m999J0156K3362m0955k6348J0131l440K6421N112k8515J9613
606a3840R810p848J8659j4818J480M1740j550j80N032k3281J7413J1313k4722
619A9208J2042K830p210J7551k9322l0281J0754q051J5410J8601l1073j872K856
$$ plain form
632 -8557 -28268 -13127 -15530 -23065 12549 12445 -786 4773 -18011 -8916 19979 4826 6624 9520
646 9520 -5744 15490 7710 -24608 -13534 -13753 -8957 11191 -18160 -30953 -16728 -28945 -17061
659 -17061 -12470 -29936 -3246 5494 -16033 -12052 -24806 -16773 23480 11958 197 6487 -7637
672 -7637 9629 15097 -13545 237 11632 8450 22781 -3212 -21874 2634 -3723 -4046 6604
685 6604 -8818 9761 19112 -11414 -8373 -5125 -3379 29829 19185 -408 12188 2899 9268
698 9268 22280 -810 7961 22128 4383 12254 4982 -11304 9954 2077 -10969 4345 -8210
711 -8210 -5261 8102 -17501 -16427 -5121 -13478 8411 8437 -13653 -2186 -10967 -14514 12242 4809
725 4809 4087 14451 -8406 -3203 5465 -10427 7462 10833 -5524 7932 -3946 -12623 9049
$$ packed form
632h557j9711J5141k403p535L5614j04j3231N559k2784R095K8895j5153J798K896
646I520j5264K1234p780l2318J1074k19M796K0148k9351j2793J4225j2217J1884
659a7061M591j7466K6690Q740k1527L981j2754Q033M0253j1522j1761O290j4124
672g637J7266N468k8642J3782J1395l182J4331k5993j8662K4508o357l23J0650
685F604j5422J8579R351l0526L041L248J746L3208j0644j9593J2596r289O369
698I268J3012k3090Q771J4167j7745P871p272j6286K1258p877j3046J5314j2555
711h210K949J3363k5603J074J1306q357K1889K6k2090J1467q781l547K6756p433
725D809p22J0364k2857N203Q668j5892J7889L371j6357J3456j1878q677K1672
$$ plain form
738 9049 -2824 -7508 2152 -15074 -106 15179 -5345 -1106 -5468 -15151 9920 6853 -3639
751 -3639 12781 -474 -3636 7160 -11780 924 16530 -501 3611 -4574 -18095 7990 7814
764 7814 -4269 4523 -10202 -5466 11415 -7107 -4174 7122 -4528 8670 6279 -10673 8900
777 8900 7882 -2457 7825 -7754 -3200 18273 341 -2165 80 -15371 2459 4770 -12344
790 -12344 3081 -1171 -8897 4769 -12209 -12189 8111 -4271 -790 4073 -12469 4529 8899 -7395
804 -7395 6128 1346 -4038 13455 -1199 -4873 11644 -2265 3376 8707 -10352 2716 5606
817 5606 -8672 3679 -2286 -9578 7266 -5597 -9770 4121 -10287 -4677 2760 -14076 -1348
830 -1348 3308 -9756 3780 -2824 -11670 7326 -1406 -2415 12483 -1808 3218 11957 -5004 8003
$$ packed form
738I049j1873m684R660j7226J4968J5285k0524M239m362r683K5071l067j0492
751c639J6420j3255l162J0796j8940J2704J5606j7031M112q185j3521K6085j76
764G814j2083Q792j4725M736J6881j8522K933J1296j1650J3198k391j6952J9573
777H900j018j0339J0282j5579M554K1473j7932k506K245j5451J7830K311j7114
790a2344J5425m252p726J3666j6978K0K0300j2382L481M863j6542J6998M370j6294
804g395J3523m782n384J7493j4654l674J6517j3909N641N331j9059J3068K890
817E606j4278J2351n965p292J6844j2863m173J3891j4408N610P437j6836J2728
830a348M656j3064J3536o604q846J8996q732j009J4898j4291N026Q739j6961J3007
$$ plain form
844 8003 12053 -925 13519 6948 -2742 14230 3809 741 12975 -4605 -818 8034 -8142
857 -8142 2645 4951 -9649 3988 -1518 -11076 5743 -3435 -5016 8900 -6569 -1279 9642
870 9642 -5302 5670 7912 -5698 9093 5189 -3611 12356 2312 -1147 10853 -6226 -3749
883 -3749 6017 -8923 971 2412 -12799 524 -4536 -14823 340 -8811 -11168 2053 -13311
896 -13311 -9713 914 -12921 -3044 -1097 -15943 -1396 -2575 -10460 4821 -4800 -7769 5629
909 5629 -8592 -4066 7572 -5133 5270 6316 -9132 5915 5559 -1113 13709 471 -4090
922 -4090 9729 -1609 2718 11979 -3191 5415 6853 -8686 3094 1955 -4947 10886 -729
935 -729 -6520 7683 -3345 1976 9386 -8328 1017 9162 -1013 11343 6407 -4308 10939 2460
$$ packed form
844H003M050j2978J4444o571r690J6972j0421l068J2234j7580L787Q852j6176
857h142J0787K306j4600J3637n506r558J6819r178j581J3916j5469N290J0921
870I642j4944J0972K242j3610J4791l904q800J5967j0044l459J2000j7079K477
883c749R766j4940R894J441j5211J3323n060j0287J5163r151k357J3221j5364
896a3311L598J0627j3835R877J947j4846J4547j179p885J5281r621k969J3398
909E629j4221M526J1638j2705J0403J046j5448J5047l56o672J4822j3238m561
922d090J3819j1338M327R261j5170Q606J438j5539J1780j139o902J5833j1615
935g29n791J4203j1028N321P410j7714R345Q145j0175J2356m936j0715J5247q479
$$ plain form
949 2460 -1301 11548 2545 7213 15167 -4026 412 6408 -1367 13418 7139 -6789 6255 322
963 322 -2245 8037 -6386 -2080 9751 -5850 -2238 -1820 -13467 3135 1633 -11169 -161 -6990
977 -6990 -8334 3422 -13714 -12569 208 -9091 -246 642 -15500 -2173 -2009 -10800 622 -7614
991 -7614 -7414 9635 -3674 -7783 -2892 -14344 -1748 5055 -9061 344 -1711 -9894 2790 -8092
1005 -8092 -11361 5823 973 1275 4843 -10799 -914 9067 266 7496 4976 -440 13835 6835
1019 6835 -878 8947 1310 6321 17348 725 4946 9749 -2318 7621 3388 -4993 11496 8114
1033 8114 2765 9979 -6867 -3925 10729 3038 10001 12371 -2356 7255 5515 -6632 6296 3134
1047 3134 1612 14376 -1645 -7141 838 -9183 -368 3048 -11696 -2447 -2020 -9703 -1102 -12040
$$ packed form
949B460l761J2849r003M668P954j9193M438N996p775J4785o279j3928J3044n933
963C22k567J0282j4423M306J1831j5601L612M18j1647J6602j502j2802J1008o829
977f990j344J1756j7136J145J2777r299Q845Q88j6142J3327J64q791J1422q236
991g614K00J7049j3309m109M891j1452J2596O803j4116R405k055q183J2684j0882
1005h092l269J7184m850L02L568j5642R885R981q801P230k520n416J4275p000
1019F835p713R825p637N011J1027j6623M221M803j2067R939m233q381J6489l382
1033H114n349P214j6846K942J4654p691O963K370j4727R611j740j2147J2928l162
1047C134j522J2764j6021n496P979j0021Q815L416j4744R249M27p683Q601j0938
$$ plain form
1061 -12040 -15498 2433 -3707 -4109 1037 -12553 -4191 3252 -10045 -2702 -461 -3005 11080 -361
1075 -361 -13996 -2230 -4757 1901 10425 -7016 -2927 2815 -8910 -3391 -5983 -10163 9930 6575
1089 6575 -3888 -932 -10764 -3919 10994 -3128 -1438 4517 -3035 8242 2618 -11180 1404
1102 1404 2004 149 10553 -3280 -3197 8687 -2630 -2231 402 -5970 12269 14990 -1777 2336
1116 2336 -3038 -2255 15549 7937 4558 11731 1987 5106 8146 -5373 6582 11596 2647 8209
1130 8209 -3239 -8153 6274 -281 -4564 1709 -8920 -611 5932 -9280 -6308 -6894 -10279 6654
1144 6654 2720 -5475 3709 -4212 -4728 2631 -7951 141 9895 650 3719 -3546 -13529 1066 2645
1159 2645 -2127 3172 -7160 -6436 5164 -7547 -8550 -2655 -7760 5306 3951 -11023 -1662 -2560
$$ packed form
1061a2040l458J7931o140m02N146j3590Q362P443j3297P343K241k544J4085j1441
1075c61j3635J1766k527O658Q524j7441M089N742j1725N519k592m180K0093l355
1089F575j0463K956r832O845J4913j4122J690N955p552J1277n624j3798J2584
1102A404O00j855J0404j3833Q3J1884j1317L99K633o372J8239K721j6767M113
1116B336n374P83J7804p612l379P173r744L119L040j3519J1955N014q949N562
1130H209j1448m914J4427o555m283O273j0629Q309O543j5212K972n86l385J6933
1144F654l934q195R184p921n16P359j0582Q092R754r245L069p265r983J4595J579
1159B645m772N299j0332P24J1600j2711j003N895n105J3066j355j4974R361q98
$$ plain form
1173 -2560 -4336 6217 -4630 -2706 12520 2716 702 275 -9433 6181 12341 1214 4410 -665
1187 -665 -3163 10305 -886 -5475 4498 152 5696 6278 -9154 -899 3887 -4320 3196 -671 -3771
1202 -3771 10894 1356 -6966 -944 -8501 1800 9829 -2990 -692 98 -7826 3551 -329 -4896
1216 -4896 7055 1044 -2943 3722 -5718 279 8732 -2163 2806 2035 -4198 6824 3226 -4698
1230 -4698 3713 -2286 -2247 7408 -2248 -576 2942 -9968 -2859 1056 -5027 4437 -330 -8110 -182
1245 -182 -6354 -7263 4818 -2280 1391 4653 -7791 -985 2986 -1234 6676 1889 -4966 6997 2459
1260 2459 453 6680 -3474 841 7617 -3449 918 3942 -3616 5174 -1059 -9057 2189 1854
1274 1854 925 5268 -8309 -5652 4122 -3060 1626 1802 -5422 4669 1384 -7072 2776 496 1963
$$ packed form
1173b560j776J0553j0847J924J5226r804k014m27r708J5614O160j1127L196n075
1187f65k498J3468j1191m589R973m346N544N82j5432Q255M786q207P516l867l100
1202c771J4665r538q322O022p557J0301Q029j2819K298P90p924J1377l880m567
1216d896J1951o011l987O665r440N997Q453j0895M969p71o233J1022l598p924
1230d698Q411n999L9R655r656J672L518j2910P109L915o083R464m767p780P928
1245a82o172r09J2081p098L671L262j2444O806L971m220P910m787o855J1963m538
1260B459k006O227j0154M315O776j1066M367L024p558Q790o233p998J1246l35
1274A854r29M343j3577K657R774p182M686J76p224J0091l285q456R848k280J467
$$ plain form
1289 1963 8424 -4791 -3987 5193 -286 3461 2375 -7154 3210 3293 -3557 3186 -3131 -3862 4121
1304 4121 -5347 -4017 3023 -3858 2304 720 -9897 -706 1708 -2728 5104 -2669 -5118 4354 -3048
1319 -3048 -1194 5123 -3024 2489 3685 -5912 3068 1726 -1538 5964 -1164 -4365 4638 -1771 -324
1334 -324 4209 -4663 600 3221 -4663 3302 1444 -4855 3550 -1787 -3215 5568 -1810 -889 4376
1349 4376 -4688 1050 4072 -4127 3947 2472 -3406 4910 -295 -2235 6468 -1820 -914 4799 -2619
1364 -2619 2354 4044 -3552 3169 2598 -2441 6133 881 -2477 5197 -1850 -997 5127 -3443 617
1379 617 2149 -6506 639 708 -4041 3047 -2496 -6503 2612 -3701 -2599 2516 -5483 -1390 628 -5191
1395 -5191 1890 1980 -4378 2811 -2017 -4669 5364 -135 165 3569 -5129 -1636 2541 -4509 1952
$$ packed form
1289A963O461j3215Q04R180n479L747j086r529J0364Q3o850O743o317p31P983
1304D121r468J330P040o881O162j584j0617R191K414m436P832p773k449R472p402
1319c048J854O317q147N513J196r597Q980j342l264P502p128l201R003o409J447
1334c24M533q872N263K621p884P965j858o299Q405n337j428Q783p378R21N265
1349D376r064N738L022q199Q074j475n878Q316n205j940Q703q288R06N713p418
1364b619M973J690p596O721n71n039Q574n252l358P674p047Q53O124q570M060
1379F17J532q655P145O9m749P088n543m007R115o313J102N115p999M093K018n819
1395e191P081R0o358P189m828k652J0033n499L00L404q698L493M177p050O461
$$ plain form
1410 1952 840 -5842 1775 -3513 -5682 3373 -1834 -2131 1512 -6200 -376 4929 -2592 3665 2059
1425 2059 -3422 5116 2239 738 6868 878 295 5063 -1873 2425 5573 -2680 1089 97 -5690
1440 -5690 2752 -766 -4034 2865 -3572 -3430 1095 -4724 -253 4719 -3089 2059 2754 -2273 6485
1455 6485 3765 -148 5874 1170 2923 6675 -870 2363 5795 -1370 2404 985 -4215 3106 -216
1470 -216 -3891 547 -4028 -2672 3068 -4630 -2237 1249 -4653 933 350 -5340 2768 897 -1654
1485 -1654 2509 -4313 -3461 3245 -2276 -414 370 -6362 -1056 -649 -6421 -324 -1985 -3259 3141 -3577
1501 -3577 -3344 3175 -1536 1787 2810 -3724 3470 5333 -219 4129 -428 -2868 5390 987 -518
1516 -518 3285 -3836 -633 1007 -7046 -1733 676 -2460 2464 -2643 -6275 2406 670 705 5059 -860
$$ packed form
1410A952j112o682P617n288k169R055n207k97L643p712N824N305p521O257j606
1425B059n481Q538k877j501O130n990n83M768o936M298L148q253L769r92n787
1440e690Q442l518l268O899o437J42M525n819M471M972p808N148O95n027Q758
1455F485k720l913O022m704J753L752p545L233L432p165L774j419n200P321l322
1470b16l675M438m575J356N740p698K393L486n902N586n83n690Q108j871k551
1485a654M163o822Q52O706n521J862P84o732N306M07n772O097j661j274O400o718
1501c577K33O519m711L323J023o534P194J863n552M348m557k440Q258m403j505
1516e18L803p121L203J640q053N313K409l136M924n107l632Q681j736L5M354n919
$$ plain form
1532 -860 2686 7483 519 4305 4381 896 8306 4211 -755 4454 301 -239 3843 -3747 -2050 2174
1548 2174 -3359 503 -1416 -7608 -1040 -633 -3385 2208 -2524 -1769 3743 -2179 -921 2836 -1178
1563 -1178 4703 5022 -2044 1377 -395 -2220 3994 -924 -2409 2735 -3047 -2084 -498 -6682 -1251
1578 -1251 1161 -4244 -44 -2918 -5700 2046 -1523 -3039 1571 -2744 581 4152 -3062 -181 681
1593 681 -3150 3065 1245 -2435 3142 -828 -2295 1239 -4409 -1011 5122 -767 894 -680 -5685
1608 -5685 1733 2063 -1245 3882 -30 -516 4702 -1051 -269 3590 48 3927 3665 -2898 2551 2847
1624 2847 -635 2999 -1569 -1472 5301 831 256 1112 -4600 608 3367 -1471 2599 1070 -1860 3390
1640 3390 -1555 -2959 3506 527 1920 3450 -4358 -1081 1366 -2113 2449 -263 -4046 2120 -1164
$$ packed form
1532h60L546M797o964L786P6l485P410m095m966N209m153n40M082p590J697M224
1548B174n533L862j919o192O568M07k752N593m732P55N512n922J258L757m014
1563a178N881L19p066L421j772j825O214m918j485N144n782R63J586o184N431
1578a251K412n405M200k874k782P746l569j516M610m315L325L571p214K881Q62
1593F81l831O215j820l680N577l970j467L534n648L398O133n889J661j574n005
1608e685P418L30l308N127l912m86N218n753P82L859l542L879k62o563N449K96
1624B847l482L634m568R7O773m470n75Q56n712N208K759m838M070j529k930N250
1640C390m945j404O465k979J393J530p808L277K447l479M562k712l783O166l284
$$ plain form
1655 -1164 -3853 -1055 -5211 -2384 2412 -3918 -2344 -1418 -4821 749 -779 -4966 963 464 305 4078
1671 4078 -2931 -1220 4356 1024 2985 3032 -1505 4274 3450 -2240 706 -1534 110 5283 -1514 -3527
1687 -3527 -583 -3418 64 -71 -5261 178 1066 -2382 639 -3050 -2881 3996 293 206 2307 -1587
1703 -1587 2980 4671 -1571 1757 2106 655 5395 364 -2066 2747 -262 604 2735 -2737 771
1718 771 3466 -1953 86 -1267 -3165 3757 1363 -1573 2221 -1695 -902 2067 -3030 -359 2473
1733 2473 -2227 739 -1303 -4995 674 -657 -2412 1153 -2977 -2079 1387 -3360 -539 1675 -2712
1748 -2712 1107 878 -1458 3050 669 -1513 3043 -638 -369 3273 -1201 1022 2023 -3166 243
1763 243 589 -1529 3273 128 -3406 640 -1900 -218 3193 -1101 511 2237 -2392 1003 1367 -1215
$$ packed form
1655a164k689K798m156K827M796o330J574R26l403N570j528m187N929m99j59L773
1671D078p009J711N576l332J961M7m537N779q24n690K946k240J644N173o797k013
1687c527K944k835L482j35n190N439Q88l448L021l689J69O877l703q7K101l894
1703a587M567J691o242L328L49j451M740n031k430M813l009Q66K131n472L508
1718G71K695n419K039j353j898O922k394k936L794l916P93K969n097K671K832
1733B473m700K966k042l692N669j331j755L565m130Q98L466m747K821K214m387
1748b712L819k29k336M508k381k182M556l681K69L642m474K223J001n189L409
1763B43L46k118M802l145l534M046k540J682L411m294J612J726m629L395L64k582
$$ plain form
1779 -1215 4110 1332 -1956 1199 -853 501 3473 -2315 -1922 348 -2613 1674 969 -3034 1166
1794 1166 -99 -2493 1741 -555 387 3558 -1991 -1365 916 -999 3157 2598 -2731 527 -695 -1189
1810 -1189 2661 -239 -1350 1568 -2092 -718 1162 -1581 1918 2027 -3008 707 673 -300 3395 -702
1826 -702 -1993 1662 -1165 15 2237 -2441 232 -336 -3931 -21 -678 -2534 1332 -2316 -2635 1411
1842 1411 -1777 170 1731 -1549 1180 1480 -1670 2855 1956 -371 3077 59 280 4164 -423 -397
1858 -397 1546 -2277 2529 1848 -2395 1634 -179 -1667 2527 -1774 -2244 2160 -2380 -597 1394 -2493
1874 -2493 1886 2122 -1919 1100 783 -956 3271 -439 -1677 1833 -1127 76 1339 -1770 123
1889 123 607 -3621 560 -1224 -2401 2376 -1429 -2785 1806 -850 601 2708 -1462 417 1705
$$ packed form
1779a215N325k778l288L155k052J354K972n788L93K270k961M287p05m003M200
1794A166j265k394M234k296R42L171n549O26K281j915M156n59n329L258j222m94
1810a189L850k900j111K918l660J374J880k743L499J09n035L715l4r73L695m097
1826g02j291L655k827J180K222m678K673n68l595L910o57j856L866l648l19M046
1842A411l188J947J561l280K729L00l150M525q99k327L448l018K21L884m587K6
1858c97J943l823M806o81m243M029j813j488M194m301m70M404m540J783J991l887
1874b493M379K36m041L019l17j739M227l710j238L510k960J203J263l109J893
1889A23M84m228M181j784j177M777l805j356M591k656J451K107m170J879J288
$$ plain form
1904 1705 -96 2963 1575 120 3402 603 -1570 2790 -133 883 2505 -3032 -1041 175 -2213
1919 -2213 633 -569 -3823 -513 -1923 -2672 896 -2088 -698 1377 -3104 -604 662 -1192 2545
1934 2545 594 -2592 2256 36 -563 2398 -1124 148 2212 -2049 -393 1467 -1080 2115 257
1949 257 -2459 2001 395 -124 2627 -1133 -68 2949 -1079 1110 2584 68 2528 717 -2024
1964 -2024 2329 855 -362 2250 -2078 -1592 795 -2624 -611 230 -2869 68 -1137 -3403 926
1979 926 -43 -656 2118 -1190 -617 2864 70 2151 2688 -1122 2404 2188 -69 2672 345 -1256
1995 -1256 1795 -1879 -2168 728 -2689 -798 -885 -5039 -1785 -748 -2595 771 -2174 -3227 1166 -1088
2011 -1088 -544 1340 -1166 1315 2890 -1254 1543 1559 -274 2972 159 -1399 2289 -81 -275 1012
$$ packed form
1904A705j801L059j388j455L282k799k173M360k923J016J622n537J991J216k388
1919b213K846j202l254L310j410p49L568k984J390K075m481K500J266j854L737
1934B545j951l186M848k220n99K961l522J272K064m261J656J860k547L195j858
1949B57k716M460j606n19K751l760J065L017m028K189J474k516K460j811k741
1964b024M353j474j217K612m328M86K387l419K013Q41l099K937j205k266M329
1979I26r69o13K774l308N73L481k794K081N37l810L526k16k257K741k327j601
1995a256L051l674k89K896l417J891q7m154L254J037j847L366k945j053M393k254
2011a088N44J884k506K481J575m144K797J6j833L246k813j558L688k370j94J287
$$ plain form
2027 1012 -2672 -65 1535 -1960 499 -242 -1865 1943 -263 -1604 2036 -41 992 3077 -745
2042 -745 815 2300 -685 1971 1479 -1025 2568 849 -1103 1578 -1241 -391 2472 -1016 145 595
2058 595 -2483 961 1236 -1496 1383 8 -876 2221 -1070 -1188 1856 -1061 130 532 -2598 815
2074 815 749 -1985 -14 -1870 -2315 1592 -1066 -2004 151 -3076 -1129 240 -2509 538 544 -1921 662
2091 662 -695 -1853 2142 167 50 1627 -1532 169 2402 -823 1359 1385 -1570 1354 217 -1822
2107 -1822 1099 -1483 -1225 1416 -2112 -711 709 -1761 239 11 -2520 1182 990 -399 2360 -632
2123 -632 -143 2971 225 1918 3120 676 2979 2239 -590 2058 1302 287 3131 -108 -1360 1373
2139 1373 -1842 -1463 494 -2842 -652 -355 -2791 -118 -1413 -2755 1400 -639 -1019 1029 -1148 463
$$ packed form
2027A012l684K607J600l495K459p41j623L808k206j341L640k077J033K085l822
2042g45J560J485k985K656m92k504L593j719j952K681k819Q50K863l488J161M50
2058E95l078L444K75k732K879j375q84L097l291j18L044k917J191M02l130L413
2074H15o6k734J971j856m45L907k658r38K155l227J947J369k749L047Ok465K583
2091F62j357j158L995j975j17J577l159J701K233l225K182K6k955K924j137k039
2107a822K921k582K58K641l528J401J420k470K000k28k531L702j92j389K759k992
2123f32M89L114k746J693J202k444K303p40k829K648p56j015K844l239j252K733
2139A373l215L79J957l336K190K97k436K673j295j342M155k039l80K048k177J611
$$ plain form
2155 463 1905 -1024 747 949 -587 2404 1007 -1570 785 -1288 -1008 1243 -1953 -841 793 -2352
2171 -2352 -1104 -1036 -2963 1036 574 -1440 700 -1203 -786 2667 -563 -125 1626 -637 1481 1015
2187 1015 -1851 1041 428 -1207 1014 -1194 -1519 1712 -1212 -547 268 -2029 1231 2370 -498 1499
2203 1499 789 -254 3140 1177 461 2885 706 1107 2014 -1470 799 1896 -646 835 -955 -2427
2219 -2427 758 -1199 -2210 -116 -2170 -824 937 -2234 -754 509 -1194 1585 359 -1485 1787
2234 1787 823 -84 1864 -972 35 1763 -1195 241 272 -1775 638 -452 -2521 252 -721 -1119
2250 -1119 1452 -1712 -1331 683 -1199 841 1497 -1125 363 450 -1016 2175 331 -398 1794 -916
2266 -916 -564 963 -1489 722 1040 -2015 320 -70 -957 1601 -28 -1426 871 -1012 22 2145
$$ packed form
2155D63J442k929J771K02j536K991j397k577K355k073K80K251l196J112J634l145
2171b352J248O8j927L999m62k014K140j903M17L453l230M38J751k263K118m66
2187A015k866K892o13j635K221k208l25L231k924O65Q15k297L260J139k868J997
2203A499p10j043L394j963p16K424k179M01R07l484K269J097k542J481j790j472
2219b427L185j957j011K094k054J346J761l171J480J263j703K779j226j844L272
2234A787r64r07J948k836J007J728k958J436L1k047K413j090k069K773r73l98
2250a119K571l164L81K014j882K040O56k622J488Q7j466L191j844p29K192k710
2266i16L52J527k452K211L18l055K335l90q87K558j629j398K297j883J034K123
$$ plain form
2282 2145 -857 625 1105 -1133 358 724 -1189 1593 -384 -334 1048 -1524 -181 2073 -734 -440
2298 -440 838 -1565 998 1059 -921 2063 413 -581 2177 190 474 1966 -995 53 883 -1612
2314 -1612 741 611 -2029 -55 -1147 -2062 781 -1225 -1454 528 -1995 -449 279 -1661 698 621
2330 621 -1460 867 -293 -1017 1562 -642 -225 1320 -1107 85 991 -1303 830 238 -1707 1067
2346 1067 -104 -774 1319 -682 -237 1407 -618 457 1198 -787 1098 903 -1021 1274 133 -475
2362 -475 1508 -814 -958 946 -1395 -417 181 -1856 523 162 -1768 82 -625 -1083 1553 -377 -734
2379 -734 1178 -505 750 1332 -874 979 1030 -399 1006 236 -531 2165 60 -362 657 -1123 201
2396 201 1157 -1257 -9 301 -1021 914 -670 -1285 1493 -144 -630 588 -1165 313 1482 -1067
$$ packed form
2282B145l002J482M80k238J491L66j913K782j977N0J382k572J343K254k807K94
2298d40J278k403K563O1j980K984j650r94K758j987K84J492k961J048Q30k495
2314a612K353j30k640J974j092r15K843k006k29J982k523J546P28j940K359p7
2330F21k081K327j160p24K579k204M17J545k427J192R06k294K133n92j945K774
2346A067j171o70K093k001M45J644k025J075P41j985J885j95j924K295j141o08
2362d75J983k322j44J904k341R78N98k037K379l61j930J850p07m58K636j930l57
2379g34J912j683J255N82k206J853N1j429J405p70p67K696k105m22J019j780J324
2396B01R56k414J248L10j322J935j584o15K778j637m86J218j753J478J169k549
$$ plain form
2412 -1067 34 281 -1087 718 -412 -1360 519 -788 -1159 49 -2147 -741 919 -1480 -682 -626
2428 -626 -1666 827 -44 -1095 979 -596 -536 1386 -335 724 2007 -313 786 911 -618 1748
2444 1748 1097 -657 1007 -625 -318 1457 -864 -475 541 -1577 -391 -201 -1267 929 -202 -1386
2460 -1386 435 -775 -385 1996 -26 193 1153 -695 897 1417 -191 1833 562 -583 1185 -34
2476 -34 242 1861 -520 -526 546 -718 674 923 -1410 289 -193 -1253 957 -378 -545 638 -1375
2493 -1375 -1255 169 -1390 284 120 -1881 -295 -727 -1490 823 -937 -1326 734 -1294 -772 382
2509 382 -1241 368 418 -1116 555 324 -385 1479 -36 -456 1300 -66 314 1143 -919 387 975
2526 975 -939 557 -229 -969 1086 -342 -787 339 -944 -195 782 -822 276 1007 -868 863 410
$$ packed form
2412a067J101K47j368J805j130r48J879j307l71J208k196J406J660k399P98N6
2428f26j040K493q71j051K074j575O0J922j721J059J283k320J099J25j529K366
2444A748o51j754J664j632L07J775k321L89J016k118J186J90j066K196j131j184
2460a386J821j210L90K381k022K19R60j848J592N20j608K024j271j145J768j219
2476c4K76J619k381oJ072j264J392K49k333J699m82j060K210j335j67J183k013
2493a375J20J424j559J674j64k001J586m32p63K313j760l89K060k028N22J154
2509C82j623J609N0j534J671k31p09J864j515m20J756j366L80Q29k062J306N88
2526I75j914J496p86p40K055j428m45J126j283P49R77j604J098P31j875J731m53
$$ plain form
2543 410 -525 1412 334 -2 1587 -127 425 1446 -164 837 734 -623 933 304 -627 1098 87
2560 87 -582 1122 -800 -335 510 -1039 169 208 -1014 -556 -317 -492 844 -1500 -1299 872 -625 -660
2578 -660 711 -1146 164 936 -1079 318 296 -790 856 -243 -1049 757 -537 -292 514 -1586 -308
2595 -308 424 -1013 -175 -274 -1048 403 -526 -1183 705 -404 -139 1006 -999 -58 1131 50 1306
2612 1306 666 -226 1313 695 31 1356 236 232 1330 -611 76 703 -566 847 745 -842 573
2629 573 -49 17 962 -226 -72 1033 -263 185 880 -423 733 521 -809 219 -548 -766 770 -918
2647 -918 -1400 -173 -1458 -577 413 -1364 -57 -403 -1179 340 -155 -234 811 -251 -248 1066 -375 258
2665 258 1640 -611 492 -299 -1571 815 -90 -554 494 -841 -1021 547 -655 -580 6 -1079 502
$$ packed form
2543D10r35J937j078l36J589j714N52J021j610J001j03j357J556o29r31J725j011
2560H7o69J704j922M65Q45j549J208L9j222M58K39j75J336k344K01K171j497l5
2578f60J371j857J310P72k015J397k2j086J646j099q06J806j294K45Q06k100J278
2595c08P32j437Q38r9p74J451r29o57J888j109K65J145k005R41J189j081J256
2612A306o40q92J539o18o64J325j120mJ098j941O87O27j269J413j02j587J415
2629E73o22O6R45j188J54J105j296M48O95j303J156k12j330J028p67k18J536j688
2647i18m82J227j285Q81R90j777J307l46p76J519m95p9J045j062LJ314j441O33
2665B58J382k251J103p91j272K386r05m64J048j335j80J568j202P5N86j085J581
$$ plain form
2682 502 -10 -785 1221 563 -232 1544 -140 -150 1474 503 686 972 -665 492 502 -759 909 -425
2700 -425 -919 591 -842 -852 414 -978 -51 537 -689 228 708 -335 906 204 -576 1084 232 -58
2718 -58 661 -533 473 540 -793 -208 -60 -834 480 -172 -1093 109 -518 -441 703 -776 -228 450 -780
2737 -780 173 84 -806 661 155 -965 -21 -584 -465 690 -829 -756 129 -731 111 245 -896 246 -117
2756 -117 -624 710 -253 -81 1229 -426 -154 470 -527 842 919 -615 349 47 -651 930 -135 -457
2774 -457 403 -708 -270 316 -755 116 334 -809 120 -149 -577 1100 216 -138 846 -352 389 999
2792 999 -278 445 786 -483 670 211 -426 812 44 -316 554 -496 -79 566 -845 45 34 -970
2810 -970 199 -233 -689 333 -225 -711 257 -845 -423 486 -660 -123 -47 -976 116 -172 -584 613
$$ packed form
2682E02n12p75K006o58p95J776j684j0J624r71J83K86j637J157J0j261J668j334
2700d25m94J510j433j0J266j392R27N88j226R17M80j043J241p02p80J660q52k90
2718e8P19j194J006O7j333N85J48p74J314o52r21J202o27P7J144j479N48O78j230
2737g80R53q9q90J467n06j120R44n63J19J155j519P3Q85q60Q42J34j141J142l63
2756a17n07J334r63J72J310j655K72O24r97J369P7j534R64l02o98J581j065l22
2774d57Q60j111M38N86j071Q71K18j143R29k69m28J677q84l54R84j198P41O10
2792I99j277P23L41j269J153m59o37J238p68l60Q70j050M17O45j411Q90j1j004
2810i70J169m32m56J022n58m86R68j102M22R09j146N37P6r29J092k88m12J197
$$ plain form
2828 613 -318 -606 694 -225 -31 1085 -276 320 624 -398 832 609 -377 953 -85 -409 596
2845 596 -308 -107 285 -908 -184 -30 -1104 236 52 -639 197 -369 -571 682 -355 -83 613 -591
2863 -591 44 503 -196 631 571 -317 427 286 -302 932 155 -286 553 -163 402 627 -520 467 327 -474
2883 -474 698 -153 -317 803 -11 12 837 -678 389 464 -479 282 70 -521 726 -97 -623 407 -439
2902 -439 -241 119 -1052 -300 223 -929 -79 -398 -301 -258 -351 -443 39 -312 -203 282 -758 -147 384 -244
2922 -244 135 -49 -783 386 147 -295 532 -360 -199 193 -905 -188 481 -327 21 -151 -953 506 589
2941 589 -373 341 -18 -864 744 -425 426 1038 -519 698 554 -215 714 710 -270 1023 -510 -698 577
2960 577 -75 252 635 -510 -408 775 333 664 370 -81 1542 -591 302 1152 -220 21 576 -1020
$$ packed form
2828F13r31k88J300r19J94J116j361N96L04j022J230k23r86J330j038l24J005
2845E96r04K01L92j193P24J54j074J340j84o91Q36n66k02J253j037K72O96j204
2863e91O35M59o99Q27o0q88P44j41n88J234p77m41Q39p16N65K25j147R87j40q01
2883d74J172q51j64J120q14K3Q25j515J067P5r43P61k12n91J247q23n26J030q46
2902d39J98L60j171P52N23j152Q50l19R7M3r3r2M82l51J09M85j040O11N31o28
2922b44L79j84p34J169k39m42Q27q92J61L92j098P17O69q08L48j72q02J459Q3
2941E89r62P14l59q46J608j169Q51O12j557J217j44p69R29mr80J293j533j88J275
2960E77o52L27L83j145J02J183m42L31k94m51J623k133Q93Q50j372K41N55j596
$$ plain form
2978 -1020 -108 -184 -865 273 -170 -817 -168 -686 -638 435 -711 -564 -220 -1040 -269 160 -711 121 -234
2997 -234 -734 547 -86 -143 664 -562 -225 283 -547 297 529 -675 397 52 -328 683 -288 -101 443
3016 443 -525 -66 235 -496 143 398 -637 392 -122 -488 778 107 -90 547 -125 12 608 -362 213
3035 213 712 -555 571 13 -126 720 260 -190 855 221 -63 673 -167 371 669 -287 348 36 -349
3054 -349 449 -95 -339 388 -411 -216 327 -666 35 458 -658 -93 -103 -543 130 -349 -503 292 -474 -232
3074 -232 190 -475 -78 457 -632 177 50 -451 346 -204 -496 259 -140 -126 341 -564 -4 224 -467 7
3094 7 -43 -643 702 -14 -330 210 -702 -22 581 -621 -142 286 -207 450 362 -407 347 396 -132 380 -116
3115 -116 202 1209 68 226 431 -9 624 527 -134 525 -8 85 310 66 -206 310 -781 -20 137 -862
$$ packed form
2978a020R12p6o81J138m43o47O49n18M8J073j146J47L44q20P71M29q71Q32l55
2997b34n00J281o33n7Q07j226L37N08q30Q44K32j204J072l45l80J011r71J87N44
3016D43r68M59L01p31O39K55j035J029n14l66J266o71j97O37o72J37N96r70N75
3035B13M99j267J126n58j39Q46m60m50J045o34k84P36q40N38K98r56O35l12l85
3054c49P98n44k44P27p99J95N43r93P01M23j116N65j0m40O73m79j54P95p66K42
3074b32M22o65L97N35j089Q09j27n01P97n50k92P55l99J4M67r05N60K28o91M74
3094Gn0o00J345p16l16N40r12O80O03j202M79M28m93O57q8p69P54M9n28N12m96
3115a16L18J007j141J58K05m40O33r7o61O59n33R3K25k44k72N16j091P61J57r99
$$ plain form
3135 -862 374 302 -190 6 -1012 -458 555 -179 -261 159 -337 -98 169 -630 201 171 -488 -64 -277 -318
3155 -318 554 -391 -315 -225 -790 103 -114 -875 162 -10 -367 286 -350 -273 270 -213 -613 508 -275 400
3175 400 968 -516 222 551 100 471 -540 -150 881 -30 588 849 355 45 514 -452 521 426 -339
3194 -339 572 107 -158 917 -79 -171 529 -538 125 1496 -441 197 315 -417 908 47 -1015 276
3212 276 17 -322 766 -154 -138 617 -443 -40 140 -438 354 248 -246 312 -283 -370 400 -85 -62 59
3232 59 -542 -13 22 -702 252 -72 -434 103 -485 -372 321 -114 -95 186 -430 177 394 41 822 -135 -510
3253 -510 383 -449 -117 666 -144 -237 231 -209 198 486 -453 343 -71 -313 571 -61 -350 264 -266 -118
3273 -118 243 -715 -1 175 -567 186 117 -223 577 214 -163 442 -151 112 491 -511 238 405 -121 669
$$ packed form
3135h62J236p2m92J96j018N54J013p34q2M20m96K39K67p99Q31l0o59M24k13m1
3155c18Q72r45P6R0n65Q93k17p61J037j72l57O53o36P7N43m83m00J121p83O75
3175D00N68j484P38L29m51L71j011L90J031r11O18K61m94l10M69r66R73r5p65
3194c39R11m65k65J075r96r2P00j067O63J371j937O38J18p32J325q61j062J291
3212B76k59l39J088r20J6P55j060M03J80n78P92j06m94N58n95q7P70m85K3J21
3232E9o01N29L5p24R54l24l62N37n88J13O93m35J9K81o16O07K17l53P81r57l75
3253e10Q93q32L32P83q10r3M68m40M07K88r39P96m14k42Q84o32k89O14n30J48
3273a18L61r58P14J76p42P53o9l40Q00l63l77O05n93K63L79j002P49J67n26P90
$$ plain form
3293 669 77 -310 342 -129 -64 541 -305 -248 242 -447 -105 128 -590 10 -51 -708 259 -193 -76 215 -399
3314 -399 -237 378 -37 168 58 -289 31 197 -310 291 -91 -308 558 -346 -188 266 -206 297 254 -602
3334 -602 -75 137 -276 287 -129 -473 234 -362 8 355 -332 -63 103 -468 158 44 -73 297 -13 -104
3354 -104 298 -136 32 426 -289 -66 325 -405 403 350 -117 627 -51 -267 501 141 362 257 -549 92
3374 92 -122 -414 341 119 -186 358 -69 -183 22 -372 -185 484 -535 -63 15 -520 165 -56 -487 154
3394 154 -105 -235 420 -179 34 576 -308 -182 37 -385 306 -132 -246 111 -11 -338 259 -47 -421 370
3414 370 -452 -286 141 -496 180 113 -437 -131 -149 -37 540 -42 71 405 -331 -165 456 -290 179 19 -453
3435 -453 87 154 261 240 107 -313 115 -293 -134 347 -188 79 339 -491 389 136 240 584 -81 77 354
$$ packed form
3293F69n92l87O52m71O5O05q46N7M90o89L42K33p18O00o1o57R67m52J17K91o14
3314c99J62O15m15K05j10l47L20J66n07O01l82k17Q66r04J58M54m72N03m3q56
3334f02N27K12m13N63m16l44P07n96L70L47o87K69J66n71O26j14j17L70l10r1
3354a04M02m34J68L94p15K23L91p30Q08n3m67P44o78k16P68l60K21j05q06O41
3374I2k14k92P55k22l05N44m27j14K05l94J87O69j019M72P8n35O85k21m31O41
3394A54k59j30O55n99K13N42q84J26K19m22O91m38j14L57j22l27N97l06l74P91
3414C70q22J66M27o37O76o7n50L06j8J12N77n82J13L34p36J66O21p46M69j60m72
3435d53N40O7J07k1j33m20M28m08J59M81n35K67K60q30Q80k53J04L44o65J58K77
$$ plain form
3456 354 -30 113 535 -257 -27 -105 -209 -168 -173 27 443 99 -310 168 -395 -2 342 -480 -10 -144 -300
3477 -300 278 -96 -254 144 -344 -329 258 -250 -83 212 -459 240 104 -325 146 137 -420 24 -262 -223 477
3498 477 -501 -42 297 -385 32 121 -92 330 149 -252 238 -69 -112 390 -254 37 61 -360 72 -31 -245
3519 -245 182 1 -290 172 -13 -133 375 -34 285 176 -223 458 409 171 226 44 -106 345 181 -42 98
3540 98 -171 -32 374 -338 224 158 -285 137 -209 -380 223 84 -297 77 -220 -279 179 -542 -64 229 -229
3561 -229 -21 -54 -107 158 -14 -322 127 -79 -138 344 -367 -175 -107 29 245 40 -230 206 -43 -435 522
3582 522 -273 132 169 -34 -232 404 34 -199 -734 -94 549 -796 -211 152 -357 -128 336 68 258 154
3602 154 -121 294 182 -274 387 63 -74 219 -355 188 419 -112 77 195 -206 188 251 -237 299 -233
$$ packed form
3456C54l84J43M22p92K30p8j04M1nK00M16l44m09M78n63L93L44q22M70j34j56
3477c00N78l74j58L98m88J5N87n08J67K95o71O99j36m29M71rn57M44k86L9P00
3498D77r78M59L39o82M17Q9k13M22j81m01M90l07m3N02o44K91K4m21M32j03k14
3519b45M27j81k91M62j85j20N08m09L19j09l99O81m9k38N5j82j50M51j64k23J40
3540I8k69J39M06p12N62o6m43M22l46j71O03j39l81L74k97n9M58p21M78K93m58
3561b29K08l3n3K65j72l08M49k06n9M82p11J92O8J36K16k05k70M36k49l92R57
3582E22p95M05L7k03j98O36l70k33n35O40O43j345N85L63n09K29M64k68J90j04
3602A54k75M15j12m56O61l24j37K93n74N43K31n31J89J18m01L94O3m88N36n32
$$ plain form
3622 -233 76 236 -133 -172 300 -73 126 164 -532 -98 -372 -765 -102 29 -198 573 -371 -274 199 -281 358
3643 358 228 -534 218 346 -387 -69 -85 -314 165 -369 -380 78 -425 -7 1 -260 312 -97 -411 157 -8
3664 -8 -130 475 24 7 308 -286 149 336 -151 57 214 -128 398 -172 -103 162 36 296 342 -213 32 173
3686 173 130 -200 -265 -535 81 3 -155 -119 -391 -381 -128 -918 343 724 -509 231 286 29 27 213 -272 219
3708 219 263 -165 196 -74 102 -50 151 -396 -316 -1473 -390 -301 318 295 -593 221 -67 -222 64 -102 -111
3729 -111 -124 223 -248 -241 6 120 606 232 -164 611 -579 481 629 -503 -166 -394 -178 -24 140 -311
3749 -311 364 99 -107 191 -325 -126 188 -249 40 56 -16 131 35 -144 218 -172 -613 644 75 -362 402
3770 402 -143 152 -45 -245 292 144 -159 87 -138 16 251 4 55 263 -262 206 116 -199 341 -39 -235
$$ packed form
3622b33L09J60l69l9M72l73J99L8o96M34k74l93O63J31k27P71r44R7M73m80O39
3643C58j30p62P52J28p33L18j6k29M79n34j1M58n03M18Qk61N72m09l14N68j65
3664hj22O05m51j7L01n94M35J87m87K08J57l42N26n70O9K65j26K60M6n55K45J41
3686A73m3l30o5k70O16p8j58L6k72J0K53p90J261L81j233P40N5k57kJ86m85M91
3708B19M4m28L61k70J76j52K01n47Q0j157J083Q9O19k3q88Q14k88j55K86j66r
3729a11j3L47m71PK47J14M86l74l96P75j190J060J48j132L37k28K16J54J64m51
3749c11O75k65k06K98n16J99L14m37K89J6p2J47r6j79L62l90m41J257n69m37P64
3770D02n45K95j97k00N37j48l03K46k25J54K35k47N1K08n25M68r0l15N40l80j96
$$ plain form
3791 -235 21 -341 -294 255 -95 -213 431 -544 -79 -104 -531 193 -54 -124 -205 93 97 104 -117 -343 -15 -322 152
3814 152 11 -188 162 -116 -130 359 20 -83 279 -87 -214 52 -316 145 141 -145 -56 -226 -122 285 -125
3835 -125 -177 -90 365 106 141 54 -11 105 -199 183 337 -193 90 60 -94 290 2 12 282 -221 214 147 -94
3858 -94 239 -56 -86 127 -35 -60 266 -178 -69 120 -122 -36 253 -434 -12 701 -141 658 -289 -156 -57 -88
3880 -88 233 -229 318 394 -101 -66 -69 -12 -408 311 -103 -255 70 -136 -17 260 8 -65 93 -253 170 95 -46
3903 -46 379 79 206 -74 0 239 456 -329 321 74 -311 -104 20 -265 -253 -155 308 268 -226 86 88 -356
3925 -356 1 115 -35 476 53 69 136 490 -232 1006 -86 -261 517 -206 -91 102 80 186 -23 -88 370
3946 370 13 -96 -104 82 -200 -60 -68 40 115 -96 52 185 2 272 14 -262 38 -26 -216 127 -114 -27
$$ packed form
3791b35K56l62M7N49l50j18O44r75M65k5m27P24k47p0q1K98MPk21k26L28l07M74
3814A52j41j99L50k78j4M89l39j03L62l66j27K66l68M61mk86Q9j70J04M07m10
3835a25n2Q7M55k59L5q7o5J16l04L82J54n30K83l0j54L84k88J0K70n03M35o7k41
3858i4L33k95l0K13j62k5L26m44J09J89k42Q6K89o87M22P13q42P99r47J33R9l1
3880h8L21m62N47P6m95L5lN7l96P19m14j52L25k06J19K77k52p3J58l46M23p5j41
3903d6M25l00J27k80P4K39K17p85O50k47l85K07J24k85J2R8M63m0m94L12Km44
3925c56L57J14j50N11m23J6O7L54p22J238j092j75P78p23J15J93k2J06k09o5M58
3946C70l57j09qJ86k82J40qJ08P5k11J48J33j83K70k58k76L00o4j90L43k41Q7
$$ plain form
3968 -27 92 -229 -66 68 -88 123 118 19 301 201 -107 270 -376 -319 90 -85 -149 27 -26 283 -9 74 108
3991 108 -249 187 -72 -118 3 201 -475 76 -165 -283 10 54 -153 380 0 -119 14 49 -258 40 -163
4012 -163 -28 213 -38 254 112 94 160 69 -103 191 -73 -254 -102 -115 36 72 -66 -7 -28 -85 -23 91 239
4035 239 262 -4 -96 80 -245 -86 -36 -240 204 134 -32 529 149 -320 16 -295 102 139 -319 36 20 -59
4057 -59 226 -159 -397 81 57 -6 175 17 -221 50 -148 235 117 -76 -5 50 -37 32 97 -129 273 -68 224
4080 224 134 -204 188 3 -76 24 3 -89 176 -65 -13 120 -26 0 7 170 88 84 -275 94 217 -77 153 -25
4104 -25 -201 94 -103 123 160 -16 147 27 -42 170 168 -23 249 40 -224 327 -39 -52 47 -136 76 42 -340
4127 -340 -116 0 -21 232 -215 -63 170 -189 95 95 -132 27 69 -271 97 108 -102 87 -73 227 15 64
$$ packed form
3968b7J19l21J63J34j56K11nr9K82j00l08L77o46N7M09j75o4J76n3L09k92Q3L4
3991A08l57M36k59m6J21J98o76N51k41j18K93M4k07N33l80j19J33L5l07K98k03
4012a63J35K41k51K92j42j8O6r1j72K94k64j81J52j3J51L6j38N9k1n7O2J14J48
4035B39K3k66r2J76l25J59N0k04M44p0j66N61l80m69L36l11L97L7m58L55j6p9
4057e9K85l85k38M78k4o3J81j58k38K71j98L83j18j93P1N5q7O9O5k26M02l41K92
4080B24r0l38L92j85p9J00k1r2K65k41N2J33j46K6PJ63q2ml59L69J23k94K30j78
4104b5j76K95j97K26L7j76J63j20o9K12kj91K72k09k64N51l66j3R9j83K12l4l82
4127c40K24J16k1K53m47J52K33l59K84%k27J59M2l40L68J1k10J89j60L00k12M9
$$ plain form
4149 64 171 104 -93 67 222 -52 -52 -36 -22 188 -66 -251 83 -89 -277 118 58 47 25 -2 274 -45 -66 215
4173 215 59 -172 -51 -158 199 -14 -240 119 -136 -165 87 126 -38 60 40 -243 4 4 -108 59 -147 122
4195 122 35 122 -57 185 -16 -11 69 -149 347 -14 87 -10 95 -3 20 -314 13 18 -40 56 124 -126 150 -118
4219 -118 -188 199 197 -94 66 -179 17 19 -101 142 -26 -98 -88 -38 -219 295 -239 20 -129 12 -164 57 3
4242 3 127 151 92 160 161 206 32 -154 102 -124 -110 -81 -184 -71 38 -27 18 142 -123 -164 53 -81 -62 222 -14
4267 -14 -108 -172 -128 -214 -46 -270 19 129 -89 65 -51 -6 125 -81 59 -24 34 -71 56 173 102 -82 86
4290 86 291 -105 3 359 -84 176 -5 -301 190 -203 -244 -130 14 -61 -96 -25 118 -154 16 109 32 -19 126
4313 126 -29 34 81 -55 64 138 -167 95 37 -148 241 146 -30 -1 67 -114 169 22 -54 -26 -72 -29 -73 14
$$ packed form
4149F4J07o7j97J60J55k74%J6J4K10k54j85L34j72j88L95o0j1k2k7K76l19k1K81
4173B15j56k31J21j07L57k13k26L59k55k9K52L9j64R8k0k83K47%j12J67k06K69
4195A22q7Q7j79K42k01NQ0k18M96l61J01r7J05r8K3l34L27Nn8R6O8k50K76k68
4219a18p0L87kk91J60k45J96Kj20K43j68p2J0N0j81N14n34K59j49J41j76K21n4
4242CJ24K4n9O8JM5j74j86K56k26J4K9j03J13J09o5M5J24k65m1K17j34J9K84k36
4267a4r4o4M4q6J68k24K89J10k18J54j16M5J31k06J40q3N8j05J27J17p1j84J68
4290H6K05l96J08L56m43K60j81k96M91l93m1J14J44p5l5P1J43k72J70R3p7n1J45
4313A26j55O3M7j36J19P4l05K62n8j85L89r5j76K9O8j81K83j47p6K8m6M3m4Q7
$$ plain form
4337 14 -104 -150 194 -12 -200 -147 79 -217 -4 108 175 -216 87 -222 -73 169 -129 -158 248 -130 -127 182
4359 182 -115 -69 83 -225 142 -47 49 -25 -32 -99 -317 91 191 -2 -54 225 17 -219 50 47 7 -191 -225 16
4383 16 -81 -128 152 -90 -43 119 102 109 -7 -11 109 -5 -11 -8 127 31 117 -101 -224 21 -13 -45 16 -113 18 210
4409 210 -89 -163 56 107 32 4 -62 -123 -76 -129 74 71 -87 228 96 45 37 -43 -31 -110 26 183 34 144 118 222
4435 222 36 -35 -93 -158 -50 -80 -221 33 167 -9 172 -274 231 136 -90 33 -160 127 159 -288 -2 122
4457 122 -75 24 -78 -62 183 96 -122 153 -34 137 -12 -37 224 186 -107 -29 56 -1 95 -189 -7 -61 -113 45
4481 45 10 -3 -43 -101 -38 89 -108 110 85 -226 59 8 -133 59 -132 58 16 -153 -3 -123 -90 -51 124 -203
4505 -203 47 102 50 26 -64 33 -146 77 35 -50 90 137 64 -89 247 -42 -232 39 74 -115 -55 -181 182 62
$$ packed form
4337A4j18m6L44k06j88N3K26k96K13J12O7l91L03l09J49K42k98k9M06l78LL09
4359A82k97M6J52l08L67j89R6p4po7k18M08J00j93n2K79k08k36K69lm0j98l4K41
4383A6r7m7K80k42M7J62j7Pj16mJ20j14oLJ35r6Q6k18j23K45l4l2O1j29J31J92
4409B10k99p4K19N1p5k8o6o1M7n3K03lj58L15j32n1qq0J2p9J36J57j49J10k6J04
4435B22j86p1n8o5J08l0j41K54J34j76J81m46N05r5k26J23j93K87L2m47K86J24
4457A22j97R9j02J6K45q7k18K75j87J71j49k5K61l8k93P8Q5n7R6k84J82n4n2J58
4481D5l5j3m0n8O3J27j97K18k5l11K85n1j41J92j91J90m2j69J50j20L3L9J75l27
4505b03K50N5n2k4r0R7j79K23m2q5J40M7p3j53L36k89j90K71L5j89O0j26L63j20
$$ plain form
4529 62 116 -160 9 -41 171 335 -309 -11 164 219 -58 65 -87 226 137 -239 -91 -139 -99 47 -25 -63 -38
4552 -38 -10 161 225 -175 -41 -50 37 171 -118 12 184 -32 241 128 134 -10 86 31 8 39 64 24 127 -166 13
4577 13 -34 -189 59 -66 3 -78 101 29 -44 78 67 -115 -73 175 94 -8 60 46 57 28 12 47 -86 -30 39 -124
4603 -124 158 350 -98 114 -35 -337 100 126 26 -79 -196 -34 23 13 140 -216 -588 -83 -93 39 28 28
4625 28 -26 -5 -18 107 71 28 -38 28 125 69 127 -41 -186 72 -55 7 -4 -74 79 -44 -322 -48 228 -123 165
4650 165 18 38 -99 101 14 -45 35 108 -84 -82 292 -76 -37 220 -142 -36 -76 -73 -415 -280 -149 -346 -93 -243
4674 -243 353 -297 -147 -118 -66 192 -65 -7 155 62 -26 75 -6 -168 95 10 32 -128 -44 19 -13 169 -25 127
4698 127 -71 -113 58 -229 63 184 -32 -15 56 -143 129 68 108 -177 -18 40 18 -47 -214 92 -14 -28 -32 99
$$ packed form
4529F2N4k76J69n0K12J64o44K98J75N5k77J23j52L13q9l76J48m8M0J46p2l8K5
4552c8K8J71O4m00J34rQ7J34k89J30J72k16K73j13Oj44R6n5k3L1K5m0J03k93J79
4577A3m7j55K48j25O9q1J79p2p3J22j1j82M2K48q1j02O8j4J1k9j6L5j33N6O9j63
4603a24K82J92m48K12j49l02M37K6j00j05j17J62N7j0J27l56l72N05j0J32j1%
4625B8n4K1j3J25l6m3o6O6R7n6N8j68j45K58j27O2j1p0J53j23k78K74K76l51K88
4650A65j47K0j37K00q7n9Q0P3j92KL74l68L9K57l62J06m0Ll42J35J31j97K53j50
4674b43N96o50J50K9N2K58k57N8J62r3q8J01q1j62K63q5K2j60Q4O3l2J82j94J52
4698A27j98m2J71k87K92J21k16J7P1j99K72o1M0k85J59N8k2o5j67L06j06j4mJ31
$$ plain form
4722 99 239 -174 111 -164 -104 -115 269 -363 -28 -113 -47 204 384 321 -69 225 212 289 -639 -99 -64 352 -125
4745 -125 -828 583 -174 -271 -275 121 -195 -223 127 -452 -259 32 28 -392 9 -29 91 23 7 68 7 17 65 -233
4769 -233 -79 -125 51 120 -39 -126 -15 15 51 -173 4 48 -228 44 96 -159 -93 -9 2 -308 -53 71 44 -21
4793 -21 -39 -174 95 -146 7 -52 180 -118 -217 -144 105 158 -50 -115 225 78 251 194 -259 74 123 169 -149
4816 -149 9 -9 -111 2 -52 -98 85 216 -232 -209 -59 -309 45 -53 86 -27 565 42 -21 -13 128 -57 -468
4839 -468 689 143 -28 118 173 30 260 -4 113 -81 -389 61 105 -204 178 -230 -182 -4 -59 -263 10
4860 10 -51 -134 -90 30 -315 -366 400 -518 -201 -381 47 -107 -30 222 74 -101 131 -40 -463 -136 685 63
4882 63 -295 170 4 -423 -138 -172 -469 -142 0 -39 62 24 -29 213 -58 -3 -30 786 160 26 32 383 271
$$ packed form
4722I9J40m13K85k75O0j1L84o32L35q5O6K51J80o3l90K94j3P7r28N40L5M16m77
4745a25p03J411p57r7mL96l16k8L50n79J93K91mm20M01l8J20o8j6O1o1J0M8k98
4769b33J54m6J76O9j59q7J11L0L6k24J77M4k76K72N2k55O6Q4J1l10K55J24k7o5
4793b1j8j35K69k41J53n9K32k98r9P3K49N3k08o5L40j47J73n7m53L33M9M6l18
4816a49J58j8j02J13n4m6J83J31m48K3J50k50L54r8J39j13N92n23o3QJ41j85m11
4839d68J157n46j71J46N5j43K30k64J17j94l08M50M4l09L82m08M8J78n5k04K73
4860A0o1q3M4J20l45n1P66r18L17j80M28j54P7K52j48j75K32j71m23L27Q21o22
4882F3l58M65j66m27K85l4k97L27J42l9J01l8n3K42k71N5k7Q16o26j34OL51j12
$$ plain form
4905 271 358 48 -134 -50 156 -113 246 174 27 -374 -250 345 662 -67 -341 -403 8 -114 -142 -88 -151 -309
4927 -309 139 -2 64 140 210 230 33 99 -72 232 89 106 221 -148 1 -65 -203 -68 -113 16 -102 -155 -6
4950 -6 5 -99 103 30 -460 -540 130 20 61 176 -128 323 83 -81 409 -229 -1114 -322 -121 302 605 161
4972 161 -680 -100 125 -88 228 84 -546 -751 304 -68 -409 205 -4 -403 -425 -804 281 -295 -629 -629
4992 -629 -457 -125 159 124 59 -297 -102 -51 -22 -258 -46 -58 229 93 293 -74 127 261 345 308 357 -379 108
5015 108 79 -213 482 -346 -147 90 167 74 -746 -236 -89 301 -109 -431 933 4 -96 -114 54 107 108 -260
5037 -260 -53 -117 217 -127 29 315 -84 -58 243 254 -748 296 -136 352 620 -83 226 -26 -231 -184 15
$$ packed form
4905B71Q7l10j82Q4K06k69L59p2j47m01J24N95L17p29k74o2M11j22k8N4o3j58
4927c09M48j41O6P6P0K0j97O6j71L04j43J7J15l69J49o6j38J35m5J29j18n3J49
4950fJ1j04K02p3m90q0O70j10M1J15l04M51k40j64M90o38q85P92K01M23L03m44
4972A61q41N80K25k13L16j44o30k05J055l72l41O14k09l99k2l79J085n76l34%
4992f29J72L32K84l5o5l56J95N1K9k36K12j2K87j36K00l67K01J34Q4l7M9p36M87
5015A08k9k92O95q28J99K37P7r3q20N10J47L90m10l22J364r29j00j8J68N3Jl68
5037b60K07o4L34l44J56K86l99K6L01J1j002J044m32M88K68p03L09k52k05M7J99
$$ [...]
8191G9
##END NTUPLES=NMR FID
##END=
