##TITLE=1H_CG-1228-X4
 200.13MHz,DMSO,
 8 sc
 
 12.11.2025
##JCAMPDX= 6.0         $$ Bruker NMR JCAMP-DX V2.0
##DATA TYPE= NMR SPECTRUM
##DATA CLASS= NTUPLES
##ORIGIN= UXNMR, Bruker Analytische Messtechnik GmbH
##OWNER= pz
$$ XWIN-NMR		Version 3.5
$$ Wed Nov 12 13:43:37 2025 Russian Standard Time (UT+4h)  she@DPX200
##.OBSERVE FREQUENCY= 200.1313
##.OBSERVE NUCLEUS= ^1H
##.ACQUISITION MODE= SIMULTANEOUS
##.ACQUISITION SCHEME= undefined
##.AVERAGES= 8
##.DIGITISER RES= 18
##SPECTROMETER/DATA SYSTEM= spect
##.PULSE SEQUENCE= zg30
##.SOLVENT NAME= DMSO
##.SHIFT REFERENCE= (INTERNAL, DMSO, 0, 15.5045)
##AUDIT TRAIL= $$ (NUMBER, WHEN, WHO, WHERE, WHAT)
$$ ##TITLE= Audit trail, XWIN-NMR		Version 3.5
$$ ##JCAMPDX= 5.01
$$ ##ORIGIN= Bruker BioSpin GmbH
$$ ##OWNER= she
$$ F:/spectra/data/she/nmr/H-C/1/pdata/1/auditp.txt
$$ ##AUDIT TRAIL=  $$ (NUMBER, WHEN, WHO, WHERE, WHAT)
(   1,<2025-11-12 13:42:06.73 +0400>,<she>,<DPX200>,
      <created by zg, POWCHK disabled, PULCHK disabled
       configuration hash MD5:
       00 E9 B6 7A A2 85 ED C7 34 08 36 98 17 FE 4E 26
       data hash MD5: 16K
       72 B8 45 AC CD C2 D2 E8 81 74 B6 6F D8 41 12 23>)
(   2,<2025-11-12 13:42:11.43 +0400>,<she>,<DPX200>,
      <Start of raw data processing
       efp BC_mod = 2 LB = 0.25 FT_mod = 6 PKNL = 1 PHC0 = -2634.35 PHC1 = 23.79237 SI = 16K 
       data hash MD5: 16K
       09 FC 88 9B 9B AE 29 F4 8C EB F6 A5 11 8B 97 DB>)
(   3,<2025-11-12 13:42:39.79 +0400>,<she>,<DPX200>,
      <pk PHC0 = 11.54447 PHC1 = -17.2 
       data hash MD5: 16K
       D5 52 BB 46 C3 E6 0C 96 86 C6 96 C4 77 73 87 BB>)
(   4,<2025-11-12 13:42:44.76 +0400>,<she>,<DPX200>,
      <abs ABSG = 5 
       data hash MD5: 16K
       A2 21 31 EC C0 1C F7 F0 E1 E6 6F F9 4A E9 DC 30>)
$$ ##END=
$$ 
$$ hash MD5
$$ D9 AF 1C 62 4F 5B 7D 6E F5 4C 56 E1 F2 D8 55 FB
##$RELAX= 
##$RELAX= 
##$RELAX= 
##$RELAX= 
##$RELAX= 
##$RELAX= 
$$ Bruker specific parameters
$$ --------------------------
##$DU= <F:/spectra>
##$EXPNO= 1
##$NAME= <H-C>
##$PROCNO= 1
##$TYPE= <nmr>
##$USER= <she>
##$AMP= (0..31)
100 100 100 100 100 100 100 100 100 100 100 100 100 100 100 100 100 100 
100 100 100 100 100 100 100 100 100 100 100 100 100 100 
##$AQSEQ= 0
##$AQ_mod= 1
##$AUNM= <au_zg>
##$AUTOPOS= <>
##$BF1= 200.13
##$BF2= 200.13
##$BF3= 200.13
##$BF4= 200.13
##$BF5= 200.13
##$BF6= 200.13
##$BF7= 200.13
##$BF8= 200.13
##$BYTORDA= 1
##$CFDGTYP= 0
##$CFRGTYP= 5
##$CHEMSTR= <none>
##$CNST= (0..31)
1 1 145 1 1 1 1 1 1 1 1 1 1 1 1 1 1 1 1 1 1 1 1 1 1 1 1 1 1 1 1 1 
##$CPDPRG= <>
##$CPDPRG1= <>
##$CPDPRG2= <>
##$CPDPRG3= <>
##$CPDPRG4= <mlev>
##$CPDPRG5= <mlev>
##$CPDPRG6= <mlev>
##$CPDPRG7= <mlev>
##$CPDPRG8= <mlev>
##$CPDPRGB= <>
##$CPDPRGT= <>
##$D= (0..31)
0 0.7 0 0 0 0 0 0 0 0 0 0.03 0 0 0 0 0 0 0 0 0 0 0 0 0 0 0 0 0 0 0 0 
##$DATE= 1762940526
##$DBL= (0..7)
120 120 120 120 120 120 120 120 
##$DBP= (0..7)
150 150 150 150 150 150 150 150 
##$DBP07= 0
##$DBPNAM0= <>
##$DBPNAM1= <>
##$DBPNAM2= <>
##$DBPNAM3= <>
##$DBPNAM4= <>
$$ [...]
##$SUBNAM3= <"">
##$SUBNAM4= <"">
##$SUBNAM5= <"">
##$SUBNAM6= <"">
##$SUBNAM7= <"">
##$SUBNAM8= <"">
##$SUBNAM9= <"">
##$SW= 18.0517328524113
##$SWIBOX= (0..15)
0 0 2 0 0 0 0 0 0 0 0 0 0 0 0 0 
##$SW_h= 3612.71676300578
##$TD= 16384
##$TD0= 1
##$TE= 0
##$TE2= 300
##$TE3= 300
##$TEG= 300
##$TL= (0..7)
0 120 120 120 120 120 120 120 
##$TP= (0..7)
150 150 150 150 150 150 150 150 
##$TP07= 0
##$TPNAME0= <>
##$TPNAME1= <>
##$TPNAME2= <>
##$TPNAME3= <>
##$TPNAME4= <>
##$TPNAME5= <>
##$TPNAME6= <>
##$TPNAME7= <>
##$TPOAL= (0..7)
0.5 0.5 0.5 0.5 0.5 0.5 0.5 0.5 
##$TPOFFS= (0..7)
0 0 0 0 0 0 0 0 
##$TUNHIN= 0
##$TUNHOUT= 0
##$TUNXOUT= 0
##$USERA1= <user>
##$USERA2= <user>
##$USERA3= <user>
##$USERA4= <user>
##$USERA5= <user>
##$V9= 5
##$VALIST= <valist>
##$VCLIST= <CCCCCCCCCCCCCCC>
##$VD= 0
##$VDLIST= <DDDDDDDDDDDDDDD>
##$VPLIST= <PPPPPPPPPPPPPPP>
##$VTLIST= <TTTTTTTTTTTTTTT>
##$WBST= 1024
##$WBSW= 4
##$XGAIN= (0..3)
0 0 0 0 
##$XL= 0
##$YL= 0
##$YMAX_a= 272224
##$YMIN_a= -357117
##$ZGOPTNS= <>
##$ZL1= 120
##$ZL2= 120
##$ZL3= 120
##$ZL4= 120
##$ABSF1= 15.5045
##$ABSF2= -2.547349
##$ABSG= 5
##$ABSL= 3
##$ALPHA= 0
##$AQORDER= 0
##$ASSFAC= 0
##$ASSFACI= 0
##$ASSFACX= 0
##$ASSWID= 0
##$AUNMP= <proc_1d>
##$AZFE= 0.1
##$AZFW= 0.1
##$BCFW= 0
##$BC_mod= 2
##$BYTORDP= 0
##$COROFFS= 0
##$CY= -3
##$DATMOD= 1
##$DC= 0
##$DFILT= <>
##$DTYPP= 0
##$F1P= 0
##$F2P= 0
##$FCOR= 1
##$FTSIZE= 16384
##$FT_mod= 6
##$GAMMA= 0
##$GB= 0
##$INTBC= 1
##$INTSCL= 3.241238e-09
##$ISEN= 128
##$LB= 0.25
##$LEV0= 0
##$LPBIN= 0
##$MAXI= 10000
##$MC2= 0
##$MEAN= 0
##$ME_mod= 0
##$MI= 1.114404
##$NCOEF= 0
##$NC_proc= -6
##$NLEV= 6
##$NOISF1= 3.799351
##$NOISF2= 2.8
##$NSP= 0
##$NTH_PI= 0
##$NZP= 0
##$OFFSET= 15.5045
##$PC= 1
##$PHC0= -2622.806
##$PHC1= 6.592369
##$PH_mod= 1
##$PKNL= yes
##$PPARMOD= 0
##$PSCAL= 0
##$PSIGN= 0
##$REVERSE= no
##$SF= 200.130003442913
##$SI= 16384
##$SIGF1= 3
##$SIGF2= 2
##$SINO= 0.751879
##$SIOLD= 32768
##$SREGLST= <19F.Aceton>
##$SSB= 0
##$STSI= 16384
##$STSR= 0
##$SW_p= 3612.71676300578
##$SYMM= 0
##$S_DEV= 0
##$TDeff= 16384
##$TDoff= 0
##$TI= <>
##$TILT= no
##$TM1= 0
##$TM2= 0
##$TOPLEV= 0
##$USERP1= <user>
##$USERP2= <user>
##$USERP3= <user>
##$USERP4= <user>
##$USERP5= <user>
##$WDW= 1
##$XDIM= 16384
##$YMAX_p= 329716150
##$YMIN_p= -349879
$$ End of Bruker specific parameters
$$ ---------------------------------
##NTUPLES= NMR SPECTRUM
##VAR_NAME=  FREQUENCY,     SPECTRUM/REAL,   SPECTRUM/IMAG
##SYMBOL=    X,             R,               I
##VAR_TYPE=  INDEPENDENT,   DEPENDENT,       DEPENDENT
##VAR_FORM=  AFFN,          ASDF,            ASDF
##VAR_DIM=   16384,         16384,           16384
##UNITS=     HZ,            ARBITRARY UNITS, ARBITRARY UNITS
##FACTOR=    0.220516191357247, 1,           1
##FIRST=     3102.91571625105, 0,            0
##LAST=      -509.801046754727, 0,           0
##MIN=       -509.801046754727, -349879,     0
##MAX=       3102.91571625105, 329716150,    0
$$ Real data points
##PAGE= N=1
##DATA TABLE= (X++(R..R)), XYDATA
$$ [...]
8638C918691j5846o6877M7639r5675q0549N038J1926j8468j28173o940J24412
$$ 3918691 3902845 3835968 3883607 3787932 3707383 3712421 3724347 3705879 3577706 3570766 3695178
8627C695178o6388j92937J20112P5087j89499l1761R3219j2622j41516L4690J1883
$$ 3695178 3628790 3435853 3555965 3631052 3441553 3409792 3503011 3490389 3348873 3383563 3395446
8616C395446j04898K64760K5459l2303P5904m2430n1374J19771K15077O1874l6860
$$ 3395446 3290548 3555308 3580767 3548464 3624368 3581938 3530564 3650335 3865412 3927286 3890426
8605C890426q8575J8549Q5326l7416Q5843L7948p316J01323M5471P7575m0558
$$ 3890426 3801851 3820400 3905726 3868310 3954153 3992101 3984785 4086108 4131579 4209154 4168596
8594D168596q4461N9535L9168j24052j64185o7345j2827q9102k078j64394k8954
$$ 4168596 4084135 4143670 4182838 4058786 3894601 3827256 3814429 3725327 3723249 3558855 3529901
8583C529901m3678l190k63195o7012K94864k57355p9193J0551n3884m1463o754
$$ 3529901 3486223 3483033 3219838 3152826 3447690 3190335 3111142 3121693 3067809 3026346 3019592
8572C019592j26044j0443j74572Q3379M0753l6797N6514l3555o4777M8196j5296
$$ 3019592 2893548 2883105 2708533 2791912 2832665 2795868 2852382 2818827 2754050 2802246 2786950
8561B786950M5895o383k7774r0518j3488K6675o1614O3077j87750p9872L7548
$$ 2786950 2832845 2826462 2798688 2708170 2694682 2721357 2659743 2722820 2535070 2455198 2492746
8550B492746R2719j32503j17789M2645r9030K7663L1119j38615o8811r5358m5699
$$ 2492746 2585465 2452962 2335173 2377818 2278788 2306451 2337570 2198955 2130144 2034786 1989087
8539A989087j23963j9615j6306o9601j29717j5341m0065p4985J11816L1948m0815
$$ 1989087 1865124 1845509 1829203 1759602 1629885 1614544 1574479 1499494 1611310 1643258 1602443
8528A602443M7917J2508k85076k4419J41964o3307j9492l9389l5245m7790j15627
$$ 1602443 1650360 1662868 1377792 1353373 1495337 1432030 1412538 1373149 1337904 1290114 1174487
8517A174487l3136K4490j8436M2008q5439j28317M9553k2673P615L1429L162K5115
$$ 1174487 1141351 1165841 1147405 1189413 1103974 975657 1025210 1002537 1010152 1041581 1044743 1069858
8505A069858j04044q478k9109p9282L4710J63167r837j50354M7972J02582j49643
$$ 1069858 965814 957336 928227 848945 883655 1046822 1036985 886631 934603 1037185 887542
8494H87542J552k5193k9947k0429K6705O6847m0580q129m2307J35246K1235l2622
$$ 887542 889094 863901 833954 813525 840230 907077 866497 858368 816061 951307 972542 939920
8482I39920r57j06685r2366N1308n6207p2703M2459J00437M0240Q793n0678j68718
$$ 939920 938963 832278 739912 791220 735013 662310 704769 805206 845446 854239 803561 634843
8470F34843j10267p905K1638q5881J06262L0620o796J02315Q7412j6619n9690
$$ 634843 524576 516671 538309 452428 558690 589310 582514 684829 772241 755622 695932
8459F95932j44718l2844J92881R976j23958o7021N8376Q1369j56686q7500q28
$$ 695932 551214 518370 711251 721227 597269 530248 588624 669993 513307 425807 424979
8448D24979J08762M5005j95007R3281L8484j15958J60300o9615j05474Q1635l4613
$$ 424979 533741 578746 383739 477020 515504 399546 559846 490231 384757 466392 431779
8437D31779J20257l7566O5986J7857o816q0342r6287o1489o2875j4307M1958j4399
$$ 431779 552036 514470 580456 598313 591497 511155 414868 353379 290504 276197 318155 303756
8425C03756N4850J478Q4194L3117m1546Q463m7367K3410O3601j03585j08067K55483
$$ 303756 358606 360084 444278 477395 435849 444312 396945 420355 483956 380371 272304 527787
8413E27787O3895j75360j78346m4838J40145R8152p1247l4808L2235o221J8629
$$ 527787 591682 416322 237976 193138 333283 431435 360188 325380 357615 351394 370023
8402C70023J6666j9260R7330R3059p8347j2542l6148j50064P010o4214o7168L4987
$$ 370023 386689 367429 464759 557818 479471 466929 430781 280717 287727 223513 156345 191332
8390A91332k2212J10939J32511l5749q5665j24103j7987l241J01318O4306n5672
$$ 191332 169120 280059 412570 376821 291156 167053 149066 145825 247143 311449 255777
8379B55777k6859O091l0724O5246M9487P3647k7609j22107L4134L6766k2404l4823
$$ 255777 228918 235009 204285 269531 319018 392665 365056 242949 277083 313849 291445 256622
8367B56622J20268q8166j6622Q859o7465J1065M7168o3563r2459o6193J26772
$$ 256622 376890 288724 272102 280961 213496 224561 271729 208166 115707 49514 176286
8356A76286R9214M187n8538r7985K80P5754J45660j1510o4950K524O542r8479
$$ 176286 275500 279687 221149 123164 123444 199198 344858 333348 268398 270922 277464 178985
8344A78985m0466n916N6435m4968J34281N6928r8406K0904j17738j89214J04018
$$ 178985 138519 132603 189038 144070 278351 335279 236873 257777 140039 -49175 54843
8333E4843J09221J63169n9325r7838j5694k0073n1571p9460J65384N4274J50807
$$ 54843 164064 327233 267908 170070 154376 134303 82732 3272 168656 222930 373737
8322C73737n2265K7237j25989j58361M5892L4679K1412r4265l1585J19061O2793
$$ 373737 321472 348709 222720 64359 110251 144930 166342 72077 40492 159553 222346
8311B22346j33011P4922q688n0170n3209N2404p8987O0388J54437L0784j32652
$$ 222346 89335 164257 155569 105399 52190 104594 25607 85995 240432 271216 138564
8300A38564o9689M9515k0718q732K8568p338r9554R111l4623M9116q340M5388
$$ 138564 68875 118390 97672 88940 117508 110170 10616 19727 -14896 34220 25880 71268
8288G1268R8936Q569k049K4052q5923q1327O5250N2742j04828J82137M9572j51882
$$ 71268 170204 178773 176724 200776 114853 33526 98776 151518 46690 228827 278399 126517
8276A26517j88973K7063Q0188O5149L1166P1356q5589j71914K2224K84687P7801
$$ 126517 -62456 -35393 44795 109944 141110 212466 126877 -45037 -22813 261874 339675
8265C39675j94630m8759m3377r1266r123K31921q2089K5913m5960J2480N9639
$$ 339675 145045 96286 52909 -38357 -47480 184441 102352 128265 82305 94785 154424
8254A54424l3107j20880J121K5083p9701j2401L5812K19235n5582p0279N9755
$$ 154424 121317 437 1558 26641 -53060 -65461 -29649 189586 134004 63725 123480
8243A23480J175N6758q7490p077k8836j8705l6237m034J25928J32734k17083q3535
$$ 123480 124655 181413 93923 86846 58010 39305 3068 -966 124962 257696 40613 -42922
8231d2922j0841N4663m842j4990N5399J51906P7019J4953k9048o173L6337k34072
$$ -42922 -53763 900 -3942 -18932 36467 188373 265392 280345 251297 245124 281461 47389
8219D7389J29705r2148J16702j2587J7380j00179K1447K1546n594j9868p0987
$$ 47389 177094 84946 201648 189061 206441 106262 127709 149255 143661 123793 52806
8208E2806m2701J53915j12974N7749P3980M5682r005m786J2902n9470j20394J3890
$$ 52806 10105 164020 51046 108795 182775 228457 219452 214666 227568 168098 47704 61594
8196F1594M1759j6784P3278N56607J249869j140516n94925P28R818n9902j67815
$$ 61594 103353 86569 159847 716454 1966323 825807 230882 231610 241428 181526 13711
8185A3711J10453r3614L1635K00232j2146j33598M3600P460M2916j10914P555
$$ 13711 124164 30550 62185 262417 250271 116673 160273 167733 210649 99735 107290
8174A07290J3449J26190m3793P5593o3721j03225K0665L0667m2669J4312l785
$$ 107290 120739 246929 203136 278729 215008 111783 132448 163115 120446 134758 130973
8163A30973N1737j2062l8491L9522k812J38870j78967o7161J4073m7098R4540
$$ 130973 182710 170648 132157 171679 168867 307737 128770 61609 75682 28584 123124
8152A23124Q4943p80j32878m3312L3958J51532j10581M1953L0250j7024j39454
$$ 123124 208067 207287 74409 31097 65055 216587 106006 147959 178209 161185 21731
8141B1731N4358m0013o6447M4472J01671j3338j13112J3661Q2840j01199j67963
$$ 21731 76089 36076 -30371 14101 115772 102434 -10678 2983 85823 -15376 -183339
8130a83339J23831j587J8637q575O1843K498n3664l4303J7773m2132N9957m7768
$$ -183339 -59508 -61095 -42458 -51033 10810 13308 -40356 -74659 -56886 -99018 -39061 -86829
8118h6829J10328l9465l8012L5852o4852J05375J7107n6891j14072L0308l1537
$$ -86829 23499 -15966 -53978 -18126 -82978 22397 39504 -17387 -131459 -101151 -132688
8107a32688Q5418P9630q6981p426L717n0294J18238O5109j00399N5474r5999P3854
$$ -132688 -47270 32360 -54621 -62047 -58330 -108624 9614 74723 -25676 29798 -66201 7653
8095G653j8975O3507j1232j07355l5691K76R0229N3953P675l0456n7436p8375
$$ 7653 -11322 52185 40953 -66402 -102093 -101817 -11588 42365 50040 19584 -37852 -116227
8083a16227j38311K6589L622p299Q0644R9444M2975N4828M0281N7373n3283k7036
$$ -116227 -254538 -227949 -224327 -231626 -150982 -51538 -8563 46265 86546 143919 90636 63600
8071F3600L2134j88557N3262J03953J01206r4403j06458j10273q385R8767R8504
$$ 63600 95734 -92823 -39561 64392 165598 71195 -35263 -145536 -153921 -55154 43350
8060D3350n0165j22164j5059m4630O1372J31908r4834Q1541J03078n5208j03011
$$ 43350 -6815 -128979 -144038 -188668 -127296 4612 -90222 -8681 94397 39189 -63822
8049f3822J47549N2697L2087j02960P962j21304o4698J50798L6101J9419O3555
$$ -63822 83727 136424 168511 65551 73513 -47791 -112489 38309 74410 93829 157384
8038A57384l8850j52107L2313j6330M89M8686l0356n8778L810k3444M857k180
$$ 157384 118534 -33573 -1260 -17590 -17101 31585 1229 -57549 -53739 -77183 -72326 -74506
8026g4506N9468P89K4902P9185p4188j10773k2610o8078J31458m8548R1513M2279
$$ -74506 -15038 -14249 10653 89838 15650 -95123 -117733 -185811 -54353 -102901 -11388 30891
8014C0891j20954J04746l8075n149J08481r6978q3463o4303J01358k0399o5986
$$ 30891 -90063 14683 -23392 -28541 79940 -17038 -100501 -164804 -63446 -83845 -149831
8003a49831j16827O3360P7198P2103J18685l9450n2310j58868K4124K851n0651
$$ -149831 -266658 -203298 -126100 -53997 64688 25238 -27072 -185940 -161816 -158965 -209616
7992b09616J8277R571n154J01371J28755o9968J1373K6651k1980l9714L9417j65061
$$ -209616 -191339 -181768 -186922 -85551 43204 -26764 -15391 11260 -10720 -50434 -11017 -176078
7980a76078l3388O61O9596J28741L385n0488j57585O0745R5842j794j55596L7020
$$ -176078 -209466 -208805 -139209 -10468 -7083 -57571 -215156 -154411 -58569 -60363 -215959 -178939
7968a78939J07754L4823j66715O9298J07015L3765J9098j6847J1582M6869l5933
$$ -178939 -71185 -36362 -203077 -133779 -26764 7001 26099 9252 20834 67703 31770
7957C1770o6817n3423K6269Q565J32605l7984p611j0169O3610P301j16177q1990
$$ 31770 -35047 -88470 -62201 -53636 78969 40985 33374 23205 86815 94116 -22061 -104051
7945a04051K5050P278K5816N2511r0796k4324j1094p0964n3106N8972M2856K20748
$$ -104051 -79001 -71723 -45907 6604 -84192 -108516 -119610 -190574 -243680 -184708 -141852 78896
7933G8896R8145o1194p9195o8233j10237P0935j10180P8228j08063N8398N3996
$$ 78896 177041 115847 36652 -31581 -141818 -70883 -181063 -102835 -210898 -152500 -98504
7922i8504m9873J67093l4305q4771J66210J05147j16832r3077l262J4567J1080
$$ -98504 -148377 18716 -15589 -100360 65850 170997 54165 -38912 -42174 -27607 -16527
7911a6527n2981K0431l5710q833O0132p1503O5465L6454j6766r3605M4616p3231
$$ -16527 -69508 -49077 -84787 -93620 -33488 -104991 -39526 -3072 -19838 -113443 -68827 -142058
7899a42058J06827o5370Q2246P5992J1024n8141j23456q8915Q2293k0902N3975
$$ -142058 -35231 -100601 -18355 57637 68661 10520 -112936 -201851 -119558 -140460 -86485
7888h6485l7807O8534J84589k1626q8681j21923o0845Q4828J42168q9987J16025
$$ -86485 -124292 -55758 128831 107205 18524 -103399 -164244 -79416 62752 -27235 88790
7877H8790j79797J7567n947O158o300j22492J07422N1708J401l9684j0176K4574
$$ 88790 -91007 -73440 -79387 -73229 -79529 -202021 -94599 -42891 -41490 -81174 -91350 -66776
7865f6776J12061j892M5175L5413j56814L2436p0489J14857N2941k4789j15000
$$ -66776 45285 43393 88568 123981 -32833 -397 -70886 43971 96912 72123 -42877
7854d2877M1079K0792j46601K9507J1358M3813l6362k1910q3514L0394J24624
$$ -42877 -1798 18994 -127607 -98100 -86742 -42929 -79291 -101201 -184715 -154321 -29697
7843b9697m3211j24353N2482J10373M0463j9782J6583j09709J03932Q9977O514
$$ -29697 -72908 -197261 -144779 -34406 6057 -13725 2858 -106851 -2919 87058 93572
7832I3572J536p2669k7192L4444n5492N2130P887j2527k9343m6579K4848k1394
$$ 93572 95108 22439 -4753 29691 -25801 26329 34216 21689 -7654 -54233 -29385 -50779
7820e0779k5842L2097P4642j98422j9362N3593J8580n0218J2721j20285J12449
$$ -50779 -76621 -44524 30118 -168304 -187666 -134073 -115493 -165711 -152990 -273275 -160826
7809a60826O4498M0627l3937P2379k00189J61338J13462j83532k7051J3120k7268
$$ -160826 -96328 -55701 -89638 -17259 -217448 -56110 57352 -126180 -153231 -140111 -167379
7798a67379n145J04509n7610k0793R5268L3591J02678J2802j87197r8377N1276
$$ -167379 -172524 -68015 -125625 -146418 -51150 -17559 85119 97921 -89276 -187653 -136377
7787a36377J05083M172N1311n321J35836L7377j40408j00038q8934R7664P693
$$ -136377 -31294 -27122 24189 18868 154704 192081 51673 -48365 -137299 -39635 -31942
7776c1942n3227J66182Q16j09778m4643K8659j27799J8013O9056N2283L2370R9102
$$ -31942 -85169 81013 81829 -27949 -72592 -43933 -171732 -153719 -84663 -32380 -10 99092
7764I9092L2217j31363R8253K8026j47276R8712M9171O1369q6037n7033o4642
$$ 99092 131309 -54 98199 126225 -21051 77661 126832 188201 102164 45131 -19511
7753a9511N1862J36642J5659o2906L3647n6698J21061l3014L5039J19417Q2281
$$ -19511 32351 168993 184652 121746 155393 98695 219756 186742 221781 341198 423479
7742D23479j84639O7832j12233l9955R2503M1535J5911L691O7612p6074m4410
$$ 423479 238840 306672 194439 154484 246987 288522 304433 308124 375736 299662 255252
7731B55252n8155o0319j61304N6508J9394M4218P6286R8067l7560j13701q2840
$$ 255252 197097 136778 -24526 31982 51376 95594 171880 269947 232387 118686 35846
7720C5846L4716j9682k3822K5285K0102o0858N0603o8305j01226P1245R8159m5030
$$ 35846 70562 50880 27058 52343 72445 11587 62190 -6115 -107341 -36096 62063 17033
7708A7033L5017J38325q8026j56507L8274Q8096j02804j01122J27224n477J5581
$$ 17033 52050 190375 102349 -54158 -15884 72212 -30592 -131714 -4490 -9967 5614
7697E614J05389l5734j25738K0282k9361J9070M4344N462Q412N5333j9192p3299
$$ 5614 111003 75269 -50469 -30187 -59548 -40478 3866 9328 17740 73073 53881 -19418
7685a9418J00378L139Q2358j04509q0912j4123O8140P3973L6720M3068j6463n690
$$ -19418 80960 84099 166457 61948 -18964 -33087 35053 109026 145746 188814 172351 166661
7673A66661p3125O8075M4994r2128m0365O4048j2501R6092q7871K0731j8077r8540
$$ 166661 93536 161611 206605 114477 74112 138160 125659 221751 133880 154611 136534 37994
7661C7994O9186n2513N5607j1323k7990R0731j36932J857J34145l8653k862J4537
$$ 37994 107180 54667 110274 98951 70961 161692 24760 26617 160762 122109 119247 133784
7649A33784o8805O4356l353L3276j04551J076n4383J3239L9285L6772O575J0938
$$ 133784 64979 129335 125982 159258 54707 55783 1400 14639 53924 90696 97271 108209
7637A08209O0006N59J2033j31633k6071N4835K4181N3427M6546L5789j28385n7791
$$ 108209 168215 168774 180807 49174 23103 77938 102119 155546 202092 237881 109496 51705
7625E1705J9292p3367j3438L8755j5279k9313R0414J7575n9002O5323J4582J2396
$$ 51705 70997 -2370 -15808 22947 7668 -21645 68769 86344 27342 92665 107247 119643
7613A19643p0067j10072J7247J30917l1426j8533J4926k807M6305Q953n9272l9330
$$ 119643 49576 -60496 -43249 87668 56242 37709 52635 49828 96133 105086 45814 6484
7601F484P7785j16958J07928L1046J1400p321K1035q028l0314j1842j1409k2273
$$ 6484 84269 -32689 75239 106285 117685 110364 131399 123371 93057 81215 69806 47533
7589D7533Q0564J0248l4598n515O2158r1P1469L6373m1284M6790m0780M5683l8725
$$ 47533 128097 138345 103747 98232 160390 160299 231768 268141 226857 273647 232867 278550 239825
7576B39825q6074J20254p1053r8688J35272O4140j44279L0138Q4688P1695p2026
$$ 239825 153751 274005 202952 104264 239536 303676 159397 189535 274223 345918 273892
7565B73892l6520n9247R0063M3596J25098R3432j00513J9167l8038R7138N8051
$$ 273892 237372 178125 268188 311784 436882 530314 429801 448968 410930 508068 566119
7554E66119P904n5728J06421O2930R193J65374J26701N3685O3811J5443M7497
$$ 566119 574023 518295 624716 687646 696839 862213 988914 1042599 1106410 1121853 1169350
7543A169350P1206l7595q8907k6387Q3985m523O7552L0492o5467j03084o9327
$$ 1169350 1240556 1202961 1114054 1087667 1171652 1167129 1234681 1265173 1199706 1096622 1027295
7532A027295j11777r0798j77227j2622N2736j67838j27337n4367r994O7255k2097
$$ 1027295 915518 824720 647493 634871 687607 519769 392432 338065 328071 395326 373229
7521C73229J1515j1626o6638M5603l1295m6449l6505j2458O1325r4077m3142P6299
$$ 373229 384744 373118 306480 352083 320788 274339 237834 225376 286701 192624 149482 225781
7509B25781M3188r9398q3439J50564k5616L9786p2429l9982J4679J3719j4680
$$ 225781 268969 169571 86132 236696 211080 250866 178437 138455 153134 166853 152173
7498A52173M7509J7656K1437M798P1728k01470N3050O426l6672P2048j20105l4384
$$ 152173 199682 217338 238775 243573 315301 113831 166881 173307 136635 208683 88578 54194
7486E4194o1068J5468O00k7045l1516J27876P730m6158l2858K8741P5744J18076
$$ 54194 -6874 8594 9194 -17851 -49367 78509 86239 40081 7223 35964 111708 229784
7474B29784o3001K0584o8089j65090R8269P8286j0720m9208o3234n4686J38088
$$ 229784 166783 187367 119278 -45812 52457 130743 120023 70815 7581 -47105 90983
7463I0983N2537l7778n2192j1656M2768N8064L3648l3813p6677j3436P0611J7861
$$ 90983 143520 105742 53550 41894 84662 142726 176374 142561 65884 52448 123059 140920
7451A40920j3694J23550j39118j04369k8051j3304m2847R2402L716M5543N5332
$$ 140920 127226 250776 111658 7289 -20762 -34066 -76913 15489 19205 64748 120080
7440A20080j48042N4625q334Q4241M1214r9144l1130r1155N110K2389K6702J3171
$$ 120080 -27962 26663 18329 102570 143784 44640 13510 -77645 -72535 -50146 -23444 -10273
7428a0273K1355l9074L9240R9510L2951j08761l3467R5889P349n4530l5955J02317
$$ -10273 11082 -27992 11248 110758 143709 34948 1481 97370 104719 50189 14234 116551
7416A16551k9336L304O3714p4769m4758J18663k5727n9802k6366o8557q9314O3104
$$ 116551 87215 90519 154233 79464 34706 153369 127642 67840 41474 -27083 -116397 -53293
7404e3293J90931O549K8713K2095k26529M753P8982r421q9478n362M7180M6489
$$ -53293 137638 144187 172900 194995 -31534 -26781 52201 42780 -46698 -52060 -4880 41609
7392D1609O7167N343O2570j31568p0525R6713M5838L9424L5085l1868q7304M8791
$$ 41609 108776 114119 176689 45121 -25404 71309 117147 156571 191656 159788 72484 121275
7380A21275N401q6892j2307p173r9862R8411O9642R106P7422j606p1369Q4345
$$ 121275 126676 39784 27477 20304 -79558 18853 88495 97601 175023 173417 102048 186393
7368A86393o1357J2866N219m6341m8907Q0576l0563n2803j3044l5525M1437m0277
$$ 186393 125036 137902 143121 96780 47873 128449 97886 45083 32039 -3486 37951 -2326
7356b326o4403J50863M4808Q25p3792o7914Q3248J0489r6683n5731Q3162J59491
$$ -2326 -66729 84134 128942 129767 55975 -11939 71309 81798 -14885 -70616 12546 172037
7344A72037p5191J7492j622l4341Q9027q4178j29394M9664O8835J5990J43292
$$ 172037 96846 114338 112716 78375 167402 83224 -46170 3494 72329 88319 231611
7333B31611o3699j7072n2808j924j65470O4347p3192M1729N660p0707J02014M5668
$$ 231611 167912 150840 98032 96108 -69362 -5015 -78207 -36478 -30818 -101525 489 46157
7321D6157K7025J9457j3367K2326K055K7409l1754K5652l1737J7488M733l4055
$$ 46157 73182 92639 79272 101598 103653 131062 99308 124960 93223 110711 115444 81389
7309H1389N1541K1930R641j13888k09997O2445J06631L9429n7911J1643J03234
$$ 81389 132930 154860 164501 50613 -159384 -96939 9692 49121 -8790 2853 106087
7298A06087Q8284M7477j22616n024p2776l9055j9898N4985J31951m8329q5005
$$ 106087 194371 241848 119232 114208 41432 2377 -17521 37464 169415 121086 36081
7287C6081J20781k1929J9612K1283R1459q7140j21842P9715N816o3625K6440r6607
$$ 36081 156862 134933 154545 175828 267287 180147 58305 138020 143836 80211 106651 10044
7275A0044L8060O5137n7664m6492Q302Q3860O9281O9545k9322j57372n7734n195
$$ 10044 48104 113241 55577 9085 17387 101247 170528 240073 210751 53379 -4355 -9550
7263i550N2409L4319N7786m1089r9443Q2161j6473P6493O5616n4637K3528J06769
$$ -9550 42859 77178 134964 93875 -5568 76593 60120 136613 202229 147592 171120 277889
7251B77889j08691j28138l0317J68463j4689l1867j33967J56327Q0197o4382K3605
$$ 277889 169198 41060 10743 179206 164517 132650 -1317 155010 235207 170825 194430
7240A94430L080l311k7609p515n5237l9187j0563N2470l4600Q840O747Q7823R399
$$ 194430 197510 194199 166590 159075 103838 64651 54088 106558 71958 80798 87545 175368 184767
7227A84767r7357L6173K8006j2397O6103q3254k2364R4718m747j32131J30042
$$ 184767 87410 123583 151589 139192 205295 122041 99677 194395 189648 57517 187559
7216A87559M1908r1113q4949O1035J48655L4857Q95o6152j4290j6390m7126L4245
$$ 187559 229467 138354 53405 114440 263095 297952 298847 232695 218405 202015 154889 189134
7204A89134m8050j45853L1382J4343O6413J57567j7939n4219J45516n326q4572
$$ 189134 141084 -4769 26613 40956 107369 264936 246997 192778 338294 332968 248396
7193B48396j9538k6654l3729j68337P1296P5021P8517k7308n2841L5317O0177
$$ 248396 228858 202204 168475 138 71434 146455 224972 197664 144823 180140 240317
7182B40317L5770m3369K1960M5123M1842l7093j00290n302L6749q8222k6780l4860
$$ 240317 276087 232718 254678 299801 341643 304550 204260 198958 235707 147485 120705 85845
7170H5845Q911M3031r7259j5415J47015K8029j21338j6700R2752M5003L9867o6983
$$ 85845 94756 137787 40528 25113 172128 200157 78819 62119 154871 199874 239741 172758
7158A72758p9048K5344o3983R0260J0057j06289K12477q3593p0369N7349l760
$$ 172758 93710 119054 55071 145331 155388 49099 261576 177983 107614 164963 161203
7147A61203J05478l579n0719j548n3824O0814k3996M0869M472r8699N1041J02443
$$ 161203 266681 263102 212383 210835 157011 217825 193829 234698 239170 140471 191512 293955
7135B93955n8263r3753k4340Q5640L6598J20356j51035k45486J10833J66403L2855
$$ 293955 235692 141939 117599 203239 239837 360193 209158 -36328 74505 240908 273763
7124B73763J4046M9453m8693n6363n5998P7356r1339J10946Q1242l3115m9270
$$ 273763 287809 337262 288569 232206 176208 253564 162225 273171 354413 321298 272028
7113B72028K1829k3693r2924K5117O0219K3136n5012n9012O426l1961J8555j03048
$$ 272028 293857 270164 177240 202357 262576 285712 230700 171688 178114 146153 164708 61660
7101F1660P0976J19655l3358J1181R837M59O8651j49111J832r0230N2733J85700
$$ 61660 132636 252291 218933 230114 239951 240410 309061 159950 161782 71552 124285 309985
7089C09985J5367q8374R165m0023K1802n6468o2164J72288j10798L5245N0904
$$ 309985 325352 236978 246143 206120 227922 171454 109290 281578 170780 206025 256929
7078B56929n7965n6474N283J11990m1869l7214j02838l2486R3620n4373j12999
$$ 256929 198964 142490 147773 259763 217894 180680 77842 45356 138976 84603 -28396
7067b8396J6548K52316J63882m3022n7092J5614n1440j1703j26576j1090m1256
$$ -28396 -11848 240468 404350 361328 304236 319850 268410 256707 130131 119041 77785
7056G7785K1833L6109N5140l3678R3965J2709n7980M405Q3571K1098l6267j09255
$$ 77785 99618 135727 190867 157189 251154 263863 205883 210288 293859 314957 278690 169435
7044A69435j5730j1960O9998n9760Q9465R831K27J8737l8883r1484k3963J06499
$$ 169435 153705 141745 211743 151983 241448 251279 251506 270243 231360 139876 115913 222412
7032B22412P5427M3860J3633o7433q1622J02717P65k6436k1399q7807p1572J71028
$$ 222412 297839 341699 355332 287899 206277 308994 309759 283323 261924 174117 102545 273573
7020B73573l6823m4925n0115n2858J24724n3195M5514M7661j15875j65635J53706
$$ 273573 236750 191825 141710 88852 213576 160381 205895 253556 137681 -27954 125752
7009A25752J51873l8206o9430L0337R4567m0753J1746m0801j9749O1717P0151
$$ 125752 277625 239419 169989 200326 294893 254140 265886 225085 205336 267053 337204
6998C37204P3782r1213n800L2658Q9039p5098j84195Q2520M200J44439j13610
$$ 337204 410986 319773 313973 346631 435670 360572 176377 258897 263097 407536 293926
6987B93926p2229r5424R4620K20880M5899j60805l9033J0368j4984m1598K8171
$$ 293926 221697 126273 220893 441773 487672 326867 287834 298202 283218 241620 269791
6976B69791l2086R5178O0524J8247n761K5002k2726o7051K4984Q2971p1730j25779
$$ 269791 237705 332883 393407 411654 405893 430895 408169 341118 366102 449073 377343 251564
6964B51564n9076J95631l1813j7874r1042P8335M4833M0874O4328O2838j3072
$$ 251564 192488 388119 356306 338432 247390 325725 370558 411432 475760 538598 525526
6953E25526n6267O767j16848l755O3054k7286j37432R0551Q9979j5230m3285Q3721
$$ 525526 469259 476026 359178 355423 418477 391191 253759 344310 434289 419059 375774 459495
6941D59495O6468o6942o2375O0500q1397M0661L5906j325P5278N6815q2244j41972
$$ 459495 525963 459021 396646 457146 375749 416410 452316 450991 526269 583084 500840 358868
6929C58868P0607P7557q0909L4533k6622N4677J36546O1543j06855R5123j67574
$$ 358868 429475 507032 426123 460656 434034 488711 625257 686800 579945 675068 507494
6918E07494M5246L1712K7723k7777j0345J04388L0167j35642j6944k0398j05618
$$ 507494 552740 584452 612175 584398 574053 678441 708608 572966 556022 535624 430006
6907D30006J33370N4437q8876J96991q275r0556m6964n2651R0476K9683L649M4459
$$ 430006 563376 617813 528937 725928 717653 627097 580133 527482 617958 647641 651290 695749
6895F95749o962j32155J32377m3310N8026L6220o0345N2948O8678K9404j33766
$$ 695749 688787 556632 689009 645699 703725 739945 679600 732548 801226 830630 696864
6884F96864L2938J5815M8p2704J2756O7322k2581j28518Q6920M2545n7940m5535
$$ 696864 729802 745617 745665 672961 685717 753039 730458 601940 688860 731405 673465 627930
6872F27930M5109p89N8497m0756j48443J37384n3586J9565J7518L8078J75979
$$ 627930 673039 672250 730747 689991 541548 678932 625346 644911 662429 700507 876486
6861H76486L5399j30034Q6362L03j7140M923j30299o7201R5853m821m1960m9880
$$ 876486 911885 781851 868213 868516 851376 856299 726000 658799 754652 749831 707871 657991
6849F57991m057P4885j7907J6049k6323L006n8801K3240o0638l0661M7967O7928
$$ 657991 653934 728819 710912 726961 700638 703644 644843 668083 607445 576784 624751 692679
6837F92679J20700m5720M9667j18602n506J63612j82716p3711J23524M4307o0292
$$ 692679 813379 767659 817326 698724 693218 856830 674114 600403 723927 768234 707942
6826G07942J2149j7221k02121K17732N9087L8521k602j5937m6631l730O7881o9645
$$ 707942 720091 702870 500749 718481 777568 816089 813487 797550 750919 747189 815070 745425
6814G45425k4249J67082j8521Q705j8574J16427K718q0596K2661r2211N5227J48381
$$ 745425 721176 888258 869737 878442 859868 976295 979013 898417 921078 828867 884094 1032475
6802A032475P0891j06777j00689j06775m5229M8662Q2871N3503q8141k7576P2283
$$ 1032475 1103366 996589 895900 789125 743896 792558 875429 928932 840791 813215 885498
6791H85498M2750M655J1976M1202Q8746j22684N6930J9139k1940K5047q3332J12768
$$ 885498 928248 932903 944879 986081 1074827 952143 1009073 1028212 1006272 1031319 947987 1060755
6779A060755N0246j8027M013O7561q2837m4456J02076P0663j43683M7995Q1200
$$ 1060755 1111001 1092974 1096987 1164548 1081711 1037255 1139331 1209994 1066311 1114306 1195506
6768A195506k5007J0945k5854k1377J06916L2745k2617o3520m9944m4807j6198
$$ 1195506 1170499 1181444 1155590 1134213 1241129 1273874 1251257 1187737 1137793 1092986 1076788
6757A076788J35940n0939O2869R0883o1856m6579J66658M6245j05098J00186L1181
$$ 1076788 1212728 1161789 1224658 1315541 1253685 1207106 1373764 1420009 1314911 1415097 1446278
6746A446278n7433Q2165r0400j1261m363k1225O0113M172J85815n6978p1454k0679
$$ 1446278 1388845 1471010 1380610 1369349 1364986 1343761 1403874 1408046 1593861 1536883 1465429 1444750
6734A444750P1608J47205K0679o0541P8910L5849l515r6701l1401q6532J8039
$$ 1444750 1516358 1663563 1684242 1623701 1702611 1738460 1734945 1638244 1606843 1520311 1538350
6723A538350J11267N1104q8492K0844R1371m5033L8264N1535P881m7493K02108
$$ 1538350 1649617 1700721 1612229 1633073 1724444 1679411 1717675 1769210 1777091 1729598 1931706
6712A931706l3558k00430R8061J52930L0441j47424R9307p5081p4763J80638R6566
$$ 1931706 1898148 1697718 1795779 1948709 1979150 1831726 1931033 1855952 1781189 1961827 2058393
6701B058393j24739L5085M50L1315J53237n8208k2924L5458o1487J8764J41561
$$ 2058393 1933654 1968739 1969189 2000504 2153741 2095533 2072609 2108067 2046580 2065344 2206905
6690B206905o3095p0860J03188J08965L5710p5716L4159k0221J5414K1461n8391
$$ 2206905 2143810 2072950 2176138 2285103 2320813 2245097 2279256 2259035 2274449 2295910 2237519
6679B237519M6705N3124O6168J33472L1381r9628J51102k8553j6508j04597J12234
$$ 2237519 2284224 2337348 2403516 2536988 2568369 2468741 2619843 2591290 2574782 2470185 2582419
6668B582419J18177o2838K02059P0358L6402p7941M3095o6393r5563R5945J1903
$$ 2582419 2700596 2637758 2839817 2910175 2946577 2868636 2911731 2845338 2749775 2845720 2857623
6657B857623P2042l0954P077J91703k8956l5496R8810j23954q7174P9267L753
$$ 2857623 2929665 2898711 2905788 3097491 3068535 3033039 3131849 3007895 2920721 2999988 3003741
6646C003741R6021O0388q687r7951L9845J33941J56811M1052J7680j35189j69899
$$ 3003741 3099762 3160150 3151463 3053512 3093357 3227298 3384109 3425161 3442841 3307652 3137753
6635C137753Q8523l6320J33701M3484n4645m3203m4971J39757R4655p1023Q4554
$$ 3137753 3226276 3189956 3323657 3367141 3312496 3269293 3224322 3364079 3458734 3387711 3472265
6624C472265O498m4839L0674K4029K7240r948P767J19595r4026j2199M7951J28616
$$ 3472265 3478763 3433924 3464598 3488627 3515867 3505919 3513686 3633281 3539255 3527056 3575007 3703623
6612C703623j8410j11139j14821O2732J9980M948J33028J3896L1748K0131r2687
$$ 3703623 3685213 3574074 3459253 3521985 3541965 3546913 3679941 3693837 3725585 3745716 3653029
6601C653029N6020k1505k2916O7762o645R7841M7750l4279J02169l5086o7732
$$ 3653029 3709049 3687544 3664628 3732390 3725745 3823586 3871336 3837057 3939226 3904140 3836408
6590C836408R0763K7908j44213n2664J24234J07406J07576K3280K9779m3907l8174
$$ 3836408 3927171 3955079 3810866 3758202 3882436 3989842 4097418 4120698 4150477 4106570 4068396
6579D068396J18636k6489n7602O4882J10100M066n1364n5939l8208J59921j7263
$$ 4068396 4187032 4160543 4102941 4167823 4277923 4281989 4230625 4174686 4136478 4296399 4279136
6568D279136l0026J4601o4820K6124P7015l2563q5867M7803N4267J82338L8254
$$ 4279136 4249110 4263711 4198891 4225015 4302030 4269467 4183600 4231403 4285670 4468008 4506262
6557D506262k3916J01136Q456o8903N917j52222J18785n299j16678R7542L4457
$$ 4506262 4482346 4583482 4591938 4523035 4528952 4376730 4495515 4490216 4373538 4471080 4505537
6546D505537K6542Q5980M993L6183P2904M0493J774J16359J49955o6343J34458
$$ 4505537 4532079 4618059 4623052 4659235 4732139 4772632 4774406 4890765 5040720 4974377 5108835
6535E108835r0969J7640N2120J49343K33484Q9001j6167J13819K3348R9550J29347
$$ 5108835 5017866 5035506 5087626 5236969 5470453 5559454 5543287 5657106 5680454 5780004 5909351
6524E909351k6223L5777J36761K38418n3383L0776K59057J18429N8955l2762P7320
$$ 5909351 5883128 5918905 6055666 6294084 6240701 6271477 6530534 6648963 6707918 6675156 6752476
6513F752476J12443J04880P3931O6165L4847J74483L7900P4774k5191J00555J05043
$$ 6752476 6864919 6969799 7043730 7109895 7144742 7319225 7357125 7431899 7406708 7507263 7612306
6502G612306l021J08718J5726j1687K79166K8823R2106K15956J82347M684p7464
$$ 7612306 7609285 7718003 7733729 7722042 8001208 8030031 8122137 8338093 8520440 8525124 8447660
6491H447660R3671J38993J90682J10848L3943K63269K56935N9247M3529K25190
$$ 8447660 8541331 8680324 8871006 8981854 9015797 9279066 9536001 9595248 9638777 9863967
6481I863967K14258N5671Q0226J60313O8792J7907R7574L2908J69433J46039J10222
$$ 9863967 10078225 10133896 10214122 10374435 10443227 10461134 10558708 10591616 10761049 10907088 11017310
6470A1017310J34903L0277J16287L3750l5816M3372r25L6007M5448L3447L4853
$$ 11017310 11152213 11182490 11298777 11332527 11296711 11340083 11339158 11375165 11420613 11454060 11488913
6459A1488913q1092o5072J36945J16252m6004k904L4078p4895p6489j42987n5648
$$ 11488913 11407821 11342749 11479694 11595946 11549942 11547038 11581116 11506221 11429732 11286745 11231097
6448A1231097j29129M4680l4652Q2698k70888j98482N0944o0975j02912j14531
$$ 11231097 11101968 11146648 11111996 11194694 10923806 10725324 10776268 10715293 10612381 10497850
6438A0497850j51281k64963m84q9020m9791k26408j75360q8146j61174l8429j01675
$$ 10497850 10346569 10081606 10081122 9992102 9942311 9715903 9540543 9452397 9291223 9252794 9151119
6427I151119j33449k59037j41735o0950q1008j37251j88828j4272M3081j80063
$$ 9151119 9017670 8758633 8616898 8555948 8474940 8337689 8148861 8134589 8177670 7997607
6417G997607l9673k14616R1085n9033J204P8593O353J11033R3963J74174J178
$$ 7997607 7957934 7743318 7834403 7775370 7776574 7855167 7861520 7972553 8066516 8240690 8241868
6406H241868j3048J25553J13326Q1808K7236J28533Q5043Q151n7535L9957J58311
$$ 8241868 8228820 8354373 8467699 8549507 8576743 8705276 8790319 8798470 8740935 8780892 8939203
6395H939203J30808N4069R9223K4844R5577P4163j16370R5176J54456p731k58767
$$ 8939203 9070011 9124080 9223303 9248147 9343724 9417887 9301517 9396693 9551149 9543418 9284651
6384I284651j97386N350r1596r0160j16956j10484j27805j27342n2594j84885
$$ 9284651 9087265 9092615 9001019 8910859 8793903 8683419 8555614 8428272 8375678 8190793
6374H190793n738j66374k00814j40838k00092k87396j11928j58254j90168n7104
$$ 8190793 8185055 8018681 7817867 7677029 7476937 7189541 7077613 6919359 6729191 6672087
6364F672087k41498k52105k10202p8162j28607j27441k58490j41153l3633k20540
$$ 6672087 6430589 6178484 5968282 5890120 5761513 5634072 5375582 5234429 5200796 4980256
6354D980256r3466o4874j15519o4632r8345l03745o557j02177j82299k3121l6815
$$ 4980256 4886790 4821916 4706397 4641765 4543420 4239675 4233118 4130941 3948642 3925521 3888706
6343C888706q2031j9735o6725j77732N0725o2359q3385m499q0966l6927j74515
$$ 3888706 3806675 3786940 3720215 3542483 3593208 3530849 3447464 3442965 3361999 3325072 3150557
6332C150557j5312p588M1627o7802k7333l1717l7435k0669l7700k1777K4639N2070
$$ 3150557 3135245 3127657 3169284 3101482 3074149 3042432 3004997 2984328 2946628 2924851 2949490 3001560
6320C001560j12007m8682k2799J2086M5365j08804m1528L3056j6778O030N7117
$$ 3001560 2889553 2840871 2818072 2830158 2875523 2766719 2725191 2758247 2741469 2747499 2804616
6309B804616J9993J1265j47976Q6926m1781l9553m6785K4774J30198j6571n699
$$ 2804616 2824609 2835874 2687898 2774824 2733043 2693490 2646705 2671479 2801677 2785106 2779407
6298B779407j16502q7189o0424P1421J6943o9755r8594K3734q605M2493Q8802
$$ 2779407 2662905 2575716 2515292 2586713 2603656 2533901 2435307 2459041 2450436 2492929 2581731
6287B581731J25844j82769r023o1121j45946j6532R6777R6609n4545K888O4939
$$ 2581731 2707575 2524806 2515783 2454662 2308716 2292184 2388961 2485570 2431025 2433913 2498852
6276B498852q2492o815J20821k21586j01429j0011R150P330O6455m0001j4128
$$ 2498852 2416360 2409545 2530366 2308780 2207351 2197340 2206490 2213820 2280275 2240274 2226146
6265B226146p7793J26102Q5805m600r5155j06230M8769Q0733L6723L3981L9598
$$ 2226146 2148353 2274455 2360260 2355660 2260505 2154275 2203044 2283777 2320500 2354481 2394079
6254B394079m3885k6445M0317j30107o1735J59274J1441Q32m30L5081k9388j7861
$$ 2394079 2350194 2323749 2364066 2233959 2172224 2331498 2342939 2343771 2343341 2378422 2349034 2331173
6242B331173L8497O8407J4991Q2940k0266k1642O4646R0417R390J42625J54463
$$ 2331173 2369670 2438077 2453068 2536008 2515742 2494100 2558746 2649163 2658553 2801178 2955641
6231B955641j56635k6412J13357R6758k2397K6872R9274j17406J24355M9853J20573
$$ 2955641 2799006 2772594 2885951 2982709 2960312 2987184 3086458 2969052 3093407 3143260 3263833
6220C263833M6912J68426j09272J86776J34917K7785K28385J43909J15126j20568
$$ 3263833 3310745 3479171 3369899 3556675 3691592 3719377 3947762 4091671 4206797 4086229
6210D086229J07994N1403K61804P1287J7934K06635J33388K2387J47051J06531
$$ 4086229 4194223 4245626 4507430 4578717 4596651 4803286 4936674 4959061 5106112 5212643
6200E212643N5076m3019J57248J65387m2211K06526R0417K71668J85787j39591
$$ 5212643 5267719 5224700 5381948 5547335 5505124 5711650 5802067 6073735 6259522 6119931
6190F119931Q1541J95635P1516P0456m046L0373J20318J8442O0702M433J17119
$$ 6119931 6201472 6397107 6468623 6539079 6535033 6565406 6685724 6704166 6764868 6769301 6886420
6179F886420P5568l1805L7731N8632J2182L6929M7195L042j30048P1633o0480
$$ 6886420 6961988 6930183 6967914 7026546 7038728 7075657 7122852 7125894 6995846 7067479 7006999
6168G006999r043P0129j00641n1970q2420o2737j7499P8764p2469o2872Q7016
$$ 7006999 6997956 7068085 6967444 6915474 6833054 6770317 6752818 6831582 6759113 6696241 6783257
6157F783257L1487j33676m1539J1774p7122j9280p3297P1072J29295j48019k0696
$$ 6783257 6814744 6681068 6639529 6651303 6574181 6554901 6481604 6552676 6681971 6533952 6513256
6146F513256K4340L092M563P981k09190m4603j10879P4337N3516j27434N574o4017
$$ 6513256 6537596 6540688 6545251 6553232 6344042 6299439 6188560 6262897 6316413 6188979 6194553 6130536
6134F130536M1461j05613j7238K4316j37245M5520J09557o3509l8671J28225j6389
$$ 6130536 6171997 6066384 6049146 6073462 5936217 5981737 6091294 6027785 5989114 6117339 6100950
6123F100950J5266P0835j92167N976l1259j58850r9536p8848J04327P6928j1874
$$ 6100950 6116216 6187051 5994884 6000860 5969601 5810751 5711215 5632367 5736694 5813622 5801748
6112E801748p3221q9956l8888m1694J03174N5945o2107p653o6051k8688J16041
$$ 5801748 5728527 5638571 5599683 5557989 5661163 5717108 5655001 5647348 5581297 5552609 5668650
6101E668650j85472j46427J47684j4535p9987K6743r9741k3586o2590j90686L9753
$$ 5668650 5483178 5336751 5484435 5469900 5389913 5416656 5316915 5293329 5230739 5040053 5079806
6090E079806M9133o155n8396K4160p6182o6215n7763l5999m6368j34814r4637
$$ 5079806 5128939 5122784 5064388 5088548 5012366 4946151 4888388 4852389 4806021 4671207 4576570
6079D576570j39496j82592j0847m1557j27754Q1988k0263R2856l3668j43544K626
$$ 4576570 4437074 4254482 4243635 4202078 4074324 4156312 4136049 4228905 4195237 4051693 4054319
6068D054319j76192m5225k7463l4255o4997j97854k1877M1225k5876p1997p0519
$$ 4054319 3878127 3832902 3805439 3771184 3706187 3508333 3486456 3527681 3501805 3429808 3359289
6057C359289m2988n9177J48Q7087R297m5552j00953p3839K2463R7149M3543k7192
$$ 3359289 3316301 3257124 3257272 3344359 3353656 3308104 3207151 3133312 3155775 3252924 3296467 3269275
6045C269275k27878J9592l927J12234K0146m4385j668O9357m9391L2334k4079
$$ 3269275 3041397 3060989 3057062 3169296 3189442 3145057 3143389 3212746 3163355 3195689 3171610
6034C171610m8936n7432k3228J4613L9802K18686L0045m0276j47339l7070j8813
$$ 3171610 3122674 3065242 3042014 3056627 3096429 3315115 3345160 3304884 3157545 3120475 3101662
6023C101662l6426N9553q0321r9477M9433K2596m5576M5406n6251o2207m297P210
$$ 3101662 3065236 3124789 3044468 2944991 2994424 3017020 2971444 3016850 2960599 2898392 2894095 2901305
6011B901305p102L9027N703m6871j7771j04440j5286l8860Q2304j04659L236M9532
$$ 2901305 2894203 2933230 2938933 2892062 2874291 2769851 2754565 2715705 2798009 2693350 2696586 2746118
5999B746118n7836P439m9892Q6117M9586j6471J3257k28335M4371O4075n9288
$$ 2746118 2688282 2695721 2645829 2731946 2781532 2765061 2778318 2549983 2594354 2658429 2599141
5988B599141n0459K804L5198m0349J12156k413J07608K6653q8744j33401K2000
$$ 2599141 2548682 2551486 2586684 2546335 2658491 2656078 2763686 2790339 2701595 2568194 2590194
5977B590194P1388j45804M2594J13023M6113k5609n5013L6895o5045j9626J31475
$$ 2590194 2661582 2515778 2558372 2671395 2717508 2691899 2636886 2673781 2608736 2589110 2720585
5966B720585q0502N2970j5523L173L4562m8548q0696m3468J24335l4723n7410
$$ 2720585 2640083 2693053 2677530 2680703 2715265 2666717 2586021 2542553 2666888 2632165 2574755
5955B574755K5879q6905M3990O511o8656n9886J26324n6369m6117J52547J49568
$$ 2574755 2600634 2513729 2557719 2564230 2495574 2435688 2562012 2505643 2459526 2612073 2761641
5944B761641p3477j94684q6395O3371j4k2131J04525m2984q3112j4496J102l7380
$$ 2761641 2688164 2493480 2407085 2470456 2470442 2448311 2552836 2509852 2426740 2412244 2413346 2375966
5932B375966N957R2054M9930p357l2313J2160k5257J02012j74370j401J3353M924
$$ 2375966 2381923 2473977 2523907 2516550 2484237 2496397 2471140 2573152 2398782 2397381 2410734 2415658
5920B415658R9996l1494J28284r949M0258M846N3344L3841n3159K0664k2143P0916
$$ 2415658 2515654 2484160 2612444 2602495 2642753 2647599 2700943 2734784 2681625 2702289 2680146 2751062
5908B751062k3711q2595n0718k4098Q5683o9194j24116J54623J14158k4789J41852
$$ 2751062 2727351 2644756 2594038 2569940 2655623 2586429 2462313 2616936 2731094 2706305 2848157
5897B848157p1733o9811J08456n3848K4274j54958j5335Q0976K8185L3796j0540
$$ 2848157 2776424 2706613 2815069 2761221 2785495 2630537 2615202 2696178 2724363 2758159 2747619
5886B747619Q1987m6435n753l6251K2230n6157O4474J19662k6905l5330J96555
$$ 2747619 2829606 2783171 2777418 2741167 2763397 2707240 2771714 2891376 2864471 2829141 3025696
5875C025696j2286n4128q4919M6705L9152N1061K0238M6226j19976r1084K12912
$$ 3025696 3013410 2959282 2874363 2921068 2960220 3011281 3031519 3077745 2957769 2866685 3079597
5864C079597Q595j01788K321J42125R7371j17935j20275L0418K9394O8010P7642
$$ 3079597 3088192 2986404 2988725 3130850 3228221 3110286 2990011 3020429 3049823 3117833 3195475
5853C195475M1774Q2677q7146p8527J71621L2583o5426k2029N369J56496k3898
$$ 3195475 3237249 3319926 3232780 3154253 3325874 3358457 3293031 3271002 3276371 3432867 3408969
5842C408969j7365Q2035L2841R3j8058k6616O8957r6519P044R4374J69006N9737
$$ 3408969 3391604 3473639 3506480 3506573 3488515 3461899 3530856 3434337 3441381 3535755 3704761 3764498
5830C764498n4476K9198R8399n3892j9538N011M6280n167J8639K6689O5759O4107
$$ 3764498 3710022 3739220 3837619 3783727 3764189 3769200 3815480 3810313 3828952 3855641 3921400 3985507
5818C985507j14842O4008K8608K7400K9852m7711J4467J47801k7633N921K95522
$$ 3985507 3870665 3934673 3963281 3990681 4020533 3972822 3987289 4135090 4107457 4113378 4408900
5807D408900j01500l5726k7454j2307O8489L4531m4195k76Q4811l6308L7942J07917
$$ 4408900 4307400 4271674 4244220 4231913 4300402 4334933 4290738 4290462 4375273 4338965 4376907 4484824
5795D484824K24486j7684O2882J10118K4887L6865J5825j00627M7825Q0729J53444
$$ 4484824 4709310 4691626 4754508 4864626 4889513 4926378 4942203 4841576 4889401 4970130 5123574
5784E123574l7127Q6065K4563l4288R784K34929Q4616Q1449M1502q516J10142
$$ 5123574 5086447 5172512 5197075 5162787 5172571 5407500 5492116 5573565 5615067 5606551 5716693
5773E716693P224O8842M1219p5226K11521K098J58186O2452K41K00342P3611j06074
$$ 5716693 5723917 5792759 5833978 5758752 5970273 5972371 6130557 6193009 6193250 6393592 6467203 6361129
5761F361129J55971J54290M6327J39885l4847J13938K27470J27531L6128J3107
$$ 6361129 6517100 6671390 6717717 6857602 6822755 6936693 7164163 7291694 7327822 7340929
5751G340929Q7378O0212k1181J81983K02873J37002J17022J37014r456j4910J5817
$$ 7340929 7428307 7488519 7467338 7649321 7852194 7989196 8106218 8243232 8233776 8218866 8234683
5740H234683P7932J75331K02312M0635M1010K9271O4062N6738J10067J43789O0569
$$ 8234683 8312615 8487946 8690258 8730893 8771903 8801174 8865236 8921974 9032041 9175830 9236399
5729I236399K22476m237j8104J61522J04617n0950O0950J36027K34140P8682k2001
$$ 9236399 9458875 9454638 9436534 9598056 9702673 9651723 9712673 9848700 10082840 10161522 10139521
5718A0139521J09479j8721M0070K44294N5100J05606J79246j13629K45419J49368
$$ 10139521 10249000 10230279 10270349 10514643 10569743 10675349 10854595 10740966 10986385 11135753
5708A1135753N5523K0236J70909J64225J07181J25207J31778R7156J6746J95375
$$ 11135753 11191276 11211512 11382421 11546646 11653827 11779034 11910812 12007968 12024714 12220089
5698A2220089J01134j2904J28940K30568K12479o0298j925M7754Q8458J51910
$$ 12220089 12321223 12308319 12437259 12667827 12880306 12820008 12818083 12865837 12954295 13106205
5688A3106205J61358K05383L7590q7630l8502J89260J20990l8574J55967J69723
$$ 13106205 13267563 13472946 13510536 13422906 13384404 13573664 13694654 13656080 13812047 13981770
5678A3981770J03436J15089m6133p3115J57068K6086J17587j20007j6006K952
$$ 13981770 14085206 14200295 14154162 14081047 14238115 14264201 14381788 14261781 14245775 14248727
5668A4248727M1569J50913Q2129N2869R8582N047K1960N241J11382M8916O6042
$$ 14248727 14290296 14441209 14523338 14576207 14674789 14679836 14701796 14707037 14818419 14867335 14933377
5657A4933377M1035K7425n7278R70J86725N3947R1266l0814J85651r473n4981
$$ 14933377 14974412 15001837 14944559 14945529 15132254 15186201 15277467 15246653 15432304 15422831 15367850
5646A5367850J37314J11707N0684J97822J06184k1238J14227R1343N0447J41352
$$ 15367850 15505164 15616871 15667555 15865377 15971561 15950323 16064550 16155893 16206340 16347692
5636A6347692M5599n890J43662K41371m7213J65649q7026J12678J83328L78858
$$ 16347692 16393291 16387401 16531063 16772434 16725221 16890870 16803844 16916522 17099850 17478708
5626A7478708J32070J13956J21458L18250J87044o5327M8832K29397K03154P4045
$$ 17478708 17610778 17724734 17846192 18164442 18351486 18286159 18334991 18564388 18767542 18841587
5616A8841587L24336Q5541J02872K01901K44831L8549J90644J73361L00057L31824
$$ 18841587 19165923 19251464 19354336 19556237 19801068 19839617 20030261 20203622 20503679 20835503
5606B0835503J7255J61258K80073K44831K39860J72104J03854J39035M78890L87308
$$ 20835503 20852758 21014016 21294089 21538920 21778780 21950884 22054738 22193773 22672663 23059971
5596B3059971K08518K66092L72010K93731L72312K24395M09632L00199K47798
$$ 23059971 23268489 23534581 23906591 24200322 24572634 24797029 25206661 25506860 25754658
5587B5754658M48050M38805L57030M33910N10782M62011M73276L67954M06487
$$ 25754658 26202708 26641513 26998543 27432453 27943235 28405246 28878522 29246476 29652963
5578B9652963M84476N11957O49648M92483N97134N96189N92343O14977N57782
$$ 29652963 30137439 30649396 31299044 31791527 32388661 32984850 33577193 34192170 34749952
5569C4749952O17744P39167P28317O98274P35682P37115O69860Q73696Q39885
$$ 34749952 35367696 36106863 36835180 37533454 38269136 39006251 39676111 40549807 41389692
5560D1389692Q56686J011505J000620R51889J038030R58308R19331J180940J315031
$$ 41389692 42246378 43257883 44258503 45210392 46248422 47206730 48126061 49307001 50622032
5551E0622032J418010J189276J199226J249347J540168J525184J523525J618076
$$ 50622032 52040042 53229318 54428544 55677891 57218059 58743243 60266768 61884844
5543F1884844J626532J644415J796867J710223K069442K001141K113648K098733
$$ 61884844 63511376 65155791 66952658 68662881 70732323 72733464 74847112 76945845
5535G6945845K385759K364126K533819K750125K758410K815655L016905L161791
$$ 76945845 79331604 81695730 84229549 86979674 89738084 92553739 95570644 98732435
5527I8732435L235918L543666L531065M002932L997504M078997M237249M647645
$$ 98732435 101968353 105512019 109043084 113046016 117043520 121122517 125359766 130007411
5519A30007411M846920M910613N155061N435986N770606N967136O058820O253331
$$ 130007411 134854331 139764944 144920005 150355991 156126597 162093733 168152553 174405884
5511A74405884O438823O716810O977935P207898P394406P403878P618389P754401
$$ 174405884 180844707 187561517 194539452 201747350 209141756 216545634 224164023 231918424
5503B31918424P736885P702638P845062P772282P375810P315259P038719O906420
$$ 231918424 239655309 247357947 255203009 262975291 270351101 277666360 284705079 291611499
5495B91611499O635688O076065N454218M910951M243811L592486K944703K107876
$$ 291611499 298247187 304323252 309777470 314688421 318932232 322524718 325469421 327577297
5487C27577297J501242O37611j71639q49098j738373k422672l189736l967618
$$ 327577297 329078539 329716150 329544511 328695413 326957040 324534368 321344632 317377014
5479C17377014m558140n182522n718447o152899o647262p011718p247769p539873
$$ 317377014 312818874 307636352 301917905 295765006 289117744 282106026 274858257 267318384
5471B67318384p809373p800115p762410p761019p868746p784074p633362p703840
$$ 267318384 259509011 251708896 243946486 236185467 228316721 220532647 212899285 205195445
5463B05195445p334639p206797p173435o886326o586074o455260o345296n972188
$$ 205195445 197860806 190654009 183480574 176594248 170008174 163552914 157207618 151235430
5455A51235430n730480n439837n242663n117802m930439m623107m308476m009466
$$ 151235430 145504950 140065113 134822450 129704648 124774209 120151102 115842626 111833160
5447A11833160l994041l949530l672172l387148l251974l245258l124982k799636
$$ 111833160 107839119 103889589 100217417 96830269 93578295 90333037 87208055 84408419
5439H4408419k644076k708182k471786k499745k329747k137923k115589k068184
$$ 84408419 81764343 79056161 76584375 74084630 71754883 69616960 67501371 65433187
5431F5433187j874572j859551j596913j831034j732638j353529j512807j422596
$$ 65433187 63558615 61699064 60102151 58271117 56538479 55184950 53672143 52249547
5423E2249547j243929j049988j000537j092747j142154j015579r43136q03224
$$ 52249547 51005618 49955630 48955093 47862346 46720192 45704613 44761477 43958253
5415D3958253r26535q73204q40639q43779o39513p76092r11456n87864p33400
$$ 43958253 43031718 42158514 41317875 40474096 39834583 39058491 38147035 37559171 36825771
5406C6825771p60057p97453r01911o09180o15341o81226n41184n75230o61791
$$ 36825771 36065714 35268261 34366350 33757170 33141829 32460603 31919419 31344189 30682398
5397C0682398n19944n63601n31854n08907n77917n23227m63968m89881l71705
$$ 30682398 30162454 29598853 29066999 28558092 27980175 27456948 26992980 26503099 26131394
5388B6131394l54505k20045m84474l38890k77473l79543k92000j86956l48645
$$ 26131394 25776889 25556844 25072370 24733480 24456007 24076464 23784464 23597508 23248863
5379B3248863l60839k09274l74271l69030k90666k43387k04043k34324k76632
$$ 23248863 22888024 22678750 22304479 21935449 21644783 21401396 21197353 20963029 20686397
5370B0686397k32647l20679l11030l97075k21028k10663j64794k29753k52913
$$ 20686397 20453750 20133071 19822041 19424966 19203938 18993275 18828481 18598728 18345815
5361A8345815k55746k26081j32177k08809j17879j67570l41696j98214k25016
$$ 18345815 18090069 17863988 17731811 17523002 17405123 17237553 16895857 16697643 16472627
5352A6472627q2945j99856j91751R901j02675j64358q4880k37842r0183j20485
$$ 16472627 16389682 16189826 15998075 16007976 15905301 15740943 15656063 15418221 15328038 15207553
5342A5207553j90868q1986L0183j15577j55315j79747k9107K0338j06986q4659
$$ 15207553 15016685 14934699 14964882 14849305 14693990 14514243 14485136 14505474 14398488 14313829
5332A4313829o7535p9808j35098K9449m2203j36209j26566K1704j11749N2682
$$ 14313829 14246294 14166486 14031388 14060837 14018634 13882425 13755859 13777563 13665814 13718496
5322A3718496o6873k19386N7351J09153k5773p4324r2308l6462r1025N5796J55261
$$ 13718496 13651623 13432237 13489588 13598741 13572968 13498644 13406336 13369874 13278849 13334645 13489906
5311A3489906M16l478m8169j1227k7549K6716q6399o089Q3853M8842M843n2569
$$ 13489906 13490322 13486844 13438675 13427448 13399899 13426615 13340216 13334127 13417980 13466822 13471665 13419096
5299A3419096N769m8637j1374n160l4094M2940k7337j86331O2310J30676L1510
$$ 13419096 13424865 13376228 13364854 13359694 13325600 13368540 13341203 13154872 13217182 13347858 13379368
5288A3379368k14073J20170J81675k1438n4863l0215J0863M7808j1804k4687m524
$$ 13379368 13165295 13285465 13467140 13445702 13390839 13360624 13371487 13419295 13407491 13382804 13378280
5277A3378280K26977J1738m0318J37513l5164J98000J0252M6611N7142o3005J39891
$$ 13378280 13605257 13616995 13576677 13714190 13679026 13877026 13887278 13933889 13991031 13928026 14067917
5266A4067917O3983M9982J76668J43285J2811K7079K18599J18636M5123K18189
$$ 14067917 14131900 14181882 14358550 14501835 14514646 14541725 14760324 14878960 14924083 15142272
5256A5142272K2691O7M5078N7091K18482M3913R3874J57074R7719J22957P6186
$$ 15142272 15164963 15165030 15210108 15267199 15485681 15529594 15623468 15780542 15878261 16001218 16077404
5245A6077404J06374k0255R0941J35133J5843K00386N5549J07282J47648n0141
$$ 16077404 16183778 16163523 16254464 16389597 16405440 16605826 16661375 16768657 16916305 16866164
5235A6866164l8995J63466K17864J00033r8267J421J27262L3486J808J994J33071
$$ 16866164 16827169 16990635 17208499 17308532 17210265 17211686 17338948 17372434 17374242 17376236 17509307
5224A7509307p4563k4693R1458j17063m3107j00957p7431K5973j64275p9129L8295
$$ 17509307 17434744 17410051 17501509 17384446 17341339 17240382 17162951 17188924 17024649 16945520 16983815
5213A6983815R6669O8889O0750j83347o8206J76662j02603J5446q735q9129m8047
$$ 16983815 17080484 17149373 17210123 17026776 16958570 17135232 17032629 17048075 17039340 16950211 16902164
5202A6902164J97872J37510K55643K68930K31815L28769O00770R20954R95743
$$ 16902164 17100036 17237546 17493189 17762119 17993934 18322703 18923473 19844427 20840170
5193B0840170R82121J415548J712315J870066K353007K534353K821891L113652
$$ 20840170 21822291 23237839 24950154 26820220 29173227 31707580 34529471 37643123
5185C7643123L359310L149210K642979K179322J888205J809417J433501J201958
$$ 37643123 41002433 44151643 46794622 48973944 50862149 52671566 54105067 55307025
5177E5307025J087350L95779k76645q89790j311685j728324k078204k326258k640945
$$ 55307025 56394375 56790154 56513509 55623719 54312034 52583710 50505506 48179248 45538303
5168D5538303l120962l174919l016674k899274k751754k396292k219972j943987
$$ 45538303 42417341 39242422 36225748 33326474 30574720 28178428 25958456 24014469
5160B4014469j639751j374749j072958j134014q26871p14981o98416p28591n11332
$$ 24014469 22374718 20999969 19927011 18792997 17966126 17251145 16552729 15824138 15312806
5151A5312806n67723m99181m23851l76606l03115k42658j62490j51342l1407k12528
$$ 15312806 14745083 14245902 13822051 13445445 13142330 12899672 12737182 12585840 12554433 12341905
5141A2341905j77044j37557j48569j02969L0082r3637j9717j40791m0068M6431
$$ 12341905 12164861 12027304 11878735 11775766 11805848 11712211 11692494 11551703 11511635 11558066
5131A1558066q8146q456l3087j31372M6014J24288m3725J1635l7838R0789J7340
$$ 11558066 11469920 11461464 11428377 11297005 11343019 11467307 11423582 11435217 11397379 11488168 11505508
5120A1505508j1224O6454q5048k0365J23011r5257m998J79063J59653P5493k2672
$$ 11505508 11494284 11560738 11475690 11455325 11578336 11483079 11478081 11657144 11816797 11892290 11869618
5109A1869618M704N7952L1727l0703K9590n3647L3128J44478K927j42836O9772
$$ 11869618 11874322 11932274 11964001 11933298 11962888 11909241 11942369 12086847 12089774 11946938 12016710
5098A2016710J35575O2329J40076n0800j09606P0069K4115l2437K3599o7589J25164
$$ 12016710 12152285 12214614 12354690 12303890 12194284 12264353 12288468 12256031 12279630 12212041 12337205
5087A2337205M4761K1798r015o2132N3913n7866m4363m1985o6095J4376J14799
$$ 12337205 12381966 12403764 12394749 12332617 12386530 12328664 12284301 12242316 12176221 12190597 12305396
5076A2305396J8151k67438k9787M5226r9585N3103o4370j03562P4946L3146M8554
$$ 12305396 12323547 12056109 12026322 12071548 11971963 12025066 11960696 11857134 11932080 11965226 12013780
5065A2013780K8773R503n3883J24205p9174j8700O3096k5628n2078L5054N7777
$$ 12013780 12042553 12052056 11998173 12122378 12043204 12024504 12087600 12061972 12009894 12044948 12102725
5054A2102725P6068M6520J38251K827q0604J8683M922Q5975j2327o225Q8809J16446
$$ 12102725 12178793 12225313 12363564 12366391 12285787 12304470 12309392 12395367 12383040 12376815 12465624 12582070
5042A2582070r5145J23259P2381K17261N2946N6623J02388J75044N1281j6522
$$ 12582070 12486925 12610184 12682565 12899826 12952772 13009395 13111783 13286827 13338108 13321586
5032A3321586O2324J66220J22519K05256N9919l3045K01647J99199J63574J18204
$$ 13321586 13383910 13550130 13672649 13877905 13937824 13904779 14106426 14305625 14469199 14587403
5022A4587403K29439J14250J74022K34554J93620L74509J31071J33377M55419
$$ 14587403 14816842 14931092 15105114 15339668 15533288 15907797 16038868 16172245 16627664
5013A6627664M57273K45768M64413L62394M25452O18844N86844N52927O35834
$$ 16627664 17084937 17330705 17795118 18157512 18582964 19201808 19788652 20341579 20977413
5004B0977413O75643O59232Q07063P21200Q69782Q33828Q95018P96310J018791
$$ 20977413 21653056 22312288 23119351 23840551 24710333 25544161 26439179 27235489 28254280
4995B8254280R35529Q76268Q81783Q58708Q13979Q35742Q59848P29157O36761
$$ 28254280 29189809 30066077 30947860 31806568 32620547 33456289 34316137 35045294 35682055
4986C5682055N32651O25790N28372L74272K70927L34697J59820J94039m3772j97956
$$ 35682055 36214706 36840496 37368868 37743140 38014067 38348764 38508584 38702623 38658851 38460895
4976C8460895j41307k44859k54812l17676l24346o78819o24345o35769o84202
$$ 38460895 38319588 38074729 37819917 37502241 37177895 36499076 35874731 35238962 34554760
4967C4554760p04007p11036q48978r72836q26898q10399q74574r04359q89952
$$ 34554760 33850753 33139717 32290739 31317903 30491005 29680606 28806032 27901673 27011721
4958B7011721q75740q12729r82597p60033p44210q62394o92496p46921o41476
$$ 27011721 26135981 25323252 24340655 23580622 22836412 21974018 21281522 20534601 19893125
4949A9893125n61256o11228o23991n93507m69206n07755m03892k88892k07540
$$ 19893125 19331869 18720641 18096650 17503143 17033937 16526182 16122290 15833398 15625858
4940A5625858k05996j43239r4166k41297j08495j65081j96768j16977k98696j2589
$$ 15625858 15419862 15276623 15182457 14941160 14832665 14667584 14470816 14353839 14055143 14042554
4930A4042554k45943k30620q7580k29858r6960k54283j66027k85040l58084l96758
$$ 14042554 13796611 13565991 13478411 13248553 13151593 12897310 12731283 12446243 12088159 11691401
4920A1691401j17057j99496l59268l20477k48318l762j61405j74528k07066k13978
$$ 11691401 11574344 11374848 11015580 10695103 10446785 10443023 10281618 10107090 9900024 9686046
4910I686046k10974j70677j66137n4254j78027j41522q7163j35384j00046j30805
$$ 9686046 9475072 9304395 9138258 9084004 8905977 8764455 8677292 8541908 8441862 8311057
4900H311057j63417m7546J4061k03355j03604j30390j36126p7009j05750p2031
$$ 8311057 8147640 8100094 8114155 7910800 7807196 7676806 7540680 7463671 7357921 7285890
4890G285890j56750r5256j08562j49725o2492r5607Q6564j35801k00581j38847
$$ 7285890 7129140 7033884 6925322 6775597 6713105 6617498 6704062 6568261 6367680 6228833
4880F228833l7700k2430j07154k4980j16729n5410K7328k08856j6408n4124k6719
$$ 6228833 6191133 6168703 6061549 6036569 5919840 5864430 5891758 5682902 5666494 5612370 5585651
4869E585651j04280j41299j3822o6993j4676J00732j3601q4414r1614o2655m0707
$$ 5585651 5481371 5340072 5326250 5259257 5244581 5345313 5331712 5247298 5155684 5093029 5052322
4858E052322r4570p2557o0147N0313r6937j11146m7200O0707j52663p0866p6509
$$ 5052322 4957752 4885195 4825048 4875361 4778424 4667278 4620078 4680785 4528122 4457256 4380747
4847D380747k02140Q8972j0110m1129K6444p573p7637p5006P1033P8950k47554
$$ 4380747 4178607 4267579 4257469 4216340 4242784 4235211 4157574 4082568 4153601 4232551 3984997
4836C984997k8912l7744p2181q5146l0584J01205R5220Q8680j65918j21225k7248
$$ 3984997 3956085 3918341 3846160 3761014 3730430 3831635 3926855 4015535 3849617 3728392 3701144
4825C701144k7351J7175p856q346q0315m0009N5309q4843l6763J9048J24357M5327
$$ 3701144 3673793 3690968 3683112 3674766 3594451 3554442 3609751 3524908 3488145 3507193 3631550 3676877
4813C676877R8598o0362l5663j26401l6130J18687j03652J43556m6371N321J49628
$$ 3676877 3775475 3715113 3679450 3553049 3516919 3635606 3531954 3675510 3629139 3634460 3784088
4802C784088J8386q107Q2832J36328L2791J52584k3575K29497J48197R4252J54264
$$ 3784088 3802474 3794367 3877199 4013527 4046318 4198902 4175327 4404824 4553021 4647273 4801537
4791D801537J37424J62782J71977J64408J64742n8495J93418O3819m7614L1281
$$ 4801537 4938961 5101743 5273720 5438128 5602870 5544375 5737793 5801612 5753998 5785279
4781E785279o807j0451M2395j44591k28343j69941j94325k26213j52061k7423
$$ 5785279 5778472 5768021 5810416 5665825 5437482 5267541 5073216 4847003 4694942 4667519
4771D667519j37257k49024k10107j18128k02291q4891p3070j00380m7244K6792
$$ 4667519 4530262 4281238 4071131 3953003 3750712 3665821 3592751 3492371 3445127 3471919
4761C471919j18739m726l9133j08392J4244K0598l1599p3950K9397l3258l4721
$$ 3471919 3353180 3348454 3309321 3200929 3215173 3235771 3204172 3130222 3159619 3126361 3091640
4750C091640L6810q0299j13988j04609M0873M4717R0734M9626j04853n8123j36356
$$ 3091640 3128450 3048151 2934163 2829554 2870427 2915144 3005878 3055504 2950651 2892528 2756172
4739B756172m0819j941j7806L137J00198n4646K5872p1683j32395k2089j4138
$$ 2756172 2715353 2713412 2695606 2698743 2798941 2744295 2770167 2698484 2566089 2544000 2529862
4728B529862R4721j1680Q5114j53646J59081o2473n9308J8102j10901r7860L2012
$$ 2529862 2624583 2612903 2698017 2544371 2703452 2640979 2581671 2599773 2488872 2391012 2423024
4717B423024J77584J29759l6152p1035j11946k0908R8324R2049j50680j33735
$$ 2423024 2600608 2730367 2694215 2623180 2511234 2490326 2588650 2680699 2530019 2396284
4707B396284M482N8702R3937j25317L5908J18681j10935J35337Q6562J8474p2067
$$ 2396284 2400766 2459468 2553405 2428088 2463996 2582677 2471742 2607079 2693641 2712115 2640048
4696B640048K2704L5880j06210P1322R0256n9809l1303M421k93O3492r1953L2087
$$ 2640048 2662752 2698632 2592422 2663744 2754000 2694191 2662888 2667309 2667016 2730508 2638555 2670642
4684B670642J31069L09641q8721j63844M5786J6460p070J5642P9660J42455m825
$$ 2670642 2801711 3111352 3022631 2858787 2904573 2921033 2913963 2929605 3009265 3151720 3146895
4673C146895J27066R2267o0175j2654J16749J00918J91195J366P132L4226M1506
$$ 3146895 3273961 3366228 3306053 3293399 3410148 3511066 3702261 3703627 3710759 3744985 3786491
4662C786491J90040K8045P4086J39229J2827J0993O3196J66033J66899R0199P4876
$$ 3786491 3976531 4004576 4078662 4217891 4230718 4241711 4304907 4470940 4637839 4728038 4802914
4651D802914J14192J31576J90143K5739K24915K05666n1704K03480K83162J94433
$$ 4802914 4917106 5048682 5238825 5264564 5489479 5695145 5643441 5846921 6130083 6324516
4641F324516J56801L94163L69906M24867M51517O29284P42559P25960O01100Q08205
$$ 6324516 6481317 6875480 7245386 7670253 8121770 8751054 9493613 10219573 10820673 11628878
4631A1628878J064693J103595J167573J299385J170259J118987J150026R92551
$$ 11628878 12693571 13797166 14964739 16264124 17434383 18553370 19703396 20695947
4623B0695947P87216J024429R74761P45490O34787O39788N19180M53259K27667
$$ 20695947 21483163 22507592 23482353 24227843 24862630 25502418 26021598 26474857 26702524
4614B6702524K81754K81305K89768M84067N09516P26714Q57199J146524J375690
$$ 26702524 26984278 27265583 27555351 28039418 28548934 29275648 30132847 31279371 32655061
4605C2655061J473393J772310K054373K207887K248040K499599K563133K531712
$$ 32655061 34128454 35900764 37955137 40163024 42411064 44910663 47473796 50005508
4597E0005508K555995K776074K730853K494255K504313K328570K150195J815046
$$ 50005508 52561503 55337577 58068430 60562685 63066998 65395568 67545763 69360809
4589F9360809J664238J406385J264845R41480O36635L92556Q2938k66881p54359
$$ 69360809 71025047 72431432 73696277 74637757 75274392 75666948 75749886 75483005 74728646
4580G4728646j088827j258218j544409j751934k022770k203353k469795k543316
$$ 74728646 73639819 72381601 70837192 69085258 67062488 64859135 62389340 59846024
4572E9846024k695119k784590k952070k911667k865691k757951k643805k751026
$$ 59846024 57150905 54366315 51414245 48502578 45636887 42878936 40235131 37484105
4564C7484105k754995k529930k330844k357800k137624j997566k014098j681598
$$ 37484105 34729110 32199180 29868336 27510536 25372912 23375346 21361248 19679650
4556A9679650j529763j540936j265697j282371j238816r60233j098206q12088
$$ 19679650 18149887 16608951 15343254 14060883 12822067 11861834 10763628 9951540
4548I951540o38803p20311o33987m10373m76356n94026l73618k92387l02721k32666
$$ 9951540 9312737 8592426 7958439 7548066 7071710 6477684 6104066 5811679 5508958 5276292
4538E276292j83321l66505k09507j87224j61753p1480k28770n7387j23144k05656
$$ 5276292 5092971 4726466 4516959 4329735 4167982 4096502 3867732 3810345 3687201 3481545
4528C481545J7022j15828k39859n0456p2185j6095q3644j49346r9955o152k0495
$$ 3481545 3498567 3382739 3142880 3092424 3020239 3004144 2920500 2771154 2671199 2665047 2644552
4517B644552o6030n9220J6762q7142m1468p70o2404Q808m4136j08033J9909J8348
$$ 2644552 2578522 2519302 2536064 2448922 2407454 2406684 2344280 2353088 2308952 2200919 2220828 2239176
4505B239176l3288m2674P2733J17968k55701j91585j3975K5542l3393O3999N7540
$$ 2239176 2205888 2163214 2235947 2353915 2098214 1906629 1892654 1918196 1884803 1948802 2006342
4494B006342m7972q0318O9343n406j04604N7025Q507p6194O4245o9090j5609P2398
$$ 2006342 1958370 1878052 1947395 1941989 1837385 1894410 1902917 1826723 1890968 1821878 1806269 1878667
4482A878667j62904k4779P3436r7M2015J37959n2078j49091l9232O7293L0967
$$ 1878667 1715763 1690984 1764420 1764323 1806338 1944297 1892219 1743128 1703896 1771189 1802156
4471A802156l5784J58447l9476q3646q4950n5697K5816p5940L3840J82761J02908
$$ 1802156 1766372 1924819 1885343 1801697 1716747 1661050 1686866 1610926 1644766 1827527 1930435
4460A930435j3748j31536q3142J2336j4061J3460o531l5756J31881l6263k5427
$$ 1930435 1916687 1785151 1702009 1714345 1700284 1713744 1707213 1671457 1803338 1767075 1741648
4449A741648L806J63053L774K26o398q6535j17354n250N6541L0625o6387m3560
$$ 1741648 1745454 1908507 1912281 1912507 1906109 1819574 1702220 1696970 1753511 1784136 1717749 1674189
4437A674189N6363l7315o1537m4154p226P8422Q4529j48527k03609O265K0804
$$ 1674189 1730552 1693237 1631700 1587546 1580320 1658742 1743271 1594744 1391135 1397400 1418204
4426A418204k0122m0081J30575J13610m6290j46915q278Q0448J0422K3631p4154
$$ 1418204 1398082 1358001 1488576 1602186 1555896 1408981 1400703 1481151 1491573 1515204 1441050
4415A441050k5065J25740M7538p8985L1768K4200r9920j13092N0975J13851p5740
$$ 1441050 1415985 1541725 1589263 1510278 1542046 1566246 1466326 1353234 1404209 1518060 1442320
4404A442320o4434l1097Q7854J521j36276J07842j1306P240o7649P3245J9444
$$ 1442320 1377886 1346789 1434643 1436164 1299888 1407730 1396424 1403664 1336015 1409260 1428704
4393A428704o4763P9863L9847j6194j9203k9491Q404K3140J53487n837j56735
$$ 1428704 1363941 1443804 1483651 1467457 1448254 1418763 1427167 1450307 1603794 1597957 1441222
4382A441222j4719M9391j174k5965m653M0298J2416k2919k7974o0066n1277M0336
$$ 1441222 1426503 1475894 1474720 1448755 1444102 1484400 1496816 1473897 1445923 1385857 1334580 1374916
4370A374916P0063m1940N1558K5706M9845M1639l7125L259M0794J8658n8940J49986
$$ 1374916 1444979 1403039 1454597 1480303 1530148 1571787 1534662 1537921 1578715 1597373 1538433 1688419
4358A688419q6436K5227m7932n786M5402J02171R8786k9680N019R9365N936m8699
$$ 1688419 1601983 1627210 1579278 1573492 1618894 1721065 1819851 1790171 1795190 1894555 1900491 1851792
4346A851792j25111R774J06980P7202O1305l7419o9107J07989J9901n6033Q6770
$$ 1851792 1726681 1736455 1843435 1920637 1981942 1944523 1875416 1983405 2003306 1947273 2034043
4335B034043O6850J5485L2115N1856J41244p4247j3812Q9129k7375M0463k0925
$$ 2034043 2100893 2116378 2148493 2200349 2341593 2267346 2253534 2342663 2315288 2355751 2334826
4324B334826N2723L4302j0463R6874K2933q1932K2062N9088R9703J03854q5862
$$ 2334826 2387549 2421851 2411388 2508262 2531195 2449263 2471325 2530413 2630116 2733970 2648108
4313B648108k9317P0777J2096J34783n4159l8569j4976K0901M1617J33555J5018
$$ 2648108 2618791 2689568 2701664 2836447 2782288 2743719 2728743 2749644 2791261 2924816 2939834
4302B939834o9551R836J60833O2912l965j2410n516r4613Q6721K41122O3427j8320
$$ 2939834 2870283 2880119 3040952 3103864 3099899 3087489 3081973 2987360 3074081 3315203 3378630 3360310
4290C360310l8948K8173J54006J57199J4653J8586J37159R305M3994J09800L5193
$$ 3360310 3321362 3349535 3503541 3660740 3675393 3693979 3831138 3840443 3884437 3994237 4029430
4279D029430K30178J16742M3604M6401J42096J59351M6474Q0709M9569K07435
$$ 4029430 4259608 4376350 4419954 4466355 4608451 4767802 4814276 4894985 4944554 5151989
4269E151989J46369J19523O0575P4291L6424J11228Q3914J51461J85031k941J74520
$$ 5151989 5298358 5417881 5478456 5552747 5589171 5700399 5784313 5935774 6120805 6117864 6292384
4258F292384J66492J5866P8003J19854J14407J48123J23827K5671K03408K33352
$$ 6292384 6458876 6474742 6552745 6672599 6787006 6935129 7058956 7084627 7288035 7521387
4248G521387J51357K55826L34081J43360P8671L32946L20908L55096L14356M29077
$$ 7521387 7672744 7928570 8262651 8406011 8484682 8817628 9138536 9493632 9807988 10237065
4238A0237065M20736L41299N08994L58354M78503N66511L92426N28465L78337
$$ 10237065 10657801 10999100 11508094 11866448 12344951 12911462 13303888 13832353 14210690
4229A4210690M47320N37354M12401L22122L66172M53464L81120M02595K21220
$$ 14210690 14658010 15195364 15607765 15929887 16296059 16749523 17130643 17533238 17754458
4220A7754458M24887M45615L44486M63755M35762L62124L18568M55907L63319
$$ 17754458 18179345 18624960 18969446 19433201 19868963 20231087 20549655 21005562 21368881
4211B1368881M25940N52697M71699M84252L35779K68886K27477J07299J64471
$$ 21368881 21794821 22347518 22819217 23303469 23639248 23908134 24135611 24242910 24407381
4202B4407381N0413o2975J19287p2597k36080k46337l52102l63248l84578m68262
$$ 24407381 24457794 24394819 24514106 24441509 24205429 23959092 23606990 23243742 22859164 22390902
4192B2390902n93464n66088m89167o44708o77060n05777m79929o67708o13782
$$ 22390902 21797438 21231350 20742183 20097475 19420415 18914638 18434709 17767001 17153219
4183A7153219m80257n05230l53607m39090n58230m81142k67409k62388n08088
$$ 17153219 16672962 16167732 15814125 15375035 14816805 14335663 14068254 13805866 13297778
4174A3297778m72339l13781l46450m16507l45186l32099j95178k21335j71467
$$ 13297778 12825439 12511658 12165208 11748701 11403515 11071416 10876238 10654903 10483436
4165A0483436l16677k06023k12036k58422j56151k89223k42409j68512J0134j40046
$$ 10483436 10166759 9960736 9748700 9490278 9334127 9044904 8802495 8633983 8644117 8504071
4155H504071j86458j16569j54384n0108j02835k17520j15124l0276r3882r4541
$$ 8504071 8317613 8201044 8046660 7996552 7893717 7676197 7561073 7530797 7436915 7342374
4145G342374M158j31638p4276r0937j44692j21526N0154O304J0880K1088r7702
$$ 7342374 7346532 7214894 7140618 7049681 6904989 6783463 6833617 6839921 6850801 6871889 6774187
4134F774187J4100J25919l8259L0131j722q6893L8040J08384O6024L997l6915
$$ 6774187 6788287 6914206 6875947 6906078 6904356 6817463 6855503 6963887 7029911 7033908 6996993
4123F996993R2113N4624K0548J99244R3196J9034J65723J72229J11220K31084
$$ 6996993 7089106 7143730 7164278 7363522 7456718 7475752 7641475 7813704 7924924 8156008
4113H156008L0105J03442K3594J13988K70785J49997K53325J02438K27625J26327
$$ 8156008 8186113 8289555 8313149 8427137 8697922 8847919 9101244 9203682 9431307 9557634
4103I557634J89514K20249K62140K13812K09628K09945L53831K58121K27836L74241
$$ 9557634 9747148 9967397 10229537 10443349 10652977 10862922 11216753 11474874 11702710 12076951
4093A2076951L40584L67376N27172M03210M72931M54747M28238N42766O27452
$$ 12076951 12417535 12784911 13312083 13715293 14188224 14642971 15071209 15613975 16241427
4084A6241427N88091O24116Q33580P03113P82056P78655Q58240R02602Q22486
$$ 16241427 16829518 17453634 18287214 18990327 19772383 20551038 21409278 22311880 23134366
4075B3134366Q75553J079554J194333J136378R98293R76133J044722J067671R96690
$$ 23134366 24009919 25089473 26283806 27420184 28418477 29394610 30439332 31507003 32503693
4066C2503693R57644J118968J074138P66043Q80252R24966P32156O64471O98392
$$ 32503693 33461337 34580305 35654443 36420486 37300738 38225704 38957860 39622331 40320723
4057D0320723O79713N66052N60202N69309M70292M80220K67999K52176J60970
$$ 40320723 41000436 41566488 42126690 42695999 43166291 43646511 43914510 44166686 44327656
4048D4327656k38624k54557k32206m38264m61607o85618p79296j021834j048667
$$ 44327656 44089032 43834475 43602269 43164005 42702398 42016780 41237484 40215650 39166983
4039C9166983j105924j318704j471948j485340j497263j634758j608056j624559
$$ 39166983 38061059 36742355 35270407 33785067 32287804 30653046 29044990 27420431
4031B7420431j418359j351417j380818j257852j236541j091331j077327r39731
$$ 27420431 26002072 24650655 23269837 22011985 20775444 19684113 18606786 17667055
4023A7667055q48239p32110p11538p70783o37563o03458n70082o09871n32196
$$ 17667055 16818816 16086706 15375168 14604385 13966822 13363364 12793282 12183411 11651215
4014A1651215m24171m83223n16388m76939k89649k60684l50861l65926k60665
$$ 11651215 11227044 10743821 10227433 9750494 9460845 9200161 8849300 8483374 8222709
4005H222709k73044k70852k67398j80437k17386k57042j45975j3536l56403m6194
$$ 8222709 7949665 7678813 7411415 7230978 7013592 6756550 6610575 6597039 6240636 6194442
3995F194442j34132k59443r3488j33545k863L5915j23488k66018n0574M7771j14106
$$ 6194442 6060310 5800867 5707379 5573834 5570971 5606886 5483398 5217380 5166806 5214577 5100471
3984E100471j81018j56610R977J25796j95096j72651j5069Q0228j2600j02567
$$ 5100471 4919453 4762843 4772820 4898616 4703520 4530869 4515800 4596028 4583428 4480861
3974D480861j80866q5227l0054l7483q8170P833j05895j2996q6463j05419l8885
$$ 4480861 4299995 4214768 4184714 4147231 4059061 4066894 3960999 3948003 3861540 3756121 3717236
3963C717236j26733J7079P767l3023M5616P579j59534j21392l8860Q01o1927j04866
$$ 3717236 3590503 3607582 3615349 3582326 3627942 3635521 3475987 3354595 3315735 3316536 3254609 3149743
3951C149743J05858J4561o0342M4602j2482O859k5113m6894j9038n7526L997R9679
$$ 3149743 3255601 3270162 3209820 3254422 3241940 3248799 3223686 3176792 3157754 3100228 3104225 3203904
3939C203904p590j4506r216l6551n6702j54143o8080M5288R940k6208k547M5761
$$ 3203904 3196314 3181808 3172592 3136041 3079339 2925196 2857116 2902404 2912344 2886136 2883589 2929350
3927B929350k2981j13917N9715r0867j32743K53569l7702r4290j5843r2281P1073
$$ 2929350 2906369 2792452 2852167 2761300 2628557 2882126 2844424 2750134 2734291 2642010 2713083
3916B713083j1241O0680j4427j41324l4246J90317R56r4276k361K6615N5300l3937
$$ 2713083 2701842 2762522 2748095 2606771 2572525 2762842 2763798 2669522 2667161 2693776 2749076 2715139
3904B715139o6402k5932K4986K1140J26956L9774j42718q9656N4960J76579Q7987
$$ 2715139 2648737 2622805 2647791 2668931 2795887 2835661 2692943 2603287 2658247 2834826 2922813
3893B922813p957j07850Q3780J8308L2095N7460N2421p2723J37620j53577J4886
$$ 2922813 2914856 2807006 2890786 2909094 2941189 2998649 3051070 2978347 3115967 2962390 2977276
3882B977276K77056M3854j62200J38382M611J97105J4688J76685J41080q2415
$$ 2977276 3254332 3298186 3135986 3274368 3278979 3476084 3490772 3667457 3808537 3726122
3872C726122N2902M8262J86939L0425J54860K1803l1345O4071R2133R3017J85457
$$ 3726122 3779024 3827286 4014225 4044650 4199510 4221313 4189968 4254039 4346172 4439189 4624646
3861D624646Q0057K74038O2996J63971J78299K4453N9742K09475K29425J74967
$$ 4624646 4704703 4978741 5041737 5205708 5384007 5408460 5468202 5677677 5907102 6082069
3851F082069N8213J04030J47377K30482l872R5766J97246J53663K17950L9859
$$ 6082069 6140282 6244312 6391689 6622171 6618299 6714065 6911311 7064974 7282924 7322783
3841G322783J40166K21049J10302J31905J92247J25425j15359K14887J42023R2879
$$ 7322783 7462949 7683998 7794300 7926205 8118452 8243877 8128518 8343405 8485428 8578307
3831H578307J82198R1250J8969J15189P1203O7607J05313J0241n9611j3769K6226
$$ 8578307 8760505 8851755 8870724 8985913 9057116 9124723 9230036 9240277 9180666 9166897 9193123
3820I193123J35543N4056J46902k3374M0907J13801K00556R5834j8726J84445
$$ 9193123 9328666 9382722 9529624 9506250 9547157 9660958 9861514 9957348 9938622 10123067
3810A0123067J27431J88181J31514R3665L26137K68860K60068J84770L03857M30035
$$ 10123067 10250498 10438679 10570193 10663858 10989995 11258855 11518923 11703693 12007550 12437585
3800A2437585L73981L92050L89345L36698N03854M79194M90285N51997M14801
$$ 12437585 12811566 13203616 13592961 13929659 14433513 14912707 15402992 15954989 16369790
3791A6369790L55470M03063P30488N77408N97177N67884M75031N45147N57395
$$ 16369790 16725260 17128323 17858811 18436219 19033396 19601280 20076311 20621458 21178853
3782B1178853M35464M71955M85666N24298M53322M28020K88236K69613K38097
$$ 21178853 21614317 22086272 22571938 23096236 23549558 23977578 24265814 24535427 24773524
3773B4773524L51119K62865K98315L08644K55301J27308J86977L35993K9392J6458
$$ 24773524 25124643 25387508 25685823 25994467 26249768 26377076 26564053 26900046 26929438 26945896
3763B6945896o0404J19133J5947j85311R59r1862r66P0344n8641k29882j95327
$$ 26945896 26885492 27004625 27020572 26835261 26836220 26744358 26743392 26813736 26755095 26525213 26329886
3752B6329886l4053j60578k35924k15895k79557k24816l67650l80474k77314l61131
$$ 26329886 26295833 26135255 25899331 25683436 25403879 25179063 24811413 24430939 24153625 23792494
3742B3792494l45427m46744n99814m39822l82855l76001m29909o14722n30623
$$ 23792494 23447067 23000323 22400509 21960687 21577832 21201831 20771922 20157200 19626577
3733A9626577m10179m89598o46243m56704n07818n63157l94244n53419n41328
$$ 19626577 19216398 18726800 18080557 17623853 17116035 16552878 16158634 15605215 15063887
3724A5063887m99970k71846l78153n84931m76270l20475m24356l68678k47626
$$ 15063887 14563917 14292071 13913918 13328987 12852717 12532242 12107886 11739208 11491582
3715A1491582k72857k71709l20374j81865k60105j83562j69479m2170p6448k21426
$$ 11491582 11218725 10947016 10626642 10444777 10184672 10001110 9831631 9789461 9713013 9491587
3705I491587j79653k88499k519m6079r5310o6951j7453k05325l6270j52708R7349
$$ 9491587 9311934 9023435 9020916 8974837 8879527 8812576 8795123 8589798 8553528 8400820 8498169
3694H498169r6534j78912p7729j17474o8381j01456o523j51574p4871k88889j67830
$$ 8498169 8401635 8222723 8144994 8027520 7959139 7857683 7851160 7699586 7624715 7335826 7167996
3683G167996j36146j42629j14136q3881l3776j30744l5912k24639k54613q3837
$$ 7167996 7031850 6889221 6775085 6691204 6657428 6526684 6490772 6266133 6011520 5927683
3673E927683j88035j99501j04931j45330k48502j23476j47687j82351j48061O6870
$$ 5927683 5739648 5540147 5435216 5289886 5041384 4917908 4770221 4587870 4439809 4506679
3663D506679j25810j30442l8674k84807k43366Q4892j5173l6973j62267k33830
$$ 4506679 4380869 4250427 4211753 3926946 3683580 3768472 3753299 3716326 3554059 3320229
3653C320229n371j8870j07453r4753k1669n5698l9202J9630m8601k39701m0096
$$ 3320229 3314858 3295988 3188535 3093782 3072113 3016415 2977213 2996843 2948242 2708541 2668445
3642B668445L7171R0868l4275j44818M4928q5176j40546L7046J2161j55552n9856
$$ 2668445 2705616 2796484 2762209 2617391 2662319 2577143 2436597 2473643 2485804 2330252 2270396
3631B270396m2668M0768l9208J3431j27483O9124n2745j1425k9424q3515Q4072
$$ 2270396 2227728 2268496 2229288 2242719 2115236 2184360 2131615 2120190 2090766 2007251 2091323
3620B091323n3169j57980O7090J37033k01557q6975K07038r8742p7933M1475M490
$$ 2091323 2038154 1880174 1947264 2084297 1882740 1795765 2002803 1904061 1826128 1867603 1872093
3609A872093j74237k165J11362N7751j71079l4312J02469J0169j02375n7086K6290
$$ 1872093 1697856 1695691 1807053 1864804 1693725 1659413 1761882 1772051 1669676 1612590 1638880
3598A638880q3428M8543p7574q4301n6925l3685M9944R3010N8090R4750j91059
$$ 1638880 1555452 1603995 1526421 1442120 1385195 1351510 1401454 1494464 1552554 1647304 1456245
3587A456245m7526q6088j8446K9063j7418l6049o7421J36447j4449j04382k0413
$$ 1456245 1408719 1322631 1304185 1333248 1315830 1279781 1212360 1348807 1334358 1229976 1209563
3576A209563K0075R4892j44655M2860j34383N0296O9850Q3272r0530R8335j7531
$$ 1209563 1229638 1324530 1179875 1222735 1088352 1138648 1208498 1291770 1201240 1299575 1282044
3565A282044N7800P1054r8249l8351o1500l1278p0491k0983P7872M2672j71336
$$ 1282044 1339844 1410898 1312649 1274298 1212798 1181520 1111029 1090046 1167918 1210590 1039254
3554A039254J0633r0560k0864J8930Q9711K2800j46436j26445N0892J08955J06428
$$ 1039254 1049887 959327 938463 957393 1047104 1069904 923468 797023 847915 956870 1063298
3543A063298M1384o6301J7054L1712J32017j20878k46608J53541j8084O1975O6178
$$ 1063298 1104682 1038381 1055435 1087147 1219164 1098286 851678 1005219 987135 1049110 1115288
3532A115288j70664j73943K49993J63151j1833J25796o7427j23815K9574j8079
$$ 1115288 944624 770681 1020674 1183825 1171992 1297788 1230361 1106546 1136120 1118041
3522A118041M4417j847j73787j54765Q923P3909M8690n5218n6019J15080K4228
$$ 1118041 1162458 1160611 986824 832059 840982 914891 963581 908363 852344 967424 991652
3511I91652Q8164J34227o0268j7811l6394q869j04650N8631J797n9779J2035J23687
$$ 991652 1079816 1214043 1153775 1135964 1099570 1090701 986051 1044682 1046479 986700 998735 1122422
3499A122422n5688l8901R4721j14328M3464P0628p636m8514N896l3781j5147N3556
$$ 1122422 1066734 1027833 1122554 1008226 1051690 1122318 1114682 1066168 1072064 1038283 1023136 1076692
3487A076692J01402k5487N4897k3421L5500p0724J22202m338q2814l4177L3227
$$ 1076692 1178094 1152607 1207504 1184083 1219583 1148859 1271061 1266723 1183909 1149732 1182959
3476A182959J60499p7896j0843Q8558q0534j37718N5423R224K4908N4338j3607
$$ 1182959 1343458 1265562 1254719 1343277 1262743 1125025 1180448 1189672 1214580 1268918 1255311
3465A255311L1176L3162o9345R7084j19297m6187J9707Q3018k058j34301q220
$$ 1255311 1286487 1319649 1250304 1347388 1228091 1181904 1201611 1284629 1282571 1148270 1140050
3454A140050o311P2313O9938L5900l3157M5558p0477q6221J38574L0038k4004
$$ 1140050 1133739 1206052 1275990 1311890 1278733 1324291 1253814 1167593 1306167 1336205 1312201
3443A312201Q8792n0215m690k8002L01438J0395l2107M7960j10657p7382J13260
$$ 1312201 1400993 1350778 1346088 1318086 1619524 1629919 1597812 1645772 1535115 1457733 1570993
3432A570993P3518Q2966J09484j15533J04608Q0231J20706K7101j25711J6281
$$ 1570993 1644511 1727477 1836961 1721428 1826036 1906267 2026973 2054074 1928363 1944644
3422A944644M078p8593K8292j51126J05563N4662n937n3111O0149j33958q6297
$$ 1944644 1948722 1870129 1898421 1747295 1852858 1907520 1901583 1848472 1908621 1774663 1688366
3411A688366p4600O5907o6412p7954L4005k1954N6794q2088R299n8727r2019n6430
$$ 1688366 1613766 1679673 1613261 1535307 1569312 1547358 1604152 1522064 1531363 1472636 1380617 1324187
3399A324187N2457Q709J42908q4755j80116j45350P1427k5351L2098J02021k3745
$$ 1324187 1376644 1385353 1528261 1443506 1263390 1118040 1189467 1164116 1196214 1298235 1274490
3388A274490l5309o2056J18315N0921q3229Q9296j54371P3653K08764j39457j04870
$$ 1274490 1239181 1177125 1295440 1346361 1263132 1352428 1198057 1271710 1480474 1341017 1236147
3377A236147J31252l0046o7578m1803j2053O673l7192P0685J8865K07012o7289
$$ 1236147 1367399 1337353 1269775 1227972 1215919 1222592 1185400 1256085 1274950 1481962 1414673
3366A414673m9954J1114N7047m5466j35119J11605J42806J47325m9736m3336J07706
$$ 1414673 1364719 1375833 1432880 1387414 1252295 1363900 1506706 1654031 1604295 1560959 1668665
3355A668665J49656R9961J29050J69555J22343K20501J68100O2209J56737K47726
$$ 1668665 1818321 1918282 2047332 2216887 2339230 2559731 2727831 2790040 2946777 3194503
3345C194503J73605K00569J72871J26004N7641R8965J3308j7601J57547N8152
$$ 3194503 3368108 3568677 3741548 3867552 3925193 4024158 4037466 4019865 4177412 4235564
3335D235564j08218J6129k43281k01216o7954k33949l73167j61589k20704l05136
$$ 4235564 4127346 4143475 3900194 3698978 3631024 3397075 3023908 2862319 2641615 2336479
3325B336479j04158j09220k32923r7283K0909j87861L3474r9619j18826o991M1889
$$ 2336479 2232321 2123101 1890178 1792895 1813804 1625943 1659417 1559798 1440972 1433981 1475870
3314A475870j14404j23164N6263J8231p1861P4333j63669P1291J55255M6240J33352
$$ 1475870 1361466 1238302 1294565 1312796 1240935 1315268 1151599 1222890 1378145 1424385 1557737
3303A557737J38736o6561R2834K34501J11873M1943o762R9122J35093J48636p4355
$$ 1557737 1696473 1629912 1722746 1957247 2069120 2111063 2104301 2203423 2338516 2487152 2412797
3292B412797K9143k8244m4150k5849j0526M6840p7483p9995J3668o6660j32503
$$ 2412797 2441940 2413696 2369546 2343697 2333171 2380011 2302528 2222533 2236201 2169541 2037038
3281B037038j54092R64L8623J22937r438q0800M1873J60084r488J86168L10670
$$ 2037038 1882946 1883910 1922533 2045470 2036032 1955232 1997105 2157189 2147701 2333869 2644539
3270B644539J47080K88756K60365J89257J05554P8843J73111P7132Q4061J81818
$$ 2644539 2791619 3080375 3340740 3529997 3635551 3714394 3887505 3964637 4048698 4230516
3260D230516J11847j93060j7953q9658j72165o9497j23875j42499l49023k02037
$$ 4230516 4342363 4149303 4131350 4041692 3869527 3800030 3676155 3533656 3184633 2982596
3250B982596j76465j02219j13965q0477k13021k36475R7848l1210K2820p1951
$$ 2982596 2806131 2703912 2589947 2509470 2296449 2059974 2157822 2126612 2149432 2077481
3240B077481q2252J43670P3448J6077R0223J26871P9401J23314O0163m310r3922
$$ 2077481 1995229 2138899 2212347 2228424 2318647 2445518 2524919 2648233 2708396 2704086 2610164
3229B610164R40N4216J13172k10934k74715j32753j05493k0791j88145k37851
$$ 2610164 2611104 2665320 2778492 2567558 2292843 2160090 2054597 2033806 1845661 1607810
3219A607810j9483k27245j00998L6024j18198n5803j1255p3672l9460k20679r3075
$$ 1607810 1588327 1361082 1260084 1296108 1177910 1122107 1110852 1037180 997720 777041 683966
3208F83966Q5927r5607r579L4260q8037p4006J05023j31550P9637N3840K2947
$$ 683966 769893 674286 664707 698967 610930 536924 641947 510397 590034 643874 666821
3197F66821P6922q4187p0195J063j9053J43666p0563j46675l0557j1404k7936
$$ 666821 743743 659556 589361 590424 571371 715037 644474 497799 467242 455838 427902
3186D27902k2728N9180L0599J24370Q4293L726j35689m2831O0664J17555N2027
$$ 427902 405174 464354 494953 619323 703616 707342 571653 528822 589486 707041 759068
3175G59068Q3126m8436J4593j52075N8227J24330K7705j16799Q061P2291O6746
$$ 759068 842194 793758 808351 656276 714503 838833 866538 749739 757800 830091 896837
3164H96837o867r5853J31508P042O0057L5668j72741L4261O3267k9476J27436
$$ 896837 889970 794117 925625 932667 992724 1028392 855651 889912 953179 923703 1051139
3153A051139J04863j25417o8890o1815N3740l9045M6060R1931j53292Q2042N088
$$ 1051139 1156002 1030585 961695 899880 953620 914575 960635 1052566 899274 981316 986404
3142I86404L7520N2052O7448m1571O5719J6980O930L3308R1530n7579q9811R8579
$$ 986404 1023924 1075976 1143424 1101853 1167572 1184552 1191482 1224790 1316320 1258741 1168930 1267509
3130A267509P4774j02509N9305p7978R7862J2766j941N6553k992N4418l0438j67598
$$ 1267509 1342283 1239774 1299079 1221101 1318963 1331729 1329788 1386341 1383349 1437767 1407329 1239731
3118A239731p0158n5411Q3437N2734O4207L1027j4084k5360j26946k7644O0918
$$ 1239731 1169573 1114162 1197599 1250333 1314540 1345567 1331483 1306123 1179177 1151533 1212451
3107A212451l7649j0602J05691K6846j34830O1569k3486l449N9969k21704P7143
$$ 1212451 1174802 1164200 1269891 1296737 1161907 1223476 1199990 1196541 1256510 1034806 1111949
3096A111949J47320K1058p7065j0404P826P5784l1841N4373j7946l3196j20982
$$ 1111949 1259269 1280327 1203262 1192858 1200684 1276468 1244627 1299000 1281054 1247858 1126876
3085A126876k2790P8329Q302p9520R4140Q0327P0306j53760j02322P0882O585
$$ 1126876 1104086 1182415 1190717 1111197 1205337 1285664 1355970 1202210 1099888 1170770 1177355
3074A177355L615p6005J0715P3952q7060J08835r3539m7048O358p0864o1655J4267
$$ 1177355 1180970 1104965 1115680 1189632 1102572 1211407 1117868 1070820 1077178 1006314 944659 958926
3062I58926J0535j5135k1672Q0418j48853j3219J48042k0828k8656o515L8965
$$ 958926 969461 954326 932654 1013072 864219 851000 999042 978214 949558 943043 982008
3051I82008j25392O7388J0799L7736m7791j41061j5961p9804J3536n2691n1262
$$ 982008 856616 924004 934803 972539 924748 783687 767726 687922 701458 648767 597505
3040E97505M0141j7896Q477n6322j17403k1342P1259o6732J7221l1310J37700
$$ 597505 637646 619750 628227 571905 454502 433160 504419 437687 454908 423598 561298
3029E61298l9720L5683J57029p5666j35630K7732m1939L0724j03643M1027m7010
$$ 561298 521578 557261 714290 638624 502994 530726 488787 519511 415868 456895 409885
3018D09885p045M8449o2177K4071J2533k744Q7046p8995J5778J0381j23508L1149
$$ 409885 402840 451289 389112 413183 425716 422972 510018 431023 446801 457182 333674 364823
3006C64823N3850K4778o7906l8232j03024R4729m9708q0602k495K9204l6584J54903
$$ 364823 418673 443451 375545 337313 234289 329018 279310 198708 196213 225417 188833 343736
2994C43736J01470p6906l6167j0913p0105p1312L9081m4319L4572J6860o8937
$$ 343736 445206 368300 332133 321220 251115 179803 218884 174565 209137 225997 157060
2983A57060N1826L6429J404m5202q560K3559O994R0496k7019o9317J05928J6538
$$ 157060 208886 245315 246719 201517 192957 216516 223510 314006 286987 217670 323598 340136
2971C40136o1673n8971N1808j21102p2420M2745J08969k0242j28946J43200Q354
$$ 340136 278463 219492 271300 150198 77778 120523 229492 209250 80304 223504 231858
2960B31858j2053m8878m8954K7128R7956O040k1545j31949n0353M5950J10265
$$ 231858 219805 170927 121973 149101 247057 253097 231552 99603 49250 95200 205465
2949B05465j626j21173M7662K9516r3768M646Q6270P6660R0880r1549m6029M1397
$$ 205465 203839 82666 130328 159844 66076 70722 156992 233652 324532 232983 186954 228351
2937B28351j2099j14845R0248o992M085p1175o3287q959M2335Q0890j25063K400
$$ 228351 216252 101407 191655 184663 188748 117573 54286 45327 87662 168552 43489 45889
2925D5889J0233k327P5864P9283r3409k2961r1450Q1364N7994K6731L7345n7787
$$ 45889 56122 53795 129659 208942 115533 92572 1122 82486 140480 167211 204556 146769
2913A46769o8376k1139J950L5810N0030m7730l242R0308L6078j16247r2320M733
$$ 146769 78393 57254 59204 95014 145044 97314 94072 184380 220458 104211 11891 16624
2901A6624j60664O0158N741N6347J10334J0380L634n6162k2665j3185J3536n3553
$$ 16624 -144040 -83882 -78141 -21794 88540 98920 102554 46392 23727 10542 24078 -29475
2889b9475M9254J5822n0691q4871J57333J26273n6721m8972N6808j15632q0870
$$ -29475 19779 35601 -15090 -99961 57372 183645 126924 77952 134760 19128 -61742
2878f1742n4350J28607M5108L5729K7055o4168l0331j0770m2515Q9295m8543P6730
$$ -61742 -116092 12515 57623 93352 120407 56239 25908 15138 -27377 61918 13375 90105
2866I0105j9577j15609Q6096N472l0190j1274m0631J01551q509j8684m2374j01746
$$ 90105 70528 -45081 41015 46487 16297 5023 -35608 65943 57434 38750 -3624 -105370
2854a05370J26760J07045k4466p4049M6704R5404k20588O1685j4929o9053J4042
$$ -105370 21390 128435 103969 29920 76624 172028 -48560 13125 -1804 -70857 -56815
2843e6815q7459L9690L7327M0387J71707J01486m3306j22795j87789L5108R2204
$$ -56815 -144274 -104584 -67257 -26870 144837 246323 203017 80222 -107567 -72459 19745
2832A9745k4486p0883J61217n3493J513N886n0386p91L3901m613J2686j875J8127
$$ 19745 -4741 -75624 85593 32100 33613 39499 -10887 -11678 22223 17610 30296 28421 46548
2819D6548k1379N4074N750K5689q6541n0197m5687K84M1685P6789m8543R1269
$$ 46548 25169 79243 84993 110682 24141 -26056 -71743 -71459 -29774 47015 -1528 89741
2807H9741m6678k0043p2277L5356m7658O793M9453L0178j636O6943O2603p7443
$$ 89741 43063 23020 -49257 -13901 -61559 -54766 -5313 24865 23229 90172 152775 75332
2795G5332j95776o7068O4183J01158R3930k8699N3608J2031M2323o578p1748l3514
$$ 75332 -120444 -187512 -123329 -22171 71759 43060 96668 108699 151022 144444 72696 39182
2783C9182O7975l1002o8591J4010O6877J2937k6663r8709k6576n3743N8079M8127
$$ 39182 107157 76155 7564 21574 88451 101388 74725 -23984 -50560 -104303 -46224 1903
2771A903k6947O638k9202j33510R718l6382J87818K3257O559K9632O5136k4511
$$ 1903 -25044 -18406 -47608 -181118 -171400 -207782 -19964 3293 9852 39484 104620 80109
2759H0109J7122N1054k107o910l3997k09813j16523j5859M9933J40608Q296J6999
$$ 80109 97231 148285 146178 139268 105271 -104542 -221065 -236924 -186991 -46383 -38087 -21088
2747b1088J22843N9952r6239O0666j08376L0589J51880j39640j11374o597l900
$$ -21088 101755 161707 65468 126134 17758 48347 200227 60587 -50787 -57384 -61284
2736f1284k9562J68347R9658j22484n2164R1924L0069n9553R2027j48362m1779
$$ -61284 -90846 77501 177159 54675 2511 94435 124504 64951 156978 8616 -33163
2725c3163P7468j50297O8623m3477l1108J39544q0766j59313M2447P921M1079
$$ -33163 44305 -105992 -37369 -80846 -111954 27590 -53176 -212489 -170042 -162121 -121042
2714a21042J74142n2380l8583N4165N8414n3919L5337k5755p9979J28901M2194
$$ -121042 53100 720 -37863 16302 74716 20797 56134 30379 -49600 79301 121495
2703A21495j49573P6873M4169l7213o5382Q0044J3968Q2101J6111m976k3887m2030
$$ 121495 -28078 48795 92964 55751 -9631 70413 84381 166482 182593 177617 153730 111700
2691A11700l3648j10157J6504L4472m2936L6626j4353K7735K5882k30209J06642
$$ 111700 78052 -32105 -15601 18871 -24065 12561 -1792 25943 51825 -178384 -71742
2680g1742O3428j4632l4808q3024k0803R9504l1326r3573J29650r5153M0290Q0100
$$ -71742 -8314 -22946 -57754 -140778 -161581 -62077 -93403 -186976 -57326 -152479 -112189 -32089
2668c2089Q7145K9792k02811J73747N6324o0041j01936J2871J17640L8236o6552
$$ -32089 55056 84848 -117963 55784 112108 52067 -49869 -36998 80642 118878 52326
2657E2326p10J1088K3764o4625N0873j1751K0743L1905q9535j44254J2711O6068
$$ 52326 51616 62704 86468 21843 72716 60965 81708 113613 24078 -120176 -107465 -41397
2645d1397P445J3357P8553n1351J1364l458L0753M179n9624p8179O3070L258n198
$$ -41397 -33952 -20595 57958 6607 17971 14513 45266 49445 -10179 -88358 -25288 -22030 -27228
2632b7228N5945l0673r5252j26953J35256N1821k6049l7089k9095L8520K52898
$$ -27228 28717 -1956 -97208 -224161 -88905 -37084 -63133 -100222 -129317 -90797 162101
2621A62101K418j90146l2310J39046j3124n8086J9697j9803o2103Q0001j00615
$$ 162101 164519 -25627 -57937 81109 67985 9899 29596 9793 -52310 27691 -72924
2610g2924O8385L6269j01301p3418o426N9834k576p5839N8611J90439M2060j92049
$$ -72924 -4539 31730 -69571 -142989 -149415 -89581 -92157 -167996 -109385 81054 123114 -68935
2598f8935k8172N7218Q299K7878n7605m1460O3054J5475J5127L0150K282k2428
$$ -68935 -97107 -39889 -31590 -3712 -61317 -102777 -39723 -24248 -9121 21029 23311 883
2586H83J08723l9102L9303O8726j15133j01285M0408n6237j48587R2354K41030
$$ 883 109606 70504 109807 178533 63400 -37885 2523 -53714 -202301 -109947 131083
2575A31083J59821r5365r4609O1412L1059m9676k14261m9849J43414K813l3452
$$ 131083 290904 195539 100930 162342 193401 143725 -70536 -120385 23029 25842 -7610
2564g610q9868J8602J46186n7587p3638K0554n8280j7131M9006N9504r753L0129
$$ -7610 -97478 -78876 67310 9723 -63915 -43361 -101641 -118772 -69766 -10262 -20015 10114
2552A0114L3868n3449p7154J3785R968M9032o3307q4954J26417j29L3410L3639
$$ 10114 43982 -9467 -86621 -72836 -62868 -13836 -77143 -162097 -35680 -35809 -2399 31240
2540C1240Q073k7312n4599P3950o474r8269P6509O9536l3296j00603o1611J20475
$$ 31240 39313 12001 -42598 31352 24878 -73391 3118 72654 39358 -61245 -122856 -2381
2528b381m8793p4649l0549j2159P5826K6763l7083J0445J37127m4650r2556l0519
$$ -2381 -51174 -125823 -156372 -168531 -92705 -65942 -103025 -92580 44547 -103 -92659 -123178
2516a23178n3355J50677k7901q000K4292j1662J05076l4712j56714J04965J04688
$$ -123178 -176533 -25856 -53757 -61757 -37465 -49127 55949 21237 -135477 -30512 74176
$$ [...]
##END NTUPLES=NMR SPECTRUM
##END=
