##TITLE=1H_CG-1228-X3
 200.13MHz,DMSO,
 8 sc
 
 12.11.2025
##JCAMPDX= 6.0         $$ Bruker NMR JCAMP-DX V2.0
##DATA TYPE= NMR SPECTRUM
##DATA CLASS= NTUPLES
##ORIGIN= UXNMR, Bruker Analytische Messtechnik GmbH
##OWNER= pz
$$ XWIN-NMR		Version 3.5
$$ Wed Nov 12 13:38:54 2025 Russian Standard Time (UT+4h)  she@DPX200
##.OBSERVE FREQUENCY= 200.1313
##.OBSERVE NUCLEUS= ^1H
##.ACQUISITION MODE= SIMULTANEOUS
##.ACQUISITION SCHEME= undefined
##.AVERAGES= 8
##.DIGITISER RES= 18
##SPECTROMETER/DATA SYSTEM= spect
##.PULSE SEQUENCE= zg30
##.SOLVENT NAME= DMSO
##.SHIFT REFERENCE= (INTERNAL, DMSO, 0, 15.5045)
##AUDIT TRAIL= $$ (NUMBER, WHEN, WHO, WHERE, WHAT)
$$ ##TITLE= Audit trail, XWIN-NMR		Version 3.5
$$ ##JCAMPDX= 5.01
$$ ##ORIGIN= Bruker BioSpin GmbH
$$ ##OWNER= she
$$ F:/spectra/data/she/nmr/H-C/1/pdata/1/auditp.txt
$$ ##AUDIT TRAIL=  $$ (NUMBER, WHEN, WHO, WHERE, WHAT)
(   1,<2025-11-12 13:35:56.14 +0400>,<she>,<DPX200>,
      <created by zg, POWCHK disabled, PULCHK disabled
       configuration hash MD5:
       00 E9 B6 7A A2 85 ED C7 34 08 36 98 17 FE 4E 26
       data hash MD5: 16K
       53 FB 05 2A 05 8D 79 EE D5 2F F3 C6 64 40 2D 7D>)
(   2,<2025-11-12 13:35:59.12 +0400>,<she>,<DPX200>,
      <Start of raw data processing
       efp BC_mod = 2 LB = 0.25 FT_mod = 6 PKNL = 1 PHC0 = -2621.365 PHC1 = 7.392366 SI = 16K 
       data hash MD5: 16K
       EB 53 32 58 1E BD 7A A3 4E 39 07 00 97 3A C3 81>)
(   3,<2025-11-12 13:36:19.98 +0400>,<she>,<DPX200>,
      <pk PHC0 = -12.98467 PHC1 = 16.4 
       data hash MD5: 16K
       C3 6F E6 9D C5 07 68 F3 AA 82 7F 03 76 F8 4D 53>)
(   4,<2025-11-12 13:36:24.04 +0400>,<she>,<DPX200>,
      <abs ABSG = 5 
       data hash MD5: 16K
       4E B8 25 EC 44 DA 70 DD CA 1F 8A 83 BA 7B D4 11>)
$$ ##END=
$$ 
$$ hash MD5
$$ 50 D0 98 44 BD AF 2E 95 6C 33 1C 63 59 0C 66 FA
##$RELAX= 
##$RELAX= 
##$RELAX= 
##$RELAX= 
##$RELAX= 
##$RELAX= 
$$ Bruker specific parameters
$$ --------------------------
##$DU= <F:/spectra>
##$EXPNO= 1
##$NAME= <H-C>
##$PROCNO= 1
##$TYPE= <nmr>
##$USER= <she>
##$AMP= (0..31)
100 100 100 100 100 100 100 100 100 100 100 100 100 100 100 100 100 100 
100 100 100 100 100 100 100 100 100 100 100 100 100 100 
##$AQSEQ= 0
##$AQ_mod= 1
##$AUNM= <au_zg>
##$AUTOPOS= <>
##$BF1= 200.13
##$BF2= 200.13
##$BF3= 200.13
##$BF4= 200.13
##$BF5= 200.13
##$BF6= 200.13
##$BF7= 200.13
##$BF8= 200.13
##$BYTORDA= 1
##$CFDGTYP= 0
##$CFRGTYP= 5
##$CHEMSTR= <none>
##$CNST= (0..31)
1 1 145 1 1 1 1 1 1 1 1 1 1 1 1 1 1 1 1 1 1 1 1 1 1 1 1 1 1 1 1 1 
##$CPDPRG= <>
##$CPDPRG1= <>
##$CPDPRG2= <>
##$CPDPRG3= <>
##$CPDPRG4= <mlev>
##$CPDPRG5= <mlev>
##$CPDPRG6= <mlev>
##$CPDPRG7= <mlev>
##$CPDPRG8= <mlev>
##$CPDPRGB= <>
##$CPDPRGT= <>
##$D= (0..31)
0 0.7 0 0 0 0 0 0 0 0 0 0.03 0 0 0 0 0 0 0 0 0 0 0 0 0 0 0 0 0 0 0 0 
##$DATE= 1762940155
##$DBL= (0..7)
120 120 120 120 120 120 120 120 
##$DBP= (0..7)
150 150 150 150 150 150 150 150 
##$DBP07= 0
##$DBPNAM0= <>
##$DBPNAM1= <>
##$DBPNAM2= <>
##$DBPNAM3= <>
##$DBPNAM4= <>
$$ [...]
##$SUBNAM3= <"">
##$SUBNAM4= <"">
##$SUBNAM5= <"">
##$SUBNAM6= <"">
##$SUBNAM7= <"">
##$SUBNAM8= <"">
##$SUBNAM9= <"">
##$SW= 18.0517328524113
##$SWIBOX= (0..15)
0 0 2 0 0 0 0 0 0 0 0 0 0 0 0 0 
##$SW_h= 3612.71676300578
##$TD= 16384
##$TD0= 1
##$TE= 0
##$TE2= 300
##$TE3= 300
##$TEG= 300
##$TL= (0..7)
0 120 120 120 120 120 120 120 
##$TP= (0..7)
150 150 150 150 150 150 150 150 
##$TP07= 0
##$TPNAME0= <>
##$TPNAME1= <>
##$TPNAME2= <>
##$TPNAME3= <>
##$TPNAME4= <>
##$TPNAME5= <>
##$TPNAME6= <>
##$TPNAME7= <>
##$TPOAL= (0..7)
0.5 0.5 0.5 0.5 0.5 0.5 0.5 0.5 
##$TPOFFS= (0..7)
0 0 0 0 0 0 0 0 
##$TUNHIN= 0
##$TUNHOUT= 0
##$TUNXOUT= 0
##$USERA1= <user>
##$USERA2= <user>
##$USERA3= <user>
##$USERA4= <user>
##$USERA5= <user>
##$V9= 5
##$VALIST= <valist>
##$VCLIST= <CCCCCCCCCCCCCCC>
##$VD= 0
##$VDLIST= <DDDDDDDDDDDDDDD>
##$VPLIST= <PPPPPPPPPPPPPPP>
##$VTLIST= <TTTTTTTTTTTTTTT>
##$WBST= 1024
##$WBSW= 4
##$XGAIN= (0..3)
0 0 0 0 
##$XL= 0
##$YL= 0
##$YMAX_a= 251027
##$YMIN_a= -319046
##$ZGOPTNS= <>
##$ZL1= 120
##$ZL2= 120
##$ZL3= 120
##$ZL4= 120
##$ABSF1= 15.5045
##$ABSF2= -2.547349
##$ABSG= 5
##$ABSL= 3
##$ALPHA= 0
##$AQORDER= 0
##$ASSFAC= 0
##$ASSFACI= 0
##$ASSFACX= 0
##$ASSWID= 0
##$AUNMP= <proc_1d>
##$AZFE= 0.1
##$AZFW= 0.1
##$BCFW= 0
##$BC_mod= 2
##$BYTORDP= 0
##$COROFFS= 0
##$CY= -3
##$DATMOD= 1
##$DC= 0
##$DFILT= <>
##$DTYPP= 0
##$F1P= 0
##$F2P= 0
##$FCOR= 1
##$FTSIZE= 16384
##$FT_mod= 6
##$GAMMA= 0
##$GB= 0
##$INTBC= 1
##$INTSCL= 3.241238e-09
##$ISEN= 128
##$LB= 0.25
##$LEV0= 0
##$LPBIN= 0
##$MAXI= 10000
##$MC2= 0
##$MEAN= 0
##$ME_mod= 0
##$MI= 1.114404
##$NCOEF= 0
##$NC_proc= -7
##$NLEV= 6
##$NOISF1= 3.799351
##$NOISF2= 2.8
##$NSP= 0
##$NTH_PI= 0
##$NZP= 0
##$OFFSET= 15.5045
##$PC= 1
##$PHC0= -2634.35
##$PHC1= 23.79237
##$PH_mod= 1
##$PKNL= yes
##$PPARMOD= 0
##$PSCAL= 0
##$PSIGN= 0
##$REVERSE= no
##$SF= 200.130003442913
##$SI= 16384
##$SIGF1= 3
##$SIGF2= 2
##$SINO= 0.751879
##$SIOLD= 32768
##$SREGLST= <19F.Aceton>
##$SSB= 0
##$STSI= 16384
##$STSR= 0
##$SW_p= 3612.71676300578
##$SYMM= 0
##$S_DEV= 0
##$TDeff= 16384
##$TDoff= 0
##$TI= <>
##$TILT= no
##$TM1= 0
##$TM2= 0
##$TOPLEV= 0
##$USERP1= <user>
##$USERP2= <user>
##$USERP3= <user>
##$USERP4= <user>
##$USERP5= <user>
##$WDW= 1
##$XDIM= 16384
##$YMAX_p= 298834691
##$YMIN_p= -5294357
$$ End of Bruker specific parameters
$$ ---------------------------------
##NTUPLES= NMR SPECTRUM
##VAR_NAME=  FREQUENCY,     SPECTRUM/REAL,   SPECTRUM/IMAG
##SYMBOL=    X,             R,               I
##VAR_TYPE=  INDEPENDENT,   DEPENDENT,       DEPENDENT
##VAR_FORM=  AFFN,          ASDF,            ASDF
##VAR_DIM=   16384,         16384,           16384
##UNITS=     HZ,            ARBITRARY UNITS, ARBITRARY UNITS
##FACTOR=    0.220516191357247, 1,           1
##FIRST=     3102.91571625105, 0,            0
##LAST=      -509.801046754727, 0,           0
##MIN=       -509.801046754727, -5294357,    0
##MAX=       3102.91571625105, 298834691,    0
$$ Real data points
##PAGE= N=1
##DATA TABLE= (X++(R..R)), XYDATA
$$ [...]
8426e06292Q5244p8930j17765K10441p2228j37453J86885J13812M683M765q6351
8415c93189R3720K6125q1246K29570k70784J85470Q5986j49425j29791J8773j7906
8404d02697L5587j41927m1471K02259j43578R6176j4508M85J18018R850k51815
8393e33621r7100L28591J07421k60478r9390L4946J3031j40103L9749J75152K05952
8382b25850M611J28311j66045j93061Q1032J95754K0144k78117K34682K0433M5423
8371a32683j11046m6904J26481M0751j06103k3804K7849L4535o225k61144L36194
8360a22099j4343j40284j25120O1218P0375N845k84188K09224K6785Q6565J48808
8349g7214k28984J31454O4392k0496J32694Q0906N6525k18857j85035R7389m3815
$$ plain form
8426 -506292 -421048 -499978 -617743 -407302 -479530 -616983 -430098 -316286 -311603 -306838 -393189
8415 -393189 -299469 -273344 -354590 -125020 -395804 -210334 -124348 -273773 -403564 -384791 -402697
8404 -402697 -367110 -509037 -550508 -348249 -491827 -395651 -410159 -409674 -291656 -281806 -533621
8393 -533621 -630721 -302130 -194709 -455187 -554577 -519631 -506600 -646703 -606954 -431802 -225850
8382 -225850 -221239 -92928 -258973 -452034 -371002 -175248 -155104 -433221 -198539 -178106 -132683
8371 -132683 -243729 -290633 -164152 -123401 -229504 -253308 -225459 -190924 -197149 -458293 -122099
8360 -122099 -136442 -276726 -401846 -340628 -270253 -264408 -548596 -339372 -312587 -226022 -77214
8349 -77214 -306198 -174744 -110352 -130848 1846 82752 139277 -79580 -264615 -167226 -211041
8338b11041o8804m6259J69125N754R3516n5794n9220j42531R9630J9628J13835
8327h2161r0536j37166J44848m2753J2074j67315J1199m9241J56432P7639j78132
8316c45112R1549Q1829m4600j5306k00386L960m808J62870r6342p0652j23318
8305e60316m0952K78040J40725r0202l9217j77769Q5681Q2598N926M7088j43674
8294d12072L2065R1204k45016l5808n9586j43164K00670k77429o2659J67284J62389
8283e82122K07010Q3953j39834J09720o610j4785r4783j69389L6090J03090l2203
8272d99863Q2488m1528k3199N4298j81223q369J14269n5164j3106M8515o1748
8261e84630P7532k8605O7207N0311N0244q973j34311J22893J57210l75311J67419
$$ plain form
8338 -211041 -279845 -326104 -156979 -151225 -57709 -113503 -172723 -315254 -215624 -195996 -82161
8327 -82161 -172697 -309863 -165015 -207768 -195694 -363009 -351810 -401051 -244619 -166980 -345112
8316 -345112 -253563 -171734 -216334 -231640 -432026 -428066 -432874 -270004 -366346 -436998 -560316
8305 -560316 -601268 -323228 -182503 -272705 -311922 -489691 -404010 -321412 -315486 -268398 -412072
8294 -412072 -380007 -288803 -533819 -569627 -629213 -772377 -571707 -849136 -911795 -744511 -582122
8283 -582122 -375112 -291159 -430993 -321273 -327883 -342668 -437451 -606840 -570750 -467660 -499863
8272 -499863 -417375 -458903 -482102 -427804 -609027 -617396 -503127 -558291 -571397 -522882 -584630
8261 -584630 -507098 -535703 -468496 -418185 -367941 -376914 -511225 -388332 -231122 -606433 -439014
8250d39014o95O5979j01222j78J90411J8126J58798N9700j42560J57831L8073
8239E249j93315J27498r6519k00001k12649K31102j33134L7376p9502K16055k3080
8228c20920q5393j59620k0200k3160L00158m7071L8497K5389j17439j96119K18097
8217c87781K21304k74480R450J0450J16786K47814j65631J20976l76672J75971
8207c01813l4773q7643Q8790P1938j51065K03035K3887m142k41512J89866k09366
8196d52798k36897k53460j83028j654894k513280L990033J013922J52895Q4054
8187e3453k5466J01653l93392j69535L71583J52590k73168k32297J0740p4655
8177e85400J78361K64699k71235J77390j13398k9074k33193K43682j53807K29177
$$ plain form
8250 -439014 -439709 -373730 -474952 -475130 -284719 -266593 -107795 -48095 -190655 -32824 5249
8239 5249 -188066 -60568 -157087 -357088 -569737 -338635 -471769 -434393 -513895 -297840 -320920
8228 -320920 -406313 -565933 -586133 -609293 -309135 -356206 -317709 -292320 -409759 -605878 -387781
8217 -387781 -166477 -440957 -431507 -421057 -304271 -56457 -222088 -101112 -477784 -301813
8207 -301813 -336586 -424229 -335439 -263501 -414566 -211531 -187644 -191786 -433298 -243432 -452798
8196 -452798 -689695 -943155 -1126183 -2781077 -5294357 -1304324 -290402 -137507 -53453
8187 -53453 -78919 22734 -370658 -540193 -168610 -16020 -289188 -521485 -510745 -585400
8177 -585400 -407039 -142340 -413575 -236185 -349583 -378657 -611850 -368168 -521975 -292798
8167b92798l04396P9716L25272p0651J16711j75429J34946k8450j83214j41721
8157e40014J11377K69786j88232r6199K5067L02579r0375q1915J37822n1725k44306
8146d46135K11953k0093r2652J5888L99878k02593j61410M202J46158J6374l04051
8135d32481M0186J58277Q4466j780l4900m2973m5268j73316J3135p8331l0746
8124e43731O6578j34129K14105K44383k66381N2615K48874R919M946O951k12739
8113c08609N607J28793j22605j61837J90840p1801j33246K9818K20104J4113N3275
8102a55548m3977j75686K8923l1953l1839K33128N3104j38699j82824P7071j46329
8091e14629R0096K93556q6369j32895J5791k9891O8545j10190K4669o8793M1137
$$ plain form
8167 -292798 -597194 -517478 -192206 -262857 -146146 -321575 -186629 -215079 -398293 -540014
8157 -540014 -428637 -158851 -347083 -443282 -418215 -115636 -206011 -287926 -150104 -201829 -446135
8146 -446135 -234182 -254275 -346927 -331039 68839 -133754 -295164 -290962 -144804 -128430 -432481
8135 -432481 -392295 -234018 -149552 -151332 -186232 -229205 -274473 -447789 -434654 -512985 -543731
8124 -543731 -477153 -611282 -397177 -152794 -419175 -366560 -117686 -107767 -102821 -95870 -308609
8113 -308609 -303002 -174209 -296814 -458651 -267811 -339612 -472858 -443040 -222936 -208823 -155548
8102 -155548 -199525 -375211 -346288 -378241 -410080 -176952 -123848 -262547 -445371 -368300 -514629
8091 -514629 -424533 -130977 -217346 -350241 -334450 -364341 -295796 -405986 -381317 -450110 -408973
8080d08973J65068J0853o6288j79558p6948K53699k68148k2490J36918l8495J38256
8069c56106J01834K0191J7800J41285l6571k53540J65785J07764k87381r7937
8059d76876j40830J09078n8752J47032J28859j23921p6661K44474l5553K37719
8049d5431j48678l1176l0499K2459p044J4763L2872L1293p7899J3678m9138J40045
8037a34755J4663P8444j28054l56273L55135M597P3576N1412q0193l6918K31100
8026G2734j10621m6156r1000j11821R2391J73990m364j07898K32552l77209j37198
8015d14600P6187k20294j26450K02534k79178K25012M6082j57625J71805L5350
8005d41177q3226k8443p3626j09278J64168J85367J57326O7119j81611k2826L42497
$$ plain form
8080 -408973 -243905 -233052 -299340 -478898 -555846 -302147 -570295 -592785 -455867 -494362 -356106
8069 -356106 -254272 -234081 -216281 -74996 -111567 -365107 -199322 -91558 -378939 -476876
8059 -476876 -617706 -508628 -567380 -420348 -291489 -415410 -492071 -247597 -283150 -45431
8049 -45431 -194109 -225285 -255784 -233325 -240369 -225606 -192734 -161441 -239340 -225662 -274800 -134755
8037 -134755 -120092 -41648 -169702 -525975 -170840 -166243 -92667 -41255 -121448 -158366 72734
8026 72734 -37887 -84043 -175043 -286864 -194473 -20483 -24847 -132745 99807 -277402 -414600
8015 -414600 -338413 -558707 -685157 -482623 -761801 -536789 -490707 -648332 -476527 -441177
8005 -441177 -524403 -552846 -626472 -735750 -571582 -386215 -228889 -161770 -343381 -366207 -23710
7994b3710p1711M8619K760j59863L9168m5846l4334n7578j18037j49212r2394
7983f62138K86849m5404J50442o3743R0193J9340J24296J84554k33265j32599
7973b81475P6415k01923Q39o7775J48046R902j43446l2125J58153K3992j77940
7962d87337P7542N3781j57099P2728m699n785K39620J2242q968m4724j06959J0728
7950c48930K59565k39120J48442L1677j43872l3958J85125j96929j13021J26638
7940c24383j27778J1056q9440j71995K34741M3348O6436j52258J86436L67995
7930D4158j26435o8397M3542n1929j54030p0313M2101r4613k28126M87923q977
7919a85096j30711J16112m5432L1586R3795j36577q4313k9031K31810p0166j68582
$$ plain form
7994 -23710 -95421 -46802 -44042 -203905 -164737 -210583 -244917 -302495 -420532 -569744 -662138
7983 -662138 -375289 -420693 -270251 -333994 -243801 -224461 -100165 84389 -148876 -281475
7973 -281475 -205060 -406983 -406144 -473919 -325873 -315971 -459417 -491542 -333389 -309397 -487337
7962 -487337 -409795 -356014 -513113 -440385 -445084 -450869 -211249 -199007 -207975 -252699 -359658 -348930
7950 -348930 -89365 -328485 -180043 -148366 -292238 -326196 -141071 -338000 -451021 -324383
7940 -324383 -452161 -441105 -530545 -702540 -467799 -424451 -358015 -510273 -323837 44158
7930 44158 -82277 -150674 -107132 -159061 -313091 -383404 -341303 -435916 -664042 -176119 -185096
7919 -185096 -315807 -199695 -245127 -213541 -119746 -256323 -340636 -369667 -137857 -208023 -376605
7908c76605k61927k3691L99424j5487o2670M9521m9542j46059J89955L62714r0849
7897b5216o1275q8614J22017k6114j9547Q8997j36434k42569j18318K70137j44774
7886c81710J5890n8715j56404J95472M7075q1083P1709J01679R5242l7617p9295
7875b67757n0193j62934j44769L53285Q9251n0989O9588q9970K66088J71998k24118
7864d0520j1981K9667r4061j02379K04748N1628Q4403k38275j81084j45972qL76773
7852f7061L0282l8018r0586r988j31571J04956J40122R6564j45841j69681J06907
7841a73915L2955L3664L0817k12563O2924K08356J94286m42808k16170J15410
7831c67044r8094K768J25397j42089k07340L91845J19928k44418J97130K5189
$$ plain form
7908 -376605 -638532 -662223 -262799 -278286 -340956 -291435 -340977 -487036 -297081 65633 -25216
7897 -25216 -86491 -175105 -53088 -79202 -98749 -9752 -146186 -388755 -507073 -236936 -381710
7886 -381710 -365820 -424535 -580939 -385467 -338392 -419475 -347766 -246087 -150845 -188462 -267757
7875 -267757 -317950 -480884 -625653 -272368 -183117 -234106 -164518 -254488 11600 183598 -40520
7864 -40520 -52501 -22834 -116895 -219274 -14526 37102 121505 -116770 -297854 -443826 -443834 -67061
7852 -67061 -36779 -74797 -165383 -175371 -306942 -201986 -61864 34700 -111141 -280822 -173915
7841 -173915 -140960 -107296 -76479 -289042 -226118 -17762 176524 -266284 -482454 -367044
7831 -367044 -465138 -462370 -336973 -479062 -686402 -294557 -174629 -419047 -221917 -196728
7821a96728J29961j37558K06901p8664j43444N1514r8484K01785j71037J6235
7811b19519Q8496K2226M1654j82730l1390l61947n02325Q36516j09437r8484J60807
7800c56133r032J68159L98098j58821l42669J82304n671j54203n4609R0136N3634
7789a88807L5027J88796J7088p5446k80993K4816Q0771J12253j37178m2670L0189
7778b36154L14121r8241N1341k55226M1813J20533j39890j48597j60274J87988
7768c22586Q5272L0927k18651L9086K81787j71987q1990Q1361L3048L71604k6479
7757A01392k4800p5479J24152k22235p8739J3530K76822o4790k39732k37362M0919
7746c86322m5484L7376Q4188J60349M2542J15936q047k26276K4366Q9633p8919
$$ plain form
7821 -196728 -66767 -204325 2576 -76088 -219532 -168018 -266502 -64717 -235754 -219519
7811 -219519 -131023 -108797 -67143 -249873 -281263 -643210 -1145535 -309019 -418456 -516940 -356133
7800 -356133 -365165 -197006 201092 42271 -300398 -118094 -123765 -277968 -332577 -242441 -188807
7789 -188807 -153780 35016 52104 -23342 -304335 -279519 -198748 -86495 -223673 -266343 -236154
7778 -236154 77967 -20274 31067 -224159 -182346 -61813 -201703 -350300 -510574 -322586
7768 -322586 -237314 -206387 -425038 -385952 -104165 -276152 -358142 -276781 -243733 127871 101392
7757 101392 76592 1113 125265 -96970 -175709 -162179 114643 49853 -189879 -427241 -386322
7746 -386322 -431806 -394430 -310242 -149893 -107351 8585 538 -225738 -201372 -111739 -190658
7735a90658J89052j75882l9371n5932o3781J04806j82105K11155R6299L7825j11219
7724a79811k03238K08161l2251j33747M2900O0583l5426K5427L20241J54982q1945
7713A45876n9103j63222L6133k78341K34662J89871k35722k5269J08333j07567
7703a54349r2357J64340n1258k98108K26908J84270J65216j10550j08112m4515
7693a18515K0765N7591j18739L11283Q1311M7495k19890k35412o7611J687n7003
7682b97038J73822k4361p7111J02989J08730r3819k38624K7751J78825M7922j69145
7671b60059j3672j02067j00445L03406J23852O2621l1685J42761j17671j16759
7661a09718n987j26514L9880J6552J98920J72523O958L5635r0194j2807k21003
$$ plain form
7735 -190658 -1606 -177488 -216859 -272791 -336572 -231766 -413871 -202716 -106417 -68592 -179811
7724 -179811 -383049 -174888 -207139 -340886 -297986 -237403 -272829 -247402 72839 227821 145876
7713 145876 86773 -76449 -40316 -318657 -83995 105876 -129846 -155115 -46782 -154349
7703 -154349 -246706 -82366 -133624 -431732 -204824 -20554 144662 34112 -74000 -118515
7693 -118515 -97750 -40159 -158898 152385 233696 281191 61301 -174111 -241722 -240035 -297038
7682 -297038 -123216 -147577 -224688 -121699 -12969 -106788 -345412 -317661 -138836 -90914 -260059
7671 -260059 -273731 -375798 -476243 -172837 -48985 13636 -18049 124712 7041 -109718
7661 -109718 -115705 -242219 -202339 -185787 13133 185656 192614 228249 138055 125248 -95755
7650i5755K73892q4347r364L883M5530O5001J99154k25029j27542J2293k23575
7639a65859J95027o0938j26847J07676M4259K21296j21059J01058j17538l57286
7629b80211K807J55438K01321j48385Q3692Q1605M7042J56085K38585J45196j01936
7618E81239k44097j27567J04844Q2756K12179j34161l19634q8219K33846Q0232
7608C81418k40542p4565k546j30379J14935J28418n9307j09220R2320N1758j96948
7597d4658K31345j46013m0743J03662K31363j60495o3511J14477P1060l42305
7587d5818O0936J25864K2247N58O1807j44382J18034j75535N6528J25446L8373
7576B44058o7853k5902K20723k90258K55997j99725J18120j25487j99566P8028
$$ plain form
7650 -95755 178137 93790 84426 88309 133839 198840 397994 172965 45423 57716 -165859
7639 -165859 29168 -31770 -158617 -50941 -6682 214614 93555 194613 77075 -280211
7629 -280211 -277404 -121966 79355 -69030 14662 96267 143309 299394 537979 683175 581239
7618 581239 337142 209575 314419 397175 609354 475193 155559 67340 301186 381418
7608 381418 140876 66311 63765 -66614 48321 176739 117432 8212 100532 152290 -44658
7597 -44658 186687 40674 -69 103593 334956 174461 110950 225427 296487 -45818
7587 -45818 15118 140982 163229 163787 225594 81212 199246 23711 80239 205685 244058
7576 244058 176205 150303 371026 80768 336765 137040 255160 129673 -69893 8135
7566H135m7941M47J5369J32228J33558j35584K933l2379K27571M4714l2240J57084
7554D73895l0070R371M5962L47628K47075J04989L4332K45480J92925J0656J07912
7543A790155N3314k9679K20849M5060j42496J07394j0325j89869J5064m23070
7533A436397l33533m5802j98450j59408j34461k30805J33388n3631k0619R0942
7523D84018k35663Q6800j1758k86885Q264J72288L2092p4364l49143J8828J12066
7512d3457n5509K21013Q9943k06122j49442P2917K05810o536o5909M9932j81455
7501f8815J2621j83445j13036R1611K53207P807q8435N7419O336j37955Q994K32333
7489G8642k3938J40444j870k75913R3662k96635Q2187J47638q8301Q6110K8952
$$ plain form
7566 8135 -39806 -39359 -23990 108238 241796 106212 109145 76766 304337 349051 316811 473895
7554 473895 443825 453196 499158 846786 1093861 1198850 1233182 1478662 1671587 1682243 1790155
7543 1790155 1843469 1813790 2034639 2079699 1937203 2044597 2034272 1844403 1859467 1436397
7533 1436397 1102864 1057062 858612 699204 564743 333938 467326 413695 393076 484018
7523 484018 248355 335155 323397 36512 44776 217064 249156 174792 -174351 -155523 -43457
7512 -43457 -98966 122047 211990 5868 -143574 -70657 135153 128617 62708 112640 -68815
7501 -68815 -56194 -239639 -352675 -261064 -7857 -50 -88485 -31066 -24730 -162685 -153691 78642
7489 78642 54704 195148 193278 -82635 11027 -285608 -203421 -55783 -144084 -57974 -29022
7478b9022L9579j54703J70172j29244J71125J8622L7610k39232n8316j6754q7356
7467b77519j87242J90602K71953q1664N4604K3708j5710j46489j816J12057L6180
7456b1336j6378j41240n6877n5738J79205j57397P6780J0575k50172N2069K98307
7445h2202J26724k20812M7198k89165O5718K2776J83954m8741n2059P994R3241
7434a45374q0216J06709J5559K42645J56244r7323k46370k22695N1024K23852
7424D055L2711j27165J74517r1536j84723r4529J19252L3220K99470K7987k49958
7413e6699j2398J66061j38455l542J34861k5338J7012o6913j95628J33657J81586
7402A34204j34231j49892j56609M6035K76736J35980K32099J33021k75546k37729
$$ plain form
7478 -29022 10557 -144146 26026 -103218 67907 86529 124139 -115093 -173409 -190163 -277519
7467 -277519 -464761 -274159 -2206 -83870 -29266 -5558 -21268 -167757 -169573 -57516 -21336
7456 -21336 -37714 -178954 -235831 -291569 -112364 -269761 -192981 -182406 -432578 -380509 -82202
7445 -82202 44522 -176290 -129092 -418257 -352539 -329763 -145809 -194550 -246609 -238615 -145374
7434 -145374 -225590 -118881 -103322 139323 295567 198244 -48126 -270821 -219797 4055
7424 4055 36766 -90399 84118 -7418 -192141 -286670 -167418 -134198 165272 193259 -56699
7413 -56699 -69097 96964 -41491 -45033 89828 64490 81502 14589 -181039 -47382 134204
7402 134204 -27 -149919 -306528 -260493 16243 152223 384322 517343 241797 4068
7392D068m2981q5641J68516m2976o7221l5027J09779q0238j27708j46456J15695
7381b30190J77121o1599J76241j41138n304O3868r0479K06263o7195l0106N440
7370B922J25754P983m6262l37403J08900K71481q5680k18817K99126M7704j52213
7359B3495L20753P4622j13527k85446o6910k46125J48622J08979j06296k09268
7349c51101J92477Q5482R2372N8012q4715j23317l5310K3290J88600j55753R5465
7338a4498j24984o2179K4295j35140K17539J54035n2027R5989K43776m1374k49687
7327E5745L1486R6613k9919P8701q4487L0884j37408M2148k6361O248K0584l06494
7315b22260J31549K9035K88563q9804j82685m7999K13080J22426k87954K56022
$$ plain form
7392 4068 -38913 -124554 43962 986 -66235 -101262 8517 -71721 -199429 -345885 -230190
7381 -230190 -53069 -114668 61573 -79565 -84869 -21001 -111480 94783 27588 -2518 2922
7370 2922 128676 136659 90397 -247006 -138106 133375 47695 -171122 128004 175708 23495
7359 23495 344248 418870 305343 19897 -47013 -293138 -144516 -35537 -141833 -351101
7349 -351101 -158624 -73142 19230 77242 -7473 -130790 -166100 -142810 45790 -109963 -14498
7338 -14498 -139482 -201661 -177366 -312506 -94967 59068 7041 103030 346806 305432 55745
7327 55745 87231 183844 153925 232626 148139 179023 41615 83763 57402 63650 84234 -222260
7315 -222260 -90711 -61676 226887 137083 -45602 -93601 119479 241905 -46049 209973
7305B09973k0718P0914k6011j35684j95764p8391M5219K18922P978K18593M9369
7294C64400j62052j07814j25303j57333L489K35050k28295R7587R1516j5118k30038
7283b33911J16805L48412J58756m580k39457q5054j29227J14272K66011J07414
7273D19441j04359k30114o2559J48149J12315q8559J69170o5784J27721n0135
7263C75286m51101K9383J95605K48137J8461k55276k1851K36122r6063k03710
7253G4993j63182k32243q7983J34965J74487J74402J78686k80435q2515M12892
7243C04067k08932N4461J86970k35935Q6155K07514l35352l6285K10289L8447
7233B71399m8305o3475n7966L0676J73328j31668L18921N0587r9991k10301q7251
$$ plain form
7305 209973 189255 260169 234158 98474 -97290 -175681 -130462 88460 96438 315031 364400
7294 364400 202348 94534 -30769 -188102 -184613 50437 -177858 -80271 11245 -3873 -233911
7283 -233911 -117106 231306 390062 385482 146025 60971 -68256 46016 312027 419441
7273 419441 315082 84968 22409 170558 282873 194314 363484 297700 425421 375286
7263 375286 -75815 -46432 149173 397310 415771 160495 138644 374766 278703 74993
7253 74993 -88189 -320432 -408415 -273450 -98963 75439 254125 -26310 -108825 304067
7243 304067 95135 149596 336566 100631 186786 394300 58948 22663 232952 271399
7233 271399 223094 159619 101653 132329 305657 173989 492910 543497 443506 233205 145954
7222A45954Q7505j91622P8105n7817M0355J2070j05394p8523K2426Q6908K10856
7211B50823J17612N873K0437p2272j40144n7513j103R2280n5809O281K22835j49947
7199B39353o1392J6817J4820j70354P8917L05632j21936j35220J05726r1195l39716
7188a58548l816K69497Q2083N6494n8856p1337J09603l31781K4655J31317Q1699
7177A31010M0500N082j55752K14474L8658j26260j1762j4253M1483m2677k8265
7166I2238k4881J52673q3417K70611j36475N0065j567o9635j1474j5066m0489
7155A82583q700j22301K23621l7087k08293O3728k15707R610K14659K59357j32666
7144B28804j2419P2980P9958k42765q0464J1872K1414P3747M0665n0748L8609
$$ plain form
7222 145954 233459 41837 119942 62125 102480 114550 9156 -69367 -46941 39967 250823
7211 250823 368435 374308 394745 322473 182329 124816 123713 215993 160184 166465 389300 239353
7199 239353 177961 194778 209598 39244 118161 423793 301857 166637 272363 181168 -158548
7188 -158548 -162364 107133 189216 245710 186854 115517 225120 -106661 -82006 49311 131010
7177 131010 171510 176592 20840 235314 273972 147712 135950 121697 163180 120503 92238
7166 92238 67357 220030 136613 407224 270749 320814 319247 249612 238138 223072 182583
7155 182583 173883 51582 275203 238116 29823 93551 -122156 -112546 102113 361470 228804
7144 228804 216385 289365 369323 126558 46094 57966 79380 153127 193792 143044 181653
7133A81653j11102P7323j01895m0079J89510Q4655q8135K63417j27630N4077Q974
7122C90768j35260J722k88342j263Q0457J60931m5084L7202m1156J24471K11354
7111D95800j61575J60067J06223k31177L9607N0546k76094j62428R6814L8369
7101A56152l4477J05011j541j04950R9775J04600m4613j25286K957j72474j08692
7090a23538N4004M0579Q8107K59531l2702K28623k9214j52775K8507j7426j04488
7079B39208k6287J30766j84623k5974J00838L0500J35506p7800k07376M9128L02187
7068D66073R0885j99999N8521m2370j27160l3763J34021j44861l09417L88432
7058B80362n4201P1110N448N8018j64334K03511J0159Q0621J4681q1091o2967
$$ plain form
7133 181653 70551 147874 45979 5900 195410 280065 191930 455347 327717 381794 390768
7122 390768 255508 257230 -31112 -32375 48082 209013 163929 201131 159975 284446 495800
7111 495800 334225 494292 600515 369338 408945 459491 183397 20969 117783 156152
7101 156152 121675 226686 225145 120195 219970 324570 279957 154671 157628 -14846 -123538
7090 -123538 -69534 -28955 59152 318683 285981 514604 485390 332615 361122 343696 239208
7079 239208 212921 343687 159064 133090 233928 264428 399934 322134 114758 163886 466073
7068 466073 556958 356959 415480 373110 245950 212187 346208 201347 -108070 280362
7058 280362 226161 297271 302719 360737 196403 399914 410073 490694 505375 424284 361317
7047C61317N9835k36766r1431K91257J02996Q0049K05289k09712j51152l7770
7037C73912Q6459L4677Q3097R0384j95853j6138j58121J05111K1132N8255K69886
7026G52801j65609k72359l4198N3697K64658j64238K02620Q7195j45112k13337
7016C66118Q2403K13222j49140k15491J39060j3214k6100j14364j63974K28475
7006C46995J93128l13981J29589J3683P8135k767Q5907J40342l47048k89021K96766
6995C31728J22813j57992J61206J20617k0632k37366j88588K05654L7347L4600
6985D09387K01598M0542j5975k13107k77848k7673p0654L59342j81910j40786
6975H2916K66064J6319R3701q9826l2867K62981l97523k07768L36077J41107P1553
$$ plain form
7047 361317 421152 184386 92955 384212 487208 567257 772546 562834 411682 373912
7037 373912 460371 495048 578145 668529 472676 456538 298417 403528 424660 482915 752801
7026 752801 587192 314833 280635 334332 598990 434752 637372 724567 579455 366118
7016 366118 448521 661743 512603 297112 436172 422958 396858 282494 118520 346995
7006 346995 540123 226142 355731 369414 447549 444782 530689 671031 323983 34962 331728
6995 331728 454541 296549 457755 578372 557740 320374 131786 337440 374787 409387
6985 409387 610985 651527 635552 422445 144597 116924 46270 405612 223702 82916
6975 82916 348980 365299 459000 369174 336307 599288 201765 -6003 330074 471181 542734
6964E42734j27443J90441R9024k03939j14246P6457j78214O3731J67337l7891
6954D77991P1988M9975j19258o6175J09095p1491J2822j72193j08798N8266k0328
6943B21894J46805O3109k48971J29284J33889j69747J84616R2817o9503M7623
6933E31816Q6799j94522j8974k1344J47825J4172J03792K0594j85314L10969j48528
6922F47285j86573p2213r5330R5968K62648m6384m7445O4260l8274l5933k7440
6911E20569J6230k1835j09406J41247L2238J07844J47959j55457n2104L4960j80516
6900D81729j52035M5204O294J15773K09086J56953k5383l4504n7284j2245O583
6889G40171p1230m0683J17339o2003R2359k3087k46381q7905n7405P4422N9589
$$ plain form
6964 542734 415291 605732 704756 500817 386571 463028 284814 348545 515882 477991
6954 477991 549979 599954 480696 414521 523616 452125 464947 292754 183956 242222 221894
6943 221894 368699 431808 182837 312121 446010 276263 460879 553696 484193 531816
6933 531816 618615 424093 405119 383775 531600 545772 649564 670158 484844 795813 647285
6922 647285 460712 388499 293169 389137 651785 605401 557956 622216 583942 548009 520569
6911 520569 536799 514964 405558 546805 579043 686887 834846 679389 627285 662245 481729
6900 481729 329694 374898 381192 496965 706051 863004 837621 803117 745833 733588 740171
6889 740171 668941 628258 745597 683594 775953 752866 506485 418580 361175 435597 495186
6878D95186K8046m0221K11030K87959k10541p3726j96940K13362j23355r711j29181
6867D51908O0420J55103J84244P0516k09857l68135J92107o6945O5516J52895
6857F87772J05684L990j42552n1995J24724J03274m9564R5416j90347q9286o1335
6846E35781J3381R9476J02009K0378k31647j23581J98482O8873k87566p1065K8176
6835C52697M2529Q045j0186L5855R0590k586k4889O8341j38124K36174J95489
6824H53935n7321k40705Q1375m7199J07160K3952p2015j11107Q5981N449j11485
6813E18020j44K17443J46724j91297l7492j92953j41193j05559J36447P9013J5979
6802D44988J38963o7198J11594K50471K37289k30511j49475M3698K05996J88383
$$ plain form
6878 495186 523232 483011 694041 982000 771459 697733 500793 714155 590800 581089 451908
6867 451908 512328 667431 851675 922191 712334 344199 536306 469361 534877 687772
6857 687772 793456 797446 654894 602899 727623 830897 781333 876749 686402 597116 535781
6846 535781 549162 648638 750647 771025 539378 415797 614279 683152 395586 324521 352697
6835 352697 395226 403271 393085 428940 519530 516944 492055 560396 422272 658446 853935
6824 853935 796614 555909 637284 590085 697245 721197 649182 538075 624056 629505 518020
6813 518020 517876 735319 882043 690746 653254 460301 319108 213549 349996 429009 444988
6802 444988 583951 516753 628347 878818 1116107 885596 736121 779819 985815 1174198
6792A174198J49880m21932k76230q1527J50621J41265j06282P278o0076j5230
6782F61965J43726P3895J56643l56083j01215K8625K27964J36713l9612m435N2966
6771I81152r4892j42176q7930J34006P7092j08547q7312N9593K81996O1503k13630
6760H60855q1658K36089M0842J37553k4761p882m6894o213l3206k25656j69327
6749F79742l3209J77461R9755K316O5325j37432l7242j66907R1148n621j30592
6738F04744K02080L7232L17529P3925k35223j9223K354o9808k2567l842K946j28460
6726G61687j80056L06388L23990P1897k95839J46158n9707r2643J82605r4234
6716A070246j62965J61876l473j41516j79824J71191r3153J62106J54296l04504
$$ plain form
6792 1174198 1324078 902146 625916 544389 695010 836275 729993 737271 677195 661965
6782 661965 805691 879586 1036229 680146 578931 607556 835520 972233 932621 928186 981152
6771 981152 886260 744084 656154 790160 867252 758705 671393 730986 1012982 1074485 860855
6760 860855 779197 1015286 1056128 1193681 1168920 1161038 1114144 1107931 1074725 849069 679742
6749 679742 646533 823994 923749 926065 991390 853958 816716 649809 740957 735336 604744
6738 604744 806824 844056 1161585 1235510 1000287 981064 983418 913610 891043 887201 890147 761687
6726 761687 581631 888019 1212009 1283906 988067 1134225 1074518 981875 1164480 1070246
6716 1070246 907281 1069157 1065684 924168 744344 915535 822382 984488 1138784 834280
6706H34280N5308q9114j94759M0831J05390Q8955J54404J42521k17151p3792p8882
6695G67991j5476J61687J00264l24733M4491J62620n1929J87070k8954K23610
6685A226641l6738R6167k16749j66737J94604j22445L2337p9435J21149J265L2812
6674A082871k5887k2937K5193Q2527P2855j18516K97426j89871p307j21860J11187
6663A185681j31824k47000K8987N7610M9937J69365P5265M4715M4181K41870k40906
6652A277881o4131J61771j26381K26202J5423j35629K0402q6401l49876J62830
6642A102091n6970R9749J36288J49702j1202m5017J4824k50753L9899J97668K2655
6631A398934L1756p5683P1714o422J96374O1891K05748j16080k81111q5821m8222
$$ plain form
6706 834280 889588 800474 605715 646546 751936 840891 995295 1137816 920665 846873 767991
6695 767991 752515 914202 1014466 689733 734224 896844 844915 1031985 1003031 1226641
6685 1226641 1189903 1286070 1069321 902584 1097188 974743 1007080 927645 1048794 1050059 1082871
6674 1082871 1056984 1034047 1059240 1141767 1214622 1096106 1393532 1203661 1196354 1074494 1185681
6663 1185681 1053857 806857 835844 893454 943391 1112756 1188021 1232736 1276917 1518787 1277881
6652 1277881 1213750 1375521 1249140 1475342 1490765 1355136 1375538 1289137 939261 1102091
6642 1102091 1045121 1144870 1281158 1430860 1419658 1374641 1389465 1138712 1178611 1376279 1398934
6631 1398934 1430690 1355007 1426721 1420299 1616673 1678564 1884312 1768232 1487121 1401300 1353078
6620A353078j19532L83615m1890m7559j35294j94452M43551k0851K05631n1566
6610A774731M912q0973l8800O6652q2345m981K0357j01122k9415j6570M2603Q7890
6598A642939j63153J36465J98067j24186P2485J03151p9912J14632M8121R231
6588A957840r3036p0178k9647p9569K00426o582j09982N5156o6239j00877J34216
6577A791528J27053P3637J69584K24820j25444r3571j82296J22911N50J23339
6567B232111j68408N5458J44537n7472L3892K9887p0615k3658J87026l3321p9203
6556B250234j03993l2988L66291k431l20122J06954K90223K1151J7856J32854
6546B726029o8653p6471L10816j29219j17926j1544O0199K31339J40520K6238
$$ plain form
6620 1353078 1233546 1617161 1575271 1527712 1392418 1197966 1641517 1620666 1826297 1774731
6610 1774731 1779643 1698670 1659870 1726522 1644177 1639196 1659553 1558431 1529016 1512446 1555049 1642939
6598 1642939 1479786 1616251 1814318 1690132 1762617 1865768 1785856 1900488 1948609 1957840
6588 1957840 1864804 1794626 1764979 1685410 1885836 1879254 1769272 1824428 1758189 1657312 1791528
6577 1791528 1918581 1992218 2161802 2386622 2261178 2167607 1985311 2108222 2108772 2232111
6567 2232111 2063703 2119161 2263698 2206226 2240118 2270005 2199390 2175732 2362758 2329437 2250234
6556 2250234 2146241 2113253 2479544 2477113 2156991 2263945 2554168 2575319 2593175 2726029
6546 2726029 2657376 2580905 2891721 2762502 2644576 2633032 2693231 2924570 3065090 3091328
6536C091328j89763o7045L07351J23433j11034L6187j05291j46499J4475K16212
6526C169354J75237l0902K16518Q2722r5772J12202k42529m650K67717J51640
6516C801537Q6595M07594q7608M6772Q3948K69923L69724j36064l23090K4997
6506D544328J70003J64870K45628K15225o7202J19057K10472J46102L28767N05553
6496F582803p3107L23505M88976M65365L64764O5356J21724O81733K99362K74716
6486I595197J24746M25005O22892L60235M03538M28916M25950L23360N37029N8140
6476A3305008M61715M93624M07925L03757J14392K11623K40831K06756J84943
6467A5930574K58846K07416K76984J75124Q7443J32589J32254q2088J71149O33254
$$ plain form
6536 3091328 2901565 2834520 3141871 3265304 3154270 3190457 3085166 2938667 2953142 3169354
6526 3169354 3344591 3313689 3530207 3612929 3517157 3629359 3386830 3382180 3649897 3801537
6516 3801537 3888132 4295726 4208118 4254890 4338838 4608761 4978485 4842421 4519331 4544328
6506 4544328 4714331 4879201 5124829 5340054 5272852 5391909 5602381 5748483 6077250 6582803
6496 6582803 6509696 6833201 7322177 7787542 8152306 8217662 8339386 9021119 9320481 9595197
6486 9595197 9719943 10144948 10767840 11128075 11531613 11960529 12386479 12709839 13246868 13305008
6476 13305008 13766723 14260347 14668272 14972029 15086421 15298044 15538875 15745631 15930574
6467 15930574 16189420 16396836 16673820 16848944 16936387 17068976 17201230 17119142 17290291 17923545
6457A7923545r3063N37810L68924J76338j49640K38863M80600L53682L89180J32235
6447B0358474J63677Q4905M82173L04998J23444J03344L20247K18109J64819J65301
6437B2489491q2305j37342k72590J02099j46843j52218j33691J69060k24971k04729
6427B1405961j1841J9652k43463l66788k20652J759l83866l03706l056j11995
6417A9782005j98864l06778j89432k68245J10078j11016j12505j53483j88066
6408A8363694k00357k88114J5383J96819m68188j87781j09797j96612m54117l79037
6398A6291893j88921m31264m44906r0864k40140m63644l16886m28745l04796n56353
6388A2825374l03203m41707m27719n40791l74903l9163k59916l38238k94024j60416
$$ plain form
6457 17923545 17830482 18368292 18737216 18913554 18763914 19002777 19483377 19837059 20226239 20358474
6447 20358474 20522151 20607056 21089229 21394227 21517671 21621015 21941262 22159371 22324190 22489491
6437 22489491 22407186 22269844 21997254 22099353 21952510 21800292 21666601 21835661 21610690 21405961
6427 21405961 21394120 21413772 21170309 20803521 20582869 20584628 20200762 19897056 19894000 19782005
6417 19782005 19583141 19276363 19086931 18818686 18928764 18817748 18705243 18551760 18363694
6408 18363694 18163337 17875223 17890606 18087425 17619237 17431456 17321659 17125047 16670930 16291893
6398 16291893 16102972 15671708 15226802 15135938 14895798 14432154 14115268 13686523 13381727 12825374
6388 12825374 12522171 12080464 11652745 11111954 10737051 10697888 10437972 10099734 9805710 9645294
6378I645294j71757k26443k55541j25104l53779k19951m86582j82577K11368M8260
6368G883188r6128M3502l45126k56884p302l3508l76588l0039J0465r184K60195
6357G042591j31630j92014O7925J10672q7332k61609J31135Q4902M3717j49608
6347F658749J77031k50031k39180Q2476J45090L0114l57629J08144O1895P8641
6337F495300O1684k09040M083Q3979j62902l3940j2999J00690j43794J59804n262
6326F337603l00238J78601P0445j64330J60441N0226j86159J17936J17716o9496
6316F312745p6913L4582J99826J9691m9744j4382J28487J3056J33425j3022J12450
6305F800201K00552j76333q5546J7172M0026L1144P6984K69592m4076J46328K12980
$$ plain form
6378 9645294 9473537 9247094 8991553 8866449 8512670 8292719 7806137 7623560 7834928 7883188
6368 7883188 7787060 7830562 7485436 7228552 7221250 7187742 6811154 6781115 6791580 6782396 7042591
6357 7042591 6910961 6718947 6786872 6897544 6810212 6548603 6679738 6764640 6808357 6658749
6347 6658749 6835780 6585749 6346569 6429045 6574135 6604249 6246620 6354764 6416659 6495300
6337 6495300 6556984 6347944 6352027 6436006 6273104 6239164 6226165 6326855 6183061 6342865 6337603
6326 6337603 6037365 6215966 6286411 6122081 6282522 6332748 6146589 6264525 6382241 6312745
6316 6312745 6235832 6270414 6470240 6489931 6440187 6425805 6554292 6567348 6700773 6687751 6800201
6305 6800201 7000753 6824420 6738874 6756046 6796072 6827216 6904200 7173792 7129716 7276044 7489024
6294G489024J51911j0129J34972J07268K16579q32k95385L199M17175M72366K37874
6283H924022J92597L13199k76838P282M06804L05579N07392M11007K65375M33561
6273A1489980M10887L84542L06565N43482M76035M45003O07293O14617N66168
6264A5844572L48088N53143N54642P04784N58884R94576R98703O91389Q70743
6255B2119524Q06742J072435N15792N97960J191935R78946O97078R34566O40167
6246B9555145P71795N68212O37716P18687M43513L90038N4521L58709j9343J16492
6236C3595485n8194j46650k53399m50683k62289n71550q80932p01984n85133o03366
6226B9081305j002800q17277r66681j088867o35635q49376q89431q20045r91879
$$ plain form
6294 7489024 7640935 7630806 7765778 7873046 8089625 8088793 7793408 7796607 8213782 8686148 8924022
6283 8924022 9116619 9429818 9152980 9160262 9567066 9872645 10380037 10791044 11056419 11489980
6273 11489980 11900867 12285409 12591974 13135456 13611491 14056494 14663787 15278404 15844572
6264 15844572 16192660 16745803 17300445 18005229 18564113 19558689 20557392 21248781 22119524
6255 22119524 22926266 23998701 24514493 25112453 26304388 27283334 27980412 28914978 29555145
6246 29555145 30326940 30895152 31532868 32251555 32695068 33085106 33139627 33498336 33478993 33595485
6236 33595485 33537291 33390641 33137242 32686559 32424270 31852720 30971788 30269804 29684671 29081305
6226 29081305 28078505 27261228 26294547 25205680 24570045 23720669 22831238 22011193 21019314
6217B1019314q04556j036491o16555p88462q04642p45592o48419o22195n07240
6208A4445162n83433q57002m66436l07113l64099n21131m64120k68717l82061
6199A0231050l19104k93868m77412j27909l85368k24558k04756l11150j24943
6190G761982K27666m04008l51430o3420j9515m8791k04850n0996l35541n3377
6180F457720j83388R0491k06773k66684k8469J30602q7824j01018j34688j8762
6170E651207j67328j22754q4213m1257j48882R4295r2264O0701l3418o8890M1840
6159E089037m4375k6021q3157O3213j44588j408j88734n4906o7198P5056M7996
6148D664915K7424q0321m0979J15830q4957j0557J50144k23870k34314J9512K65546
$$ plain form
6217 21019314 20214758 19178267 18561712 17773250 16968608 16223016 15574597 14952402 14445162
6208 14445162 13861729 13004727 12538291 12231178 11867079 11345948 10881828 10613111 10231050
6199 10231050 9911946 9618078 9140666 9012757 8627389 8402831 8198075 7886925 7761982
6190 7761982 7989648 7585640 7234210 7170790 7151275 7102484 6897634 6846638 6511097 6457720
6180 6457720 6274332 6364823 6158050 5891366 5862897 5993499 5905675 5804657 5669969 5651207
6170 5651207 5483879 5361125 5276912 5235655 5086773 5181068 5088804 5149505 5116087 5047197 5089037
6159 5089037 5044662 5018641 4935484 4998697 4854109 4852701 4663967 4609061 4541863 4616919 4664915
6148 4664915 4692339 4612018 4571039 4686869 4601912 4591355 4741499 4517629 4283315 4302827 4568373
6137D568373l1617J37101K83818m32911k19512M9146k17700J35616J10697K5829
6127D408840k15652J02799j57498J80911R6591k12159P4053n7140L9811k26826
6117D033730j69536K46031K68799n0987k86430p5422M77653k03089k68573L1101
6107D003277j2760J03482r2010j14016j25395m3969P1496J19943k05949j5316
6097C688783K25393o4541J27004r4075R1937j0250r9517n1751k14320J10558K00886
6086C910107j11406n0148J29173j04916J38435j9762j96404m2750L0505Q5898
6076C768732J2606q2356J72914K008Q4983k22662j77793K0806J61852m1345l917
6065C695828j89526O1956J1705J95571p6987O6172k6600j98327j1918Q5533r8158
$$ plain form
6137 4568373 4536756 4673857 4957675 4524764 4305252 4354398 4136698 4272314 4383011 4408840
6127 4408840 4193188 4295987 4138489 4319400 4415991 4203832 4277885 4220745 4260556 4033730
6117 4033730 3864194 4110225 4379024 4328037 4041607 3966185 4443838 4240749 3972176 4003277
6107 4003277 3990517 4093999 4001989 3887973 3762578 3718609 3790105 3910048 3704099 3688783
6097 3688783 3914176 3849635 3976639 3882564 3974501 3964251 3864734 3812983 3598663 3709221 3910107
6086 3910107 3798701 3748553 3877726 3772810 3911245 3891483 3695079 3652329 3682834 3768732
6076 3768732 3781338 3698982 3871896 3873904 3958887 3736225 3558432 3579238 3741090 3699745 3695828
6065 3695828 3506302 3568258 3579963 3775534 3698547 3764719 3738119 3539792 3527874 3613407 3515249
6054C515249j27234N4541J32345J1373k24120J29771m2347K4526k6380j87648
6044C260076r3287K52532L60271k923O2346K04542j67098K06241k72928J2414
6034C822186N3831p4835k04664n8553j06011K77043P7771l2627P3637p6169r0219
6023C661390k0842M0806M9996Q1300K7711r3923K420j51823R6793K3348j04653
6012C612523L4015O5187L42192l7022j44779l3432J56013J6594l78728o277m5973
6001C580313J79635K5928r0183K06066J93936J44492j32274K49165k16493k48540
5991C892045p339J04364n002P7662J75184j33899N0171j02499J63653O6017k04942
5980D075415n1090p8852K69504o5168k41682K74927p7815J20162J56381j41153
$$ plain form
6054 3515249 3388015 3442556 3574901 3586274 3362154 3491925 3449578 3474104 3447724 3260076
6044 3260076 3166789 3419321 3779592 3776669 3839015 4043557 3876459 4082700 3809772 3822186
6034 3822186 3876017 3801182 3596518 3537965 3431954 3708997 3786768 3754141 3827778 3751609 3661390
6023 3661390 3640548 3681354 3731350 3812650 3840361 3746438 3748858 3597035 3693828 3717176 3612523
6012 3612523 3646538 3711725 4053917 4016895 3872116 3838684 3994697 4011291 3632563 3626286 3580313
6001 3580313 3759948 3785876 3695693 3901759 4095695 4240187 4107913 4357078 4140585 3892045
5991 3892045 3884706 3989070 3984068 4061730 4236914 4103015 4153186 4050687 4214340 4280357 4075415
5980 4075415 4024325 3945473 4214977 4149809 3908127 4183054 4105239 4225401 4381782 4240629
5970D240629K08257q9653N6787K8751j80247N7115L49117L0691j80311k0790l8361
5959D461985p4545M1959J68873Q7949j7707R6264j81972Q5022K75822K18p9094
5948D864774r8615l6254j19332j14265J87102K30706j212l13961J34156L72743
5938E105842l24624q9710p1119K31772n6850j51416k3232j0596M7780J10986r0335
5927D678498Q9311J68894J66369j11882K16172P346j96817N692k15485J42121
5917D950219k741K07262M4244j158J37817l8452J29900R474o4278J04657R3422
5906E570366L7800K37897N7660Q5880K2177j15594j62243o4720K07988J16074
5896E993285L5500r9793j8927K947J5663j94642L61584L7639R6138q2052j41086
$$ plain form
5970 4240629 4448886 4359233 4416020 4444771 4264524 4321639 4670756 4701447 4521136 4500346 4461985
5959 4461985 4387440 4429399 4598272 4686221 4668514 4764778 4582806 4667828 4943650 4943868 4864774
5948 4864774 4766159 4729905 4610573 4496308 4683410 4914116 4912904 4598943 4733099 5105842
5938 5105842 4781218 4691508 4620389 4852161 4795311 4643895 4620663 4610067 4657847 4768833 4678498
5927 4678498 4767809 4936703 5103072 4991190 5207362 5214708 5017891 5023583 4808098 4950219
5917 4950219 4947478 5154740 5198984 5197826 5335643 5297191 5427091 5436565 5372287 5476944 5570366
5906 5570366 5608166 5846063 5903723 5989603 6011780 5896186 5733943 5669223 5877211 5993285
5896 5993285 6028785 5928992 5910065 5913012 5928675 5734033 6095617 6133256 6229394 6147342 6006256
5885F006256M4494K01155J99956k56046j99170K26544l6495j02128J32046J17295
5875F333907Q8597J74641q0989k00368J16291J50036l9354J1118j46128j9019
5865F388732O5773P2299R7551K67883J39419l8003q2581j59617j54240j3890N467
5854F588793j4455j08249j36892K0542L13876K31957r9555J30994P4048l6169
5844F964890l81658j31533M7188j59882J14238N31842Q5874j52038p5048L34341
5834G178214Q9291K89284k12365j79850N1076j249j66943L569K71275n6777Q5164
5823G350689p9329R4187m5357K17939J18291m3384J90064N5636q840K00064j64943
5812G885017k54189o039R5054J49663N09896n6747l42388m27m1276Q2930M9844
$$ plain form
5885 6006256 6050750 6251905 6451861 6195815 5996645 6223189 6186694 6084566 6216612 6333907
5875 6333907 6422504 6597145 6516156 6315788 6432079 6582115 6542761 6553879 6407751 6388732
5865 6388732 6454505 6526804 6624355 6892238 7031657 6993654 6911073 6751456 6597216 6583326 6588793
5854 6588793 6574338 6466089 6329197 6349739 6663615 6895572 6796017 6927011 7001059 6964890
5844 6964890 6583232 6451699 6498887 6339005 6453243 6985085 7070959 6918921 6843873 7178214
5834 7178214 7267505 7556789 7344424 7164574 7215650 7214401 7047458 7051027 7322302 7265525 7350689
5823 7350689 7271360 7365547 7320190 7538129 7656420 7613036 7803100 7858736 7849896 8049960 7885017
5812 7885017 7630828 7624789 7719843 7869506 8379402 8322655 7980267 7979840 7938564 8021494 8071338
5801H071338K2667J96089q1487j91788J25962J89354M1605N8416M46314j90517
5791H687953k47807L84925J05722n9705J06517K79563J49330K5234j1915J56291
5781I576108j36106j8926Q5416J32704j4276l7520K26025j93657J20569J06818
5771I847155j02529j4439R4138K96107K49234k77228J13969p372J95394j39387
5761A0255042n6365J40684O5769J77459K52232j48203J90375K2468J30695K54783
5751A1284939l070K58663r9217L003K88344k03862q4546J94801j5125l0648J55555
5740A1748837K8543j00713K44284J50315K49130K03091K05299j48763j54661K28233
5730A2653595J56836k14333j24031K94319J3383J26380M20703K8162Q1286O8841
$$ plain form
5801 8071338 8094005 8290094 8208607 8016819 8142781 8332135 8373740 8432156 8878470 8687953
5791 8687953 8440146 8825071 8930793 8871088 8977605 9257168 9406498 9431732 9419817 9576108
5781 9576108 9440002 9421076 9506492 9639196 9624920 9587400 9813425 9619768 9740337 9847155
5771 9847155 9744626 9730187 9824325 10120432 10369666 10092438 10206407 10199035 10394429 10255042
5761 10255042 10198677 10339361 10405130 10582589 10834821 10686618 10876993 10899461 11030156 11284939
5751 11284939 11281869 11540532 11441315 11444318 11732662 11528800 11444254 11639055 11623930 11593282 11748837
5740 11748837 11777380 11676667 11920951 12071266 12320396 12523487 12728786 12580023 12425362 12653595
5730 12653595 12810431 12596098 12472067 12766386 12779769 12906149 13326852 13355014 13436300 13505141
5720A3505141k36425J58525L03900M33501K76156j05208M4189R1138j45319N205
5710A4330803L07015L59672L10174j18728o3479K8371J20414J41410O8167K29037
5700A5712856K27683q6904L60957R4349K40054K98758N3737k2178N1184N2995
5690A6983491J50262J34332J67615K50005Q5853J98046K16732J17357J43938j96202
5680A8251429J97900K56171J79243J38861n4755J22331L38299K11847K07073m9573
5670A9798826K64511J10851J90856L77528R5320M27043L59411j1665M4039J79090
5660B1835810K46025J73095p2261m9208L75941N13973M95872L27634L17826Q9259
5650B4253966J51491Q0223Q3913L06416L06835L27058K2101L89206L96353J35397
$$ plain form
5720 13505141 13268716 13427241 13731141 14164642 14440798 14335590 14379779 14470917 14325598 14330803
5710 14330803 14637818 14997490 15307664 15188936 15125457 15153828 15274242 15415652 15483819 15712856
5700 15712856 15940539 15853635 16214592 16308941 16548995 16847753 16901490 16879312 16930496 16983491
5690 16983491 17133753 17268085 17435700 17685705 17771558 17969604 18186336 18303693 18447631 18251429
5680 18251429 18449329 18705500 18884743 19023604 18968849 19091180 19429479 19641326 19848399 19798826
5670 19798826 20063337 20174188 20365044 20742572 20837892 21264935 21624346 21612681 21656720 21835810
5660 21835810 22081835 22254930 22182669 22133461 22509402 23023375 23519247 23846881 24164707 24253966
5650 24253966 24405457 24485680 24569593 24876009 25182844 25509902 25532003 25921209 26317562 26452959
5640B6452959M05177p4899M49603N47308J5996O16820m3413K40337K04171L42749
5630B9156808M15154N45121M9196J28507N14686L67918J33526K51673J54058L58722
5620C2075369M25194O84545R5360J51069N43789N85982M03718M21742N64283N11182
5610C6462233L68057J63590N74954O96871M25319K57051Q22789M37391L44007
5601D0552262O71173M40656N66088O39887O39099N01966P09545Q16068P07726
5592D6244470Q48319P05799Q46389O07732Q09514R13543P14191O93188Q33613
5583E3216758J003025J049167R01375J003084Q54479J177354R91130Q08580J066989
5574F2071941R81702Q27106J061975R90952J066325J412430J192733J007316R27130
$$ plain form
5640 26452959 26858136 26783237 27232840 27780148 27796144 28412964 28369551 28609888 28814059 29156808
5630 29156808 29571962 30117083 30166279 30294786 30809472 31177390 31310916 31562589 31716647 32075369
5620 32075369 32500563 33185108 33280468 33431537 33975326 34561308 34965026 35386768 35951051 36462233
5610 36462233 36830290 36993880 37568834 38265705 38691024 38948075 39770864 40208255 40552262
5601 40552262 41223435 41664091 42230179 42870066 43509165 44011131 44720676 45536744 46244470
5592 46244470 47092789 47798588 48644977 49252709 50062223 50975766 51689957 52383145 53216758
5583 53216758 54219783 55268950 56170325 57173409 58027888 59205242 60196372 61004952 62071941
5574 62071941 63053643 63880749 64942724 65933676 67000001 68412431 69605164 70612480 71539610
5565G1539610J441515J266944J111338J113830J241727J297650J132110J289573
5557H1434297J299357J233314J169272J035540J208903J347554J410501J628564
5549I1767302J307181J029974J118202J480738J297501J419000J343488J348986
5541A02112372J360424R29617J164540J351933R16931J252107J369316R81016
5533A11438256J370798J301781J397754J136263J083935J587272J096055J357730
5525A21769844J373750J031543J430782J302823J659572J451633J753102J798465
5517A33571514J376919J741963J809330J653377J579301J601521J931125K091807
5509A47356857K033801J897773J918028J968597J828872K301217K305090K266710
$$ plain form
5565 71539610 72981125 74248069 75359407 76473237 77714964 79012614 80144724 81434297
5557 81434297 82733654 83966968 85136240 86171780 87380683 88728237 90138738 91767302
5549 91767302 93074483 94104457 95222659 96703397 98000898 99419898 100763386 102112372
5541 102112372 103472796 104402413 105566953 106918886 107835817 109087924 110457240 111438256
5533 111438256 112809054 114110835 115508589 116644852 117728787 119316059 120412114 121769844
5525 121769844 123143594 124175137 125605919 126908742 128568314 130019947 131773049 133571514
5517 133571514 134948433 136690396 138499726 140153103 141732404 143333925 145265050 147356857
5509 147356857 149390658 151288431 153206459 155175056 157003928 159305145 161610235 163876945
5501A63876945K871352K441108J840807K438947K661120K744144K592271K802146
5493A84268840K726515K840143L133177K966765L081340L172111L140384L228641
5485B08557916K988939L258730L341810L129102L481312L219982L259620L497012
5477B34734423L207398L351785L358850K910308L049674L151253L039196K871430
5469B59674317K828747K797647K781661K814560K530492K544365K591027K350127
5461B80912943K107816K018651K291865K026898J711987J553776J222497R90545
5453B94836978J334774R47832P87810N68809L09863M8625l22471j83402n18971
5444B97809847j054202q75963j151120j305410j805066j764360j643676k046677
$$ plain form
5501 163876945 166748297 169189405 171030212 173469159 176130279 178874423 181466694 184268840
5493 184268840 186995355 189835498 192968675 195935440 199016780 202188891 205329275 208557916
5485 208557916 211546855 214805585 218147395 221276497 224757809 227977791 231237411 234734423
5477 234734423 237941821 241293606 244652456 247562764 250612438 253763691 256802887 259674317
5469 259674317 262503064 265300711 268082372 270896932 273427424 275971789 278562816 280912943
5461 280912943 283020759 285039410 287331275 289358173 291070160 292623936 293846433 294836978
5453 294836978 296171752 297119584 297907394 298476203 298786066 298834691 298512220 298328818 297809847
5444 297809847 296755645 295879682 294728562 293423152 291618086 289853726 288210050 286163373
5436B86163373k474916k660652k279702k610878l176981k876488k623866l426189
5428B64033701l108785l103711l179943l318362l418193l484472l309736l336527
5420B37773972l408775l547063l330382l302586l351158l405028l532934l600717
5412B10295329l218514l370908l511611l411719l627185l880390l332706l482428
5404A82459868l448449l400817l383589l242181l468304l052179l228798l307215
5396A55928336l407157k807283k749581k731002k806679k766885k539482k578927
5388A33541340k394016k220418k360681k440231k361090k109697k426834k130628
5380A15097745j970616j969494k131355k046861j990903k022267j869634k076770
$$ plain form
5436 286163373 283688457 281027805 278748103 276137225 272960244 270083756 267459890 264033701
5428 264033701 260924916 257821205 254641262 251322900 247904707 244420235 241110499 237773972
5420 237773972 234365197 230818134 227487752 224185166 220834008 217428980 213896046 210295329
5412 210295329 207076815 203705907 200194296 196782577 193155392 189275002 185942296 182459868
5404 182459868 179011419 175610602 172227013 168984832 165516528 162464349 159235551 155928336
5396 155928336 152521179 149713896 146964315 144233313 141426634 138659749 136120267 133541340
5388 133541340 131147324 128926906 126566225 124125994 121764904 119655207 117228373 115097745
5380 115097745 113127129 111157635 109026280 106979419 104988516 102966249 101096615 99019845
5372I9019845j746956j627418j569875j835313j766513j746105j595315j267115
5364H5865235j694106j711232j591627j222399j171896j360957j303718j167878
5356G4641422j180644j229981j291245j228843j120106j083393j099843r22596
5348F5484771r71260r64440j098378j168156r80869p59817o16080r71697r38766
5339E7015308p27960p97017o82835q19522r96811r06320n87822p82921p64355
5330D9949745m77812q35064o87378m04624n38032r26969o00588n00995o84905
5321D4293378n14918l87236o10758n30354m36908n20763n22618l43108l16546
5312D0110169n29784p43656m73807l50059l49969l03699m35847n20261k68888
$$ plain form
5372 99019845 97272889 95645471 94075596 92240283 90473770 88727665 87132350 85865235
5364 85865235 84171129 82459897 80868270 79645871 78473975 77113018 75809300 74641422
5356 74641422 73460778 72230797 70939552 69710709 68590603 67507210 66407367 65484771
5348 65484771 64513511 63549071 62450693 61282537 60301668 59541851 58925771 57954074 57015308
5339 57015308 56287348 55490331 54807496 53987974 52991163 52084843 51497021 50714100 49949745
5330 49949745 49471933 48636869 47949491 47544867 47006835 46079866 45479278 44978283 44293378
5321 44293378 43778460 43391224 42780466 42250112 41813204 41292441 40769823 40426715 40110169
5312 40110169 39580385 38836729 38362922 38012863 37662894 37359195 36923348 36403087 36134199
5303C6134199l41186m70021l67603l79739m05088k28768o47406l15105k66474
5294C2712809k78311l54136j79824n08558l18371k45853j70406n003J4525k76737
5284C0390135m79456j84976m86585M6047m5378l18970k10667K6636m04896m51828
5274B7880062l23758j36428o7748j18504k64229j19262k8313R5167k77775j0474
5264B6628738J11193k24344j47408o0512p4334J82711o9577J10038M7253N026
5254B6508784k11274M99058O0846K4757K68972Q747J91455M39324L59690M00253
5244B8550612M64948K21529O61671L31931K50737K26871M47357L56666L39769
5235C1852091N15988L65119M45679K74304L18077O17734L06324K79461M74225
$$ plain form
5303 36134199 35793013 35322992 34955389 34575650 34170562 33941794 33294388 32979283 32712809
5294 32712809 32434498 32080362 31900538 31391980 31073609 30827756 30657350 30652347 30666872 30390135
5284 30390135 29910679 29725703 29239118 29285165 29239787 28920817 28710150 28736786 28331890 27880062
5274 27880062 27556304 27419876 27352128 27233624 26969395 26850133 26821820 26916987 26639212 26628738
5264 26628738 26739931 26515587 26368179 26307667 26233333 26416044 26346467 26456505 26503758 26508784
5254 26508784 26297510 26796568 26857414 26882171 27151143 27159890 27351345 27790669 28150359 28550612
5244 28550612 29015560 29237089 29898760 30230691 30481428 30708299 31155656 31512322 31852091
5235 31852091 32368079 32733198 33178877 33453181 33771258 34388992 34695316 34974777 35449002
5226C5449002Q4709M12360N22640K44441L95875J76257K51872M84084L46873J51609
5216C8519722K10785M83898M03839K95115N21103K98829N49751j817K13985J05208
5206D1600418J33574j1044J80925j82706p8092K15792l57246l14998k01178m11889
5196D0573556k95447k16249L462l61051l51766j57251l88811l57751n64833j88151
5186C7695708Q6312k51055k35696l11839m29721k83954k77446l62293l81180n21720
5176C4727116n28850o34327q84554o21808o10986o29194n88097m40499o11215
5167B9177586p74529n93942n50393o36824o11124m84572k92729m65530l04103
5158B4463840m55466j09182N8506m6842j71169m48026p6166K09274j35830n0100
$$ plain form
5226 35449002 35533711 35946071 36468711 36713152 37109027 37285284 37537156 38021240 38368113 38519722
5216 38519722 38730507 39214405 39618244 39913359 40434462 40733291 41283042 41281225 41495210 41600418
5206 41600418 41733992 41722948 41903873 41721167 41643075 41858867 41501621 41186623 40985445 40573556
5196 40573556 40278109 40061860 40065322 39704271 39352505 39195254 38806443 38448692 37883859 37695708
5186 37695708 37782020 37530965 37295269 36983430 36553709 36269755 35992309 35630016 35248836 34727116
5176 34727116 34198266 33563939 32679385 32057577 31446591 30817397 30229300 29788801 29177586
5167 29177586 28403057 27809115 27258722 26621898 26010774 25526202 25233473 24767943 24463840
5158 24463840 24008374 23899192 23957698 23910856 23739687 23291661 23215495 23424769 23288939 23238839
5148B3238839J15292P9975J63437J47574J75190J34819O688j31252K98683K88028
5138B4517273P6120K39663j55599j99979J98696P1905N3057K41622J25335N6488
5128B5224581L20022J61590J42630k2576j41402r5829J7727J25268k5301N0795
5118B5757505J48915K06843p8529n493L71301L60324j05236M0359K10628j31671
5108B6774946p3673Q5516K06924J51158p0729K21858k04269p7321k18382k23379
5098B6572649k4636j79036j27033J6226j88157q7238k64413n1098r9578k71692
5088B5295994m55296n21241p0386j77061l87113o24758j23358K1590l04859k60437
5078B2393075l86201k80154k53299J40203J4347l13998k86026k08216j95079l79451
$$ plain form
5148 23238839 23354131 23434106 23597543 23745117 23920307 24055126 24061814 23930562 24229245 24517273
5138 24517273 24593393 24833056 24677457 24477478 24676174 24748079 24801136 25042758 25168093 25224581
5128 25224581 25544603 25706193 25848823 25826247 25684845 25589016 25606743 25732011 25706710 25757505
5118 25757505 25906420 26113263 26034734 26029241 26400542 26760866 26655630 26695989 26906617 26774946
5108 26774946 26701273 26786789 26993713 27144871 27074142 27296000 27091731 27014410 26796028 26572649
5098 26572649 26548013 26368977 26241944 26258170 26070013 25982775 25718362 25667264 25567686 25295994
5088 25295994 24840698 24319457 24249071 24072010 23684897 23060139 22936781 22958371 22653512 22393075
5078 22393075 22006874 21726720 21473421 21613624 21627971 21313973 21027947 20819731 20624652 20245201
5068B0245201n8640k52259k81617k96753j02245j75048n54045l94938r1078m22489
5058A7616089j38810k98751o18325k33584l41201k94610k21337l35823m10723
5049A4722925k98344j05090l31602o07111l91330p3213k48376l86007p498l00727
5039A1973627j82508l1374k49377k1426j00545p5391o5374O6668l2317m3084l27104
5028A0911795l42149l4147M8392J86741j99801k04154O2249J79987j1656q2267
5018A0514990q8622J21761n6296j97813L99767p3431j05798M2743P2705m3093
5008A0586913K06854J04705K21272J64077L07717J11518L39279K20476J46398
4999A2409209L04463K71825O7737K86753O22061M33948N92941M67800N30734N56492
$$ plain form
5068 20245201 20186561 19934302 19652685 19355932 19253687 19078639 18524594 18129656 18038578 17616089
5058 17616089 17477279 17178528 16560203 16326619 15985418 15690808 15469471 15133648 14722925
5049 14722925 14424581 14319491 13987889 13380778 12989448 12916235 12667859 12281852 12274354 11973627
5039 11973627 11791119 11759745 11510368 11488942 11388397 11313006 11247632 11314300 11281983 11238899 10911795
5028 10911795 10569646 10535499 10583891 10770632 10570831 10366677 10428926 10608913 10597257 10514990
5018 10514990 10426368 10548129 10491833 10294020 10693787 10620356 10514558 10557301 10630006 10586913
5008 10586913 10793767 10898472 11119744 11283821 11591538 11703056 12042335 12262811 12409209
4999 12409209 12713672 12985497 13053234 13339987 13962048 14395996 14988937 15456737 15987471 16543963
4989A6543963Q70079P85804O38654Q58247J217645J239323J119603J289004J782297
4980B6344619J880513J786591K383827K503609K897686L042049L053590L485934
4972D7378418L720746L960247L761763L976519M113276L478979L177482K923787
4964G6491217K667581K412395J733256J292905Q90600J2879o72985j097031j680977
4955H2049840k402612k728492k935481l568752l564313l655253l897764m119763
4947E5177410m012958l378870l399671k665955k538425k528344k107646k087690
4939C2457851j786143j657521j216607j674090j102412q21546q58431j069873
4931B2271228r21456r82214p61557o64560q30486q68049p59030q48793q77349
$$ plain form
4989 16543963 17414042 18199846 18838500 19696747 20914392 22153715 23273318 24562322 26344619
4980 26344619 28225132 30011723 32395550 34899159 37796845 40838894 43892484 47378418
4972 47378418 51099164 55059411 58821174 62797693 66910969 70389948 73567430 76491217
4964 76491217 79158798 81571193 83304449 84597354 85487954 85500833 84827848 83730817 82049840
4955 82049840 79647228 76918736 73983255 70414503 66850190 63194937 59297173 55177410
4947 55177410 51164452 47785582 44385911 41719956 39181531 36653187 34545541 32457851
4939 32457851 30671708 29014187 27797580 26123490 25021078 24199532 23341101 22271228
4931 22271228 21349772 20367558 19606001 18941441 18110955 17242906 16483876 15635083 14757734
4922A4757734p03396q59549n75781o68990p58794n42397l21830l93440k78946
4913I654611l02366m80283l98852l17810j81354r3255n5334j88059N8594P124
4903G703016r204k61770M0933n16673k60237L1565k57550O3693k5439m0387j44560
4892F323387J41164j15921l1658P0631r0138j68330R8531p0622l37849j58894
4882E660301n1915J02827n8613j67030p2729k52033k22482J49880M3614j19785
4872E012035k02061j11474P2454j69478j08482J61062K8809k67838j16555J08573
4862D407045J38486J3991q5002j20210k66860J95462k7801k15850P3791j75201
4852C937851o4762L91025N7115l37935J9627j18034j71010p3684K68215J4614
$$ plain form
4922 14757734 14054338 13194789 12619008 11950018 11191224 10648827 10326997 9933557 9654611
4913 9654611 9352245 8871962 8473110 8155300 7973946 7880691 7825357 7637298 7695892 7703016
4903 7703016 7693812 7432042 7472975 6956302 6696065 6727630 6470080 6533773 6508334 6467947 6323387
4892 6323387 6464551 6348630 6316972 6387603 6297465 6129135 6227666 6157044 5819195 5660301
4882 5660301 5608386 5711213 5652600 5485570 5412841 5160808 4938326 5088206 5131820 5012035
4872 5012035 4809974 4698500 4770954 4601476 4492994 4654056 4682865 4415027 4298472 4407045
4862 4407045 4545531 4559522 4474520 4354310 4087450 4282912 4255111 4039261 4113052 3937851
4852 3937851 3873089 4264114 4321229 3983294 4002921 3884887 3713877 3640193 3908408 3923022
4842C923022r5875N4485M0633q3193j4198p9577J8184j37844J35051j92930n0788
4831C516970J3768l09369J99330Q8440n4054n3011r9644j13705R4772K17428M8408
4820C549333N683l79810k09001L79179j05949K13060L14587k3137o1636k91803
4810C390506l2604l3720L8290k4268J65784O7084J16406l2232r0158K28082J35733
4799C928903K11438K66484M00357L91645M61972L23755M86743J26476K6403L28384
4789F952560K65311N52160J39856o9520O4629J74987k26538m87283k78061j63868
4779F924233j18160j26045l18225k22538m18557k68416k45193q5024k49048m68044
4769D404983j35431K2318k74048M3804q0679k6510j27011l31337q3582P5267J57696
$$ plain form
4842 3923022 3827147 3881632 3922265 3839072 3824874 3745297 3763481 3625637 3760688 3567758 3516970
4831 3516970 3530738 3221369 3420699 3509139 3455085 3402074 3302430 3188725 3283497 3500925 3549333
4820 3549333 3555016 3175206 2966205 3345384 3239435 3452495 3767082 3743945 3682309 3390506
4810 3390506 3357902 3324182 3362472 3338204 3503988 3571072 3687478 3655246 3565088 3793170 3928903
4799 3928903 4140341 4406825 4807182 5198827 5660799 5984554 6471297 6597773 6624176 6952560
4789 6952560 7217871 7770031 7909887 7840367 7904996 8079983 7853445 7366162 7088101 6924233
4779 6924233 6806073 6680028 6361803 6139265 5720708 5452292 5207099 5122075 4873027 4404983
4769 4404983 4269552 4291870 4017822 4061626 3980947 3954437 3827426 3496089 3412507 3487774 3645470
4758C645470J14371K5043r5919R1887K06700o1914l19110L1466P5598k2975j12827
4747C577790p5662o9256K02048r6062o9722j89132O1920k61775J56507l40781
4737B895875m17497J13338K65396n2475J39943Q9425K1255l66799K04034K20277
4727C112772k68359J15150J47488j46346o5960K4054k11752m7377o1285J50380
4717B748765k76177m2360n2531J32829L85369k53268k71384Q0702L20800J02937
4707B875682j00797O6427P5559M8679J89331K1469q9328j80877j89555K46710
4697B963300Q0611o8331o2550K10833l0843m0450o1551K1058P4520k4762R0644
4686C152479K6558J26149P90K00J24892J93194o9807K67965l68456k88782L85150
$$ plain form
4758 3645470 3759841 3784884 3688965 3780852 3987552 3925638 3606528 3637994 3713592 3690617 3577790
4747 3577790 3502128 3432872 3634920 3538858 3469136 3280004 3341924 3080149 3236656 2895875
4737 2895875 2478378 2591716 2857112 2804637 2944580 3034005 3055260 2688461 2892495 3112772
4727 3112772 2844413 2959563 3107051 2960705 2894745 2918799 2707047 2659670 2598385 2748765
4717 2748765 2472588 2430228 2377697 2510526 2895895 2642627 2371243 2451945 2772745 2875682
4707 2875682 2774885 2841312 2916871 2965550 3154881 3176350 3087022 2906145 2716590 2963300
4697 2963300 3043911 2975580 2913030 3123863 3093020 3052570 2991019 3012077 3086597 3061835 3152479
4686 3152479 3179037 3305186 3305976 3306176 3431068 3624262 3554455 3822420 3453964 3165182 3550332
4675C550332J76265k8872J85347M23367q2080j76198n7440j43388K48330R6351
4665D192014r2498M12406K11731L10692j72979j43286K98162n4360O7781K09216
4655E238879J0040o667j47643L38633L32065K71389J61672L70954J13463K67811
4645F950596M70403M22518M00389L77489O76813M61733N36632R02342J209104
4636A2408019J041675J203052J681697J812649K238029K673441K772345K472927
4628B8303834K253686K456577K161507J996324K106701K088207K199044K144459
4620D5710339J366543O57282L73483N83340O24190L83511O45938M65420J04434
4611E0914480L26356M92291Q07927J754056K411962K878699L610643M222154M675261
$$ plain form
4675 3550332 3726597 3697725 3883072 4306439 4224359 4048161 3990721 3847333 4095663 4192014
4665 4192014 4099516 4511922 4723653 5034345 4861366 4718080 5016242 4961882 5029663 5238879
4655 5238879 5248919 5242252 5094609 5433242 5765307 6036696 6198368 6569322 6682785 6950596
4645 6950596 7420999 7843517 8243906 8621395 9298208 9759941 10296573 11198915 12408019
4636 12408019 13449694 14652746 16334443 18147092 20385121 23058562 25830907 28303834
4628 28303834 30557520 33014097 35175604 37171928 39278629 41366836 43565880 45710339
4620 45710339 47076882 47734164 48107647 48690987 49315177 49698688 50344626 50810046 50914480
4611 50914480 51240836 51733127 52541054 54295110 56707072 59585771 63196414 67418568 72093829
4602G2093829M877491M483714M848220N282081N451516N812628N766393N891229
4594A14507101N931072M974178M612012L822978L650091L378954L078925K781659
4586A46736970K369074J269549k27990j018535j722063k076163k423949k922731
4578A39984162l109918m106842m940699n383578o202650n781089n825238n985322
4570I8648826n894161n935733o156595n871891n980774n919315n610071n036865
4562E2243421m776691m505103l920850l834265l394616l381622l329094k460725
4554B2640455k042057k200458j968245j295649j183901j222195j076926j007769
4546A0643255r79000m69924o07080m78792n15474j81796l35199n44821l03227
$$ plain form
4602 72093829 76971320 81455034 86303254 91585335 97036851 102849479 108615872 114507101
4594 114507101 120438173 125412351 130024363 133847341 137497432 140876386 143955311 146736970
4586 146736970 149106044 150375593 150147603 149129068 147407005 145330842 142906893 139984162
4578 139984162 136874244 132767402 127826703 122443125 116240475 110459386 104634148 98648826
4570 98648826 92754665 86818932 80662337 74790446 68809672 62890357 57280286 52243421
4562 52243421 47466730 42961627 39040777 35206512 31811896 28430274 25101180 22640455
4554 22640455 20598398 18397940 16429695 15134046 13950145 12727950 11651024 10643255
4546 10643255 9664255 9194331 8587251 8108459 7592985 7411189 7075990 6531169 6227942
4537F227942n04010j96262j51084k90987q1950J197k45814k07323j69944M322
4527D386087K8480l7475J02317l15920k1500k06642l4108o429q1528P8240j08132
4516C783390k63012k70059O7619K4481j5341Q0682P73l28801R4955J72281k24930
4505C122038q1197p1981j67742j1788K84782j28587j93929L03812j3919l04185
4495B737304k48685R6090j56683p2155K38927O7654k388j11120l86004M04126
4485B567066j93006K6120N2937m24994K31874K25621M1161R5591J29411Q5924
4475B837705k50709r7701J05758l86605L1524j4200o150J10530j34754J38816
4465B334214j40471k78251J71751m7397M8711L9202K89971l26956J11451L255
$$ plain form
4537 6227942 5723932 5527670 5376586 5085599 5003649 5004846 4759032 4551709 4381765 4386087
4527 4386087 4414567 4377092 4479409 4163489 4141989 3935347 3901239 3894810 3813282 3891522 3783390
4516 3783390 3520378 3250319 3317938 3342419 3327078 3407760 3408533 3079732 3174687 3346968 3122038
4505 3122038 3040841 2968860 2801118 2789330 3074112 2945525 2751596 3055408 3041489 2737304
4495 2737304 2488619 2584709 2428026 2355871 2594798 2662452 2660064 2548944 2162940 2567066
4485 2567066 2374060 2400180 2453117 2028123 2259997 2485618 2526779 2622370 2751781 2837705
4475 2837705 2586996 2489295 2595053 2208448 2239972 2225772 2219622 2330152 2195398 2334214
4465 2334214 2193743 1915492 2087243 2039846 2088557 2127759 2417730 2090774 2202225 2205480
4455B205480j66688J54042O3750r1351l23526O3412K08815l6417j73145j8908
4445A885464j16672Q1614j88818N0819N7217j55777K5425K00815Q3109M680l00789
4434A627087l63881Q7400M64962K5209l79676r205L25570k7472Q792p7504m28656
4423A252626J45973K84314l58814k9385J57817m9053Q0926k5142O539M8623M0952
4412A555376j92156J03471J79947J10534m8694j64049j9671J07715j51493M022
4402A485002j04974K3069N8894k50003J25538L75599k32299k03200J95245n8160
4392A414711N5076q8819o3842K28311L0806m966Q754j39835j5952Q0455m1496
4381A463203k5043J12133o0821Q2293J66765K74223o3327m22435k95418K76603
$$ plain form
4455 2205480 2038792 2192834 2256584 2165233 1841707 1905119 2113934 2077517 1904372 1885464
4445 1885464 1768792 1850406 1661588 1712407 1769624 1613847 1639272 1840087 1923196 1927876 1627087
4434 1627087 1263206 1350606 1815568 1840777 1461101 1451896 1777466 1749994 1758786 1681282 1252626
4423 1252626 1398599 1682913 1324099 1294714 1452531 1403478 1484404 1459262 1465801 1514424 1555376
4412 1555376 1363220 1466691 1646638 1757172 1708478 1544429 1524758 1632473 1480980 1485002
4402 1485002 1380028 1403097 1461991 1211988 1337526 1713125 1480826 1277626 1472871 1414711
4392 1414711 1469787 1380968 1317126 1545437 1576243 1571277 1580031 1440196 1424244 1504699 1463203
4381 1463203 1438160 1550293 1489472 1571765 1738530 2012753 1949426 1526991 1231573 1508176
4371A508176K01416J35064j8177n5151O5979L3924k05325o756J30141K24924J09427
4360B123642j66736j77664j2139M1511j01921J05662J56735K5186P5654j3271
4350B056659j94811Q3106J12497J15396l8519J15358K56450k13976J52587j18067
4340B326680k21764K4434J67376J89815J6186m9278K51620Q420P755J89660j73475
4329B737429q3795J47461P8157o2224K5607j16939o30Q3797K87694P4070O21J7887
4317C189135j15205K6112J82963J86667p0599o672K18414n0861N3110k70176J61357
4306C504245J24925j23322O8654R4205Q9047M7800j5003j32314K8312J84990K97662
4295D169201r8975J42070J27920K5793O4174R5107k3132M1871K47786N6769R2744
$$ plain form
4371 1508176 1709592 1844656 1826479 1771328 1837307 1871231 1665906 1659150 1789291 2014215 2123642
4360 2123642 1956906 1779242 1767103 1808614 1706693 1812355 1969090 1994276 2069930 2056659
4350 2056659 1861848 1944954 2057451 2172847 2134328 2249686 2506136 2292160 2444747 2326680
4340 2326680 2104916 2129350 2296726 2486541 2502727 2453449 2705069 2713489 2721244 2910904 2737429
4329 2737429 2653634 2801095 2879252 2817028 2842635 2725696 2725066 2808863 3096557 3170627 3171248 3189135
4317 3189135 3073930 3100042 3283005 3469672 3399073 3392401 3610815 3559954 3613064 3342888 3504245
4306 3504245 3629170 3505848 3574502 3668707 3757754 3805554 3790551 3658237 3686549 3871539 4169201
4295 4169201 4070226 4212296 4340216 4366009 4430183 4525290 4502158 4544029 4791815 4848584 4941328
4284D941328Q1609J66781J14212l5601k0565L48755J58555j06428N0514M73254
4274F172414P4231J4031K56113J05105K83222M56077n0416J81547K890J24615
4264G619829O99053M13973J60200M65514P80884M40903L7897M82190O02244N32617
4254A2235304N57534N69692Q04502Q55377P36876P63937O90225J250856J310821
4245A9775124P19142J076642J314356R44329J213377J288243J342316J359915
4237B9033444J266241J430110J589804J526878J621204J384694J402822J720173
4229D0975370J523863J467074J433811J547291J289535J390081J246698J394121
4221E2267844J197535J188373J075179R44359Q53431Q28588Q55769N76747M98114
$$ plain form
4284 4941328 5022937 5189718 5303930 5268329 5247764 5596519 5755074 5648646 5699160 6172414
4274 6172414 6246645 6260676 6516789 6621894 6905116 7361193 7310777 7492324 7495214 7619829
4264 7619829 8318882 8732855 8893055 9358569 10139453 10580356 10618253 11100443 11702687 12235304
4254 12235304 12792838 13362530 14167032 15022409 15759285 16523222 17213447 18464303 19775124
4245 19775124 20494266 21570908 22885264 23829593 25042970 26331213 27673529 29033444
4237 29033444 30299685 31729795 33319599 34846477 36467681 37852375 39255197 40975370
4229 40975370 42499233 43966307 45400118 46947409 48236944 49627025 50873723 52267844
4221 52267844 53465379 54653752 55728931 56673290 57526721 58355309 59211078 59787825 60285939
4212F0285939L86069L00536K32931K63817J54671j27038j29848m72329m66248
4203F0428500m63121q16333n15582p49443o10997p83976j241689r89668j136889
4194E3120802j231468j315875j266171j200552j313773j237666j279174j700647
4186D2575476j240064j181489j369684j412463j105669j626883j352796j160300
4178C2126128j176130j398803j024572q69555j130525j405457r57137r79093j027059
4169B2157797r45613j052649p73354p64065r39870p46075n63350q28001o84469
4160A4860351m51369l66349n79230m14873n73006n50887l66202l05665l28374
4151A0924396n23769k35416l9166l44318j84786j86503l23375m16550l73134k31118
$$ plain form
4212 60285939 60672008 60972544 61205475 61469292 61623963 61496925 61367077 60894748 60428500
4203 60428500 59965379 59149046 58633464 57884021 57273024 56489048 55247359 54257691 53120802
4194 53120802 51889334 50573459 49307288 48106736 46792963 45555297 44276123 42575476
4186 42575476 41335412 40153923 38784239 37371776 36266107 34639224 33286428 32126128
4178 32126128 30949998 29551195 28526623 27657068 26526543 25121086 24163949 23184856 22157797
4169 22157797 21212184 20159535 19386181 18622116 17682246 16936171 16372821 15544820 14860351
4160 14860351 14408982 14042633 13463403 13048530 12475524 11924637 11558435 11252770 10924396
4151 10924396 10400627 10165211 10126045 9781727 9596941 9410438 9087063 8670513 8297379 8066261
4141H066261M022M605N477k53402k56231o8436n016J18920p3688J62965p4215
4130G631262m05396k4600J6085R6764j28976J59846J57359j83105J6571M335J38147
4119G478292L79960j69849J05603L65605J45722J04579p4499J30190N9141Q4807
4109H609551J68691J92442K93032K0623L06056K41610K78372K40816L87489K73322
4099A1012004j72169K88236K67226K94987N62162K52170L69683M11236M08696
4090A3694231M01964M35333N74321O97749N21871N89376R18500Q08065R53963
4081A9595373R63415O91414J026753J011310J045490J193395J683343J613584
4073B8824077J476397J663171J891519K105091K238906K705687K851418L124268
$$ plain form
4141 8066261 8070283 8074888 8080365 7826963 7570732 7502296 7497280 7616200 7542512 7705477 7631262
4130 7631262 7225866 7201266 7217351 7314115 7185139 7344985 7502344 7319239 7335810 7340145 7478292
4119 7478292 7858252 7688403 7794006 8159611 8305333 8409912 8335413 8465603 8524744 8609551
4109 8609551 8778242 8970684 9263716 9284339 9590395 9832005 10110377 10351193 10738682 11012004
4099 11012004 10839835 11128071 11395297 11690284 12252446 12504616 12874299 13285535 13694231
4090 13694231 14096195 14531528 15105849 15803598 16325469 16914845 17833345 18641410 19595373
4081 19595373 20558788 21250202 22276955 23288265 24333755 25527150 27210493 28824077
4073 28824077 30300474 31963645 33855164 35960255 38199161 40904848 43756266 46880534
4065D6880534L342015L669304L353765L676373M199457M335252M544927M729976
4057G8731603M764305N056452N281820N141343N362919N038592M932959M351525
4049A18661518M159279L665549L508028K900821K436921K083465J503173N57936
4041A39476690k27815j133883j519001k005000k803431k915776l606764m304330
4033A20960690m638009m570765m698226m790177m575705m582299m572850m514072
4025H4018587m639065m301511m206553m164136m021841l790454l544480l089954
4017E2260593k929722l001260l125934k726202k572450j812522k052283k140252
4009C1899968j970065j500201j649699j354306j286022j331510j069875q66784
$$ plain form
4065 46880534 50222549 53891853 57245618 60921991 65121448 69456700 74001627 78731603
4057 78731603 83495908 88552360 93834180 98975523 104338442 109377034 114309993 118661518
4049 118661518 122820797 126486346 129994374 132895195 135332116 137415581 138918754 139476690
4041 139476690 139248875 138114992 136595991 134590991 131787560 128871784 125265020 120960690
4033 120960690 116322681 111751916 107053690 102263513 97687808 93105509 88532659 84018587
4025 84018587 79379522 75078011 70871458 66707322 62685481 58895027 55350547 52260593
4017 52260593 49330871 46329611 43203677 40477475 37905025 36092503 34040220 31899968
4009 31899968 29929903 28429702 26780003 25425697 24139675 22808165 21738290 20871506
4001B0871506o87771p15332o73743o33540o48111p11431n72080l90601o41727
3992A5197170p10335n32537j54855k18685k99613m20187n25502k91508j45691
3983A1898257j48002j10973j76715k59667k46304j54378j65831k16050r4348K7127
3973A0353116k73586j35984R6461j85684j98491j12445J15064O4797J57150j7578
3963I862820K22844o4328K64174M44841K43915J41857K94364K40404L87115O35694
3953A2673700O02552P16554J105480J058944Q76015J127699J153063J638022J300764
3944B2252793J327502J761830J804233J504592J412186J761825J548583J481857
3936C4855401J489836J425850J201774J089456J121229R19630P01730N18848O7406
$$ plain form
4001 20871506 20183735 19468403 18794660 18161120 17513009 16801578 16229498 15838897 15197170
3992 15197170 14486835 13954298 13799443 13580758 13281145 12860958 12335456 12043948 11898257
3983 11898257 11750255 11639282 11462567 11202900 10956596 10802218 10636387 10420337 10325989 10353116
3973 10353116 10079530 9943546 10040007 9854323 9655832 9543387 9658451 9723248 9880398 9862820
3963 9862820 10085664 10021336 10285510 10730351 10974266 11116123 11410487 11650891 12038006 12673700
3953 12673700 13276252 13992806 15098286 16157230 17033245 18160944 19314007 20952029 22252793
3944 22252793 23580295 25342125 27146358 28650950 30063136 31824961 33373544 34855401
3936 34855401 36345237 37771087 38972861 40062317 41183546 42103176 42804906 43323754 43391160
3927D3391160K24438k49263l20434n70274m33229o56848j120010j010445j318747
3918C7936348j298150j663947j508243j549357j543149j499167j657650j904585
3910B5312100j557238j503475j184989j342900j374824j238921j047518q02105
3902A5260130r45370p95234j073926m97583n50687n15969m32905l96125j53121
3893I899210m56095m56725o0798j62831n07965k70475m6436j62435o0754p6647
3883G638049L72634K10044l3162q6329k44211L6832R1906Q4292J48832k350Q8431
3872H304968P3032K43410J15612M31998J93413K7894K83487M92764L89911N22425
3862A1078914L72345L78482N15306J83672N50626N79435Q32268M60665M67194
$$ plain form
3927 43391160 43615598 43366335 43045901 42475627 42042398 41385550 40265540 39255095 37936348
3918 37936348 36638198 34974251 33466008 31916651 30373502 28874335 27216685 25312100
3910 25312100 23754862 22251387 21066398 19723498 18348674 17109753 16062235 15260130
3902 15260130 14314760 13519526 12445600 11948017 11397330 10881361 10448456 10052331 9899210
3893 9899210 9443115 8986390 8925592 8762761 8254796 7984321 7937885 7775450 7714696 7638049
3883 7638049 8010683 8220727 8187565 8101236 7857025 7893857 7985763 8070055 8218887 8216537 8304968
3872 8304968 8378000 8621410 8737022 9169020 9362433 9390327 9673814 10166578 10556489 11078914
3862 11078914 11451259 11829741 12345047 12528719 13079345 13658780 14491048 14951713 15418907
3853A5418907L19250M40080N35987M93888K42996Q60293L96327R5994J98988N43697
3843A9546407M94217J08805M31455M97071J96155j03401Q0680P6525K47073K65889
3833B1840876J69986p9086k15174j70419L4079M9762K42509J4893p4815k26646
3823B1585965K9591J20734j0276J48154J98627O1010M12685M76079N76595P76029
3813B4375193O16836R04544J019910Q79511J147689J440237J152772J323681J542376
3804C4402749J896882J872203J825289J992096J931492K170022K262962K119982
3796E0473677K052966K141350K355614K439583J982112J873494J875774J647124
3788F6841694J841553J561347J694318J628485J384482J204135J119899R41633
$$ plain form
3853 15418907 15738157 16178237 16714224 17208112 17451108 18311401 18707728 18803722 19002710 19546407
3843 19546407 20040624 20149429 20580884 21077955 21274110 21170709 21251389 21327914 21574987 21840876
3833 21840876 22010862 21931776 21716602 21546183 21580262 21630024 21872533 21887426 21812611 21585965
3823 21585965 21615556 21736290 21726014 21874168 22072795 22133805 22546490 23022569 23599164 24375193
3813 24375193 24992029 25896573 26916483 27795994 28943683 30383920 31536692 32860373 34402749
3804 34402749 36299631 38171834 39997123 41989219 43920711 46090733 48353695 50473677
3796 50473677 52526643 54667993 57023607 59463190 61445302 63318796 65194570 66841694
3788 66841694 68683247 70244594 71938912 73567397 74951879 76156014 77275913 78217546
3780G8217546R27230P94068R74337O89162N29446K94637N40468J46351J46224
3771H3259469K16812J82456K23441l40280k160P2555j61745j97996L1133j40559
3761H3143126j90117k91106m42966n69223n07657n22898m29935j022835m56732
3752G8709657n49669j091823r64552j046941j194568j525182j487669j189577
3744F9659676j791379j867456j745104j594278j857633j769710k274752k210007
3736E4549357k231973k042051j602134k107189k071046k167177j795499j878849
3728C8653439j649096j500779j713009j479892j237228j412676j322391r86483
3720B7351885p09693r95383q77496o72990m81460l47146o42331n62298k20042
$$ plain form
3780 78217546 79144776 79938844 80913181 81602343 82131789 82426426 82966894 83113245 83259469
3771 83259469 83476281 83658737 83882178 83541898 83539738 83612293 83450548 83252552 83283685 83143126
3761 83143126 82953009 82661903 82218937 81649714 81142057 80619159 80189224 79166389 78709657
3752 78709657 78159988 77068165 76103613 75056672 73862104 72336922 70849253 69659676
3744 69659676 67868297 66000841 64255737 62661459 60803826 59034116 56759364 54549357
3736 54549357 52317384 50275333 48673199 46566010 44494964 42327787 40532288 38653439
3728 38653439 37004343 35503564 33790555 32310663 31073435 29660759 28338368 27351885
3720 27351885 26642192 25646809 24769313 24096323 23614863 23267717 22625386 22063088 21843046
3711B1843046j47598k26540j9971J716k30108k15268K8766k92488P7085Q7892
3701B0906532J36876J50445q8732M4176j28540l27562l20987k29981m15523j07303
3691A9619401j4969j81688p49696n73392j2249k48227p48165n35953m74779k43334
3681A5836949n63025n47475o17295o63417n28618n89790n17563k62897k71932
3672A1274937n40696m95053m36008l75232n59896k74531l20944n42510j04354
3663G625713k41669m43421m9930m20874j23489j33704m14468l57601m2176o4825
3653E333556o0822Q4781j30751j27436j04780l15925k25370j31811j55702R3253
3643D258993m15213J9721M3783j06380j10225k0017j10324r5183K76158k3623
$$ plain form
3711 21843046 21695448 21468908 21448937 21450653 21220545 21005277 21034043 20741555 20818640 20906532
3701 20906532 21043408 21193853 21105121 21149297 21020757 20693195 20372208 20142227 19726704 19619401
3691 19619401 19604432 19422744 18673048 18099656 18087407 17839180 17091015 16555062 16080283 15836949
3681 15836949 15273924 14726449 14109154 13445737 12917119 12327329 11809766 11546869 11274937
3672 11274937 10734241 10239188 9803180 9427948 8868052 8593521 8272577 7730067 7625713
3663 7625713 7384044 6940623 6890693 6469819 6346330 6212626 5798158 5440557 5398381 5333556
3653 5333556 5272734 5357515 5226764 5099328 4994548 4678623 4453253 4321442 4165740 4258993
3643 4258993 3843780 3863501 3907284 3800904 3690679 3670662 3560338 3465155 3741313 3717690
3633C717690q0284k43272R2710J89683j76657J19032k67498j51489l47384j63888
3623B688643J46686J13281J8158j36972j10336k10875j40276J34492J37030p5905
3613B563926l13998k93580K98189J32386P4345K957j63182j02477L4879m5987
3603B187458P8266K21035r8685j45100k97036p4493K70058k56532K99345J01942
3593B286258k13136M7843j41506P1813M35614j91960k5268j62044j3041Q2647
3583B177220m2827l1071r520R4157l13889j44073L01425k7605k29624K2204P6895
3572A873292L03669k10703j09098m3172J44190J74998l59282r3819N923O2639
3562A748637m2420K5682j12299L6316K35318r0108k09152j15146Q1235M37483
$$ plain form
3633 3717690 3637406 3394134 3486844 3676527 3499870 3618902 3351404 3199915 2852531 2688643
3623 2688643 2835329 2948610 2966768 2829796 2719460 2508585 2368309 2502801 2639831 2563926
3613 2563926 2249928 1956348 2254537 2386923 2461268 2464225 2301043 2198566 2233445 2187458
3603 2187458 2265724 2486759 2388074 2242974 1945938 1871445 2141503 1884971 2184316 2286258
3593 2286258 2073122 2120965 1979459 2051272 2486886 2294926 2269658 2107614 2094573 2177220
3583 2177220 2134393 2103322 2093802 2187959 1874070 1729997 2031422 2003817 1774193 1796397 1873292
3572 1873292 2176961 1966258 1857160 1813988 1958178 2133176 1773894 1680075 1685998 1748637
3562 1748637 1706217 1731899 1619600 1655916 1891234 1801126 1591974 1476828 1558063 1995546
3552A995546Q6838l43180j76598K6102J21952j39051NJ75136J2614O1671J68556
3541A989591K2793k07258J24478p2384k12611j86966j1185R8484j98801J24906
3531A471047J55265n7267J2557L4591r9856k533J57633k12247j61140J70463P8267
3520A546780j2670k25275j16589K90827J06033l7951k83482J5284O0408k0833
3510A322532k5790l5828j9120J88870J75310q4395J38672J21640J15125k9595
3500A867421j15836j1904j4082l9833p0503p9179O4062m4124N5524n0897J42717
3489A703366j98240n454o8546P5177l38426L86048M995m0119K25724r6365k7394
3478A620766P1745J8283O9083r5792k9999k17779M6343K52321j1072k01113L22170
$$ plain form
3552 1995546 2082384 1739204 1562606 1588708 1710660 1571609 1571614 1746750 1759364 1821035 1989591
3541 1989591 2012384 1805126 1929604 1857220 1644609 1457643 1446458 1544942 1346141 1471047
3531 1471047 1626312 1569045 1581602 1616193 1516337 1513804 1671437 1459190 1298050 1468513 1546780
3520 1546780 1534110 1308835 1192246 1483073 1589106 1551155 1267673 1282957 1343365 1322532
3510 1322532 1296742 1260914 1241794 1430664 1605974 1521579 1660251 1781891 1897016 1867421
3500 1867421 1751585 1739681 1725599 1685766 1615263 1536084 1600146 1556022 1611546 1560649 1703366
3489 1703366 1505126 1499672 1431126 1506303 1167877 1553925 1558920 1518801 1744525 1648160 1620766
3478 1620766 1692511 1710794 1779877 1684085 1654086 1436307 1482650 1734971 1723899 1522786 1844956
3467A844956j41788r7778K45305l23590p9786K0911J47370j25306J65817J88747
3457A844858r9717k76877l0225k68102L83789l776K07K3300R2125O7198J34605
3446A867385j6514l94137K13130J10562P9270r409l94711K0108L15266J48393
3436A939343J0829p5776K5416J62970K86429J35320j59099p8779K61011r8751
3426B408913J31345k5545j71674M3931j87475p6795j980J07773l2230o5608o0496
3415B070159l151j06236J46640j34115j67169j91840m4813L2960L7097K0552n2249
3404A607835O4675J13376q5745l0908j5291j28418o6432n3429J8042r14M5211
3393A468002k22799j31310K36264k34727l6880J20491j5565L74o847J1045j9114
$$ plain form
3467 1844956 1703168 1605390 1850695 1527105 1447319 1468230 1615600 1490294 1656111 1844858
3457 1844858 1745141 1468264 1438039 1169937 1553726 1549950 1550157 1573457 1665582 1732780 1867385
3446 1867385 1850871 1456734 1669864 1780426 1859696 1850287 1455576 1475684 1790950 1939343
3436 1939343 1950172 1874396 1899812 2062782 2349211 2484531 2325432 2246653 2507664 2408913
3426 2408913 2540258 2514713 2343039 2386970 2199495 2122700 2120720 2228493 2196263 2130655 2070159
3415 2070159 2067008 1960772 2107412 1973297 1806128 1614288 1569475 1602435 1639532 1660084 1607835
3404 1607835 1672510 1785886 1700141 1669233 1653942 1525524 1459092 1405663 1423705 1422791 1468002
3393 1468002 1245203 1113893 1350157 1115430 1078550 1199041 1183476 1183850 1177003 1188048 1168934
3382A168934L6501k00339p2145K96991K07044J1555n5673j47043l0848K45159
3372A460136j27090l4171r2302q7211k28741k56140J05125L78865K53659J61337
3362A533467K17110J5282j16502o0637p5225J3985J89698L8806j41759m3636k4946
3351A545643K25262L17941j43425N3050J08849p4711k77766l2226P3325j54473
3341A641469J6321k3142N1123O1787j54901J02380j3421k6249j25303j97443R5490
3330A428111q9147l7859J00500k37583J58199J76267k289o3725L71751O2533K7454
3319A894212J02288r9306r4273J63292J91079L58767J18700M5461l2421J18995
3309B766794N00295P53575L68508L56164N55165Q79091M21415K82043O73233L84522
$$ plain form
3382 1168934 1205435 1005096 932951 1229942 1436986 1448541 1392868 1245825 1214977 1460136
3372 1460136 1333046 1298875 1206573 1119362 890621 634481 739606 1118471 1372130 1533467
3362 1533467 1750577 1765859 1649357 1588720 1513495 1527480 1717178 1755984 1614225 1570589 1545643
3351 1545643 1770905 2088846 1945421 1998471 2107320 2032609 1754843 1722617 1795942 1641469
3341 1641469 1657790 1634648 1685771 1747558 1592657 1695037 1681616 1655367 1530064 1332621 1428111
3330 1428111 1338964 1301105 1401605 1164022 1322221 1498488 1496199 1432474 1804225 1866758 1894212
3319 1894212 1996500 1897194 1802921 1966213 2157292 2516059 2634759 2680220 2647799 2766794
3309 2766794 3267089 4020664 4389172 4745336 5300501 6179592 6601007 6883050 7556283 7940805
3299G940805M40101K89082K21717Q644N36372r2167k53850r1294n8056j22738
3289H818616l99485m54125l63468k62045q45376m55376m4377j73943j68687J51154
3279E802888L42384L89471M58137M98173Q28972P78584R73925J027644O28975
3270A1729153P51085Q62882R48885O94007K93637Q21012O64987J91671o1264j96721
3260A6699334l93797n06834n73858p89860j338113q95853j134420j350677r45928
3251H769994q55260m18605l51358l59292k46891k32800J8218J25969N9479J64524
3241F673978L12151M95919o2590j3294J62721K43841N16173K55795K61505J17827
3231H964026Q6323J40187m09503l21681l67873l03772l79951o94464n80067m92122
$$ plain form
3299 7940805 8380906 8669988 8891705 8900349 9436721 9344554 9090704 8999410 8941354 8818616
3289 8818616 8419131 7965006 7601538 7339493 6494117 6038741 5994364 5820421 5651734 5802888
3279 5802888 6145272 6534743 6992880 7491053 8320025 9098609 10072534 11100178 11729153
3270 11729153 12480238 13343120 14292005 14986012 15279649 16100661 16765648 16957319 16896055 16699334
3260 16699334 16305537 15798703 15224845 14434985 13096872 12201019 11066599 9715922 8769994
3251 8769994 7914734 7496129 7144771 6785479 6538588 6305788 6324006 6449975 6509454 6673978
3241 6673978 6986129 7482048 7419458 7406164 7568885 7812726 8328899 8584694 8846199 8964026
3231 8964026 9050349 9190536 8781033 8459352 8091479 7787707 7407756 6713292 6133225 5641103
3221E641103m72058m24670n36683m77152k18459n46927l31737o3455j91755N3329
3211B431536j37766l46988M768J42214k7580j75898K74499J48735j89446r258
3201B114816M4850j7327N7204J67075K24388L8689L29363n3345k95740J42341
3191B752314J06465K17655j50381k66411m2916k9074J21078m40699k91401J76659
3181B153289l38623l5278K82933J14095l59213J35483L36792j59157J43365L1121
3171B304807K14347K88436j6705L5776j62644o0665j38598n1404j82458J94756
3161B425648J04356N4623r0022m05260p0273n5582j22982J08620n4007q4415k22
3150A810484k22166m64393n7164L47520j21250J0684J62382l01556l07161J5653
$$ plain form
3221 5641103 5169045 4744375 4207692 3730540 3512081 2965154 2633417 2569962 2378207 2431536
3211 2431536 2293770 1946782 1951550 2093764 2066184 1890286 2164785 2313520 2124074 2114816
3201 2114816 2159666 2142339 2199543 2366618 2591006 2629695 2959058 2905713 2609973 2752314
3191 2752314 2858779 3076434 2926053 2659642 2616726 2587652 2708730 2268031 1976630 2153289
3181 2153289 1814666 1779388 2062321 2176416 1817203 1952686 2289478 2130321 2273686 2304807
3171 2304807 2519154 2807590 2790885 2826661 2664017 2603352 2464754 2413350 2230892 2425648
3161 2425648 2530004 2584627 2494605 2089345 2019072 1963490 1840508 1949128 1895121 1810706 1810484
3150 1810484 1588318 1123925 1066761 1414281 1293031 1303715 1466097 1164541 857380 873033
3140H73033K00329j3650o9288K77742k27031o8969m2158o6945J22437k81958k4047
3129F79495K03943m5360j52913J29827K83736n8075P5070P0943k7622L3362J94513
3118A386919l2592j88614m38833j20218K30047N4479j0306j83374M6846J64384
3108I08738r1036K1978J0533O3093R3987j9496l11240Q7956N5306L01707k42240
3097H79286l28868J77580K98976j21935J49347J05166Q2432j61228j78433K30777
3087A133100j60620r3364j86820J26375L42386j0406k50905L20149O116k4632
3077A201379l9041j11504j6257j69196j51476K28089j96289K17466K29325j44860
3067A047636p7889j72173K9380M12779k07702j06290R5649j80390J11669r935
$$ plain form
3140 873033 1073362 1059712 990424 1268166 1041135 972166 930008 863063 985500 703542 679495
3129 679495 883438 838078 685165 814992 1098728 1040653 1115723 1186666 1159044 1192406 1386919
3118 1386919 1354327 1165713 726880 606662 836709 891188 880882 697508 744354 908738
3108 908738 817702 839680 850213 913306 1007293 987797 676557 764513 819819 1121526 879286
3097 879286 550418 727998 1026974 905039 1054386 1159552 1241984 1080756 902323 1133100
3087 1133100 972480 879116 692296 818671 1161057 1150651 899746 1219895 1226011 1201379
3077 1201379 1162338 1050834 1034577 865381 713905 941994 745705 963171 1192496 1047636
3067 1047636 969747 797574 826954 1239733 1032031 925741 1021390 841000 952669 942734
3057I42734K5894Q925j44507j14889K43528j08556k20201J81647j26645O3507
3047G51437J20511K18674j9892j11667J30020k7787j10497p625o2540j22139Q04
3036G59299j35766K5711j47936J0531o7260o6856J44171J97832j23316M3361r6271
3025E43500R9064r2485j91111K39766j04740k8018k34988Q8371J23033N0937j72677
3014C20652Q5721K7603J41047j06137Q8570J32047K7407P0682j65271r2529K3358
3003E53150j85487J60500J33258n1251l67235n8310K14509k46652K4555J24342
2993C01379j18397L1187J56219J46647J05392k67150j1062K18515Q4798m08220
2983B39308P0492J9347q7204J73521R6631l9688j78952j12907Q8269J54468j9523
$$ plain form
3057 942734 968628 977553 833046 718157 961685 853129 632928 814575 687930 751437
3047 751437 871948 1090622 1070730 959063 1089083 1061296 950799 943174 880634 758495 759299
3036 759299 623533 649244 501308 511839 444579 377723 521894 719726 596410 639771 543500
3025 543500 642564 550079 358968 598734 493994 465976 230988 319359 442392 493329 320652
3014 320652 406373 433976 575023 468886 557456 689503 716910 787592 622321 529792 553150
3003 553150 367663 528163 661421 610170 242935 184625 399134 152482 177037 301379
2993 301379 182982 214169 370388 517035 622427 355277 344215 562730 647528 239308
2983 239308 309800 329147 241943 415464 512095 472407 293455 180548 268817 423285 403762
2972D03762K31044k21334J9588j70355O7880j7070l4986J22145k21819j89539
2962a0684m9678K66047q4805L0478M3274o8594L0337J07001N7343j09820j61345
2951D9554J91404J31824J02480J05688P5792m01102j49411m5320J31497Q5875
2941B78281J68150J752j13476j14579J32045j97738K68685P5345O6148l62108
2931B02505O4602K28243j93385j13499o1290R5399p0539k5427L0367K07637l5427
2920C29186J51143j1840p0473l03464K00355L35962j41166j02303j15599R7174
2910C68975r2774j91526J09244j8325M5591J46852P7035j95400l75858K37918
2900A11732K18674k08028n6315O854o8425J93288j28522k32297R8740P7936J74335
$$ plain form
2972 403762 634806 413472 433060 262705 330585 313515 278529 400674 178855 -10684
2962 -10684 -60362 205685 120880 151358 194632 126038 156375 263376 320719 210899 49554
2951 49554 240958 372782 475262 580950 656742 255640 106229 60909 192406 278281
2941 278281 446431 448183 334707 220128 352173 154435 423120 498465 564613 202505
2931 202505 267107 495350 301965 188466 127176 222575 152036 126609 156976 364613 329186
2920 329186 480329 468489 398016 94552 294907 630869 489703 387400 271801 368975
2910 368975 276201 84675 193919 175594 221185 368037 445072 249672 -126186 111732
2900 111732 330406 122378 66063 72917 4492 197780 69258 -163039 -64299 13637 187972
2889A87972j21202M0635R9041n8434M2105N9459r0083J18798j14289J67435j9914
2878C11523N2903P8351j23666m3683L7659j20580O9487l8218j18301j38072K11155
2867A78558K28227o2927r1710j5081j0267j52744K19697J65316j68031l08923
2857a7885J77675k64278j06118L69920L231l1404o7171j67692O3010m7075J24332
2846C6545L7988J0643J27584J96813K4484o6536j49355j75097p9786N1055o3014
2835d8676j80709R1778k21902K85829J74793M677J21614M0567j72447n4031Q12
2824D2305L9165N5951l7511j82158K20034j04929k30253K13526R9245J79646R5891
2813C90912j88891M1081R7866O7036j7653j52631J18664J4525l18619k55226L00738
$$ plain form
2889 187972 66770 107405 206446 148012 190117 249576 159493 278291 164002 331437 311523
2878 311523 364426 442777 319111 275428 313087 192507 261994 223776 105475 -32597 178558
2867 178558 406785 343858 252148 237067 226800 74056 293753 459069 291038 -17885
2857 -17885 159790 -104488 -210606 159314 162545 131141 63970 -103722 -40712 -87787 36545
2846 36545 74533 85176 212760 409573 434057 367521 218166 43069 -36717 14338 -48676
2835 -48676 -229385 -137607 -359509 -73680 101113 105790 227404 267971 95524 41493 42305
2824 42305 81470 137421 99910 -82248 137786 32857 -197396 16130 115375 295021 390912
2813 390912 202021 243102 340968 408004 390351 237720 356384 370909 52290 -202936 97802
2802I7802J18918j92625K0454J829J91881L2255k63520J54383J23594k54435K60321
2791B90857K4080l93503J71927J6314J06501P158J25593j05275R2031l4559j82000
2780A19124J68126J4132o437n564J59148N4758M5626k25898P2356j41658k02242
2769E1471N0792j9868L9792J1532J88277J21441j77391k77147j05132P0872N3565
2758H204L10888L9699l19594j7037R0559J98424J88539l87946j29307L2350j22572
2747a07793m9434L8631J26259L3581J59729j04097j5053K5462J86817m25761j1275
2736a42934K16136k00606N8931J3128L9075J38279L269J5461k85237j79944K17022
2725a07420J68496J444l2599j0961n0340N7127K10445j06832k12991j0690J11593
$$ plain form
2802 97802 216720 24095 44549 46378 238259 270514 6994 161377 284971 30536 290857
2791 290857 314937 -78566 93361 109675 216176 223334 348927 243652 335683 301124 119124
2780 119124 287250 301382 294945 289381 448529 503287 548913 323015 395371 253713 51471
2769 51471 102263 82395 122187 133719 321996 443437 266046 -11101 -116233 -45361 8204
2758 8204 319092 358791 39197 22160 112719 311143 499682 111736 -17571 14779 -107793
2747 -107793 -157227 -118596 7663 41244 200973 96876 81823 107285 294102 -131659 -142934
2736 -142934 73202 -127404 -68473 -55345 -16270 122009 125278 140739 -144498 -324442 -107420
2725 -107420 61076 62520 29921 18960 -31380 25747 236192 129360 -83631 -94321 17272
2714A7272l781r7995J79213Q0812j42717J28096k51713l4455N3609M1247K8396
2703b016k7696J75452O1649o8972j07549l44183J54433M64568j84565Q6194k11320
2692d005j17858K13723J47267k07173O3457Q6948q3742n1183Q6333n5049n962
2681G2756K55630j89263O8481N2257r9417J95499k06209j48298M2005M9459J41459
2670B34359K1727N4369k31764P0352M4363P731k12096j6326R2390m6996K02349
2659B20458J16331k01074j01648J98281l13404R8570J19042j28735k2468K08337
2649A93690j9855K12406J0093K1894P0488m98283j71081J62909J42660O1945O2082
2638B48948K2375P2349j78460J10200j89281l1577J37917r8102J31795K75170
$$ plain form
2714 17272 13491 -84504 94709 175521 32804 160900 -90813 -125268 -71659 -30412 -2016
2703 -2016 -29712 145740 207389 138417 30868 -313315 -158882 305686 121121 207315 -4005
2692 -4005 -121863 91860 239127 31954 95411 182359 98617 47434 133767 78718 72756
2681 72756 328386 139123 207604 259861 160444 355943 149734 1436 43441 92900 234359
2670 234359 256086 310455 78691 149043 193406 201137 -10959 -27285 65105 18109 220458
2659 220458 336789 135715 34067 232348 -81056 17514 136556 7821 -14647 193690
2649 193690 173835 386241 396334 418228 488716 -9567 -180648 -17739 124921 186866 248948
2638 248948 271323 343672 165212 275412 86131 54554 192471 94369 226164 501334
$$ [...]
##END NTUPLES=NMR SPECTRUM
##END=
