##TITLE=1H_CG-1228-AX1
 200.13MHz,DMSO,
 8 sc
 
 1.11.2025
##JCAMPDX= 6.0         $$ Bruker NMR JCAMP-DX V2.0
##DATA TYPE= NMR SPECTRUM
##DATA CLASS= NTUPLES
##ORIGIN= UXNMR, Bruker Analytische Messtechnik GmbH
##OWNER= pz
$$ XWIN-NMR		Version 3.5
$$ Sat Nov  1 13:59:52 2025 Russian Standard Time (UT+4h)  she@DPX200
##.OBSERVE FREQUENCY= 200.1313
##.OBSERVE NUCLEUS= ^1H
##.ACQUISITION MODE= SIMULTANEOUS
##.ACQUISITION SCHEME= undefined
##.AVERAGES= 8
##.DIGITISER RES= 18
##SPECTROMETER/DATA SYSTEM= spect
##.PULSE SEQUENCE= zg30
##.SOLVENT NAME= DMSO
##.SHIFT REFERENCE= (INTERNAL, DMSO, 0, 15.532)
##AUDIT TRAIL= $$ (NUMBER, WHEN, WHO, WHERE, WHAT)
$$ ##TITLE= Audit trail, XWIN-NMR		Version 3.5
$$ ##JCAMPDX= 5.01
$$ ##ORIGIN= Bruker BioSpin GmbH
$$ ##OWNER= she
$$ F:/spectra/data/she/nmr/H-C/1/pdata/1/auditp.txt
$$ ##AUDIT TRAIL=  $$ (NUMBER, WHEN, WHO, WHERE, WHAT)
(   1,<2025-11-01 13:58:36.06 +0400>,<she>,<DPX200>,
      <created by zg, POWCHK disabled, PULCHK disabled
       configuration hash MD5:
       00 E9 B6 7A A2 85 ED C7 34 08 36 98 17 FE 4E 26
       data hash MD5: 16K
       2E 9B B1 D2 CF 55 39 08 AD D8 1D 8B 51 54 68 4D>)
(   2,<2025-11-01 13:58:38.48 +0400>,<she>,<DPX200>,
      <Start of raw data processing
       efp BC_mod = 2 LB = 0.25 FT_mod = 6 PKNL = 1 PHC0 = -2633.71 PHC1 = 16.79235 SI = 16K 
       data hash MD5: 16K
       34 D2 E4 82 00 3A 07 EF D3 F8 16 19 3D 27 03 9E>)
(   3,<2025-11-01 13:59:00.07 +0400>,<she>,<DPX200>,
      <pk PHC0 = 2.450068 PHC1 = -6 
       data hash MD5: 16K
       94 8C E0 14 0C 06 C8 1C 73 5D 72 3F C6 E3 4B F7>)
(   4,<2025-11-01 13:59:03.87 +0400>,<she>,<DPX200>,
      <abs ABSG = 5 
       data hash MD5: 16K
       13 8D A2 52 CE 74 31 24 70 BC E8 B0 C8 81 39 A0>)
$$ ##END=
$$ 
$$ hash MD5
$$ 60 27 5B 2D 85 17 A9 62 12 F6 4C 02 B1 15 74 D8
##$RELAX= 
##$RELAX= 
##$RELAX= 
##$RELAX= 
##$RELAX= 
##$RELAX= 
$$ Bruker specific parameters
$$ --------------------------
##$DU= <F:/spectra>
##$EXPNO= 1
##$NAME= <H-C>
##$PROCNO= 1
##$TYPE= <nmr>
##$USER= <she>
##$AMP= (0..31)
100 100 100 100 100 100 100 100 100 100 100 100 100 100 100 100 100 100 
100 100 100 100 100 100 100 100 100 100 100 100 100 100 
##$AQSEQ= 0
##$AQ_mod= 1
##$AUNM= <au_zg>
##$AUTOPOS= <>
##$BF1= 200.13
##$BF2= 200.13
##$BF3= 200.13
##$BF4= 200.13
##$BF5= 200.13
##$BF6= 200.13
##$BF7= 200.13
##$BF8= 200.13
##$BYTORDA= 1
##$CFDGTYP= 0
##$CFRGTYP= 5
##$CHEMSTR= <none>
##$CNST= (0..31)
1 1 145 1 1 1 1 1 1 1 1 1 1 1 1 1 1 1 1 1 1 1 1 1 1 1 1 1 1 1 1 1 
##$CPDPRG= <>
##$CPDPRG1= <>
##$CPDPRG2= <>
##$CPDPRG3= <>
##$CPDPRG4= <mlev>
##$CPDPRG5= <mlev>
##$CPDPRG6= <mlev>
##$CPDPRG7= <mlev>
##$CPDPRG8= <mlev>
##$CPDPRGB= <>
##$CPDPRGT= <>
##$D= (0..31)
0 0.7 0 0 0 0 0 0 0 0 0 0.03 0 0 0 0 0 0 0 0 0 0 0 0 0 0 0 0 0 0 0 0 
##$DATE= 1761991115
##$DBL= (0..7)
120 120 120 120 120 120 120 120 
##$DBP= (0..7)
150 150 150 150 150 150 150 150 
##$DBP07= 0
##$DBPNAM0= <>
##$DBPNAM1= <>
##$DBPNAM2= <>
##$DBPNAM3= <>
##$DBPNAM4= <>
##$DBPNAM5= <>
$$ [...]
##$SUBNAM3= <"">
##$SUBNAM4= <"">
##$SUBNAM5= <"">
##$SUBNAM6= <"">
##$SUBNAM7= <"">
##$SUBNAM8= <"">
##$SUBNAM9= <"">
##$SW= 18.0517328524113
##$SWIBOX= (0..15)
0 0 2 0 0 0 0 0 0 0 0 0 0 0 0 0 
##$SW_h= 3612.71676300578
##$TD= 16384
##$TD0= 1
##$TE= 0
##$TE2= 300
##$TE3= 300
##$TEG= 300
##$TL= (0..7)
0 120 120 120 120 120 120 120 
##$TP= (0..7)
150 150 150 150 150 150 150 150 
##$TP07= 0
##$TPNAME0= <>
##$TPNAME1= <>
##$TPNAME2= <>
##$TPNAME3= <>
##$TPNAME4= <>
##$TPNAME5= <>
##$TPNAME6= <>
##$TPNAME7= <>
##$TPOAL= (0..7)
0.5 0.5 0.5 0.5 0.5 0.5 0.5 0.5 
##$TPOFFS= (0..7)
0 0 0 0 0 0 0 0 
##$TUNHIN= 0
##$TUNHOUT= 0
##$TUNXOUT= 0
##$USERA1= <user>
##$USERA2= <user>
##$USERA3= <user>
##$USERA4= <user>
##$USERA5= <user>
##$V9= 5
##$VALIST= <valist>
##$VCLIST= <CCCCCCCCCCCCCCC>
##$VD= 0
##$VDLIST= <DDDDDDDDDDDDDDD>
##$VPLIST= <PPPPPPPPPPPPPPP>
##$VTLIST= <TTTTTTTTTTTTTTT>
##$WBST= 1024
##$WBSW= 4
##$XGAIN= (0..3)
0 0 0 0 
##$XL= 0
##$YL= 0
##$YMAX_a= 138157
##$YMIN_a= -158438
##$ZGOPTNS= <>
##$ZL1= 120
##$ZL2= 120
##$ZL3= 120
##$ZL4= 120
##$ABSF1= 15.53204
##$ABSF2= -2.51981
##$ABSG= 5
##$ABSL= 3
##$ALPHA= 0
##$AQORDER= 0
##$ASSFAC= 0
##$ASSFACI= 0
##$ASSFACX= 0
##$ASSWID= 0
##$AUNMP= <proc_1d>
##$AZFE= 0.1
##$AZFW= 0.1
##$BCFW= 0
##$BC_mod= 2
##$BYTORDP= 0
##$COROFFS= 0
##$CY= -3
##$DATMOD= 1
##$DC= 0
##$DFILT= <>
##$DTYPP= 0
##$F1P= 0
##$F2P= 0
##$FCOR= 1
##$FTSIZE= 16384
##$FT_mod= 6
##$GAMMA= 0
##$GB= 0
##$INTBC= 1
##$INTSCL= 3.241238e-09
##$ISEN= 128
##$LB= 0.25
##$LEV0= 0
##$LPBIN= 0
##$MAXI= 10000
##$MC2= 0
##$MEAN= 0
##$ME_mod= 0
##$MI= 1.114404
##$NCOEF= 0
##$NC_proc= -8
##$NLEV= 6
##$NOISF1= 3.799351
##$NOISF2= 2.8
##$NSP= 0
##$NTH_PI= 0
##$NZP= 0
##$OFFSET= 15.53204
##$PC= 1
##$PHC0= -2631.26
##$PHC1= 10.79235
##$PH_mod= 1
##$PKNL= yes
##$PPARMOD= 0
##$PSCAL= 0
##$PSIGN= 0
##$REVERSE= no
##$SF= 200.12999793033
##$SI= 16384
##$SIGF1= 3
##$SIGF2= 2
##$SINO= 0.751879
##$SIOLD= 32768
##$SREGLST= <19F.Aceton>
##$SSB= 0
##$STSI= 16384
##$STSR= 0
##$SW_p= 3612.71676300578
##$SYMM= 0
##$S_DEV= 0
##$TDeff= 16384
##$TDoff= 0
##$TI= <>
##$TILT= no
##$TM1= 0
##$TM2= 0
##$TOPLEV= 0
##$USERP1= <user>
##$USERP2= <user>
##$USERP3= <user>
##$USERP4= <user>
##$USERP5= <user>
##$WDW= 1
##$XDIM= 16384
##$YMAX_p= 343223321
##$YMIN_p= -2374572
$$ End of Bruker specific parameters
$$ ---------------------------------
##NTUPLES= NMR SPECTRUM
##VAR_NAME=  FREQUENCY,     SPECTRUM/REAL,   SPECTRUM/IMAG
##SYMBOL=    X,             R,               I
##VAR_TYPE=  INDEPENDENT,   DEPENDENT,       DEPENDENT
##VAR_FORM=  AFFN,          ASDF,            ASDF
##VAR_DIM=   16384,         16384,           16384
##UNITS=     HZ,            ARBITRARY UNITS, ARBITRARY UNITS
##FACTOR=    0.220516191357247, 1,           1
##FIRST=     3108.4270614741, 0,             0
##LAST=      -504.289701531676, 0,           0
##MIN=       -504.289701531676, -2374572,    0
##MAX=       3108.4270614741, 343223321,     0
$$ Real data points
##PAGE= N=1
##DATA TABLE= (X++(R..R)), XYDATA
$$ [...]
7404a53200R3220L75692J17292k21041j03472J6742l49607j10456M30612L17017
7394D12799k01704j13647o35304k01054R5243j16851M56513K63157Q2724j93081
7384a51205j48486K8305N00903k53447K644J49474j93995O3114K47516K68552
7374E13375k36763k29933P3688M3377M5318m16290J21693L18896O6024n77671
7364b78286j79634K75674M77784M14357l8076l80091j58322K49495J51157L57585
7354H91643j49069o63803m58153k97904L18534L94290n8304M10207m17661j39089
7344a69309j54792j26427O31317j6272l10559K29175J18006K0005m4064k86945
7334a09865l79107N55932j32427M16736L4905m37231M68802J46524K396n55802
$$ y = [-153200, -59980, 315712, 433004, 211963, 108491, 125233, -224374, -334830, 95782, 412799, 211095, 97448, -537856, -738910, -643667, -760518, -304005, -40848, 41876, -151205, -299691, -271386, 229517, -23930, -21286, 128188, -65807, -2693, 244823, 513375, 276612, 46679, 120367, 163744, 209062, -207228, -85535, 233361, 299385, -278286, -457920, -182246, 295538, 709895, 671819, 291728, 133406, 382901, 534058, 891643, 742574, 78771, -379382, -677286, -358752, 35538, -22766, 387441, -30220, -169309, -324101, -450528, 180789, 164517, -146042, 83133, 201139, 221144, 177080, -109865, -488972, 66960, -65467, 351269, 386174, -51057, 417745, 564269, 566665, 10863]
7324A0863J89850N28933m8126o55119Q7021J71708l9294o14414m27006n7482J36909
7313g16157L54426K52974l34018l475L02063M62043J06376m64970L07442m04758
7303a38054J3303P01663k03436n0861J99460L35661k38815M1941p00606J4962
7293b4782K20350J61782J98956m25559p7868j76589L316r1106J84086K89953o44418
7282c81879j71564M42247L41134m10068j24844R78116p0191r4747k41669r3634
7272A72901n21378L60146K50277O4096L3420j84914q8683l5294l18496J99370
7262f8555p0434k27773j38192l61540P28153M64949J44407n88288Q528o350j8750
7251a33845K86067j88183l38361J46880O70155k12002O0590l5601l29061j14160
$$ y = [10863, 200713, 729646, 681520, 26401, 113422, 285130, 245836, -368578, -795584, -853066, -716157, -361731, -108757, -442775, -446250, -144187, 317856, 424232, -40738, 266704, -138054, -124751, 576912, 373476, 322615, 522075, 857736, 618921, 660862, -39744, -24782, 195568, 357350, 556306, 130747, 52879, -123710, -120394, -211500, -27414, 262539, -381879, -553443, -111196, 229938, -180130, -304974, 673142, 602951, 508204, 266535, 172901, -348477, 11669, 261946, 326042, 359462, 174548, 85865, 50571, -267925, -68555, -138989, -366762, -504954, -866494, -138341, 326608, 471015, -117273, -108745, -115095, -133845, 152222, -35961, -374322, -227442, 442713, 230711, 291301, 255700, -73361, -187521]
7241a87521N94752l84523J62001P6204J02259M4750k29144N84494j20754n43968
7231I8550m35018L46507L25785J15121N3249j44402p10862L63268R8480p27727
7221f17049L43066L14549M7270k04941K65923l85750K10504m6824k6586j00898
7211b00736l60212M75002O3946R0420j55043J36631J49922K8609l2650J5650K3437
7200B34976l5964q7294J73102k33331j45506k94393J91010L61633J99559J03160
7190D66952k39239l7115K6296P3457R6995m2662K26307j4791n60436k43359M28412
7179A80817l55216K35263L23651l21876j30732J32215k41902j62230j72361L71529
7169a40842M86364q6005N98724l31374j75336j36259k14046K98210K02895r7733
$$ y = [-187521, 407231, 22708, 184709, 260913, 363172, 407922, 178778, 763272, 642518, 98550, -336468, 10039, 335824, 450945, 504194, 359792, -351070, 12198, 110678, -617049, -273983, 40566, 87836, -117105, 148818, -236932, -26428, -73252, -99838, -200736, -560948, -85946, -22000, 68420, -86623, 50008, 199930, 228539, 195889, 211539, 234976, 199012, 111718, 284820, 51489, -94017, -388410, -197400, 164233, 363792, 466952, 227713, 190598, 216894, 290351, 387346, 344684, 570991, 556200, -4236, -247595, 180817, -174399, 60864, 384515, 62639, -68093, 64122, -177780, -340010, -512371, -140842, 345522, 259517, 858241, 526867, 351531, 215272, 1226, 299436, 502331, 404598]
7159D04598J09307J24107p9845K54828M2119l44435n8938J22692n17369j14051
7149e6987L28701J12424J39381J32656k52245m20959m50615k64949N75651j24257
7139b81199J06951K27774l19377l7561K97529J545K9413k2750l29042K22954M70245
7128C66482k39140m9598m7734k02462P007J26284j76962L31555k58532K69810
7118A26710L21611k5467J73000j60612K87358l05875m70045P804K87875Q5744
7108C28103m06476k81069l4529j6871M02842k30278m83606K36936K46149l29740
7098e68539M00921L8036P99963k62292l66850K920o6537J69074M75225j64160
7088D57761j14494j78493o36412J56363O3216J83840K31708n02824q7905L83074
$$ y = [404598, 513905, 638012, 558167, 812995, 855114, 510679, 451741, 574433, 57064, -56987, 271714, 384138, 523519, 656175, 403930, -17029, -467644, -732593, -156942, -281199, -174248, 53526, -265851, -303412, -5883, -4338, 25075, 2325, -326717, -103763, 366482, 127342, 77744, 30010, -172452, -165445, -39161, -216123, 115432, -143100, 126710, 448321, 422854, 595854, 435242, 722600, 416725, -53320, -45516, 242359, 328103, -78373, -359442, -393971, -410842, -8000, -238278, -721884, -484948, -238799, -568539, -167618, -129582, 670381, 408089, 41239, 44159, -22378, 146696, 621921, 457761, 343267, 164774, -471638, -315275, -252059, -68219, 163489, -339335, -427240, -44166]
7078d4166K01405L8400j29687K71326l0660n78279K69277L21817p2460k07258
7068C9715j2957N2J17730k14635J74568l94140M88L78274j73751J26820k43576
7057b01412j21728N2508K60948K28810J86553j37546l59010l02916N87077K37759
7047D31043K13397o54334m02666N61626N59524p4706R5453o05113J33227j74764
7037H2687K40714J16840l6564L6837q2230L16173m61716r923m5338m24736L53778
7026H6522J97288K72223K666n2995n75731M1845L62369N01460m628o15845p0110
7015A45064M01387l45171Q0734L12743j16340L0000m64269r8803L51274M3480
7005C40099J21027M29736j04799M1770L6283k05961k64603K58418o08851o4725
$$ y = [-44166, 157239, 195639, 65952, 337278, 306618, -271661, -2384, 319433, 246973, 39715, 26758, 26810, 144540, -70095, 104473, -289667, -289179, 89095, -84656, 42164, -201412, -323140, -270632, -9684, 219126, 405679, 268133, -90877, -393793, 193284, 431043, 644440, -9894, -412560, 149066, 708590, 633884, 729337, 124224, 257451, 82687, 323401, 440241, 403677, 440514, 358284, 674457, 212741, 202818, 157480, -267256, 86522, 283810, 556033, 558699, 505704, -70027, -28182, 334187, 835647, 831019, 215174, 145064, 546451, 201280, 282014, 594757, 478417, 508417, 44148, -54655, 296619, 340099, 461126, 890862, 786063, 827833, 864116, 658155, 393552, 651970, 43119, -21606]
6995b1606M99855K01356l34985O6767j6201j57043L77019J96932j18859k92876
6985D00359k09332J27853J3836K82295j86345l25829j21421L4113M9200O0388
6975A25117l18999L64375k02790j78083q8329j02227R01051N19367j3561l32939
6965F72982L1055m91549K23312K24240l56460M19523n1800o03438L3893J57288
6955B59046m6089j5685L57010L1861o78266K20569O42557k06999n27843K73434
6945C09595L23120p4200M03731K06163p84514J68281M01854L84762J0101p26476
6935F22417J15355O2059o10076L0126N13433L91592k77580r0015K08117K02868
6925A168296o8208n80253n90597r9886M16370q7940L77070N44869J84090l07064
$$ y = [-21606, 478249, 679605, 344620, 411387, 395186, 238143, 615162, 812094, 693235, 400359, 191027, 318880, 332716, 615011, 428666, 102837, -18584, 15529, 64729, 125117, -193882, 170493, -32297, -210380, -298709, -400936, 500115, 1019482, 1005921, 672982, 704037, 212488, 435800, 660040, 303580, 723103, 671303, 67865, 101758, 259046, 212957, 197272, 554282, 586143, -92123, 128446, 771003, 564004, 36161, 309595, 632715, 558515, 962246, 1168409, 383895, 552176, 954030, 1338792, 1348893, 622417, 737772, 799831, 189755, 219881, 733314, 1124906, 847326, 757311, 965428, 1168296, 1100088, 519835, -70762, -170648, 245722, 157782, 534852, 1079721, 1263811, 956747]
6915I56747L7882K19989r541Q8922j39484K12505j98267j35257o32797o8266j79390
6904A53043J21168J56921L4k19570m90627M82666j59779N10837j74289K16566
6894E96970K41807K16970R9248j43510o72184m17026M16879o3441K70368K50932
6884G97013l95577K49696j49303N9124N96264r742j28454j98043L5082L66454
6874A222514m14833k27584L66988M9399J86439J63578l87534j49372K09689j41327
6864H77957L71481k03307o2118N75789j24528m25505m19227j25986J00113M95531
6854A060200O43529l32839r4840L0264L40413j36460k05025m82857P9141J80264
6844A081790p69456k6839J59281O2466K64848J91746J9491J01565j06598o10678
$$ y = [956747, 994629, 1214618, 1205077, 1293999, 1154515, 1367020, 1168753, 1033496, 400699, 332433, 153043, 274211, 431132, 431166, 211596, -279031, 203635, 43856, 554693, 380404, 596970, 838777, 1055747, 1154995, 1011485, 339301, -77725, 339154, 275713, 546081, 797013, 401436, 651132, 501829, 560953, 1157217, 1147475, 1019021, 820978, 856060, 1222514, 807681, 580097, 947085, 996484, 1182923, 1346501, 958967, 809595, 1019284, 877957, 1249438, 1046131, 984013, 1559802, 1435274, 1009769, 590542, 464556, 564669, 1060200, 1703729, 1370890, 1276050, 1306314, 1646727, 1510267, 1305242, 822385, 901526, 1081790, 312334, 285495, 444776, 507242, 772090, 963836, 983327, 1084892, 978294, 367616]
6834C67616L4000P95408K46749N28657n40764q16080n8086J92266L22246L25314
6824A397326n06812m04468K59316M06919K43723l53734n81630O5118O15093M32078
6814A572929R4841k26174m23805k21430O06204l21030k52181P69550j92255j61539
6804A245110R3165K92962K20673o43604K37438j17671j13724m92393k1144K34493
6794I35305j40972L14791L47119J88533m58520m63567J78588R19244q8193r4777
6784A637551l15744J64306K05133l84393K82932K72063m0196m91277j60049j58486
6774A011840k44339K82579O7511L62856j88761o0163L22482K67015O36362p87986
6764A669396k82097j7820j63460L12514k76497j73513N28674r6453o2716O18866
$$ y = [367616, 401616, 1197024, 1443773, 1972430, 1431666, 615586, 557500, 749766, 1072012, 1397326, 890514, 486046, 745362, 1152281, 1396004, 1042270, 460640, 525758, 1140851, 1572929, 1667770, 1441596, 1017791, 796361, 1402565, 1081535, 829354, 1598904, 1406649, 1245110, 1338275, 1631237, 1851910, 1208306, 1445744, 1328073, 1214349, 721956, 700812, 935305, 794333, 1109124, 1456243, 1644776, 1186256, 722689, 901277, 1820521, 1732328, 1637551, 1321807, 1486113, 1691246, 1306853, 1589785, 1861848, 1821652, 1330375, 1170326, 1011840, 767501, 1050080, 1117591, 1480447, 1291686, 1231523, 1554005, 1821020, 2457382, 1669396, 1387299, 1369479, 1206019, 1518533, 1242036, 1068523, 1597197, 1500744, 1438028, 2056894]
6754B056894m0740Q0199l83640l56323Q7058K49316L89709j27973L72495k81079
6744B045916m62035R1782K61896M56677P0698r0857L45183k11991l01962j50385
6734B054922j64072l8284K61398L44148l70233J14086J19675j42213J04254L13540
6724B597221l47582K40392J39241L28433l42432k54844N21304m57749o0950j10685
6714B252349j99874L84517O41384k01844o8445m51073k78987l1646N90955J95318
6704B832654J27662o6536j70777k97037J88941N65408J1312R8364j58888k9740
6694C101363K96511Q7888k43797l77429K83587J84885m88023L43284k38548L00131
6684C249852K53947l76288l4051j29479K25851M84426n2831K40024K05750k29705
$$ y = [2056894, 2016154, 2096353, 1712713, 1356390, 1443448, 1692764, 2082473, 1954500, 2326995, 2045916, 1583881, 1675663, 1937559, 2394236, 2464934, 2374077, 2719260, 2507269, 2205307, 2054922, 1890850, 1852566, 2113964, 2458112, 2087879, 2201965, 2321640, 2179427, 2283681, 2597221, 2249639, 2490031, 2629272, 2957705, 2615273, 2360429, 2881733, 2423984, 2363034, 2252349, 2052475, 2436992, 3078376, 2876532, 2808087, 2357014, 2078027, 2046381, 2637336, 2832654, 2960316, 2893780, 2723003, 2425966, 2614907, 3180315, 3191627, 3289991, 3131103, 3101363, 3397874, 3485762, 3241965, 2864536, 3148123, 3333008, 2844985, 3188269, 2949721, 3249852, 3503799, 3127511, 3093460, 2963981, 3189832, 3674258, 3621427, 3861451, 4067201, 3837496]
6674C837496j27289M60922l69956n25897m5880M19042m13115k00382O22357L17438
6664C974736L99967j28137j96636k49336k79811L19450M13529m59971L69303J9474
6654D182568p5373j01065J19561N23350o46173O90693j96229J02381P0105j22712
6644D547106J67250J15129L89903n8930l5432l13994L91313l15867r3618J71073
6634D963933j71536P8876N33254p0635n51550j36097j9592N14423P6558L88234
6624E605868j08604N5428k1153k06223M3041J06464l6373J21636K43153k66621
6614E536616m61039o3165N59951L31188M06874m49713o40651J18871L52745K1524
6604E713201q322o2697L53878k76139l09204M7306N82441k82877j4379L77560
$$ y = [3837496, 3710207, 4171129, 3801173, 3275276, 3229396, 3648438, 3235323, 3034941, 3657298, 3974736, 4374703, 4246566, 4049930, 3800594, 3520783, 3840233, 4253762, 3793791, 4163094, 4182568, 4107195, 4006130, 4125691, 4649041, 4002868, 4693561, 4497332, 4599713, 4669818, 4547106, 4714356, 4829485, 5219388, 5160458, 5125026, 4811032, 5202345, 4886478, 4792860, 4963933, 4792397, 4871273, 5404527, 5333892, 4782342, 4646245, 4626653, 5141076, 5217634, 5605868, 5497264, 5552692, 5531539, 5325316, 5368357, 5474821, 5438448, 5560084, 5803237, 5536616, 5075577, 5012412, 5572363, 5903551, 6310425, 5860712, 5220061, 5338932, 5691677, 5713201, 5704879, 5642182, 5996060, 5719921, 5410717, 5458023, 6040464, 5757587, 5743208, 6120768]
6594F120768j72677k32375l24843L34688J21173N6525N52543j70081n03380K5181
6584E807522M17371K84407k88765R3055K41387j78529K53368K21679j22920R7395
6574F825970J26494p5526J06034L01716K22472r2569j24731m94726K74561K93386
6564G363081k91272L58904M77237k79028j78998k83102N37647Q54213m65951j77256
6554G915475K94221J33964J3990q8492N74583J00825L29468L25728n7711J04785
6544I646836j31711J41425L82966J95151o21267j97613K71413M24813Q5998J046354
6534A1244365J13594p8559L57255r476L8376K64772O65458k5724L97437O15252
6524A3582750k6584K63731O54395p9378K70359P48074R32860Q60269R1571O58046
$$ y = [6120768, 5948091, 5715716, 5390873, 5725561, 5846734, 5903259, 6455802, 6285721, 5782341, 5807522, 6224893, 6509300, 6220535, 6313590, 6554977, 6376448, 6629816, 6851495, 6728575, 6825970, 6952464, 6876938, 6982972, 7284688, 7507160, 7414591, 7289860, 6795134, 7069695, 7363081, 7071809, 7430713, 7907950, 7628922, 7449924, 7166822, 7704469, 8558682, 8092731, 7915475, 8209696, 8343660, 8357650, 8269158, 8843741, 8944566, 9274034, 9599762, 9542051, 9646836, 9515125, 9656550, 10039516, 10234667, 9613400, 9415787, 9687200, 10112013, 10198011, 11244365, 11357959, 11279400, 11636655, 11627179, 11665555, 11930327, 12595785, 12570061, 12967498, 13582750, 13556166, 13819897, 14474292, 14394914, 14665273, 15413347, 16346207, 17206476, 17298047, 17956093]
6514A7956093O06999M96453L16863P89777J18457K65650L31057R01812L85250
6505B2168411L81560L09250K25222N76939L78897N49323M80910R3134k88119P52287
6495B5627814L45576M86907j18081P277N34697R74418M15341J81581R00395L22165
6485B9678090M33921O79338J003068P16830N95053O13025M75711J23229R06109
6476C5224374J093533J8628P24426O42667R29143Q87827L12908Q19720J55658
6467D0808884M02440O79368k49284m27762N79200N4776k01609M78291m43078m75574
6457D1205652K98153m72028n74309k49144r39593k00935L3787j55786k50725j152705
6447C7542367n42589R4827k11789p84110p99335q62269m48252m32991r75089l14907
$$ y = [17956093, 18563092, 19059545, 19376408, 20166185, 20284642, 20550292, 20881349, 21783161, 22168411, 22549971, 22859221, 23084443, 23661382, 24040279, 24589602, 25070512, 25163646, 24875527, 25627814, 25973390, 26460297, 26342216, 26349493, 26884190, 27858608, 28273949, 28455530, 29355925, 29678090, 30112011, 30791349, 31794417, 32511247, 33106300, 33719325, 34195036, 34318265, 35224374, 36317907, 36336535, 37060961, 37703628, 38632771, 39520598, 39833506, 40653226, 40808884, 41211324, 41890692, 41641408, 41213646, 41792846, 41847622, 41646013, 42124304, 41681226, 41205652, 41503805, 41031777, 40457468, 40208324, 39268731, 39067796, 39101583, 38945797, 38695072, 37542367, 36999778, 37094605, 36882816, 36098706, 35299371, 34437102, 33988850, 33555859, 32580770, 32265863]
6437C2265863m86617m44095k27224j080243m58307j56882n16300o24730o06375
6428B7665090l18772j123014n74869j008426m40352o10058p01146m93407k5841
6419B2369205K93251l00231j55667k96982l84235l61993J07465L54497R3716J31096
6409B1850122J33164n54405J20184M37069R21759N71854j01594K84086L26606
6400B3988845L70245N75321M94584J35084O9125j0327J81377j2484P5358l84804
6390B5482324j09175J22420k39703m32388J60459l82085m04837k70687m29602
6381B3496726l31409l54702r43948j360351j024526o67244l14560o19440p15578
6372A7164968l46372r20802r98217k76636m32329m48178n44030o69008o12122
$$ y = [32265863, 31779246, 31335151, 31107927, 30027684, 29569377, 29412495, 28896195, 28271465, 27665090, 27346318, 26223304, 25648435, 24640009, 24199657, 23589599, 22888453, 22395046, 22369205, 22662456, 22362225, 22206558, 21909576, 21525341, 21163348, 21270813, 21625310, 21719026, 21850122, 21983286, 21428881, 21549065, 21986134, 22907893, 23479747, 23378153, 23662239, 23988845, 24359090, 24934411, 25428995, 25564079, 25633204, 25622877, 25804254, 25791770, 25867128, 25482324, 25373149, 25495569, 25255866, 24823478, 24983937, 24601852, 24197015, 23926328, 23496726, 23165317, 22810615, 21866667, 20506316, 19481790, 18814546, 18499986, 17880546, 17164968, 16818596, 15897794, 14899577, 14622941, 14190612, 13742434, 13198404, 12529396, 11917274]
6363A1917274m09970k14735k74904m78754n39890l84246n00807l06206m82885
6354H324877l23276m54307m19232N26856o32753n74120m08425N2667k68263l52011
6344E472013L21884K97177p2200l67675m56343l3994L41666n22921m78517L87999
6334D889089j35080m87298r6759j85216M7604m686j78520K44373J91568N66869
6324D851944l03748l39548l85753l17963K11815J76344j8935n3955o502m44400
6314C369299K00974K87403r2391m88327k17580L87889Q9685k50707N04466P7317
6304C868028O9726l16132j22784j79925M73392k33029k77175J32809L74127j98612
6294C590425l65777L45714l67228o46786J7009P36426m05231m8130N16713M08623
$$ y = [11917274, 11507304, 11292569, 11017665, 10538911, 9999021, 9614775, 9113968, 8807762, 8324877, 8001601, 7547294, 7128062, 7654918, 7022165, 6448045, 6039620, 6092287, 5824024, 5472013, 5793897, 6091074, 6018874, 5651199, 5194856, 5160862, 5502528, 4979607, 4501090, 4889089, 4754009, 4266711, 4169952, 3984736, 4032340, 4027654, 3849134, 4093507, 4285075, 4851944, 4548196, 4208648, 3822895, 3504932, 3716747, 3893091, 3874156, 3820201, 3813699, 3369299, 3570273, 3857676, 3765285, 3276958, 3059378, 3447267, 3536952, 3286245, 3790711, 3868028, 3937754, 3621622, 3498838, 3318913, 3792305, 3559276, 3282101, 3414910, 3789037, 3590425, 3224648, 3570362, 3203134, 2556348, 2573357, 3309783, 2904552, 2856422, 3373135, 3781758]
6284C781758l45241k25117J8503M1016M19727l31996p38113J19077J52817k15999
6274B676432Q8440K9694j54141O61484j17494j19489j73444N42167O4379L24702
6264C822730j299l35522m01922k10454J17212J15247l59234M37386L37566J15602
6254C637312j23946p69517K35189J58411L88206L11396J37846K560k81921j78101
6244C517435K99423M02211m8336j47558p0263l4197N60191k09177p9236j43493
6234D047000M11207j16478j4510J32527M1068L81571L88700J4512K12321L33249
6224E831167N3371J92755J71276m2568k1639L14494j4857N60246Q87620j69636
6214G762229k93924J38706N15356L28843j34754M81425O16924P21697O68000K27681
$$ y = [3781758, 3436517, 3211400, 3229903, 3270919, 3690646, 3358650, 2620537, 2739614, 2892431, 2676432, 2764872, 2794566, 2640425, 3301909, 3184415, 3064926, 2891482, 3433649, 3498028, 3822730, 3821431, 3485909, 3083987, 2873533, 2990745, 3105992, 2746758, 3184144, 3521710, 3637312, 3513366, 2743849, 2979038, 3137449, 3525655, 3837051, 3974897, 3977457, 3695536, 3517435, 3816858, 4219069, 4170733, 4023175, 3952912, 3918715, 4478906, 4269729, 4190493, 4047000, 4458207, 4341729, 4327219, 4459746, 4500814, 4882385, 5271085, 5285597, 5497918, 5831167, 5884538, 6077293, 6248569, 6206001, 6184362, 6498856, 6483999, 7044245, 7931865, 7762229, 7468305, 7607011, 8122367, 8451210, 8316456, 8797881, 9414805, 10136502, 10804502, 11032183]
6204A1032183M72472K87580O00756M79075J71807O73060R2907L23522L70940j87949
6194A4316353L63517N11800O68374k5023m35239K05792J57060K65359M6707M62039
6184A6536739k97533l86465L33657K23672Q273p57491j1608L4405o498N94908
6174A6272059k78983l36364L57871o5016J05224L35662L07884q15235N37123K23210
6164A6643435o76999Q3508M37821o3590j18748m03553l30845R2719j32136l99962
6154A5131650j79858j45670j81296r3374k95333k45837l1883n240k71263j2844
6144A3669052q75470n65843k59203N87466K86505K55723J4720j04385l2635q4954
6134A2890976N19363P20934j69865o47147n5978q5504n36173j63962K01229j98349
$$ y = [11032183, 11504655, 11792235, 12392991, 12872066, 13043873, 13716933, 13809840, 14133362, 14504302, 14316353, 14679870, 15191670, 15860044, 15835021, 15399782, 15605574, 15762634, 16027993, 16074700, 16536739, 16239206, 15852741, 16186398, 16410070, 16418343, 15660852, 15649244, 15683649, 15677151, 16272059, 15993076, 15656712, 16014583, 15949567, 16054791, 16390453, 16698337, 15883102, 16420225, 16643435, 15966436, 16049944, 16487765, 16424175, 16305427, 15901874, 15571029, 15663748, 15531612, 15131650, 14951792, 14806122, 14624826, 14531452, 14236119, 13990282, 13958399, 13953159, 13681896, 13669052, 12793582, 12227739, 11968536, 12556002, 12842507, 13098230, 13112950, 13008565, 12975930, 12890976, 13410339, 14131273, 13961408, 13314261, 13258283, 13172779, 12636606, 12472644, 12673873, 12475524]
6124A2475524k22439K38077j45954k73231N2751l88463M18222m4846k72802j11466
6114A1725373n54602K6650R10966k248j3462l30002k78523K15157m24201J18755
6104A1393863J04850l76635j02603q2383P09902n93247m09486M89064M11744n32806
6094A1012263m26169Q01886k13048n84628n44491K13341k97053j39588m76619
6085I345894n15987L4943N21435K23408o37083n49153k64037j62955n40918j096767
6075F358780l0452k4333K11612j78687k02187n65586k15867k06889j25093O0036
6065E081334J06660m67883J02244O4538m17554K09184n0526K6701l64118k44819
6055D045761J60731k45191J54444l4870k21642j30071J23756j02066l60639M37722
$$ y = [12475524, 12253085, 12491162, 12345208, 12071977, 12124728, 11736265, 12154487, 12109641, 11836839, 11725373, 11170771, 11197421, 12108387, 12106139, 12092677, 11762675, 11484152, 11699309, 11275108, 11393863, 11498713, 11122078, 11019475, 10937092, 11646994, 11053747, 10644261, 11133325, 11545069, 11012263, 10586094, 11387980, 11174932, 10590304, 10045813, 10259154, 9962101, 9822513, 9345894, 8829907, 8864850, 9386285, 9609693, 8972610, 8423457, 8159420, 7996465, 7455547, 6358780, 6328328, 6303995, 6515607, 6336920, 6134733, 5569147, 5353280, 5146391, 5021298, 5081334, 5187994, 4720111, 4822355, 4886893, 4469339, 4678523, 4627997, 4654698, 4290580, 4045761, 4206492, 3961301, 4115745, 4080875, 3859233, 3729162, 3852918, 3750852, 3390213, 3827935]
6045C827935j38961M99545J81638k31566p3118l40382m72379O9942J23826j29641
6035C316839k66683l71665N98449M43158o20048k09872L57459L80681P0949N4795
6025C754062M94572j89711j15656K59089m20218m56454j2776M32744k53924p4250
6015C417478n18233o3385L85803J14140L77710n35546J02085K02357l45790j62381
6005B974238m08904m6551l32222k5532r9404M94443K81331L16901J3992o32106
5995B536186L3967l47509L46807j37031j37870L96240l54698k44102M31738L99069
5985B922797K26095m3809k83198j45143N6428P9907K03276k77640o49789J51302
5975B240226M7253K05209l03536J43807M94901K75782j54537K15277P4404p10042
$$ y = [3827935, 3688974, 4188519, 4370157, 4138591, 4065473, 3725091, 3252712, 3322654, 3446480, 3316839, 3050156, 2678491, 3276940, 3720098, 3100050, 2890178, 3247637, 3628318, 3699267, 3754062, 4248634, 4058923, 3943267, 4202356, 3782138, 3325684, 3312908, 3745652, 3491728, 3417478, 2899245, 2835860, 3221663, 3335803, 3713513, 3177967, 3280052, 3482409, 3136619, 2974238, 2565334, 2518783, 2186561, 2161029, 2061625, 2556068, 2837399, 3154300, 3168292, 2536186, 2570153, 2222644, 2569451, 2432420, 2294550, 2690790, 2336092, 2091990, 2523728, 2922797, 3148892, 3105083, 2821885, 2676742, 2733170, 2813077, 3016353, 2738713, 2088924, 2240226, 2287479, 2492688, 2189152, 2332959, 2827860, 3103642, 2949105, 3164382, 3238786, 2528744]
5965B528744K94492K41581q4597j44076l78133K85217k86973J71238P1533J51456
5955B850482J65195j25492j8002j60859R1761p6561J01088k88723m15541r8490
5945B024858J84730J23234L16820q4041J28455K59459k04207J84653K01812J91369
5935C327142l0822m50215N1526j3779j73498L9587J67238j71811J75994k49356
5925B672006k36493N04155K36892n09873K72844L7589m8487L36895J7269K17869
5915C500666m62039j44261M46383K05097m4232j09884m05059K77307K3269N2107
5905C339354m6834P998n62035k8429O7997M2110N27945J99772K78638j24476j06192
5894C595848n13696J27038K06337m17371j34623l5979L05173N47254j5049n3519
$$ y = [2528744, 2823236, 3064817, 2980220, 2836144, 2458011, 2743228, 2456255, 2627493, 2699026, 2850482, 3015677, 2890185, 2872183, 2711324, 2803085, 2726524, 2827612, 2538889, 2123348, 2024858, 2209588, 2332822, 2649642, 2565601, 2694056, 2953515, 2749308, 2933961, 3135773, 3327142, 3296320, 2846105, 2897631, 2883852, 2710354, 2749941, 2917179, 2745368, 2921362, 2672006, 2435513, 2939668, 3176560, 2666687, 2939531, 2977120, 2928633, 3265528, 3282797, 3500666, 3038627, 2894366, 3340749, 3545846, 3501614, 3391730, 2986671, 3263978, 3287247, 3339354, 3292520, 3300518, 2738483, 2710054, 2778051, 2820161, 3348106, 3547878, 3826516, 3702040, 3595848, 3082152, 3209190, 3415527, 2998156, 2863533, 2827554, 3132727, 3679981, 3664932, 3611413]
5884C611413j88126P2488l25532L89783L54820n13485p8813j67723J10286O15684
5874C880795k7405l79205N3448L70330J81532K5469k09666m33695J72476J13698
5864C747777j69344J22283M21564L15590p92856K44594J87279j73712J42994r828
5854D036341L45250l14479m578J57008O5241j25597K36201P3349o32961J81683
5844D017458k96098l45589N31641N39338k86116m6103k23970K54455o924K62698
5834D400790k26086j33544r2314j3459N41554j7225J39204K27309R1842j18041
5824D800030L6865J32955P82278r4112j16212K30790k80844j23343j87170l97862
5814D783375L50077N27948J00618l06315k98006o05250L91404K88865N80259P3910
$$ y = [3611413, 3423287, 3495775, 3170243, 3560026, 3914846, 3401361, 3322548, 3154825, 3265111, 3880795, 3853390, 3474185, 3527633, 3897963, 4079495, 4104964, 3895298, 3461603, 3634079, 3747777, 3578433, 3700716, 4122280, 4437870, 3645014, 3889608, 4076887, 3903175, 4046169, 4036341, 4381591, 4067112, 4062534, 4219542, 4284783, 4159186, 4395387, 4468736, 3835775, 4017458, 3721360, 3375771, 3907412, 4446750, 4160634, 4114531, 3890561, 4145016, 4138092, 4400790, 4174704, 4041160, 3948846, 3935387, 4476941, 4459716, 4598920, 4826229, 4918071, 4800030, 4836895, 4969850, 5752128, 5658016, 5541804, 5772594, 5491750, 5368407, 5181237, 4783375, 5133452, 5661400, 5762018, 5455703, 5157697, 4552447, 4943851, 5232716, 5812975, 5886885]
5804E886885k34375l7885N74576R0720O9698K87635p24636L01215O27386L44007
5794G185226K2122R2151p30317j52003P09787L14252j33114L13789k4104m05704
5784G192085N01860l9963P6067R3990O70626M44026J51372k58050L6016j17738
5774H750291J39462L06873j98394q8546L55583P66696O68863r3805P706K50097
5764A0864826N49472K89171L87201O68071n72963K27831L3832K56990K86140K99328
5754A3289899k04846M60781M77234K04823K26995N15920K10508K61983N95610
5745A6038907K35575m35798L39793Q42075k7328n65458N22994N69991l69928j33205
5735A7017618Q5222L35714L83851P1433m3055M1632q3526J98033K01988Q5104
$$ y = [5886885, 5652510, 5614625, 6189201, 6279921, 6349619, 6637254, 5912618, 6213833, 6841219, 7185226, 7207348, 7299499, 6569182, 6417179, 7126966, 7441218, 7308104, 7621893, 7597789, 7192085, 7693945, 7653982, 7730049, 7824039, 8494665, 8938691, 9090063, 8832013, 8868029, 8750291, 8889753, 9196626, 8998232, 8909686, 9265269, 10031965, 10700828, 10607023, 10614729, 10864826, 11414298, 11703469, 12090670, 12758741, 12185778, 12413609, 12447441, 12704431, 12990571, 13289899, 13085053, 13545834, 14023068, 14227891, 14454886, 14970806, 15181314, 15443297, 16038907, 16274482, 15838684, 16178477, 17020552, 16993224, 16427766, 16950760, 17520751, 17150823, 17017618, 17102840, 17438554, 17822405, 17893838, 17850783, 17892415, 17808889, 18006922, 18208910, 18294014]
5725A8294014l2084L10265L16996K97313j87717l27651L39682L71894j73560K62739
5715A9471891K64602J02063P8620M68012O09344M7742J11762K11086p2249j27104
5705B1165769K45830J03821J09457k32563j91727N35622L44492L13621l6800P74868
5695B3132390K11461M0106m27674m5466J62684O09785l07802K35828M67248J41789
5685B4220349L24522q6218l78280J66739m71519Q361k1575l77529O97247L3651
5675B4115748p40428o18240J40386j60084N08883k234m22025k72622l32361k67860
5665B1949163m71358o49393J19713n21916K73885k1266j83314m0547m48216r6225
5655A9910526k04706j91138n08706q6565j09778j49939J82895l87127M87352n74527
$$ y = [18294014, 18261930, 18572195, 18889191, 19186504, 18998787, 18671136, 19010818, 19382712, 19209152, 19471891, 19736493, 19838556, 19917176, 20385188, 20994532, 21042274, 21154036, 21365122, 21292873, 21165769, 21411599, 21515420, 21624877, 21392314, 21200587, 21736209, 22080701, 22394322, 22357522, 23132390, 23343851, 23383957, 22956283, 22910817, 23073501, 23683286, 23375484, 23611312, 24078560, 24220349, 24544871, 24458653, 24080373, 24247112, 23775593, 23783954, 23762379, 23384850, 24082097, 24115748, 23375320, 22757080, 22897466, 22737382, 23246265, 23244031, 22822006, 22549384, 22217023, 21949163, 21477805, 20828412, 20948125, 20426209, 20700094, 20678828, 20495514, 20454967, 20006751, 19910526, 19705820, 19514682, 19005976, 18919411, 18809633, 18659694, 18842589, 18455462, 18942814, 18368287]
5645A8368287K13058n0036J04140m48784l26431J87016l10292J06954m92435q9296
5635A7262181J77824J17771l75426M2416Q17085k98667Q6727L71015m22762l05404
5625A7472760M41600K67205O5559l21632o5811L66077O8683J3782M13510P0932
5615A8792665M1057L43233n22935N39746L57933N71109K17094R0580M15164O23878
5605B1469524Q7846j81863J2775Q49612L61300l94976m4087N06375o2766M70414
5595B3074154M66328K96455J11416N75235J99242k95140L29633M50312O48283
5586B5855918K54945M75511J64957Q36352N71915N00115o2969L24818Q65230M75108
5576C0261900J69831N32033M33013O31297M81827O49712O27695M06494K82278
$$ y = [18368287, 18581345, 18531309, 18635449, 18186665, 17860234, 18047250, 17736958, 17843912, 17351477, 17262181, 17440005, 17557776, 17182350, 17224766, 18041851, 17743184, 17829911, 18200926, 17778164, 17472760, 17914360, 18181565, 18247124, 17925492, 17859681, 18225758, 18294441, 18308223, 18721733, 18792665, 18833722, 19176955, 18654020, 19193766, 19551699, 20122808, 20339902, 20430482, 20845646, 21469524, 21557370, 21375507, 21388282, 22237894, 22599194, 22204218, 22160131, 22666506, 22603740, 23074154, 23540482, 23836937, 23948353, 24523588, 24722830, 24427690, 24757323, 25207635, 25855918, 26110863, 26586374, 26751331, 27587683, 28159598, 28659713, 28596744, 28921562, 29786792, 30261900, 30431731, 30963764, 31396777, 32028074, 32509901, 33159613, 33787308, 34193802, 34476080]
5567C4476080P79251Q24115O00548P01631N92890Q36716O81006N71028R93125
5558D1056390Q87712L77493J371663J296057Q25802P81835J222171J251578P96051
5549D9866752Q95445R79804J817650R85628R80555J882394J484765J659405J184716
5540F1737114J115504J506285J672658J113889J811293J487240K129982K203085
5532G4777050J715450K070629J791583J955514K533685J993158K396135K291182
5524I1524386K453395L193179K413403J800918K237270L105877K568829K557653
5516A11854910L052517K163484K663023L203015K603434K179558K252471K492557
5508A32464969K142175K953703K670348J807005J748493J838667J124730J603282
$$ y = [34476080, 35255331, 36079446, 36679994, 37381625, 37974515, 38811231, 39492237, 40063265, 41056390, 41944102, 42321595, 43693258, 44989315, 45815117, 46596952, 47819123, 49070701, 49866752, 50762197, 51742001, 53559651, 54545279, 55525834, 57408228, 58892993, 60552398, 61737114, 62852618, 64358903, 66031561, 67145450, 68956743, 70443983, 72573965, 74777050, 76492500, 78563129, 80354712, 82310226, 84843911, 86837069, 89233204, 91524386, 93977781, 97170960, 99584363, 101385281, 103622551, 106728428, 109297257, 111854910, 114907427, 117070911, 119733934, 122936949, 125540383, 127719941, 129972412, 132464969, 134607144, 137560847, 140231195, 142038200, 143786693, 145625360, 146750090, 148353372]
5500A48353372J567309Q60325Q14826M31318K74079M49232O43884n24044n88362
5491A52281939o77971p84003j041429j166209j529809j560856j205150j816373
5483A42500139j720617j760907j689101j794995k366111j939798k457213k521573
5475A26249824k398479k986967l042048k834966k759625k933377j941443k216025
5467A05136894k630149k618659k455402k534816k489407k235321j980601j845303
5459H6347236j434682j865273j983322j041420j635250j726892j275895o55088
5451G4729414Q1521o69708j071338j233892n23895o16122q79356n68384r67781
5442F8280459j998424j911495j464061j639076j001995j361209j972976j414132
$$ y = [148353372, 149920681, 150781006, 151595832, 152027150, 152301229, 152750461, 153394345, 152870301, 152281939, 151603968, 150819965, 149778536, 148612327, 147082518, 145521662, 144316512, 142500139, 140779522, 139018615, 137329514, 135534519, 133168408, 131228610, 128771397, 126249824, 123851345, 120864378, 117822330, 114987364, 112227739, 109294362, 107352919, 105136894, 102506745, 99888086, 97432684, 94897868, 92408461, 90173140, 88192539, 86347236, 84912554, 83047281, 81063959, 80022539, 78387289, 76660397, 75384502, 74729414, 74810935, 74141227, 73069889, 71835997, 71312102, 70695980, 69816624, 69248240, 68280459, 66282035, 64370540, 62906479, 61267403, 60265408, 58904199, 56931223, 55517091]
5434E5517091j239273r89594j411532j102391q12672j086369q75213r09688j59433
5425D6930926p61440p50684n23318r7491M86693o9588L84296O37890j55277p6857
5415D6005150l0892j24449m18289m14828p61757j827133j035278r08018j284088
5406C9200418p28899m82464j104935j102934j283745j003104r83720o99866o04477
5397C1206274q59747o08084o37859o44739l41569l04413q51127k92298m12553
5388B6253885J16796q557M10803J10404m59246L86362n79231o62523L84691q10082
5378B5143302n87241l69200m40050n03089m55483l19541k39473p62789o49730
5369B0816706Q6199m03083m68024o25261M0212k94922p27167k59122L64332j86303
$$ y = [55517091, 54277818, 53288224, 51876692, 50774301, 49961629, 48875260, 48000047, 47090359, 46930926, 46169486, 45418802, 44895484, 44797993, 45284686, 45215098, 45599394, 46237284, 46082007, 46005150, 45974258, 45849809, 45431520, 45016692, 44254935, 42427802, 41392524, 40484506, 39200418, 38471519, 37989055, 36884120, 35781186, 34497441, 33494337, 32510617, 31810751, 31206274, 30346527, 29738443, 29100584, 28455845, 28114276, 27809863, 26958736, 26666438, 26253885, 26370681, 26362124, 26772927, 26883331, 26424085, 26810447, 26231216, 25568693, 25953384, 25143302, 24556061, 24186861, 23746811, 23243722, 22788239, 22468698, 22229225, 21466436, 20816706, 20902905, 20499822, 20031798, 19406537, 19446749, 19151827, 18424660, 18165538, 18529870, 18343567]
5359A8343567o59562m38310L9445k87227L24588N71k41180Q5852j09282N5782
5349A7114244k2314J18508k31703k05091n22183R1060p8016M47841J52850m85879
5339A6379317k159J88254m8276l21552K650j15305N25940M07737m09905l35165
5329A6271536P0314N5936J87871O8246L81491j46752l92885L55579j52761j00775
5319A6597800k20732K65427l0399J25425P35621j70248q1618J41566M93250q3716
5309A7772376l8391j78910k83034R6320Q06751J0663K07059J16174k87747R924
5299A8231185J14562J05664J48922O34323k39722o3009L54448M4425J87466R70949
5289B0489213L39124k99810p7308n8751N78075L96252M91647K0984M6411O54208
$$ y = [18343567, 17684005, 17245695, 17285140, 16997913, 17322501, 17323072, 17081892, 17167744, 17058462, 17114244, 17091930, 17210438, 16978735, 16773644, 16251461, 16342521, 16264505, 16712346, 16865196, 16379317, 16377158, 16565412, 16517136, 16195584, 16198234, 16082929, 16608869, 17016606, 16606701, 16271536, 16341850, 16397786, 16585657, 16653903, 17035394, 16888642, 16495757, 16851336, 16698575, 16597800, 16377068, 16642495, 16612096, 16737521, 17473142, 17302894, 17221276, 17362842, 17856092, 17772376, 17733985, 17555075, 17272041, 17368361, 18175112, 18185775, 18392834, 18509008, 18221261, 18231185, 18345747, 18451411, 18600333, 19234656, 18994934, 18931925, 19286373, 19330798, 19518264, 20489213, 20828337, 20528527, 20451219, 20392468, 20970543, 21366795, 21858442, 21879426, 21925837, 22580045]
5279B2580045K90238Q08718P67458M63279P53143M84899L20133N50015M92447
5270B7510375L85327R09170N57211P58211J161301O68916M78559Q66951O01302
5261C3897323N28157O45815M81433R46386R97124J124254P20555P17590N33906
5252D0592543O51767N76849R37986J60254N72027P79558N70134P28596O30823
5243D6200537N57843K7069J17442P040M52282N49323Q13696Q54835l67818O41715
5233D9853964K16162P0202N32509l38357J8699J78751l72552L58130K39916K72292
5223E1029716n00215R3802M0639l64989o70765n69826l02480J63969k7228n75725
5213D8316898J2427R1583K13944M53013P84275N57898M81688R53217Q35837Q90055
$$ y = [22580045, 22870283, 23679001, 24446459, 24909738, 25662881, 26147780, 26467913, 27017928, 27510375, 27895702, 28804872, 29362083, 30120294, 31281595, 31950511, 32429070, 33296021, 33897323, 34425480, 35071295, 35552728, 36499114, 37496238, 38620492, 39341047, 40058637, 40592543, 41244310, 41821159, 42759145, 42919399, 43491426, 44270984, 44841118, 45569714, 46200537, 46758380, 46785449, 46902891, 46909931, 47362213, 47911536, 48725232, 49580067, 49212249, 49853964, 50070126, 50140328, 50672837, 50334480, 50353179, 50531930, 50159378, 50517508, 50757424, 51029716, 50529501, 50623303, 50663942, 50298953, 49628188, 49058362, 48755882, 48919851, 48892623, 48316898, 48329325, 48420908, 48634852, 49087865, 49872140, 50430038, 50911726, 51864943, 52700780, 53590835]
5203E3590835Q95700Q65956J866046K288190K294625K044028K071612K710186
5195F8627178L274559L273499L661466M141280M735503N157151O633173Q728786
5187A08232595J1608399J2105831J0239971Q595063P259365O389113M189922J53453
5179A68773712l439277o493058p937631r574382r168554q424547p884590p628930
5171A08222743p595467q237436p652195q145315o810675o008691n372552m784795
5163E3615617m152274m304623l679844k801200k935853k013255j816557j979834
5155B9932177j200162j64744o93819n40844N1194J04977m21916m29873r0415O1788
5145B6608363m52136k33373J73931l71400j97045P0153j49954n56196k14595l3972
$$ y = [53590835, 54486535, 55352491, 57218537, 59506727, 61801352, 63845380, 65916992, 68627178, 71901737, 75175236, 78836702, 82977982, 87713485, 92870636, 99503809, 108232595, 119840994, 131946825, 142186796, 150781859, 158041224, 164430337, 168620259, 168773712, 165334435, 158841377, 150903746, 141329364, 132160810, 123736263, 115851673, 108222743, 100627276, 92389840, 84737645, 76592330, 69781655, 63772964, 58400412, 53615617, 49463343, 45158720, 41478876, 38677676, 35741823, 33728568, 31912011, 29932177, 28732015, 28567271, 27873452, 27332608, 27383802, 27488779, 27066863, 26636990, 26546575, 26608363, 26156227, 25922854, 26096785, 25725385, 25528340, 25598493, 25448539, 24892343, 24677748, 24643776]
5135B4643776j38681M9865m10427J5810j74916J03806J6341J82481p32072q3577
5125B3472406M53216n82806J62739M88246N8206l55258J73997k01030m9089O40186
5115B4260813l77725J29161L49829n18614L51166J64211n48755N47635J80355
5106B4538076l79667K44993m3667j64782R7508k09131N38853n47410K09045p1750
5096B4212068p1100M07619j04055l36519P4752P39228L2892j92535k16459J1198
5086B4557089L54431J20181K32812m42868j22835M54461r2847l02067K48591L5132
5076B5042080j91161M33282r154M78991K2597k16365q1387R8999n71799J97874
5066B5203957M93305k02921j21894J47091L30222n82864k76950K1362L49352N75194
$$ y = [24643776, 24505095, 24554960, 24144533, 24160343, 23985427, 24089233, 24105574, 24288055, 23555983, 23472406, 23925622, 23342816, 23505555, 23993801, 24052007, 23696749, 23870746, 23669716, 23620627, 24260813, 23883088, 24012249, 24362078, 23843464, 24194630, 24358841, 23810086, 24357721, 24538076, 24158409, 24403402, 24359735, 24194953, 24292461, 24083330, 24622183, 24074773, 24283818, 24212068, 24140968, 24548587, 24444532, 24108013, 24182765, 24921993, 24954885, 24762350, 24545891, 24557089, 24911520, 25031701, 25264513, 24821645, 24698810, 25153271, 25060424, 24758357, 25006948, 25042080, 24850919, 25284201, 25275047, 25754038, 25776635, 25560270, 25478883, 25577882, 25006083, 25203957, 25697262, 25494341, 25372447, 25519538, 25849760, 25266896, 24989946, 25011308, 25360660, 25935854]
5056B5935854O36636l55205n85403M34485K70811N83003K30903j94183j73816
5047B6783085M20956j4736J96266J97223l61964o583L38213K99440J58991J11123
5037B8122014K7183N112J148386K62869l90811K45356J02302M84496M47690m9483
5027C0405114N04883J38510j78656Q02142O13784Q22183N70537L87309M32962
5018C4498768J097982Q47056Q37795O29993Q99314N78689J046147J885344J447431
5009D3768519J057931J630091J771635J763265K665255J754246K199820K678548
5001E9289310K313997K675400K740135L339543K519210K733553L050908L027009
4993H1689065K946445K780622K399864K575903K401785J658457J344069J048911
$$ y = [25935854, 26572490, 26217285, 25631882, 26066367, 26337178, 26920181, 27151084, 26956901, 26783085, 27204041, 27189305, 27385571, 27582794, 27220830, 27214247, 27552460, 27851900, 28010891, 28122014, 28149197, 28154309, 29302695, 29565564, 29174753, 29420109, 29522411, 30006907, 30454597, 30405114, 30909997, 31048507, 30869851, 31671993, 32285777, 33107960, 33678497, 34065806, 34498768, 35596750, 36443806, 37281601, 37911594, 38810908, 39389597, 40435744, 42321088, 43768519, 44826450, 46456541, 48228176, 49991441, 52656696, 54410942, 56610762, 59289310, 61603307, 64278707, 67018842, 70358385, 72877595, 75611148, 78662056, 81689065, 84635510, 87416132, 89815996, 92391899, 94793684, 96452141, 97796210, 98845121]
4985I8845121N26938N08749J69422J03002r450k42113K39920k48302l45791n90701
4975I8956795m43373j144596o07372m88893q93979j407120j790881j752886k449623
4966H7978072k544660l032811l338878k664119k405864l212092l694024l243683
4958F3841941l402135l278257k913101k606461k953542k700022k270925k734273
4950D0983225k316476k047356j607567k484115j980951j164254j641140p79445
4942B6961921j476698j069114q87673r31133r02154j321324r28281j11450k24358
4933A9109736n79567n71085n91048o89346q9448J90947N1211l14233q77931n75267
4923A5063969J09339N83076n68537J6654J68095o10072m3679j53956o22257j40097
$$ y = [98845121, 99372059, 99880808, 100050230, 100153232, 100143782, 99901669, 100141589, 99893287, 99547496, 98956795, 98513422, 97368826, 96761454, 96272561, 95378582, 93971462, 92180581, 90427695, 87978072, 85433412, 82400601, 79061723, 76397604, 73991740, 70779648, 67085624, 63841941, 60439806, 57161549, 54248448, 51641987, 48688445, 45988423, 43717498, 40983225, 38666749, 36619393, 35011826, 32527711, 30546760, 29382506, 27741366, 26961921, 25485223, 24416109, 23528436, 22597303, 21695149, 20373825, 19445544, 19334094, 19109736, 18530169, 17959084, 17368036, 16678690, 16589242, 16780189, 16831400, 16517167, 15639236, 15063969, 15173308, 15756384, 15187847, 15204501, 15372596, 14762524, 14718845, 14564889, 13942632, 13802535]
4913A3802535J21031k20065o5533P2194k67988K7821M30376k61385l4922l5235
4903A3568829L76130j7393l76592n15619N9049m81194K79027j39624l07029Q8470
4893A2534054n8469L3525m6269l64584j55128o02997k13321K12731m64102l13188
4883A0562252O1025N25422K76234k35542p81366m96071l49598n71057k25706N39374
4873I304967j01054J98598m08628l17576k62839J93311m0498j17958K18441j60959
4863H505805O6202l71688k54667K24313J6974q2187J4184k71272m12020K88035
4853G723679m0346n50061K430q046k53621O46297j58072j31280l76263n3659m00117
4842F400941K43954K25958l44443k94159O8222K52221l03043m87389l8126K60123
$$ y = [13802535, 13923566, 13703501, 13637968, 13710162, 13442174, 13469995, 13900371, 13638986, 13604064, 13568829, 13944959, 13927566, 13550974, 13035355, 13094404, 12613210, 12892237, 12752613, 12445584, 12534054, 12475585, 12509110, 12462841, 12098257, 11943129, 11340132, 11126811, 11339542, 10875440, 10562252, 10623277, 11148699, 11424933, 11189391, 10408025, 9911954, 9562356, 8991299, 8765593, 9304967, 9203913, 9402511, 8993883, 8676307, 8413468, 8606779, 8566281, 8448323, 8666764, 8505805, 8572007, 8200319, 7945652, 8169965, 8186939, 8104752, 8118936, 7847664, 7435644, 7723679, 7683333, 7133272, 7135702, 7127656, 6874035, 7520332, 7362260, 7230980, 6854717, 6801058, 6400941, 6644895, 6870853, 6526410, 6232251, 6300473, 6552694, 6249651, 5762262, 5724136, 5984259]
4832E984259p3895j37055k89217K91933K12318M3488l10606l02291M4021J72581
4822E635536N51989n3072l78737Q3965l7976j86561L04898k33538l2309l4917
4812E619278J27500P92595L9692l33696n88643k50293k27872j14509k6173R4416
4802E132295R70065L66291k72750l73104J42699m9853k96434K93439K50504m30725
4792E732427j3432L75573k2804P6051j23916K98990k05124M31051J10819k90150
4782F369485N8026l03800l29915L27432n57726J35129j04212N8014M48496k70181
4772E830748N2885j87698n00965K61023Q68935p4526m52743j94337M20717k25398
4762E798641J74325L3206m27077J11860Q6459J6975J6512m1504l98216M40904
$$ y = [5984259, 5910364, 5773309, 5484092, 5776025, 5988343, 6031831, 5721225, 5418934, 5462955, 5635536, 6187525, 6134453, 5755716, 5839681, 5801705, 5615144, 5920042, 5686504, 5654195, 5619278, 5746778, 6539373, 6579065, 6245369, 5656726, 5406433, 5178561, 5064052, 5037879, 5132295, 6102360, 6468651, 6195901, 5822797, 5965496, 5915643, 5619209, 5912648, 6163152, 5732427, 5718995, 6094568, 6071764, 6147815, 6023899, 6322889, 6117765, 6548816, 6659635, 6369485, 6427511, 6123711, 5793796, 6121228, 5563502, 5698631, 5594419, 5652433, 6100929, 5830748, 5883633, 5695935, 5194970, 5455993, 6324928, 6250402, 5797659, 5603322, 6024039, 5798641, 5972966, 6006172, 5579095, 5690955, 5777414, 5794389, 5810901, 5769397, 5371181, 5812085]
4752E812085J62526k58683k25239m61001R9063J74542M5586J13231l19665l32502
4742D809943N56348J18772J05338j28763L60151M24014Q3601J72670k56492j53066
4732F092516k80690j28962L17538M24689j23273m80409J15426R5286m15008L15178
4722E932291P08246K55606m09655j97190o93665L96141O45369K95477k10114k9464
4712F693042M51411k89081L141J20712o5324K87726j78903J46973N15279m21398
4702G263578j06632M25385L31366j242196K21062L0532o01437O67403O33783K22992
4692G845836k32585j37589M132K77943K40316O07898j49267O816N32668N24782
4682I520950j36017l6225n85649J57504K92195N69386n9511q8806N88269M14102
$$ y = [5812085, 5974611, 5715928, 5490689, 5029688, 5128751, 5303293, 5348879, 5462110, 5142445, 4809943, 5366291, 5485063, 5590401, 5461638, 5821789, 6245803, 6329404, 6502074, 6245582, 6092516, 5811826, 5682864, 6000402, 6425091, 6301818, 5821409, 5936835, 6032121, 5617113, 5932291, 6640537, 6896143, 6486488, 6289298, 5595633, 5991774, 6637143, 6932620, 6722506, 6693042, 7144453, 6855372, 6858513, 6979225, 6913901, 7201627, 7022724, 7169697, 7684976, 7263578, 7156946, 7582331, 7913697, 6671501, 6892563, 6923095, 6321658, 6989061, 7622844, 7845836, 7613251, 7475662, 7479794, 7757737, 7998053, 8605951, 8456684, 8463500, 8996168, 9520950, 9384933, 9348708, 8763059, 8920563, 9212758, 9782144, 9722633, 9633827, 10222096, 10636198]
4672A0636198l2726J48366O40830K43574o34452K81835P01397R7751M76070k83717
4662A2275126L53946j66630M67266L68060q993K52600Q9456K98574K50875J46360
4652A4326640Q69905J28496k60210K24639J12092L40247N86030p1836K40080N01763
4642A6997846J48399J93658O70653O71404K88194J01821L14484K82578K25398
4633A9894435O91524N82075J115514N49702P14022J433298O68556J134898J684186
4624B8468210J640939J460570K289524J684505K098996K792041L204896L049844
4616D6689525L150997L849247M043403M579201N376407N997498O676060P387884
4608H7750222Q130312Q877303R954577J0065396J0657406J1578003J2090822J1386257
$$ y = [10636198, 10603472, 10751838, 11392668, 11636242, 11001790, 11283625, 11985022, 12082773, 12558843, 12275126, 12629072, 12462442, 12929708, 13297768, 13288775, 13541375, 13630831, 13929405, 14180280, 14326640, 15196545, 15325041, 15064831, 15289470, 15401562, 15741809, 16327839, 16256003, 16496083, 16997846, 17146245, 17339903, 18010556, 18681960, 18970154, 19071975, 19386459, 19669037, 19894435, 20585959, 21168034, 22283548, 22833250, 23547272, 24980570, 25649126, 26784024, 28468210, 30109149, 31569719, 33859243, 35543748, 37642744, 40434785, 43639681, 46689525, 49840522, 53689769, 57733172, 62312373, 67688780, 73686278, 80362338, 87750222, 95880534, 104757837, 114712414, 124777810, 135435216, 147013219, 159104041, 170490298]
4600A70490298J2597485J3158342J3761785J3218799J2515628J3130697J1940723
4593B60813757J2670654J1778404J1624137J0230444Q659701Q101698O913429
4586C30792224N194996L636035K717103Q82963r16123l237991m951302o968230
4578C27149675p519355p513712r134791j0374231j1726675j2475392j3647957
4571B54757562j3943422j4079684j4204912j4373057j3890734j3921714j3765844
4564A56578195j2906657j2734401j2981202j1576652j0546317r873081q655000
4557G7304885q470124p375619o822712o030686m786245l999919m392819m218287
4549C1208474k616218k699325k407865j958781j729348j981603j404480j402519
$$ y = [170490298, 183087783, 196246125, 210007910, 223226709, 235742337, 248873034, 260813757, 273484411, 285262815, 296886952, 307117396, 315777097, 323878795, 330792224, 335987220, 339623255, 342340358, 343223321, 342307198, 339069207, 334117905, 327149675, 319630320, 312116608, 302981817, 292607586, 280880911, 268405519, 254757562, 240814140, 226734456, 212529544, 198156487, 184265753, 170344039, 156578195, 143671538, 130937137, 117955935, 106379283, 95832966, 85959885, 77304885, 68834761, 61459142, 54636430, 48605744, 43819499, 39819580, 35426761, 31208474, 28592256, 25892931, 23485066, 21526285, 19796937, 17815334, 16410854, 15008335]
4541A5008335l87847j088512j528533k65738j09506n29408m62290o27407n39035
4532I470059l01628n01221j07587j4333l47346m57784L15739m02006j139184J4255
4522F528964J2297j81080L22935L3759q4209m51711m97651l70473J30365l3179
4512E410017L3203k60191m49094r4421j62849m50854K63941K8486M8642r5724
4502D271156J38460j3440j3511k93378j40345J04835K15145M10357k25082m28317
4492D025880k20687l55573K73360N02326J49543l399J9055J62459N1203j08456
4482D495711l48692R3516R1756k24453l20252J52961M17312M90844o75149L74679
4472D548233j00674m66956m87209N9195o6810O5499j54741P16M40817l27594j62980
$$ y = [15008335, 14620488, 13531976, 12003443, 11737705, 11628199, 11098791, 10636501, 10009094, 9470059, 9168431, 8667210, 8559623, 8545290, 8197944, 7740160, 8055899, 7653893, 6514709, 6528964, 6541261, 6360181, 6683116, 6716875, 6632666, 6180955, 5683304, 5312831, 5443196, 5410017, 5443220, 5183029, 4733935, 4639514, 4476665, 4025811, 4289752, 4318238, 4366880, 4271156, 4409616, 4396176, 4382665, 4089287, 3948942, 4053777, 4268922, 4679279, 4454197, 4025880, 3805193, 3449620, 3722980, 4225306, 4374849, 4371450, 4390505, 4552964, 4604167, 4495711, 4147019, 4240535, 4332291, 4107838, 3787586, 3940547, 4357859, 4848703, 4173554, 4548233, 4447559, 3980603, 3493394, 3552589, 3485779, 3551278, 3396537, 3397253, 3838070, 3510476, 3347496]
4461C347496p9132k65484j73258N45554M2157j18830J61358j16498p9671M33241
4451C696933J84257m16244L45816N50521J97325k59150j70602o40976Q4829K85025
4441C857734L5303j32251M14331j69165l14508M32677o10684P8106M1987k1452
4431C612078L9578L99220K61902q7973l56311j15576J16883L95898K63721j0116
4421D519304m96083k46048j28113R338K07127j47128J27918k90713l30545J43702
4411C368759N92944K84560n23106J61683j98724j86824j93225J46353k88920K40297
4401C403797J49613k58105j10987L81520L52101l69593J56577k30826M880J55292
4391C634269J40034K52368n63528p3655j31645M39001K81956m1828J31229J00068
$$ y = [3347496, 3268364, 3002880, 2829622, 3375176, 3417333, 3298503, 3459861, 3343363, 3263692, 3696933, 3881190, 3464946, 3810762, 4361283, 4558608, 4299458, 4128856, 3487880, 3572709, 3857734, 3893037, 3760786, 4175117, 4005952, 3691444, 4124121, 3513437, 3591543, 3633530, 3612078, 3651656, 4050876, 4312778, 4224805, 3868494, 3752918, 3869801, 4265699, 4529420, 4519304, 4023221, 3777173, 3649060, 3658398, 3865525, 3718397, 3846315, 3555602, 3225057, 3368759, 3961703, 4246263, 3723157, 3884840, 3686116, 3499292, 3306067, 3452420, 3163500, 3403797, 3553410, 3295305, 3184318, 3565838, 3917939, 3548346, 3704923, 3474097, 3478977, 3634269, 3774303, 4026671, 3463143, 3389488, 3257843, 3696844, 3978800, 3936972, 4068201, 4168269]
4381D168269M6885j1126k65971N994j94407l5767J98108R2243m0032M7746m8925
4370C963017K48285k0183J23442O0154q3515m41787J28851N16639m87142j55107
4360C852654N00121J48477k46315K098O08527J03838m04516j48389J18343R0122
4350D624960O711P39244J19474l1402j37866J24587J65535M79360m92380j09447
4340E488776r553M1935k5224N46094L8671l9875O7550L7766o0915j14905j65668
4329E804652K77093L3818J57293k32115k02446o9976j90814K081O15041J00834
4319F295461m3120p3197O15249J08129L03703J86362m02735J64697o0151j63844
4309F930554N65944j15087l77327K82369K2529n5372M04444L29738r2484Q3880
$$ y = [4168269, 4215154, 4204028, 3938057, 3944051, 3749644, 3713877, 3911985, 4004228, 3964196, 4011942, 3963017, 4211302, 4191119, 4314561, 4374715, 4291200, 3849413, 3978264, 4494903, 4007761, 3852654, 4352775, 4501252, 4254937, 4257035, 4865562, 4969400, 4564884, 4416495, 4534838, 4624960, 4631671, 5370915, 5490389, 5458987, 5321121, 5445708, 5611243, 6090603, 5598223, 5488776, 5479223, 5521158, 5495934, 6042028, 6080699, 6040824, 6108374, 6146140, 6085225, 5970320, 5804652, 6081745, 6115563, 6272856, 6040741, 5838295, 5768319, 5577505, 5579586, 6194627, 6295461, 6252341, 6179144, 6794393, 6902522, 7206225, 7392587, 6989852, 7154549, 7094398, 6930554, 7496498, 7381411, 7004084, 7286453, 7308982, 7253610, 7658054, 7987792, 7895308, 7979188]
4299G979188k09694Q23016K40946J64806J96565M19848J69729Q5051m3756J6785
4289I842484r4702L95574M30972K85891J7383p9453J35080M33540O29373P28286
4279A2724428J24282M5095O22385Q49071L66128J04885P99232J223480j01407
4270A6757579k79679M35731N38165K96173M87382L41835K09804O77921Q34161
4261B0299072N25576M38066R77015R16326R13650O21004N60625Q95643J076462
4252B7223439J547684R20213J054738J134622J289912J570585J252142J255091
4244C7248426J227342J695573J293034J586867K045149K003688J717400J864529
4236E0682008K022885J552495K168254J741813J410683J887091J701233J519017
$$ y = [7979188, 7769494, 8592510, 8833456, 8998262, 9194827, 9614675, 9784404, 9869455, 9825699, 9842484, 9747782, 10143356, 10574328, 10860219, 10877602, 10798149, 10933229, 11366769, 11996142, 12724428, 12848710, 12893805, 13516190, 14365261, 14731389, 14836274, 15635506, 16858986, 16757579, 16477900, 16913631, 17451796, 17747969, 18235351, 18577186, 18786990, 19464911, 20299072, 20824648, 21262714, 22239729, 23156055, 24069705, 24690709, 25251334, 26146977, 27223439, 28771123, 29691336, 30746074, 31880696, 33170608, 34741193, 35993335, 37248426, 38475768, 40171341, 41464375, 43051242, 45096391, 47100079, 48817479, 50682008, 52704893, 54257388, 56425642, 58167455, 59578138, 61465229, 63166462, 64685479]
4228F4685479J736627K586943J096156J079401J886368R90306Q89670Q63484J535187
4219G7349621P64685P69493J262803O68602J98584K20439j47518O8773J15782
4210H1271264k78866J34922k4571r85397o51682p55497o54062j185955j790000
4201G5080156j499507j947553k194511k297663j974489k350866j969240k329495
4193E8516832k177879k401582k297300j924611j871159k397506k090801j321935
4185D2034059j923279k010832j419188j536146j036396j478958j379936j566721
4177B9682603r94400j169593j444736k7351r60702p42677j155143j325401l31588
4168B1531012q72358q60069n68913q8586k25605o15635k25031p17956m97384m41307
$$ y = [64685479, 66422106, 69009049, 70105205, 71184606, 73070974, 74061280, 74950950, 75814434, 77349621, 78114306, 78883799, 80146602, 80815204, 81013788, 81234227, 81086709, 81155482, 81271264, 80992398, 81127320, 81102749, 80117352, 79465670, 78710173, 78056111, 76870156, 75080156, 73580649, 71633096, 69438585, 67140922, 65166433, 62815567, 60846327, 58516832, 56338953, 53937371, 51640071, 49715460, 47844301, 45446795, 43355994, 42034059, 40110780, 38099948, 36680760, 35144614, 34108218, 32629260, 31249324, 29682603, 28688203, 27518610, 26073874, 26046523, 25085821, 24343144, 23188001, 21862600, 21531012, 20658654, 19798585, 19229672, 19141086, 18915481, 18299846, 18074815, 17356859, 16859475, 16418168]
4158A6418168m01215K37445r4658o15457L71798M30077r60506n94482M26853j04968
4148A5113055k77989O33995J6648k79035l25239j57459L30930l03445K21498L93007
4138A5365966K53840j37821j88610N77214p3970R6355L88488m4716M15742O35924
4128A7288412L30896O24078m30057J48371L02881M11749L17285p2521P23330M21862
4118B0066286N17346P25459Q9546R2237L92528L2693O68526N43796L87872R34784
4108B4451073O39811q078O05230O91960J053915R76573J059092P61311O94900
4099C0925787J186482O83194K11162J585117J226257J205371J960916J652108
4091D0636394J797783J549509J947085J873963J974234K367784K598352K979158
$$ y = [16418168, 16016953, 16254398, 16159740, 15544283, 15916081, 16346158, 15385652, 14791170, 15218023, 15113055, 14835066, 15469061, 15485709, 15206674, 14881435, 14723976, 15054906, 14751461, 14972959, 15365966, 15619806, 15481985, 15293375, 15870589, 15796619, 15892974, 16281462, 16236746, 16652488, 17288412, 17619308, 18243386, 17813329, 17961700, 18264581, 18676330, 18993615, 18921094, 19644424, 20066286, 20583632, 21309091, 21398637, 21490874, 21883402, 21916095, 22584621, 23128417, 23516289, 24451073, 25090884, 25082806, 25688036, 26379996, 27433911, 28410484, 29469576, 30230887, 30925787, 32112269, 32795463, 33006625, 34591742, 35817999, 37023370, 38984286, 40636394, 42434177, 43983686, 45930771, 47804734, 49778968, 52146752, 54745104, 57724262]
4083E7724262L164238K743010K929914L289126L376436L811290L944479M902796
4075H5885551M030732M265450M782058M575993M623411N056596M360529M598025
4067A22178345N576944M427824M346988M021854L876067L410172K876729K657717
4059A53372640K199628J513625R13374L62305k50114p2149q61735j394320k080382
4050A53702872k620195k865360l649478l677613m024076m841976m668011m475434
4042A22880729n595835n110509n066440n573657n201007m593189n073175m958915
4034H1708002n000290n022092l613591m255615m450222k845928l288769l789383
4026D9442112k765201k540821k348690k228972k011322j825112j867986j560838
$$ y = [57724262, 60888500, 63631510, 66561424, 69850550, 73226986, 77038276, 80982755, 85885551, 89916283, 94181733, 98963791, 103539784, 108163195, 113219791, 117580320, 122178345, 127755289, 132183113, 136530101, 140551955, 144428022, 147838194, 150714923, 153372640, 155572268, 157085893, 157999267, 158361572, 158111458, 158039309, 157177574, 155783254, 153702872, 151082677, 148217317, 144567839, 140890226, 136866150, 132024174, 127356163, 122880729, 117284894, 112174385, 107107945, 101534288, 96333281, 91740092, 86666917, 81708002, 76707712, 71685620, 68072029, 63816414, 59366192, 56520264, 53231495, 49442112, 46676911, 44136090, 41787400, 39558428, 37547106, 35721994, 33854008, 32293170]
4018C2293170j438856j450231j393160q66984j402403q99980q00478q61540q52097
4009B2327441m85523l36449p35249q45721k90772m31210j58156o13666j176561
4000A7254134l44692k97736l86301l86679o57797l91025j4987k41312q01430o53341
3990A3078834k63275L39159l84662l76794N2918k18840k55847r3466j04806n74925
3980A1198296j17924l62569m66423M013l70547k05654j16953P139P8280m52234
3970I195424N03789n6487o34193n8100J51163k4409p3598j92416j21186M64053
3960I154040O1608K7216l7638J29544L26780K19844p4899R7496j76334q4390P28157
3949A0371424M48697l1154o8100L17240O20405K0065P21884K82615n78271Q93436
$$ y = [32293170, 30854314, 29404083, 28010923, 27143939, 25741536, 24841556, 24041078, 23179538, 22327441, 21841918, 21505469, 20770220, 19924499, 19633727, 19202517, 19044361, 18430695, 17254134, 16909442, 16611706, 16225405, 15838726, 15180929, 14789904, 14774917, 14533605, 13732175, 13078834, 12815559, 13154718, 12770056, 12393262, 12446180, 12227340, 11971493, 11878027, 11773221, 11198296, 11080372, 10717803, 10251380, 10255393, 9884846, 9679192, 9562239, 9569378, 9647658, 9195424, 9699213, 9642726, 9008533, 8950433, 9101596, 9077187, 9003589, 8811173, 8689987, 9154040, 9215648, 9242864, 9205226, 9334770, 9661550, 9881394, 9806495, 9903991, 9727657, 9643267, 10371424, 10820121, 10788967, 10720867, 11038107, 11658512, 11678577, 12400461, 12683076, 12104805, 12998241]
3939A2998241j82394j78569L9298J28822L08103O35207O07440k8437n04947k80024
3929A3542740j92654N9799j58209K61540l29081K64309n86322o12392L78463o21535
3919A2006658l60156p18l99918m82906q4256J26302p34718n75039l74137O1324
3909I182436J42866R3085P2711J19335p2973k59133r0909M15776k3122l01885
3899I278187R4642k16563M01137p9620Q9760M55097m9496k30652M54864O6035
3889A0263391m27306m3299L92535j18025N40728L33447l54769M84468Q0379O98424
3879A1849973K32290k88868L37208L97841N12643J20709K32763M24366O22912
3870A4441837J99126j06801M00633L71365O01444P85426P07286J86916O89294
$$ y = [12998241, 12815847, 12637278, 12676576, 12805398, 13113501, 13748708, 14356148, 14327711, 13822764, 13542740, 13350086, 13409885, 13251676, 13513216, 13184135, 13448444, 12862122, 12249730, 12628193, 12006658, 11646502, 11645784, 11245866, 10762960, 10678704, 10805006, 10070288, 9495249, 9121112, 9182436, 9325302, 9418387, 9491098, 9610433, 9537460, 9278327, 9187418, 9603194, 9580072, 9278187, 9372829, 9156266, 9557403, 9477783, 9567543, 10022640, 9973144, 9742492, 10197356, 10263391, 9836085, 9792786, 10185321, 10067296, 10608024, 10941471, 10586702, 11071170, 11151549, 11849973, 12082263, 11793395, 12130603, 12528444, 13041087, 13161796, 13394559, 13818925, 14441837, 14640963, 14534162, 14934795, 15306160, 15907604, 16693030, 17400316, 17587232, 18276526]
3861A8276526O54724k3819Q69999P45897O47131O16140Q17259L50676R33110L47352
3851B4234995O03780O11775L97622O24549P34884K41108J69669O8904N98062M25893
3841B8711241M46136N11035J26881J17998k36198j28802K87384J90194L75325
3832C0401194j0950M2453K86397N29577j68940o29931n2223L57577L6661O89622
3822C1481437P14239K4147Q14493O34487J013504O56116M72839R98956O14639
3813C7424857J069623R40017J208119J275820J651673J735815J656907K177067
3805D9139898J994292J622775J899368K657423K372815K517857K390851J753361
3797F6348640J205564K110505K734070K566176K092351K251181J892415J087145
$$ y = [18276526, 18931250, 18907431, 19777430, 20523327, 21170458, 21786598, 22603857, 22954533, 23887643, 24234995, 24838775, 25450550, 25848172, 26472721, 27207605, 27448713, 27618382, 27687286, 28285348, 28711241, 29157377, 29668412, 29795293, 29913291, 29677093, 29548291, 29835675, 30025869, 30401194, 30390244, 30432697, 30719094, 31248671, 31079731, 30449800, 30397577, 30755154, 30791815, 31481437, 32195676, 32219823, 33034316, 33668803, 34682307, 35338423, 35811262, 36810218, 37424857, 38494480, 39434497, 40642616, 41918436, 43570109, 45305924, 46962831, 49139898, 51134190, 52756965, 54656333, 57313756, 59686571, 62204428, 64595279, 66348640, 67554204, 69664709, 72398779, 74964955, 77057306, 79308487, 81200902, 82288047]
3789H2288047J683519K566876J682836J379448J176959J001164J339967J390921
3781I4509737N71707O42124J019284O51108J99477K71225j85178M9923M0991l30179
3771I7440219p5355J80142q09419J8819j1517o1209K2531l72192j32280m78112
3761I5721627q78787n67525q67350j31534r59746j174268j473493r86345k75541
3752H8407038j816434j734539k009890j593439r21985j399556k211185k182354
3744G4537656j901032k512321k020963k298227j665207j732983k747827k690172
3736E6968924k232372k118134j689343k102189k085585j981544k223198j590971
3728D0945588j966618q34046j343192j641641j719368j127430j183819r20064
$$ y = [82288047, 83971566, 86538442, 88221278, 89600726, 90777685, 91778849, 93118816, 94509737, 95081444, 95723568, 96742852, 97393960, 97593437, 97864662, 97679484, 97729407, 97770398, 97440219, 97364864, 97545006, 96735587, 96754406, 96742889, 96681680, 96704211, 96332019, 96199739, 95721627, 94842840, 94275315, 93407965, 93276431, 92316685, 91142417, 89668924, 88682579, 88407038, 86590604, 84856065, 82846175, 81252736, 80330751, 78931195, 76720010, 74537656, 72636624, 70124303, 68103340, 65805113, 64139906, 62406923, 59659096, 56968924, 54736552, 52618418, 50929075, 48826886, 46741301, 44759757, 42536559, 40945588, 38978970, 38144924, 36801732, 35160091, 33440723, 32313293, 31129474, 30209410]
3720C0209410j466733l96580j60162m11896r02691m89928j0369p82656j03216
3711B5485179k3177k61682J01987l11457J26759j6511l77061n5600r075j20893
3701B4538469L94573j86778r51386J07643j4611n3818m97651p24011n2776k74334
3691B2285320j080379o19647n90524m39221l94790n01768k88147m19146L8334
3682A7990032r65000p73094o01086p72644k69357k18069n31648o03079q39895
3673A2416160r00765m52401l67533l18356l82023o12676k93454l60532o02618
3664H125802m26726Q2718k57339k90153j23706n49171J67866J13862K55320m61134
3654F637339J84626j13057m98047l96777j84661J90867m15983m05746J56685K38998
$$ y = [30209410, 28742677, 28346097, 28185935, 27774039, 26871348, 26381420, 26371051, 25588395, 25485179, 25462002, 25200320, 25302307, 24990850, 25117609, 25101098, 24724037, 24668437, 24659362, 24538469, 24933042, 24746264, 23794878, 23902521, 23887910, 23834092, 23336441, 22612430, 22559654, 22285320, 21204941, 20585294, 19994770, 19555549, 19160759, 18658991, 18370844, 17951698, 17990032, 17025032, 16251938, 15650852, 14878208, 14608851, 14390782, 13859134, 13256055, 12416160, 11515395, 11062994, 10695461, 10377105, 9995082, 9382406, 9088952, 8728420, 8125802, 7699076, 7781794, 7524455, 7234302, 7110596, 6561425, 6729291, 6843153, 7098473, 6637339, 6821965, 6708908, 6210861, 5814084, 5629423, 5820290, 5404307, 4998561, 5155246, 5394244]
3644E394244R4436n36917k00598m993l16563m87853p9198K60352p0169j59362
3634C893379J61003M7797m64094j62892l54291P8122O72660L55717l24002N84337
3624D487736K1497o01515J39001K46852n30398K18635o10330j68194K21321j17798
3614C306807r8869K56503N99785j44634p27327j8395p3095L679o14212k26992
3604B263250N63186k67517l16618j73679K88423J96161M01615L6698N10338p66854
3594B735003o8730N15477J63617m02640K74271j55380J45043k97093k86680l15761
3584B307127k81094j08316M22902K53612J12294m46444k7573M36614J82078j46554
3574B704646l30106j09982k48826k19203j48220l90192K66977M00367l17177P99062
$$ y = [5394244, 5488680, 4951763, 4751165, 4746172, 4429609, 3941756, 3862558, 4122910, 4052741, 3893379, 4054382, 4102179, 3638085, 3475193, 3120902, 3199024, 3871684, 4227401, 3903399, 4487736, 4509233, 3907718, 4046719, 4293571, 3763173, 3981808, 3371478, 3203284, 3424605, 3306807, 3207938, 3464441, 4064226, 3919592, 3192265, 3173870, 3100775, 3104454, 2490242, 2263250, 2826436, 2558919, 2242301, 2068622, 2357045, 2553206, 2954821, 2991519, 3501857, 2735003, 2666273, 3181750, 3345367, 2942727, 3216998, 3061618, 3206661, 2909568, 2622888, 2307127, 2026033, 1917717, 2340619, 2594231, 2706525, 2260081, 2232508, 2669122, 2851200, 2704646, 2374540, 2264558, 2015732, 1796529, 1648309, 1258117, 1525094, 1925461, 1608284, 2407346]
3564B407346L78008l50459K46911L69530m24750j83368k17864j29635J2562J09167
3554B217448l04689J42864l46255P4548L75860r8218j72181K03128O3419J46806
3544B302730m19454L95513J73824n42823L37696M86646q7489j81927j105141M83304
3534A842879K80616k58396M20773m38837k12383P56899K82245q19380n24299M45138
3524A775255j18036l44767l8176L71546J23720J0095M04551j20082L19077K01321
3514B584504n10771k31745L13449J92321J50355l2458L60437r9899j56647q3926
3504B485620j54698K58117M5351k01203J63452j40960K8877m00144J44619J90026
3494B419057L61157k24922j28341J76171M630q6164q8512J63604m26674m17332
$$ y = [2407346, 2785354, 2434895, 2681806, 3051336, 2626586, 2443218, 2225354, 2095719, 2108281, 2217448, 1912759, 2055623, 1709368, 1783916, 2159776, 2061558, 1889377, 2092505, 2155924, 2302730, 1883276, 2278789, 2452613, 1909790, 2247486, 2734132, 2646643, 2464716, 1359575, 1842879, 2123495, 1865099, 2285872, 1847035, 1634652, 2391551, 2673796, 1854416, 1330117, 1775255, 1657219, 1312452, 1274276, 1645822, 1769542, 1779637, 2184188, 2064106, 2383183, 2584504, 2073733, 1841988, 2155437, 2347758, 2498113, 2465655, 2826092, 2726193, 2569546, 2485620, 2330922, 2589039, 2634390, 2433187, 2596639, 2455679, 2484556, 2084412, 2229031, 2419057, 2780214, 2555292, 2426951, 2603122, 2607752, 2521588, 2433076, 2596680, 2170006, 1752674]
3484A752674J07234K65804N87836K49215j76125l02750O208K75691J69902k4888
3474B910801m15222J01218p3738L1922q619m3532l9392J10461K37301l93109l61969
3463B056122l24446R6985L90434j30056q1396O9554j92540n6251N90295l17738
3453B100963J12372l3884N4533j8925m8500k81659N4759p2886K9413L23534l87819
3442A831901j56642P94460N90292m93555K00152m68306K44650l6472m4106O6966
3432B529340j20394J98992j32781n6260J20420J29029L9696K3612k70232l05133
3422B156289J45575K9677K65290j14717j92324L50941k47026l05980l18307m34378
3412A335040M40228K59452N47825K77326n05515k27341o4732j82996k6003K06132
$$ y = [1752674, 1859908, 2125712, 2713548, 2962763, 2786638, 2483888, 2490096, 2765787, 2935689, 2910801, 2495579, 2596797, 2523059, 2554981, 2546362, 2502830, 2463438, 2573899, 2811200, 2418091, 2056122, 1731676, 1828661, 2219095, 2089039, 2007643, 2077197, 1884657, 1828406, 2418701, 2100963, 2213335, 2179451, 2233984, 2215059, 2166559, 1884900, 1939659, 1866773, 1896186, 2219720, 1831901, 1675259, 2469719, 3060011, 2566456, 2766608, 2298302, 2542952, 2506480, 2462374, 2529340, 2408946, 2607938, 2475157, 2418897, 2539317, 2668346, 2708042, 2731654, 2461422, 2156289, 2301864, 2331541, 2596831, 2482114, 2289790, 2640731, 2393705, 2087725, 1769418, 1335040, 1775268, 2034720, 2582545, 2859871, 2354356, 2127015, 2062283, 1879287, 1853284, 2059416]
3402B059416l71408M43838l71674n9943N25698l25738K50261n1095M1735Q7302
3392B228392n06455K57932j97268k26404K90514J62177K43973J36065K4487k20684
3382B192729k33584J49384j90298l62910p6175k67897K81489N05096K11285q5151
3372B123968j82476P6811L59606K3340j63044m4839M10656l01198N38032K23864
3362C064720k47955L31401k6065n98730J51816L25301K10495M73506L5688J69964
3352C890141m39182L26126N23549R4942j79446J32413M90385P989J03752n78727
3342D371942k40641j0380j77403N84056l47340k68527K08951L08759l37547n1014
3332D040856p30522j72098P4344n42078l17312K6463J05083K29318J2115l55896
$$ y = [2059416, 1688008, 2131846, 1760172, 1700229, 2225927, 1900189, 2150450, 2099355, 2141090, 2228392, 1721937, 1979869, 1782601, 1556197, 1846711, 2008888, 2252861, 2388926, 2413413, 2192729, 1959145, 2108529, 1918231, 1555321, 1479146, 1211249, 1492738, 1997834, 2209119, 2123968, 1941492, 2018303, 2377909, 2401249, 2238205, 2193366, 2604022, 2302824, 2840856, 3064720, 2816765, 3148166, 3122101, 2523371, 2675187, 3000488, 3210983, 3684489, 3720177, 3890141, 3450959, 3777085, 4300634, 4395576, 4216130, 4348543, 4838928, 4846917, 4950669, 4371942, 4131301, 4120921, 3943518, 4527574, 4180234, 3911707, 4120658, 4429417, 4091870, 4040856, 3310334, 3138236, 3212580, 2670502, 2353190, 2379653, 2484736, 2714054, 2726169, 2370273]
3322B370273J82247K51289N72499J9097p9829K10525J96240J84775O09308J09905
3312D626329M4203m3055M08892K18637N33838J197876K29410O34257R18959L45084
3302I114430R36528P14065P48608M27515N37891P16768M36680M42559m58721l70053
3292A3246270o41809n1981m01839l84062m06506j006165L72959k25390n39820
3283I961657J07426n9240K46407n30222M89681r8290M14655Q02409n1766J018366
3273A2301083J001307J092974J939158J851227J240653R47964R20912J021057
3265B2316335R27203L59552m5271o40087j324387j457559r58537r79021q19491
3256A7378737j175995j576441j286977r24384m09951o82292n23448j030490j013196
$$ y = [2370273, 2552520, 2803809, 3376308, 3395405, 3315576, 3526101, 3722341, 3907116, 4516424, 4626329, 4670532, 4627477, 5036369, 5255006, 5788844, 6986720, 7216130, 7850387, 8769346, 9114430, 10050958, 10765023, 11513631, 11941146, 12479037, 13195805, 13632485, 14075044, 13616323, 13246270, 12604461, 12552480, 12150641, 11766579, 11360073, 10353908, 10726867, 10501477, 9961657, 10069083, 10009843, 10256250, 9726028, 10215709, 10117419, 10532074, 11334483, 11282717, 12301083, 13302390, 14395364, 16334522, 18185749, 19426402, 20374366, 21295278, 22316335, 23243538, 23603090, 23557819, 22917732, 21593345, 20135786, 19177249, 18198228, 17378737, 16202742, 14626301, 13339324, 12414940, 12004989, 11322697, 10799249, 9768759, 8755563]
3247H755563j48375k7380j33110m11768P9911N08014l21805N23837Q48950K15541
3237I889378M87585O97805P04456O58472j67813K24362m43101m39967p91528j008921
3227I810728k99682n47314m14944j011904k78430r41505o40823j25602n78324
3218D972200j81990n55290n68620n77207k47762o82908Q3052J09480l08476r4882
3208A947597L41378k05920k08537l2949r5430N59628j8368n85537M34685j7223
3198B119324o8581L32159m30829J8356k88254J5247N87801J27988o47672L47175
3188B112714J3614m56125L52654J84139k38198l94892J64021M05307l44429j56480
3178A642325K88029j59145J25923j79581N23934J62022m952l2419m602J06590
$$ y = [8755563, 8607188, 8579808, 8446698, 8034930, 8114841, 8622855, 8301050, 8824887, 9673837, 9889378, 10376963, 11074768, 11779224, 12437696, 12269883, 12494245, 12051144, 11611177, 10819649, 9810728, 9511046, 8963732, 8548788, 7536884, 7258454, 6316949, 5676126, 5550524, 4972200, 4790210, 4234920, 3666300, 3089093, 2841331, 2158423, 2241475, 2350955, 2042479, 1947597, 2288975, 2083055, 1874518, 1841569, 1746139, 2305767, 2287399, 1701862, 2136547, 2119324, 2050743, 2382902, 1952073, 1970429, 1682175, 1697422, 2285223, 2413211, 1765539, 2112714, 2126328, 1670203, 2022857, 2206996, 1968798, 1573906, 1737927, 2143234, 1798805, 1642325, 1930354, 1771209, 1897132, 1717551, 2241485, 2403507, 2398555, 2366136, 2361534, 2468124]
3168B468124n44568L54219L78878l56053k8859k54328m5147K06494k27671K30255
3158B181344J09569l40287J56856k86751K90232L11872J76893J15148k27454j09856
3148B377566n80129K15539M59797L89454p59325R3804M49888K31703j54021O363
3138B730639K05504n74700J01315M27550m12672O3465J46176O4903m53967n47193
3128A751020K61579j83211K69159N36309J49r5770k62091j42275L26764j38741
3118B322892k04949k09469K28944O98818r9320J37065k21901l21258p0903M12691
3108B672610j35806q5794O4658k86671l6475K53938n63230m39632K68611n6129
3098A656080J25476M3324L72468k4678k04618j56533k48005j91341K61478K34163
$$ y = [2468124, 1923556, 2277775, 2656653, 2300600, 2271741, 2017413, 1972266, 2178760, 1951089, 2181344, 2290913, 1950626, 2107482, 1820731, 2110963, 2422835, 2599728, 2714876, 2487422, 2377566, 1797437, 2012976, 2472773, 2862227, 2102902, 2196706, 2646594, 2878297, 2724276, 2730639, 2936143, 2361443, 2462758, 2890308, 2477636, 2541101, 2687277, 2752180, 2298213, 1751020, 2012599, 1829388, 2098547, 2634856, 2635005, 2539235, 2277144, 2134869, 2461633, 2322892, 2117943, 1908474, 2137418, 2836236, 2736916, 2873981, 2652080, 2330822, 2259919, 2672610, 2536804, 2451010, 2515668, 2228997, 2192522, 2446460, 1883230, 1443598, 1712209, 1656080, 1781556, 1824880, 2197348, 2172670, 1968052, 1811519, 1563514, 1372173, 1633651, 1867814]
3088A867814K06487k86382K03167J675l97094m5110M1927M7995K94050j50145
3078A784384j26903l54466O0199K0796m14752j33901K45222K14151m50196K47026
3068A091560J30211K44424r8495j18737n4813L9644K86695j88052k79522N6073
3058A108988K37379K214j40307k24849J62096j31260n18792j61964J34061R9130
3048E66696M52590l22123n06018M23730K24441K19182J30191R9875l78257j34247
3038G76060p3336r885k07428M70793k11004J18533L47800r8465m89541M15960
3028A039487p97277k7152Q04801l06953K59260j09713l4186k61829N885M086M44603
3017A021012L15256m7501R6501k76835l15907L7320p0674N2771r2779j69123k07024
$$ y = [1867814, 2074301, 1787919, 1991086, 1992761, 1595667, 1550557, 1592484, 1640479, 1934529, 1784384, 1657481, 1303015, 1363214, 1384010, 969258, 835357, 1080579, 1294730, 844534, 1091560, 1221771, 1466195, 1367700, 1248963, 1194150, 1233794, 1520489, 1332437, 1052915, 1108988, 1346367, 1348581, 1208274, 983425, 1145521, 1014261, 495469, 333505, 467566, 566696, 1019286, 697163, 191145, 614875, 839316, 1058498, 1188689, 1288564, 910307, 776060, 702724, 692839, 485411, 956204, 745200, 863733, 1211533, 1113068, 623527, 1039487, 242210, 215058, 1019859, 712906, 972166, 862453, 828267, 566438, 572323, 576409, 1021012, 1336268, 1288767, 1385268, 1108433, 792526, 829846, 759172, 811943, 719164, 550041, 343017]
3006C43017K64118o2493K69232J66700r780k51797j53090L80200N73764m01089
2996A118782l42470r2693L64621j75884j76536j31965k82358J12082M46103R995
2986H49677M26636O6194m74182k52569J08646k5923m1584N2657J97077m04582
2976E02047L53694K36867J40010J34786n49874O7077J87045Q6778p28848k02150
2966B27432J16284N6135J65261k69587k08777K71583M03617L60811l7253j31564
2956I53942l32748J93145p0233k42192L04980J788N4371K38801q84537j86556
2946C0761K15132L84331N8655k62703m8320j33512J32780J23395L34664m46872
2936C88311m3771O0441Q541O9341n46708j04792L27818j50795J88858K38479O9370
$$ y = [343017, 607135, 544642, 813874, 980574, 970794, 718997, 565907, 946107, 1519871, 1118782, 776312, 683619, 1048240, 872356, 695820, 563855, 281497, 393579, 839682, 849677, 1276313, 1342507, 868325, 615756, 724402, 698479, 656895, 709552, 906629, 502047, 855741, 1092608, 1232618, 1367404, 817530, 884607, 1071652, 1158430, 429582, 227432, 343716, 399851, 565112, 295525, 86748, 358331, 761948, 1122759, 1085506, 953942, 621194, 814339, 744106, 501914, 806894, 808682, 863053, 1101854, 217317, 30761, 245893, 630224, 688879, 426176, 377856, 244344, 377124, 500519, 835183, 388311, 344540, 404981, 413522, 482863, -63845, -168637, 159181, 8386, 197244, 435723, 505093]
2925E05093R6295K4327J8506k66086K34021M8602Q9403n64499Q9331K24662L9975
2914E39630J48164J88691j20966m57606m20037J98858l6155J96247j39205k31879
2904a34258L35531J56080J17033K53409k35231N2784k71256l95073K19134m6781
2894E1372K23371L77970k69300o29804k10488J85670M00895M934N6471K28625
2884D19716k50020l45446J38284J70733j16940J88720m50734N77159N12295l16061
2874E27706k65623l29422m43540N63891K098p8309j92936L44756J82721J038k05513
2863A06867n55521K46696L60833N87890j45146j43594j31311K60693k62640J48499
2853D73266P2545R5386J10081j26083k72612j09648n1855j87518J75062L93940
$$ y = [505093, 601388, 625715, 644221, 378135, 612156, 660758, 750161, 185662, 274993, 499655, 539630, 687794, 876485, 755519, 297913, -122124, 76734, 40579, 236826, 97621, -134258, 201273, 357353, 474386, 727795, 492564, 545348, 274092, -120981, 98153, 51372, 274743, 652713, 383413, -246391, -456879, -271209, 129686, 134620, 191091, 419716, 169696, -175750, -37466, 133267, 16327, 205047, -245687, 331472, 843767, 527706, 262083, -67339, -510879, 53012, 55110, -23199, -216135, 128621, 311342, 312380, 106867, -448654, -201958, 158875, 746765, 601619, 458025, 326714, 587407, 324767, 473266, 545811, 641197, 751278, 625195, 352583, 242935, 191080, 3562, 178624, 572564]
2843E72564o80575L44737M91535M53234m77830j01137K05394k40300k39928M0555
2833C68249j91213k26112L11146L46100n4651K2839m1257l838l36455j85463K92441
2822C01786L13219p66018L28085j01188k27784L65815m66195M01059L53963L6651
2812E39393n18906k59369M34796J80912k19594N4911k40488J43707L6660M30905
2802E82927k10142m117o40758R5746J79798K3045K06426J71501L27742j6917k82446
2791D32805k92906M41573o10614J60149J45871L23524j96434n36349Q3391L00685
2781B51695M64927K03597O692k05313p95387L45570K7971L2597J78368J36045
2771F46762L34727n77026K27240m61375n8320J17476k27524K31843L31645K07114
$$ y = [572564, -108011, 236726, 728261, 1181495, 703665, 602528, 807922, 567622, 327694, 368249, 177036, -49076, 262070, 608170, 553519, 576358, 535101, 531263, 194808, 9345, 301786, 615005, -151013, 177072, 75884, -151900, 213915, -252280, 148779, 502742, 539393, 20487, -238882, 195914, 376826, 157232, 212143, -28345, 115362, 152022, 582927, 372785, 368668, -272090, -176344, 3454, 26499, 232925, 404426, 732168, 715251, 432805, 139899, 581472, -29142, 131007, 276878, 600402, 403968, -132381, -48990, 251695, 716622, 920219, 926911, 721598, -73789, 271781, 299752, 332349, 510717, 646762, 981489, 404463, 631703, 170328, 112008, 229484, 1960, 233803, 565448, 772562]
2761G72562J58642j762o79815k19218k71374L3682J03526L81134K30328J00406
2751F08111N7207J83171p24893k81990L92334m21670o558J97954m21032L9740
2741c77626O80655k09906J26363K90282j74323l57669L43893l5176k66981K33509
2731B53021L77551K688m52884j42707L43365m54925L62873o55656M0440L44320
2721A8086N58178N7129k60777j33866K17190M04767J53778k86499j26983j48390
2711D52613K11369L7397l27613o70474J45175N00139M3702j34032q9774j2603
2701A55899L10716M01739k03616J38155k01049l38145Q4347J72043o97536q2297
2691b59744l2097J93905K12747l3528K54724J84579p3053k99634J94464k37236
$$ y = [772562, 931204, 929442, 249627, 30409, -240965, -207283, -103757, 277377, 507705, 608111, 665318, 848489, 123596, -158394, 233940, -187730, -194288, 3666, -417366, -377626, 303029, 93123, 219486, 509768, 335445, -22224, 321669, 286493, 19512, 253021, 630572, 633260, 180376, 37669, 381034, -73891, 288982, -366674, -326234, 18086, 576264, 633393, 372616, 238750, 455940, 860707, 1014485, 727986, 601003, 452613, 663982, 701379, 373766, -296708, -151533, 348606, 392308, 258276, 168502, 155899, 466615, 868354, 664738, 802893, 601844, 263699, 348046, 520089, -177447, -259744, -291841, -97936, 114811, 81283, 336007, 520586, 447533, 147899, 342363, 105127]
2681A05127L787j26706l13163N8601J55764K67863j24487L48410k12902k43695
2671h1401L18093K98911k51145j14498N8981J25987j11447L10890N6737j34960
2661D76148o25270k2066M24611O2187m54763m45166R167J72504N43851M4572j65907
2650A9868j51988m71838O42342J41767o6989l41161m5376J46317j16477L75989
2640A32454o8948l4631K07641j22860o4006k79121L85001k7757Q1984j20798R3508
2629A82467M280J20303j18477K44382q3072J63829r0745l28408n0592M65733J06753
2618F16453m63747M14767k40820m13634K50242K44774k61236J29057L34560l43627
2608B66789l30043M91890j58733P7302k7010M04993l68824K0437J18761Q0415
$$ y = [105127, 108914, -17792, -330955, -272354, -116590, 151273, 26786, 375196, 162294, -81401, 236692, 535603, 284458, 169960, 228941, 354928, 243481, 554371, 611108, 476148, -149122, -171188, 253423, 315610, -139153, -584319, -575152, -402648, 141203, 185775, 19868, -132120, -603958, 38384, 180151, 113162, -227999, -273375, -127058, -243535, 132454, 63506, 28875, 236516, 113656, 49650, -229471, 155530, 127773, 209757, 88959, 182467, 186747, 307050, 188573, 432955, 349883, 513712, 422967, 94559, 43967, 509700, 616453, 152706, 567473, 326653, -86981, 163261, 408035, 146799, 275856, 610416, 266789, -63254, 428636, 269903, 347205, 320195, 725188, 356364, 376801, 495562, 575977]
2598E75977J45807L2127l97639j61486k70763j62331J00108L5852K96443l8422
2588A55673l9473k72416K035N87340k08301j20115J66968J86924j81419m70608
2578a93392Q4002N06891J01441J05813k11262l39167q2292j14565M51730j42138
2568A67061n79023M29420L5981j568j7196K62714J13722l7781l85051j10945M33786
2557C11120K26571m42456L24928L28317o3612o12203j49068L54753K17484m03651
2547I2183l21852p373q3251L92976L61048K11273m94221m4117j64185n78296J32247
2536e03568M04287K07637P0698n0046j40870M59170J96923l12239L37367n13674
2526A55685P30537L0955l30776j35174K91099n99376p5660L90552k81515j86359
$$ y = [575977, 721784, 753911, 356272, 194786, -75977, -238308, -138200, -102348, 194095, 155673, 116200, -156216, -154181, 433159, 224858, 104743, 271711, 458635, 277216, -193392, -109390, 397501, 498942, 604755, 393493, 54326, -27966, -142531, 309199, 167061, -411962, 17458, 53439, 51871, 34675, 297389, 411111, 373330, -11721, -122666, 311120, 537691, 95235, 420163, 748480, 684868, 72665, -76403, 278350, 495834, 92183, -229669, -237042, -320293, 72683, 433731, 645004, 150783, 106666, -57519, -635815, -503568, -99281, 108356, 179054, 129008, -11862, 447308, 644231, 331992, 669359, 155685, 886222, 917177, 586401, 451227, 742326, 142950, 67290, 457842, 176327, -10032]
2516a0032l64242k42296K15510M36198L34119l92746j16926K64037L20608k69549
2506A74681L8908j05612M8081k98943k75618L90492L81744Q6823k50314L53057
2496E43299j85619k54610j85669M10220k25959j12709N3722O7077M04466L01747
2486H15965k93082k05301j35562M19000m41392j37405J01506L67493l70804J63870
2476B84288N06146l70510L4335n35218q1960L42183J98041k30583J86260M38252
2466G71234m8259J97900l93129j2216J55134N4497Q1719n14999O9710j71517r178
2455A80896m06539K42828L07895j28309R8369p3623j55479K38306k40529j57967
2445i4152M8433L88484r7437K62030k61025o01385l28323L39508L44395j84142
$$ y = [-10032, -374274, -616570, -401060, 35138, 369257, -23489, -140415, 123622, 444230, 174681, 213589, 107977, 156058, -142885, -418503, -28011, 353733, 440556, 190242, 543299, 357680, 103070, -82599, 327621, 101662, -11047, 42675, 109752, 514218, 815965, 522883, 317582, 182020, 601020, 159628, 22223, 123729, 491222, 120418, 284288, 790434, 419924, 454259, -80959, -162919, 179264, 377305, 146722, 332982, 771234, 722975, 920875, 527746, 515530, 670664, 725161, 806880, 291881, 361591, 190074, 180896, -225643, 17185, 325080, 196771, 295140, 221517, 66038, 304344, 63815, -94152, -45719, 342765, 245328, 507358, 246333, -355052, -683375, -343867, 528, -183614]
2435a83614k08303L20471M92356M71861o74516K01250O09433k97464J65066m88101
2425D08439L35875m59250n95561j76378N64342n3587n03093J23674j29922J05140
2415c80321L15364l35268R7358J1180P4844L58718L8787k97023L49510N58603
2405G91752p870m88238k51542k87600k10375k2020M69966k84931J3148K35270
2395d2440K49701K11418n69684N1830R0006p32769K2386N50680m1947Q4115m83529
2384f10233M67360O32167K94857k57052l78988r4402Q9913J54455l68699K72460
2374B01838l6422L11944j72563m74579J21862Q6078J20714o26305k4143O65461
2364A73885p1114J09106J80307k6913l30130m41906P6787P95752m005j040014
$$ y = [-183614, -391917, -71446, 420910, 892771, 218255, 419505, 1028938, 731474, 896540, 408439, 744314, 285064, -310497, -486875, 77467, 23880, -479213, -355539, -485461, -380321, -64957, -400225, -302867, -291687, -216843, 141875, 180662, -116361, 233149, 791752, 783882, 295644, 44102, -243498, -453873, -475893, -5927, -290858, -277710, -42440, 207261, 418679, -151005, -99175, -9169, -741938, -719552, -168872, -210819, -126704, -610233, -142873, 489294, 784151, 527099, 148111, 53709, 143622, 298077, -70622, 201838, 165416, 477360, 304797, -169782, -47920, 38158, 158872, -467433, -491576, 173885, 102771, 211877, 392184, 365271, 35141, -406765, -329978, 465774, 461769, -578245]
2354e78245M85698L868j34304j04952L3655M56473l79031k94028L39615O6018
2344a05233m9368O32933m40603o27124J90435J2796r9283K95179N12868m94350
2334a71750j87763L03920j00142j2548K91348J26567L79908K04284n39106j67912
2324A26806j77100L59861J01544J63008j65988L3774k48393l53711J62357k26321
2314b24163K05456L44972l14762m3778J6674m61235K29264k7696J80050q3827
2304a79045J60186N4799k98426J82880O5465j20642J3330l62376L27393K30749
2294G4313l15523O2942N50884n04522k69561R9812L97716K58605j13289l85438
2284a44061j76012M81743K33116m66208j22062N02009n05016n707L18154l99320
$$ y = [-578245, -92547, -88679, -222983, -327935, -294280, 162193, -216838, -510866, -171251, -105233, -154601, 478332, 37729, -589395, -398960, -386164, -485447, -190268, 322600, -171750, -359513, -55593, -155735, -168283, 123065, 249632, 629540, 833824, 294718, 126806, -50294, 309567, 411111, 574119, 408131, 441905, 193512, -160199, 2158, -224163, -18707, 326265, 11503, -32275, -15601, -476836, -247572, -275268, -95218, -179045, -18859, 35940, -262486, -79606, -14141, -134783, -121453, -483829, -156436, 74313, -241210, -178268, 372616, -131906, -401467, -301655, 96061, 354666, 241377, -144061, -320073, 161670, 394786, -71422, -193484, 308525, -196491, -202198, 115956, -283364]
2274b83364q3250J70522k68544M36870j0948n87804K18559j38562K78824L86215
2264A18518N868N9370L3157Q7123j01542j03901J9682l34188j88685K22108L7775
2253a44715J3675n0092M5732j22143L66009k00013K29286J13113p99441M67464
2243h1125K50045J81757l16637N3423o9977k22194M74246J429N63694j20484n44847
2232A69330j34048k27286m25193J33418K00059K23254J44468m75683L5832L19954
2222c5895N7237K16569m33666N86368q1461m73027m29464J05437J8282k07047
2212f76667q2343J193137J57850l72318m9882o74345K78574k15197K29521L29328
2202A17658l19780j72482N87304l50154j9192L04364q5243L0997m41957j68290
$$ y = [-283364, -366614, -196092, -464636, -27766, -38714, -626518, -407959, -546521, -267697, 118518, 124386, 183756, 216913, 304036, 202494, 98593, 118275, -215913, -404598, -182490, -144715, -131040, -181132, -135400, -257543, 108466, -91547, 137739, 250852, -548589, -81125, 168920, 350677, 34040, 87463, 17486, -204708, 269538, 270967, 834661, 714177, 169330, 35282, -192004, -617197, -483779, -283720, -60466, 84002, -391681, -355849, -35895, 21342, 237911, -195755, 390613, 309152, -163875, -593339, -487902, -469620, -676667, -759010, 434127, 591977, 219659, 169777, -504568, -225994, -441191, -211670, 117658, -202122, -374604, 212700, -137454, -156646, 147718, 62475, 93472, -348485, -516775]
2192e16775L31457K89198L0042m92211j63135M4696J80124n4822j0257L80180
2182A8497j44482n6197O9337M89008K06399o54914J30448J2354M059K6280J78158
2171B78947j07104k82124N74982k69408m93187P15423J88065l75765N271l1627
2161B03473k25183K65675j83892j81979Q2977l95163M12606o7545l38935r1898
2151e19864M00770L51993l0027n12145J35631K94675l13346K36449k14604K1951
2141a48517K32849K8161N09365o24728J48995J44524o6439j22054o45588N64321
2131B0889L74339j39032K08260k25269n2132o13883m38158O53567m75892M8124
2121f39187M55472m6834n87680K59284O83574k13674k60621L21424J02382q08016
$$ y = [-516775, -185318, 103880, 133922, -358289, -521424, -476728, -296604, -351426, -361683, 18497, -125985, -182182, -112845, 376163, 582562, -72352, 58096, 70450, 74509, 100789, 278947, 171843, -110281, 464701, 195293, -297894, 417529, 605594, 229829, 235100, 203473, -21710, 243965, 60073, -121906, -38929, -434092, -21486, -89031, -427966, -519864, -119094, 232899, 202872, -309273, -173642, 121033, -192313, 44136, -170468, -148517, 84332, 112493, 621858, -2870, 146125, 290649, 224210, 102156, -543432, 20889, 395228, 256196, 464456, 239187, 187055, -426828, -864986, -211419, -687311, -639187, -183715, -230549, -818229, -558945, 124629, -89045, -349666, -28242, 74140, -733876]
2111g33876O99179L81291j06307J16202k28230o0775k51556M28953K66634j4774
2101D96741m49666J11593o40610L72216L78692K77579j39435p2478J40203j50534
2091C24301j94776r9286P3354J74126q9207l59958p0022j13911L16300K04889
2081A65810j63608N5109k46447P6257M91695L96174J65562p6028k12443p35555
2071h3474J88452J06231k96740L47780J44092l69068J11706p0488K49572K47678
2061E75741j04691K4k27834J93961l30732p9570j14366j05550M9652M526k37572
2050c76411l03456P13557K08298k79663K35355l45944M24850R9504l75139K28639
2040B29590K06422j81358o33994k71240N4635M30789q2203K79055R3333j00476
$$ y = [-733876, -34697, 346594, 240287, 356489, 128259, 67484, -184072, 244881, 511515, 496741, 47075, 158668, -481942, -109726, 268966, 546545, 407110, 334632, 474835, 324301, 129525, 30239, 103593, 277719, 188512, -171446, -241468, -355379, -39079, 165810, 2202, 57311, -189136, -112879, 378816, 774990, 940552, 864524, 652081, -83474, 104978, 211209, -85531, 262249, 406341, 37273, 148979, 78491, 328063, 575741, 471050, 471074, 243240, 437201, 106469, 26899, -87467, -193017, -143365, -138839, -376411, -679867, 33690, 241988, -37675, 197680, -148264, 276586, 376090, 951, 229590, 436012, 254654, -379340, -650580, -595945, -165156, -247359, 31696, 125029, 24553]
2030B4553P3032K41575N67728n47277k90715K65225r2661L33964q3081k66414
2020B25929k21259L52396j30747l10485L00005J6414j85580J78545J00608K05933
2010E31759m72917l89422l01834J18525l4255m92023M55858P26099m67387j32077
2000d57674l12806N1350M09239J68858J24590J48517k61132l18573L15662j13796
1990b45765n55503M17472P4059L80762j84131j16639M78425J97782l05523k09843
1980f8904J84244J71888l47078p9352k14030J92541K46089n63665L2104N54086
1970A07923L93001j64186k58687J92472L1495m94140J90699L55972k44671p4971
1960C4907O84777K45007m60618n24668k47498m1988L16834K95658L47104r5472
$$ y = [24553, 97585, 339160, 906888, 359611, 68896, 334121, 241460, 575424, 492343, 225929, 4670, 357066, 226319, -84166, 215839, 232253, 46673, 225218, 325826, 531759, 58842, -330580, -632414, -513889, -548144, -1040167, -584309, 141790, -325597, -457674, -770480, -719130, -309891, -141033, -16443, 132074, -129058, -447631, -131969, -245765, -801268, -383796, -309737, 71025, -113106, -229745, 248680, 446462, 140939, -68904, 115340, 287228, -59850, -139202, -353232, -160691, 85398, -478267, -446163, 107923, 500924, 336738, 78051, 270523, 302018, -192122, -1423, 354549, 109878, 34907, 719684, 964691, 504073, -20595, -268093, -310081, 6753, 302411, 649515, 554043]
1950E54043n80724n47501L82142J33482M75432P0971j62069K52137K62952l52372
1940D88493n81147l05678K73446q2159k28953K05932k26523q7675L01416Q9864
1930a52984j10076m8880K78502J4384J16370R3528J17175k09122m36033M55P383
1919c29298j60744k78340N1266J85028L20369K03970k62342J34352L25689J9759
1909B09709k05674M95241j10602m26774J69927L12142j34815j42707K2378P0360
1899B59185j38933k06410k77304K09144l20635L15326J05148j33413k17610N690
1889c99812O1533L09025O9988L67586j71277l32056K76637m54175M1953K17921
1879a2677J07074O00605j70990l59011N2362K5639j24284l93614M1116K7898K32293
$$ y = [554043, -26681, -574182, -192040, -58558, 416874, 487845, 325776, 577913, 840865, 488493, -92654, -398332, -124886, -207045, -435998, -230066, -456589, -544264, -242848, -152984, -263060, -311940, -33438, -19054, 97316, 190844, 308019, 98897, -337136, -336681, -329298, -490042, -768382, -717116, -532088, -211719, -7749, -270091, -135739, 189950, 209709, 4035, 499276, 388674, -38100, 131827, 443969, 309154, 166447, 188825, 259185, 120252, -86158, -363462, -154318, -474953, -159627, -54479, -187892, -405502, -399812, -338279, -29254, 40734, 408320, 237043, -95013, 181624, -272551, -230598, -12677, 94397, 695002, 524012, 165001, 217363, 243002, 118718, -274896, -233780, -205882, 26411]
1868B6411j65289J11496K25021j14496L09396l10539k5542J73268K12893k35098
1858B07521K40906l1387o83403j80744K27758M24122o46972O5644L21471o7887
1848a22971L96965m42873m18143L61083J82551J68343M5117m54323k13672M35673
1838f2250o36794R6885M15323M10330L41538k54614k2177j52770M0729L02657
1828D78857j4729k4783k50618L987o27192N17903k43239L3130M19202L34513l77689
1817B49342k80603k8216N86085m66476l4144K52451L41946l06906n6592l09605
1807e2718J00276L58248m09775m66583N01199l00718l3315O34578q917l63502
1797d1227j9539L0469K10550l88508m01032N97293l01829L42785J1142k42262
$$ y = [26411, -138878, -27382, 197639, 83143, 392539, 82000, 56458, 229726, 442619, 207521, 448427, 417040, -266363, -447107, -219349, 204773, -442199, -376555, -55084, -122971, 273994, -168879, -587022, -225939, -43388, 124955, 170072, -284251, -497923, -62250, -699044, -602159, -186836, 223494, 565032, 310418, 288241, 135471, 176200, 478857, 464128, 439345, 188727, 192714, -434478, 83425, -159814, -126684, 292518, 627031, 249342, -31261, -59477, 526608, 60132, 25988, 278439, 620385, 313479, 256887, -52718, 47558, 405806, -3969, -470552, 30647, -270071, -303386, 331192, 322275, -41227, -60766, -30297, 180253, -208255, -609287, -11994, -313823, 28962, 40104, -202158]
1787b02158N1655J99655L16867k47638k12680M63060k66956J3412j55749l04459
1777c44991K40784K66903J67779P7414j72839J24986n16536q691J51050M69019
1767D54878k8776k55156P5675k28445l594J34172O5692j64593k56298N4661j21102
1756b72886K91048L52239j13780m44952K03898L44244m90257l66737L16267j60534
1746c41450M06623l40518J38012k4057L20609K85465J14927O9006m92205p2205
1736F4207o1401j60600l7404Q8785L66700m77407Q3353N36281j87332k70994l02307
$$ y = [-202158, -150503, 49152, 366019, 118381, -94299, 368761, 101805, 115217, -40532, -344991, -104207, 162696, 330475, 407889, 235050, 360036, -156500, -165191, -14141, 454878, 426102, 170946, 246621, 18176, 14582, 148754, 214446, 49853, -206445, -151784, -272886, 18162, 370401, 256621, -188331, 15567, 359811, -130446, -497183, -180916, -341450, 65173, -275345, -137333, -161390, 159219, 444684, 559611, 628617, 136412, 64207, 2806, -157794, -195198, -106413, 260287, -217120, -133767, 402514, 215182, -55812, -358119]
$$ [...]
##END NTUPLES=NMR SPECTRUM
##END=
