##TITLE=1H_CG-1228-AX
 200.13MHz,CDCl3,
 8 sc
 
 1.11.2025
##JCAMPDX= 6.0         $$ Bruker NMR JCAMP-DX V2.0
##DATA TYPE= NMR SPECTRUM
##DATA CLASS= NTUPLES
##ORIGIN= UXNMR, Bruker Analytische Messtechnik GmbH
##OWNER= pz
$$ XWIN-NMR		Version 3.5
$$ Sat Nov  1 13:52:26 2025 Russian Standard Time (UT+4h)  she@DPX200
##.OBSERVE FREQUENCY= 200.1313
##.OBSERVE NUCLEUS= ^1H
##.ACQUISITION MODE= SIMULTANEOUS
##.ACQUISITION SCHEME= undefined
##.AVERAGES= 8
##.DIGITISER RES= 18
##SPECTROMETER/DATA SYSTEM= spect
##.PULSE SEQUENCE= zg30
##.SOLVENT NAME= CDCl3
##.SHIFT REFERENCE= (INTERNAL, CDCl3, 0, 15.532)
##AUDIT TRAIL= $$ (NUMBER, WHEN, WHO, WHERE, WHAT)
$$ ##TITLE= Audit trail, XWIN-NMR		Version 3.5
$$ ##JCAMPDX= 5.01
$$ ##ORIGIN= Bruker BioSpin GmbH
$$ ##OWNER= she
$$ F:/spectra/data/she/nmr/H-C/1/pdata/1/auditp.txt
$$ ##AUDIT TRAIL=  $$ (NUMBER, WHEN, WHO, WHERE, WHAT)
(   1,<2025-11-01 13:51:10.50 +0400>,<she>,<DPX200>,
      <created by zg, POWCHK disabled, PULCHK disabled
       configuration hash MD5:
       00 E9 B6 7A A2 85 ED C7 34 08 36 98 17 FE 4E 26
       data hash MD5: 16K
       1D 36 55 87 E7 DD 7F 70 60 01 3A 6A 8F BE 41 E0>)
(   2,<2025-11-01 13:51:13.31 +0400>,<she>,<DPX200>,
      <Start of raw data processing
       efp BC_mod = 2 LB = 0.25 FT_mod = 6 PKNL = 1 PHC0 = -2790.269 PHC1 = 16.79235 SI = 16K 
       data hash MD5: 16K
       18 D8 68 93 DC 6D EF 1B C4 4D 5B 49 0B 56 E4 91>)
(   3,<2025-11-01 13:51:32.62 +0400>,<she>,<DPX200>,
      <pk PHC0 = 156.5587 PHC1 = 0 
       data hash MD5: 16K
       8C F1 7C 10 BB E8 B4 FD C0 B0 2B 22 28 84 35 24>)
(   4,<2025-11-01 13:51:36.42 +0400>,<she>,<DPX200>,
      <abs ABSG = 5 
       data hash MD5: 16K
       B1 93 6C DE D7 48 D8 75 3E BA 3A DF C0 5F 0E 81>)
$$ ##END=
$$ 
$$ hash MD5
$$ A7 41 67 2A FD 2C C0 8E 6A 0C D3 77 03 70 4D 7E
##$RELAX= 
##$RELAX= 
##$RELAX= 
##$RELAX= 
##$RELAX= 
##$RELAX= 
$$ Bruker specific parameters
$$ --------------------------
##$DU= <F:/spectra>
##$EXPNO= 1
##$NAME= <H-C>
##$PROCNO= 1
##$TYPE= <nmr>
##$USER= <she>
##$AMP= (0..31)
100 100 100 100 100 100 100 100 100 100 100 100 100 100 100 100 100 100 
100 100 100 100 100 100 100 100 100 100 100 100 100 100 
##$AQSEQ= 0
##$AQ_mod= 1
##$AUNM= <au_zg>
##$AUTOPOS= <>
##$BF1= 200.13
##$BF2= 200.13
##$BF3= 200.13
##$BF4= 200.13
##$BF5= 200.13
##$BF6= 200.13
##$BF7= 200.13
##$BF8= 200.13
##$BYTORDA= 1
##$CFDGTYP= 0
##$CFRGTYP= 5
##$CHEMSTR= <none>
##$CNST= (0..31)
1 1 145 1 1 1 1 1 1 1 1 1 1 1 1 1 1 1 1 1 1 1 1 1 1 1 1 1 1 1 1 1 
##$CPDPRG= <>
##$CPDPRG1= <>
##$CPDPRG2= <>
##$CPDPRG3= <>
##$CPDPRG4= <mlev>
##$CPDPRG5= <mlev>
##$CPDPRG6= <mlev>
##$CPDPRG7= <mlev>
##$CPDPRG8= <mlev>
##$CPDPRGB= <>
##$CPDPRGT= <>
##$D= (0..31)
0 0.7 0 0 0 0 0 0 0 0 0 0.03 0 0 0 0 0 0 0 0 0 0 0 0 0 0 0 0 0 0 0 0 
##$DATE= 1761990669
##$DBL= (0..7)
120 120 120 120 120 120 120 120 
##$DBP= (0..7)
150 150 150 150 150 150 150 150 
##$DBP07= 0
##$DBPNAM0= <>
##$DBPNAM1= <>
##$DBPNAM2= <>
##$DBPNAM3= <>
##$DBPNAM4= <>
##$DBPNAM5= <>
$$ [...]
##$SUBNAM3= <"">
##$SUBNAM4= <"">
##$SUBNAM5= <"">
##$SUBNAM6= <"">
##$SUBNAM7= <"">
##$SUBNAM8= <"">
##$SUBNAM9= <"">
##$SW= 18.0517328524113
##$SWIBOX= (0..15)
0 0 2 0 0 0 0 0 0 0 0 0 0 0 0 0 
##$SW_h= 3612.71676300578
##$TD= 16384
##$TD0= 1
##$TE= 0
##$TE2= 300
##$TE3= 300
##$TEG= 300
##$TL= (0..7)
0 120 120 120 120 120 120 120 
##$TP= (0..7)
150 150 150 150 150 150 150 150 
##$TP07= 0
##$TPNAME0= <>
##$TPNAME1= <>
##$TPNAME2= <>
##$TPNAME3= <>
##$TPNAME4= <>
##$TPNAME5= <>
##$TPNAME6= <>
##$TPNAME7= <>
##$TPOAL= (0..7)
0.5 0.5 0.5 0.5 0.5 0.5 0.5 0.5 
##$TPOFFS= (0..7)
0 0 0 0 0 0 0 0 
##$TUNHIN= 0
##$TUNHOUT= 0
##$TUNXOUT= 0
##$USERA1= <user>
##$USERA2= <user>
##$USERA3= <user>
##$USERA4= <user>
##$USERA5= <user>
##$V9= 5
##$VALIST= <valist>
##$VCLIST= <CCCCCCCCCCCCCCC>
##$VD= 0
##$VDLIST= <DDDDDDDDDDDDDDD>
##$VPLIST= <PPPPPPPPPPPPPPP>
##$VTLIST= <TTTTTTTTTTTTTTT>
##$WBST= 1024
##$WBSW= 4
##$XGAIN= (0..3)
0 0 0 0 
##$XL= 0
##$YL= 0
##$YMAX_a= 410856
##$YMIN_a= -517423
##$ZGOPTNS= <>
##$ZL1= 120
##$ZL2= 120
##$ZL3= 120
##$ZL4= 120
##$ABSF1= 15.46152
##$ABSF2= -2.590329
##$ABSG= 5
##$ABSL= 3
##$ALPHA= 0
##$AQORDER= 0
##$ASSFAC= 0
##$ASSFACI= 0
##$ASSFACX= 0
##$ASSWID= 0
##$AUNMP= <proc_1d>
##$AZFE= 0.1
##$AZFW= 0.1
##$BCFW= 0
##$BC_mod= 2
##$BYTORDP= 0
##$COROFFS= 0
##$CY= -3
##$DATMOD= 1
##$DC= 0
##$DFILT= <>
##$DTYPP= 0
##$F1P= 0
##$F2P= 0
##$FCOR= 1
##$FTSIZE= 16384
##$FT_mod= 6
##$GAMMA= 0
##$GB= 0
##$INTBC= 1
##$INTSCL= 3.241238e-09
##$ISEN= 128
##$LB= 0.25
##$LEV0= 0
##$LPBIN= 0
##$MAXI= 10000
##$MC2= 0
##$MEAN= 0
##$ME_mod= 0
##$MI= 1.114404
##$NCOEF= 0
##$NC_proc= -7
##$NLEV= 6
##$NOISF1= 3.799351
##$NOISF2= 2.8
##$NSP= 0
##$NTH_PI= 0
##$NZP= 0
##$OFFSET= 15.53204
##$PC= 1
##$PHC0= -2633.71
##$PHC1= 16.79235
##$PH_mod= 1
##$PKNL= yes
##$PPARMOD= 0
##$PSCAL= 0
##$PSIGN= 0
##$REVERSE= no
##$SF= 200.12999793033
##$SI= 16384
##$SIGF1= 3
##$SIGF2= 2
##$SINO= 0.751879
##$SIOLD= 32768
##$SREGLST= <19F.Aceton>
##$SSB= 0
##$STSI= 16384
##$STSR= 0
##$SW_p= 3612.71676300578
##$SYMM= 0
##$S_DEV= 0
##$TDeff= 16384
##$TDoff= 0
##$TI= <>
##$TILT= no
##$TM1= 0
##$TM2= 0
##$TOPLEV= 0
##$USERP1= <user>
##$USERP2= <user>
##$USERP3= <user>
##$USERP4= <user>
##$USERP5= <user>
##$WDW= 1
##$XDIM= 16384
##$YMAX_p= 517696031
##$YMIN_p= -1045205
$$ End of Bruker specific parameters
$$ ---------------------------------
##NTUPLES= NMR SPECTRUM
##VAR_NAME=  FREQUENCY,     SPECTRUM/REAL,   SPECTRUM/IMAG
##SYMBOL=    X,             R,               I
##VAR_TYPE=  INDEPENDENT,   DEPENDENT,       DEPENDENT
##VAR_FORM=  AFFN,          ASDF,            ASDF
##VAR_DIM=   16384,         16384,           16384
##UNITS=     HZ,            ARBITRARY UNITS, ARBITRARY UNITS
##FACTOR=    0.220516191357247, 1,           1
##FIRST=     3108.4270614741, 0,             0
##LAST=      -504.289701531676, 0,           0
##MIN=       -504.289701531676, -1045205,    0
##MAX=       3108.4270614741, 517696031,     0
$$ Real data points
##PAGE= N=1
##DATA TABLE= (X++(R..R)), XYDATA
$$ [...]
7086a28122J81881N710l34721o2982J46265J33799J22874j07829o7095m6966l1809
$$ -128122 53759 59469 -275252 -338234 -191969 -58170 64704 -43125 -110220 -157186 -188995
7075a88995M7447m0385K22293J36031k01779k96944K15125J96418j55201o1143
$$ -188995 -141548 -181933 40360 176391 -25388 -322332 -107207 89211 -65990 -127133
7065a27133J13601N2958M5773n6380k9444J42015l7253k26090k15266O5988J33587
$$ -127133 -13532 39426 85199 28819 -625 141390 104137 -121953 -337219 -271231 -137644
7054a37644l7062J71035J0260k80346M174J13316L4181o4880L31018J16855k07497
$$ -137644 -174706 -3671 6589 -273757 -269583 -156267 -122086 -186966 144052 260907 53410
7043E3410J26460j51682p3249R9418p7746j00151K13578J24462K4494k02075k16503
$$ 53410 179870 28188 -45061 54357 -23389 -123540 90038 214500 238994 36919 -179584
7032a79584j7580k4936N5198K3106J09943K4830j4541Q6614o8150Q7295J57242
$$ -179584 -197164 -222100 -166902 -143796 -33853 -9023 -23564 63050 -5100 82195 239437
7021B39437M3332l07390O8680J23726j98736j4778j06149M8795j4919j3727l5617
$$ 239437 282769 -24621 44059 167785 -30951 -45729 -151878 -103083 -118002 -131729 -167346
7010a67346M707K42521k75185K01360J43495m4584k4952j58039N0188k6055J21151
$$ -167346 -162639 79882 -195303 6057 149552 104968 80016 -78023 -27835 -53890 67261
6999F7261j78398J01326Q2164j48380m3777M4697j50549J73569J00607K2681q3331
$$ 67261 -111137 -9811 72353 -76027 -119804 -75107 -225656 -52087 48520 71201 -12130
6988a2130K44415p226o6353J534j9949L5228j18901J4354J01656j31580j19699
$$ -12130 232285 225059 158706 160240 140291 175519 56618 70972 172628 41048 -78651
6977g8651j8928M0064J47302R9523l8591p0213j32433j13514j4680n385j10341
$$ -78651 -97579 -57515 89787 189310 150719 80506 -51927 -165441 -180121 -185506 -295847
6966b95847K33753J14435R2707q3249m4037M900j79534J83466J56894j46318r2804
$$ -295847 -62094 52341 145048 61799 17762 22662 -156872 26594 183488 37170 -55634
6955e5634k0811k4528K05051K3670o0711m3695J91796k9020j52907o3606o5133
$$ -55634 -76445 -100973 104078 127748 67037 23342 215138 186118 33211 -30395 -95528
6944i5528M3109L633J85583J16907p448j06807j36295Q7497J64590K6262K1105
$$ -95528 -52419 -48786 136797 253704 246256 139449 3154 90651 255241 281503 302608
6933C02608L644j76906p7273R8969n2685l16461K43126m2168J32129K7135R2926
$$ 302608 306252 129346 52073 151042 98357 -218104 25022 -17146 114983 142118 235044
6922B35044r2565M8967m6365j63768J49708K5303j18947O8301p6418Q9429O4989
$$ 235044 142479 191446 145081 -18687 131021 156324 37377 105678 29260 118689 183678
6911A83678k4955n7154P6291K79950j58717m9493J3090k28388J83660J118l757
$$ 183678 158723 101569 177860 457810 299093 249600 262690 34302 217962 219080 215323
6900B15323j23032j60115K4870J38040J21188P9558p6643m2904j88941m4223K10726
$$ 215323 92291 -67824 -42954 95086 216274 295832 219189 176285 -12656 -56879 153847
6889A53847N1315m2258r7273J08017r5106M634j92681J26527J53094L2351k7907
$$ 153847 205162 162904 65631 173648 78542 83176 -109505 17022 170116 202467 174560
6878A74560o6797m3631J63341J07035k0407p7522O809R8643K1519L8678k43913
$$ 174560 107763 64132 227473 334508 314101 236579 243388 342031 363550 402228 158315
6867A58315L7963O3900n3937Q4171J68857q5833l0892p6984j08533o4157K9216
$$ 158315 196278 260178 206241 290412 459269 373436 342544 265560 157027 92870 122086
6856A22086m2067J32786Q5881Q1681j52152K2502J70277q0294Q1471k01195K35055
$$ 122086 80019 212805 298686 380367 228215 250717 420994 340700 422171 220976 456031
6845D56031j22564j69826O9918N9199j49452J01208r4210K55527J96748j30285
$$ 456031 333467 163641 233559 292758 143306 244514 150304 405831 602579 472294
6835D72294o8301Q5784j06172l0709J56824J16572j47708o7034N8009q7683j7740
$$ 472294 403993 489777 383605 352896 509720 626292 478584 411550 469559 381876 364136
6824C64136K5851j18060J99718J62624p0272j01738n573J2080j42652J00256J69640
$$ 364136 389987 271927 471645 634269 563997 462259 456686 468766 326114 426370 596010
6813E96010l747K3063n8418J96289m8591j56796n9982q4721J14505J75567J68855
$$ 596010 592263 615326 556908 753197 704606 547810 487828 403107 517612 693179 862034
6802H62034j25419L9204M8950j57612l08789k2682p9759J81597Q0052J05532O6068
$$ 862034 736615 775819 824769 667157 358368 335686 255927 437524 517576 623108 689176
6791F89176o2113O3514m1217K37469r5727P7873j51665j32861J41475k1490L09373
$$ 689176 627063 690577 649360 886829 791102 868975 717310 584449 725924 704434 1013807
6780A013807j37667M3879j3776j25484M868K69371J7023l82986M4391K4622M1535
$$ 1013807 876140 920019 906243 780759 785627 1054998 1072021 689035 733426 758048 799583
6769G99583J04672R8221j29170L4443N3512n8386l7645k1990k34694R4147o7998
$$ 799583 904255 1002476 873306 907749 961261 902875 865230 843240 608546 702693 634695
6758F34695Q2888p8012O3029P0719J28434J74027k98662J61025J58439o0164o096
$$ 634695 717583 639571 702600 773319 901753 1075780 777118 938143 1096582 1036418 1030322
6747A030322o6900O4691K23946j38243m707j35534J4444J18114J8491j85567j9619
$$ 1030322 963422 1028113 1252059 1113816 1109109 973575 988019 1106133 1124624 939057 919438
6736I19438m2125J75674j6832n822k01640J22498J77814j18344k02565N3089K35859
$$ 919438 877313 1052987 1036155 1030333 828693 951191 1129005 1010661 808096 861185 1097044
6725A097044o8037P3191j07614O2528P1040m130N9580p2953J90479j22476O6441
$$ 1097044 1029007 1102198 994584 1057112 1128152 1124022 1183602 1110649 1301128 1178652 1245093
6714A245093J40288q6608j66318M0119j22444K18169Q7531j30307J45175o8789
$$ 1245093 1385381 1298773 1132455 1172574 1050130 1268299 1355830 1225523 1370698 1301909
6704A301909o9436l6562m6361J58159n5484J53495O6768o0496j40563k37499j36
$$ 1301909 1232473 1195911 1149550 1307709 1252225 1405720 1472488 1411992 1271429 1033930 1033794
6693A033794L8270J59538J45370N6909m6669M8899n8447J42323M4144j54389Q9874
$$ 1033794 1072064 1231602 1376972 1433881 1387212 1436111 1377664 1519987 1564131 1409742 1499616
6682A499616j70272J4039M0048q3249J74003J4356j11145j05912O5307m0749K59721
$$ 1499616 1329344 1343383 1383431 1300182 1474185 1488541 1377396 1271484 1336791 1296042 1555763
6671A555763m137k44008r4049N0721J79722K17604q5936K42339k06052j48723
$$ 1555763 1551626 1307618 1213569 1264290 1444012 1661616 1575680 1818019 1611967 1463244
6661A463244Q8470M7819q265J29039j41731m2541J58405p6940K8221k9946k08677
$$ 1463244 1551714 1599533 1591268 1720307 1578576 1536035 1694440 1617500 1645721 1615775 1407098
6650A407098J16529K3007p2366Q5116Q5562L7456n1960L05471Q1133l0542J76385
$$ 1407098 1523627 1546634 1474268 1559384 1644946 1682402 1630442 1935913 2017046 1986504 2162889
6639B162889q7473j24251j9597K01373J8210J8504k22255q2918J89755m3630J08244
$$ 2162889 2075416 1951165 1931568 2132941 2151151 2169655 1947400 1864482 2054237 2010607 2118851
6628B118851k9055J45184n5916j69789J15165k769L46221P8828r2698p3538m7460
$$ 2118851 2089796 2234980 2179064 2009275 2124440 2121671 2467892 2546720 2454022 2380484 2333024
6617B333024N0869L2091K63069j60946K6433K53277k8911j21753J33070j16130
$$ 2333024 2383893 2415984 2679053 2518107 2544540 2797817 2768906 2647153 2780223 2664093
6607B664093N0132J80020j9035k9102P9152O2436k2804Q8626K24226j3081k12107
$$ 2664093 2714225 2894245 2875210 2846108 2925260 2987696 2964892 3053518 3277744 3264663 3052556
6596C052556M755J56435R7450P6773j01660o7078m0026O7199r3182K25091K17717
$$ 3052556 3057311 3213746 3311196 3387969 3286309 3219231 3179205 3246404 3153222 3378313 3596030
6585C596030K0924K2808j92363J54688J73624K0753L5128J86978Q5046o2285j38406
$$ 3596030 3616954 3639762 3447399 3602087 3775711 3796464 3831592 4018570 4103616 4041331 3902925
6574C902925J52128J38928k9192Q8196J63077K84322M0414K1995J47857L9833
$$ 3902925 4055053 4193981 4164789 4252985 4416062 4700384 4740798 4762793 4910650 4950483
6564D950483J46520j2498J19626J88113Q2206J02750j44680L13139J36944j23934
$$ 4950483 5097003 5084505 5204131 5392244 5474450 5577200 5432520 5745659 5882603 5758669
6554E758669M06544M7660j05279K41962K66485j0753J50440K65165J97693J66312
$$ 5758669 6165213 6212873 6107594 6349556 6616041 6605288 6755728 7020893 7218586 7384898
6544G384898K0462k7933J45394R5114K04176K1259j8810R2878J764L11882M06551
$$ 7384898 7405360 7377427 7522821 7617935 7822111 7843370 7824560 7917438 7919202 8231084 8637635
6533H637635J80715K07131p469o6726K87009L95266J72666J24881M62729L01082
$$ 8637635 8818350 9025481 9018012 8951286 9238295 9633561 9806227 9931108 10393837 10694919
6523A0694919K76883K44822L96197K01044J84202J91295M88140L73335N62543
$$ 10694919 10971802 11216624 11612821 11813865 11998067 12189362 12677502 13050837 13613380
6514A3613380L80155L52734L54430N95383L73601K98744O06840N37725L84070
$$ 13613380 13993535 14346269 14700699 15296082 15669683 15968427 16575267 17112992 17497062
6505A7497062M64419N10685K96688K72068O70024N16555L75922N00829L49583
$$ 17497062 17961481 18472166 18768854 19040922 19710946 20227501 20603423 21104252 21453835
6496B1453835K63924K87795M21979L29400J15668K65450L83430N1519L26472L76777
$$ 21453835 21717759 22005554 22427533 22756933 22872601 23138051 23521481 23573000 23899472 24276249
6486B4276249J53504K89705L20609L16245L47393k6236K86726J95197L28837J01667
$$ 24276249 24429753 24719458 25040067 25356312 25703705 25677469 25964195 26159392 26488229 26589896
6476B6589896Q9676K27552J63510P4961M80220J37401Q9808J82850J18541K01354
$$ 26589896 26679572 26907124 27070634 27145595 27625815 27763216 27853024 28035874 28154415 28355769
6466B8355769J57530j82273J13798K58721P8508q4112R3462L9026L6297j85485
$$ 28355769 28513299 28331026 28444824 28703545 28782053 28697941 28791403 28830429 28866726 28681241
6456B8681241j54985j58115j72139k80060o2489J431j86220q812j65657k65213
$$ 28681241 28526256 28368141 28196002 27915942 27853453 27854884 27668664 27659852 27494195 27228982
6446B7228982j41534k67809n22124p3641q7984l18954j82332j18403m03998M840
$$ 27228982 27087448 26819639 26297515 26223874 26135890 25816936 25634604 25516201 25112203 25117043
6436B5117043k4553j86203n12374k35910l33163j39062k83069l70333k80767k45820
$$ 25117043 25092490 24906287 24393913 24158003 23824840 23685778 23402709 23032376 22751609 22505789
6426B2505789k12276l20623k62443k74927l48525l64665m48584p50092m21791
$$ 22505789 22293513 21972890 21710447 21435520 21086995 20722330 20273746 19523654 19101863
6417A9101863l84400n69346l02849m76121m54639n93640l60679j79922n40207
$$ 19101863 18717463 18148117 17845268 17369147 16914508 16320868 15960189 15780267 15240060
6408A5240060p48123m56035k20257n18539p07390o03001k17498l32973l55327
$$ 15240060 14491937 14035902 13815645 13297106 12589716 11986715 11769217 11436244 11080917
6399A1080917m14175m60180k93298k90353k92311j36770l29429j98013k77357
$$ 11080917 10666742 10206562 9913264 9622911 9330600 9193830 8864401 8666388 8389031
6390H389031k40857J22617k48934m26853k01449p4891j97038k93803k8059J78633
$$ 8389031 8148174 8270791 8021857 7595004 7393555 7318664 7121626 6827823 6799764 6978397
6380F978397K4978j66498j87886k96786m3401m8666k6392J44431k9411r3633k48317
$$ 6978397 7003375 6836877 6648991 6352205 6308804 6260138 6233746 6378177 6348766 6255133 6006816
6369F006816J9340j8031M1511j14627N6690L1856j30242J43493J68801j05907
$$ 6006816 6026156 6008125 6049636 5935009 5991699 6023555 5893313 6036806 6205607 6099700
6359F099700j47809K5921K72938O9431k44715J49444P5466r0214j48972J66383
$$ 6099700 5951891 5977812 6250750 6320181 6075466 6224910 6300376 6210162 6061190 6227573
6349F227573M5556l7963j1443m9132j4566K50548J08120k6053j43201n3551Q4114
$$ 6227573 6273129 6235166 6223723 6174591 6160025 6410573 6518693 6492640 6349439 6295888 6380002
6338F380002N8455P7045l4018K80327m4710j12544K48225J81879j31464l9788
$$ 6380002 6438457 6515502 6481484 6761811 6717101 6604557 6852782 7034661 6903197 6863409
6328F863409N022L3140M1206P0999j06174J89068N3696K71781K37763k50926o6024
$$ 6863409 6868431 6901571 6942777 7013776 6907602 7096670 7150366 7422147 7659910 7408984 7342960
6317G342960J86685J30775J52813J0256L3457J59794j13674J90230N0882J64066
$$ 7342960 7529645 7660420 7813233 7823489 7856946 8016740 7903066 8093296 8144178 8308244
6307H308244J72731j12065K38340J89965j1811L8311J39724J82464L29451K22262
$$ 8308244 8480975 8368910 8607250 8797215 8785404 8823715 8963439 9145903 9475354 9697616
6297I697616J6261J86326J83055K06163L1650N8659L94666L77332J96623Q5640
$$ 9697616 9713877 9900203 10083258 10289421 10321071 10379730 10774396 11151728 11348351 11433991
6287A1433991K82059L57625Q1177K46849K48455M96297K08759O2707M75276M09521
$$ 11433991 11716050 12073675 12154852 12401701 12650156 13146453 13355212 13417919 13893195 14302716
6277A4302716K09408M19843J64287K86916K05840M75407O56093N48635N56776
$$ 14302716 14512124 14931967 15096254 15383170 15589010 16064417 16720510 17269145 17825921
6268A7825921N91318O53267N05073N35665Q91153R21454P83046R55898J034671
$$ 17825921 18417239 19070506 19575579 20111244 21002397 21923851 22706897 23662795 24697466
6259B4697466P62596Q36832J128639J231659J243055J452367J346484J474606
$$ 24697466 25460062 26296894 27425533 28657192 29900247 31352614 32699098 34173704
6251C4173704J476364J680677K150731K116419J828184K175731K418056K445290
$$ 34173704 35650068 37330745 39481476 41597895 43426079 45601810 48019866 50465156
6243E0465156K658153K543304K916530K954498L098031L110650L117746L070507
$$ 50465156 53123309 55666613 58583143 61537641 64635672 67746322 70864068 73934575
6235G3934575L104161L186085L229339K882866K735345K430139K147304J617719
$$ 73934575 77038736 80224821 83454160 86337026 89072371 91502510 93649814 95267533
6227I5267533J504852R22242O06848L97518j19568r9527m31973q03498r28531
$$ 95267533 96772385 97694627 98301475 98698993 98579425 98479898 98047925 97244427 96315896
6218I6315896j055691j300035j642531j441755j769443j786815j986167k057814
$$ 96315896 95260205 93960170 92317639 90875884 89106441 87319626 85333459 83275645
6210H3275645j856605j957807j920668k186209k082550k083537k054092k359609
$$ 83275645 81419040 79461233 77540565 75354356 73271806 71188269 69134177 66774568
6202F6774568k428006k093331k331744k392928k153250k151198k228796k270000
$$ 66774568 64346562 62253231 59921487 57528559 55375309 53224111 50995315 48725315
6194D8725315k280101k053027j807009k136277k147278j877499j573565j759127
$$ 48725315 46445214 44392187 42585178 40448901 38301623 36424124 34850559 33091432
6186C3091432j500934j493362j696681j377779j213353j209226j022529j157124
$$ 33091432 31590498 30097136 28400455 27022676 25809323 24600097 23577568 22420444
6178B2420444j188954q50710n56278p65866q66558o73935m73124n53004n59719
$$ 22420444 21231490 20380780 19824502 19058636 18192078 17518143 17045019 16492015 15932296
6169A5932296m32136o02184l34962k68285k71970m68970l35841k28079k65453
$$ 15932296 15500160 14897976 14563014 14294729 14022759 13553789 13217948 12989869 12724416
6160A2724416Q6780l6122l19390K385j90591J1223j73949j69057J46216L5167
$$ 12724416 12811196 12775074 12455684 12458069 12267478 12278701 12104752 11935695 12081911 12117078
6150A2117078Q158m9648M9748P5653n9063j51587l77245J8659K63764J14447j64957
$$ 12117078 12125236 12075588 12125336 12200989 12141926 11990339 11613094 11631753 11895517 12009964 11845007
6139A1845007m18452k9054j46830l30638j50792k54965m6158j53979j74987q8388
$$ 11845007 11426555 11397501 11250671 10920033 10769241 10514276 10468118 10314139 10139152 10050764
6129A0050764l21597j94816J04716r3967m17683l33223o0905M7592k32682J34361
$$ 10050764 9729167 9534351 9639067 9545100 9127417 8794194 8733289 8780881 8548199 8682560
6119H682560p2369p1383j16452k06680J17391L9889p4452K9537n6443O5665J79420
$$ 8682560 8610191 8538808 8422356 8215676 8333067 8372956 8298504 8328041 8271598 8337263 8516683
6108H516683k28427n7457L98185J17018J24793K03041J25384J38642J21576K45238
$$ 8516683 8288256 8230799 8628984 8746002 8870795 9073836 9199220 9337862 9459438 9704676
6098I704676O2392K75085M21342K60627M17044L63362L42326N30199N80846O21851
$$ 9704676 9767068 10042153 10463495 10724122 11141166 11504528 11846854 12377053 12957899 13579750
6088A3579750M27396N92041Q69591M72769P25066J055917J072709R28433R16292
$$ 13579750 14007146 14599187 15468778 15941547 16666613 17722530 18795239 19723672 20639964
6079B0639964J047820J081107J190920J130687O44818R36990J050494P56947P98963
$$ 20639964 21687784 22768891 23959811 25090498 25735316 26672306 27722800 28479747 29278710
6070B9278710N65015N75198M75937L57833M10413L15140L07899L71555O62448
$$ 29278710 29843725 30418923 30894860 31252693 31663106 31978246 32286145 32657700 33320148
6061C3320148O92947O39952P64328Q59511J099767J250898J238271J218764J190899
$$ 33320148 34013095 34653047 35417375 36276886 37376653 38627551 39865822 41084586 42275485
6052D2275485J427678Q92501P86830P37225M20326K29401j40907k52051o63730
$$ 42275485 43703163 44595664 45382494 46119719 46540045 46769446 46628539 46376488 45712758
6043D5712758q52742r41999j021417j220328j220893j284872j000773r92690j034868
$$ 45712758 44860016 43918017 42896600 41676272 40455379 39170507 38169734 37177044 36142176
6034C6142176p88262q70107o34406n57342r42995l41637m69125n20179n58681
$$ 36142176 35353914 34483807 33849401 33292059 32349064 32007427 31538302 31018123 30459442
6025C0459442n22765m70268o11655o64614p34773q41700j064789r70508j250518
$$ 30459442 29936677 29466409 28854754 28190140 27455367 26613667 25548878 24578370 23327852
6016B3327852j097419j168853j141436j358161j207024j061629j019498j019944
$$ 23327852 22230433 21061580 19920144 18561983 17354959 16293330 15273832 14253888
6008A4253888j040904r96522p60861o64703r17816p56015o55851n51352l65855
$$ 14253888 13212984 12216462 11455601 10790898 9873082 9117067 8461216 7909864 7544009
5999G544009o20090m62490k79281j96350k79090m17418k29660j57578l4408j35285
$$ 7544009 6923919 6461429 6182148 5985798 5706708 5289290 5059630 4902052 4867644 4732359
5989D732359k21917j35552j77936j97148q246j63387l4923q5178j4352r5893J0190
$$ 4732359 4510442 4374890 4196954 3999806 3991560 3828173 3793250 3708072 3693720 3597827 3608017
5978C608017J00328j89847k81066N480N041M3637M9540Q3302L2425j76170j20312
$$ 3608017 3708345 3518498 3237432 3242912 3247953 3291590 3341130 3424432 3456857 3280687 3160375
5967C160375N9242l8906n2629q891J8540l5568n7599M6141n9420k49659J1494
$$ 3160375 3219617 3180711 3128082 3119191 3137731 3102163 3044564 3090705 3031285 2781626 2793120
5956B793120J95683l22436O1184m0584j63657J45778J8371m2968J23182N6944
$$ 2793120 2988803 2666367 2727551 2686967 2523310 2669088 2687459 2644491 2767673 2824617
5946B824617R4467r9320k83124M3002J81227k0146k1094j94642L3791J28951j01798
$$ 2824617 2919084 2819764 2536640 2579642 2760869 2740723 2719629 2524987 2558778 2687729 2585931
5935B585931J13593l5305J69121n2639k11868j95206j07768K44278q1209J3085
$$ 2585931 2699524 2664219 2833340 2780701 2568833 2373627 2265859 2510137 2428928 2442013
5925B442013J12236q9778N2246j88040l0727K40552j55271L0422O3489k2664l6274
$$ 2442013 2554249 2464471 2516717 2328677 2297950 2538502 2383231 2413653 2477142 2454478 2418204
5914B418204K92719p6938j34065N6086l8306K86696o2006J23736j67629J05817
$$ 2418204 2710923 2633985 2499920 2556006 2517700 2804396 2742390 2866126 2698497 2804314
5904B804314J35672J38455j22181j05762Q9837m7086M7286m0072r1409n8863R7225
$$ 2804314 2939986 3078441 2956260 2850498 2940335 2893249 2940535 2900463 2809054 2750191 2847416
5893B847416R3309j32788j19577K12704J3725J341J13009j9493j01509j69252
$$ 2847416 2940725 2807937 2688360 2901064 2914789 2916130 3029139 3009646 2908137 2738885
5883B738885Q1759O4275k02621n1208q3487R6955j9130J32602k3173j08333P3248
$$ 2738885 2820644 2884919 2682298 2631090 2547603 2644558 2625428 2758030 2734857 2626524 2699772
5872B699772l3200p0117J39158J05177j89880o1071M0385O766j49050l10708J15411
$$ 2699772 2666572 2596455 2735613 2840790 2650910 2589839 2630224 2636990 2487940 2177232 2292643
5861B292643O6212j38770J71518m758j0992M5939J66484k3806l5006k65317k095
$$ 2292643 2358855 2220085 2391603 2386845 2375853 2421792 2588276 2564470 2529464 2264147 2262052
5850B262052K88085j71599M0425J9455M2068R2107j09048j7831k90596J60575
$$ 2262052 2550137 2378538 2418963 2438418 2480486 2572593 2463545 2445714 2155118 2315693
5840B315693J60742k74947P3090R8281r4244j8531j9011J17568k3473k63626M03084
$$ 2315693 2476435 2201488 2274578 2372859 2278615 2260084 2241073 2358641 2335168 2071542 2474626
5829B474626J53800o5518j71272K15903K51268j7413j70340j26942l2980J52289
$$ 2474626 2628426 2562908 2391636 2607539 2858807 2841394 2671054 2544112 2511132 2663421
5819B663421j4800n286Q4976r8790j5639L30225j43428r4108P1217q9906J23701
$$ 2663421 2648621 2643335 2728311 2629521 2613882 2944107 2800679 2706571 2777788 2687882 2811583
5808B811583K8657J44971K26648k42309k04138J66462j05770O0995J01216O4967
$$ 2811583 2840240 2985211 3211859 2969550 2765412 2931874 2826104 2887099 2988315 3053282
5798C053282o4957J25403p4029N9523m1012r9991J33220n0346R7205O6558q1244
$$ 3053282 2988325 3113728 3039699 3099222 3058210 2958219 3091439 3041093 3138298 3204856 3123612
5787C123612J38488l2665j21614J85653K08530j94769R8672K4576j72334P131
$$ 3123612 3262100 3229435 3107821 3293474 3502004 3307235 3405907 3430483 3258149 3265280
5777C265280N5411J85674L47085o2575j05847O5151j20964J49238P4192R2181
$$ 3265280 3320691 3506365 3853450 3790875 3685028 3750179 3629215 3778453 3852645 3944826
5767C944826q002Q9489K309K72398j3675p1888J29885N0818o2972p5743J46231
$$ 3944826 3936824 4026313 4028622 4301020 4287345 4215457 4345342 4396160 4333188 4257445 4403676
5756D403676p614O8072J30649l8108J08958Q9725J02328q9578J18211K73780O7882
$$ 4403676 4396062 4464134 4594783 4556675 4665633 4755358 4857686 4768108 4886319 5160099 5227981
5745E227981K911J5066J48785J17344L00813j9367J87086R5050J92230J29590
$$ 5227981 5230892 5245958 5394743 5512087 5812900 5793533 5980619 6075669 6267899 6397489
5735F397489K7003j3060l9887J72750J56245P4919n7993p2758p2663N5797J43360
$$ 6397489 6424492 6411432 6371545 6544295 6700540 6775459 6717466 6644708 6572045 6627842 6771202
5724F771202l7944J54210n8458J43379M9920J81222J92197k11407O1220K97141
$$ 6771202 6733258 6887468 6829010 6972389 7022309 7203531 7395728 7184321 7245541 7542682
5714G542682L53056P9312J95387L734K09232K47129O4444J4999j8417J61523k151
$$ 7542682 7895738 7975050 8170437 8174171 8383403 8630532 8694976 8709975 8691558 8853081 8850930
5703H850930j2654J32215k04786k714Q5493M413J48267l3271n4903q8646n4805
$$ 8850930 8838276 8970491 8765705 8762991 8848484 8852897 9001164 8967893 8912990 8824344 8769539
5692H769539J19424J23416M4900K2556J30441K06200j28637O9457K6521R2021
$$ 8769539 8888963 9012379 9057279 9079835 9210276 9416476 9287839 9357296 9383817 9475838
5682I475838J60914M5494j06770m8788Q7554J25479k03457r6562J47218R0913
$$ 9475838 9636752 9682246 9575476 9526688 9614242 9739721 9536264 9439702 9586920 9677833
5672I677833J8594o9195R3247q637j43014j30602J09070J87077J58230Q0913K56880
$$ 9677833 9696427 9627232 9720479 9711842 9568828 9438226 9547296 9734373 9892603 9973516 10230396
5661A0230396J37947k2175R1848Q9605K85268J87814J15327K53063K81297K32897
$$ 10230396 10368343 10346168 10438016 10527621 10812889 11000703 11116030 11369093 11650390 11883287
5651A1883287J02250k2796J54252K55473Q0014J47385J90254K74093K85482L21395
$$ 11883287 11985537 11962741 12116993 12372466 12452480 12599865 12790119 13064212 13349694 13671089
5641A3671089Q5115K33838N02184J09992J17426L34491O7350M26731M94861M49270
$$ 13671089 13756204 13990042 14492226 14602218 14719644 15054135 15121485 15548216 16043077 16492347
5631A6492347K53074M62810O67008N43444P46402P64929M83803M80121O54355
$$ 16492347 16745421 17208231 17875239 18418683 19165085 19930014 20413817 20893938 21548293
5622B1548293O94856O65075P67630P62179Q35883J011397J125474Q93158J140465
$$ 21548293 22243149 22908224 23675854 24438033 25273916 26285313 27410787 28303945 29444410
5613B9444410J247033J194577J220005J253479J484197J579220J767679J634722
$$ 29444410 30691443 31886020 33106025 34359504 35843701 37422921 39190600 40825322
5605D0825322J759327K148985K120605J998772K085099J936339J969301J761757
$$ 40825322 42584649 44733634 46854239 48853011 50938110 52874449 54843750 56605507
5597E6605507J717551J538568J213756J164018J410109R12378Q81752R50332O82854
$$ 56605507 58323058 59861626 61075382 62239400 63649509 64561887 65443639 66393971 67076825
5588F7076825P14243J040141J092699R87025J310828J280781J569642J594967
$$ 67076825 67791068 68831209 69923908 70910933 72221761 73502542 75072184 76667151
5580G6667151J696157J862855J802132J970716J648263J222676J420741J146142
$$ 76667151 78363308 80226163 82028295 83999011 85647274 86869950 88290691 89436833
5572H9436833O79929M22667q9272p87306r27286j377574j561666j709395j708828
$$ 89436833 90116762 90539429 90450157 89662851 88735565 87357991 85796325 84086930 82378102
5563H2378102j806282j931301j680631j741864j696868j538603j447568j612418
$$ 82378102 80571820 78640519 76959888 75218024 73521156 71982553 70534985 68922567
5555F8922567j318249j304862j371215j116690p94583j201872j031619j040450
$$ 68922567 67604318 66299456 64928241 63811551 63016968 61815096 60783477 59743027
5547E9743027j304670j267021j526214j659850j642849j516974j998208j729830
$$ 59743027 58438357 57171336 55645122 53985272 52342423 50825449 48827241 47097411
5539D7097411j726105j891354j977984j818307j883282j751317j427109j548242
$$ 47097411 45371306 43479952 41501968 39683661 37800379 36049062 34621953 33073711
5531C3073711j474780j317249j524218j185236j231414j350832o76409q45743
$$ 33073711 31598931 30281682 28757464 27572228 26340814 24989982 24313573 23467830
5523B3467830q69985n66507n81117o24651m95167l81407l89091m72103l91032
$$ 23467830 22597845 22031338 21450221 20825570 20330403 19948996 19559905 19087802 18696770
5514A8696770m26982k97410n5925J39988j93850k24723l4001O9066O3564K1981
$$ 18696770 18269788 17972378 17916453 18056441 17862591 17637868 17603867 17672933 17736497 17758478
5504A7758478K09027r412O5874K20806L62556K80032K80363M77900L26486L64173
$$ 17758478 17967505 17958093 18023967 18244773 18607329 18887361 19167724 19645624 19972110 20336283
5494B0336283N14188O50928O46498O34197M71768O44852P04347Q74499O16062
$$ 20336283 20850471 21501399 22147897 22782094 23253862 23898714 24603061 25477560 26093622
5485B6093622P87520O01424P20948P25396O07301N96918N55153O97218N48783
$$ 26093622 26881142 27482566 28203514 28928910 29536211 30133129 30688282 31385500 31934283
5476C1934283M32584K76885O90269N18082L27071N93058O35487N76208P23006
$$ 31934283 32366867 32643752 33334021 33852103 34179174 34772232 35407719 35983927 36706933
5467C6706933Q40263N75102P49178R83685J161685J153212R20120R84258J242292
$$ 36706933 37547196 38122298 38871476 39855161 41016846 42170058 43090178 44074436 45316728
5458D5316728J134965J155936Q92391Q96838N90309Q94654N48134K58027L17121
$$ 45316728 46451693 47607629 48500020 49396858 49987167 50881821 51429955 51687982 52005103
5449E2005103K5035l06470m78499m26411o00459m63137o28653p22316p45216p81999
$$ 52005103 52030138 51723668 51245169 50818758 50218299 49755162 49126509 48404193 47658977 46876978
5439D6876978m26984o45271o61254n11295m08485k68523k48276m1074k06685K70445
$$ 46876978 46449994 45804723 45143469 44632174 44223689 43955166 43706890 43665816 43459131 43729576
5429D3729576m1664j91403j14516L413K9726j00825p3486j13715j74727k41281
$$ 43729576 43687912 43496509 43381993 43385406 43415132 43314307 43240821 43127106 42952379 42711098
5419D2711098m74669k04142l04022l34829p35106o07600q94700r91958j104282
$$ 42711098 42236429 42032287 41728265 41393436 40658330 40050730 39156030 38164072 37059790
5410C7059790j147162j184926j043969j005201o47544m91326o04633o24041l66196
$$ 37059790 35912628 34727702 33683733 32678532 32030988 31539662 30935029 30310988 29944792
5401B9944792k29067k08213k61618k4521K2726J12451N79548N05750L51258M13921
$$ 29944792 29715725 29507512 29245894 29221373 29244099 29356550 29936098 30441848 30793106 31207027
5391C1207027J97349M00021N55082L18816L98692k04854l50869m52100n30155
$$ 31207027 31404376 31804397 32359479 32678295 33076987 32872133 32521264 32069164 31539009
5382C1539009n50781n59118p76820n80519m81435l15558o39081l10780o3585k01425
$$ 31539009 30988228 30429110 29652290 29071771 28590336 28274778 27635697 27324917 27261332 27059907
5372B7059907n2948N9790P8604L61709L39844N56286P17900O80077P36603O92310
$$ 27059907 27006959 27066749 27145353 27507062 27846906 28403192 29121092 29801169 30537772 31230082
5362C1230082Q87429P76146N98611L66916L46488K87447K53696j45008k66858
$$ 31230082 32117511 32893657 33492268 33859184 34205672 34493119 34746815 34601807 34334949
5353C4334949K50753K71162j36221p6971J34247J61618K63017Q8932J35984O16575
$$ 34334949 34585702 34856864 34720643 34643672 34777919 34939537 35202554 35291486 35427470 36044045
5343C6044045M77873L62082M15775Q16779Q19346L08733M94948O57361P35036
$$ 36044045 36521918 36884000 37299775 38116554 38935900 39244633 39739581 40396942 41131978
5334D1131978O05426P29166P86902L19297K71535M17107K67143L91520K79409
$$ 41131978 41737404 42466570 43253472 43572769 43844304 44261411 44528554 44920074 45199483
5325D5199483R7076L53252L03563L89411L18997L05271J67442K54608N23102L16921
$$ 45199483 45296559 45649811 45953374 46342785 46661782 46967053 47134495 47389103 47912205 48229126
5315D8229126J63165M27900P9260k2176K92782N32528K89235M0789K00476J44819
$$ 48229126 48392291 48820191 48899451 48877275 49170057 49702585 49991820 50032609 50233085 50377904
5305E0377904J97007J91401K29958N38154L8138J8540J72083K07342M47514J49526
$$ 50377904 50574911 50766312 50996270 51534424 51572562 51591102 51763185 51970527 52418041 52567567
5295E2567567L35442L26837L91816L53039L39609J99914K86287J13310K03914
$$ 52567567 52903009 53229846 53621662 53974701 54314310 54514224 54800511 54913821 55117735
5286E5117735K32092k24132l33934j51156K5244l17811l57049j01384l06215k22546
$$ 55117735 55349827 55125695 54791761 54640605 54665849 54348038 53990989 53889605 53583390 53360844
5276E3360844j78844l36073j68695k7088J54948j09129J2091M3901n5960R5488
$$ 53360844 53182000 52845927 52677232 52650144 52805092 52695963 52708054 52751955 52695995 52791483
5266E2791483m4563K47954o4774p6101k54007l20844j83509k13049o13197o49215
$$ 52791483 52746920 52994874 52930100 52853999 52599992 52279148 52095639 51882590 51269393 50620178
5256E0620178p81703p98471q99906r25107j109641r88120j070648j056070j162007
$$ 50620178 49838475 49040004 48140098 47214991 46105350 45117230 44046582 42990512 41828505
5247D1828505j047186j015979j047308j176003q16976r30354o88513p85118q82531
$$ 41828505 40781319 39765340 38718032 37542029 36725053 35794699 35106186 34321068 33438537
5238C3438537p52734p58504m27798p84045n53866n93840n52651n83329n47142
$$ 33438537 32685803 31927299 31499501 30715456 30161590 29567750 29015099 28431770 27884628
5229B7884628n50674q36784o24811n93590n25635o01634p58259n77400n88882
$$ 27884628 27333954 26497170 25872359 25278769 24753134 24151500 23393241 22815841 22226959
5220B2226959l40596o92193m71225n81678n93759o71734n60906n22814k71273
$$ 22226959 21886363 21194170 20722945 20141267 19547508 18875774 18314868 17792054 17520781
5211A7520781m15560n22919o23440l74314l14100l17706k41059j00886k17119
$$ 17520781 17105221 16582302 15958862 15584548 15270448 14952742 14711683 14610797 14393678
5202A4393678k91457l00028k41737r7601k76570j74444j4055j76740p5623j2041
$$ 14393678 14102221 13802193 13560456 13462855 13186285 13011841 12997786 12821046 12745423 12733382
5192A2733382k14591L55086r755k37162J29539j27943j40169J74845r3334k86626
$$ 12733382 12518791 12873877 12864122 12626960 12756499 12628556 12488387 12663232 12569898 12283272
5182A2283272k16587j62795J66622J37270r6393k54487O0832K87997J89769j40374
$$ 12283272 12066685 11903890 12070512 12207782 12111389 11856902 11917734 12205731 12395500 12255126
5172A2255126J7070j25402j07261J09483o780o6266K29431m4642p0222Q0746K8000
$$ 12255126 12272196 12146794 12039533 12149016 12142236 12075970 12305401 12260759 12190537 12271283 12299283
5161A2299283j54041m0130J27327L12302j037j63851R5001L02292J8577j70628
$$ 12299283 12145242 12105112 12232439 12544741 12543704 12379853 12474854 12777146 12795723 12625095
5151A2625095K3269J49438J67284p7221j31734J68343N2078K14945J87023q0304
$$ 12625095 12648364 12797802 12965086 12887865 12756131 12924474 12976552 13191497 13378520 13298216
5141A3298216J9961J74597K62725R8070J66893J27896J41016K15853J5445J66209
$$ 13298216 13318177 13492774 13755499 13853569 14020462 14148358 14289374 14505227 14520672 14686881
5131A4686881L59469K1297J88970K39902L44796N8329Q0467L96922J45309J71323
$$ 14686881 15046350 15067647 15256617 15496519 15841315 15899644 15980111 16377033 16522342 16693665
5121A6693665M05767K19812J29754K73256N20035M79371K92586m082K57840K80363
$$ 16693665 17099432 17319244 17448998 17722254 18242289 18721660 19014246 19010164 19268004 19548367
5111A9548367O60839M70560L92398N12668K30556K71070N36008O30282M12206
$$ 19548367 20209206 20679766 21072164 21584832 21815388 22086458 22622466 23252748 23664954
5102B3664954M58529P17269M99780P53463O79397P48694O98741Q63606J002746
$$ 23664954 24123483 24840752 25340532 26093995 26773392 27522086 28220827 29084433 30087179
5093C0087179O67318N84168P13771O12661Q49943J062613P97926Q17014N40509
$$ 30087179 30754497 31338665 32052436 32665097 33515040 34577653 35375579 36192593 36733102
5084C6733102J021899J007054Q74404R43960Q60199Q19276P23300J086698Q38355
$$ 36733102 37755001 38762055 39636459 40580419 41440618 42259894 42983194 44069892 44908247
5075D4908247Q41220R23664J025905J250342J056640P43754J129298J353280J221121
$$ 44908247 45749467 46673131 47699036 48949378 50006018 50749772 51879070 53232350 54453471
5066E4453471J184257J452850J567325J564579J672937J831265J962602K047545
$$ 54453471 55637728 57090578 58657903 60222482 61895419 63726684 65689286 67736831
5058F7736831K410973K189210K147149K516533K702183L245375L072108L220530
$$ 67736831 70147804 72337014 74484163 77000696 79702879 82948254 86020362 89240892
5050H9240892L449996L616035L825254M011985M309311M337493M353031M408956
$$ 89240892 92690888 96306923 100132177 104144162 108453473 112790966 117143997 121552953
5042A21552953M244641M236603L761463L570716L065222K310845J886577J077761
$$ 121552953 125797594 130034197 133795660 137366376 140431598 142742443 144629020 145706781
5034A45706781L74589l38420j237501k133167k252707l044317l426880l743705
$$ 145706781 146081370 145742950 144505449 142372282 140119575 137075258 133648378 129904673
5026A29904673l871711m020781m107352m105984l932684l776631l510898l072316
$$ 129904673 126032962 122012181 117904829 113798845 109866161 106089530 102578632 99506316
5018I9506316k989450k624045k239862k184123j519902j056691m66347m32248
$$ 99506316 96516866 93892821 91652959 89468836 87948934 86892243 86425896 85993648
5010H5993648k4330N16724P87322J060954J334727J703959K219436K866222L165290
$$ 85993648 85969318 86486042 87273364 88334318 89669045 91373004 93592440 96458662 99623952
5001I9623952L420574M068689M612276N050575N197749N040728N009757M375258
$$ 99623952 103044526 107113215 111725491 116776066 121973815 127014543 132024300 136399558
4993A36399558M118445L568331K798991J452426J89814j204025l089473m384738
$$ 136399558 140518003 144086334 146885325 148337751 148527565 147323540 144234067 139849329
4985A39849329n496709o009030o491016o644831o598936o639709o636952o506085
$$ 139849329 134352620 128343590 121852574 115207743 108608807 101969098 95332146 88826061
4977H8826061o346834o160827o028877n481522m842164m521789m340374l996435
$$ 88826061 82479227 76318400 70289523 64808001 59965837 55444048 51103674 47107239
4969D7107239l212840k701628k400997k053901j702481j408418j147801j014409
$$ 47107239 43894399 41192771 38791774 36737873 35035392 33626974 32479173 31464764
4961C1464764r46749p73353p14454r78256r39360q43466p96710o55970j157552
$$ 31464764 30518015 29744662 29030208 28051952 27112592 26269126 25472416 24816446 23658894
4952B3658894r80770r00665o98973r32112q31546q90936p96253q78366p72218
$$ 23658894 22678124 21777459 21078486 20146374 19314828 18423892 17627639 16749273 15977055
4943A5977055o07218p55426m11757l98827o50654n52321l51507m09767m35851
$$ 15977055 15369837 14614411 14202654 13803827 13153173 12600852 12249345 11839578 11403727
4934A1403727k40198l85227n11202k88085j84589k17198k79734j45970p1290j75965
$$ 11403727 11163529 10778302 10267100 9979015 9794426 9577228 9297494 9151524 9080234 8904269
4924H904269k23165j05822k1153k35507l80434j93815k12126j21952o4931j37475
$$ 8904269 8681104 8575282 8554129 8318622 7938188 7744373 7532247 7410295 7345364 7207889
4914G207889p2973O2563j04665j38271l8060K00313j53229j67983k35222m7325
$$ 7207889 7134916 7197479 7092814 6954543 6916483 7116796 6963567 6795584 6560362 6513037
4904F513037j9443j27711j91668J08135q4344k48523j28235n3619l2167J85186
$$ 6513037 6493594 6365883 6174215 6282350 6198006 5949483 5821248 5767629 5735462 5920648
4894E920648j00948j39324o93o7510k93626J65555P4905j14328j48780p4093P0955
$$ 5920648 5819700 5680376 5679683 5612173 5318547 5484102 5559007 5444679 5295899 5221806 5292761
4883E292761K14325j7598l8976k81886j13813K9248L2896K4916j21966k97955
$$ 5292761 5507086 5489488 5450512 5168626 5054813 5084061 5116957 5141873 5019907 4721952
4873D721952J97279J46535k08838J6998j44912J93847j7187n2989m7025O0629
$$ 4721952 4919231 5065766 4856928 4873926 4729014 4922861 4905674 4852685 4805660 4866289
4863D866289O4513q679j99290p0635N4680L9983N3566n5965j73127j38605L6093
$$ 4866289 4930802 4922123 4722833 4652198 4706878 4746861 4800427 4744462 4571335 4432730 4468823
4852D468823P6487r3664J45656j20748M2460K0783k28244k67393J69234q8131
$$ 4468823 4545310 4451646 4597302 4476554 4519014 4539797 4311553 4044160 4213394 4125263
4842D125263k7366j9481j46010K03083J13557K6945K65509N2869k21239q579k4975
$$ 4125263 4097897 4078416 3932406 4135489 4249046 4275991 4541500 4594369 4373130 4364551 4339576
4831D339576M6485Q0536p7635j46801J00383j12768k04867J11104k0896l41228
$$ 4339576 4386061 4466597 4388962 4242161 4342544 4229776 4024909 4136013 4115117 3773889
4821C773889J47799J04219K7585j8631k42738J50620O7552m5953k7613K0224p2534
$$ 3773889 3921688 4025907 4053492 4034861 3792123 3942743 4010295 3964342 3936729 3956953 3884419
4810C884419k14288K48915p8488P6285J34851j03516m0012j45892K678M2888R0562
$$ 3884419 3670131 3919046 3840558 3916843 4051694 3948178 3908166 3762274 3764952 3807840 3898402
4799C898402p6244J03138m8796j44537q3764j6494Q7022j32765O1427K27160j23593
$$ 3898402 3822158 3925296 3876500 3731963 3648199 3631705 3718727 3585962 3647389 3874549 3750956
4788C750956p7487q7633N9165p5986L1274O7152J9891J8870m5876p9360K78123
$$ 3750956 3673469 3585836 3645001 3569015 3600289 3667441 3687332 3706202 3660326 3580966 3859089
4777C859089r0187J15602R5825O7005k7924j5270J7423j91758J42579R4612r4814
$$ 3859089 3768902 3884504 3980329 4047334 4019410 4004140 4021563 3829805 3972384 4066996 3972182
4766C972182k21534j7990J75732j26391J38945P525j09430J31762J28680j40137
$$ 3972182 3750648 3732658 3908390 3781999 3920944 3928469 3819039 3950801 4079481 3939344
4756C939344L506J56002J2403J24085j66881J59645r9547N4053J11248J888R6066
$$ 3939344 3942850 4098852 4111255 4235340 4068459 4228104 4128557 4182610 4293858 4295746 4391812
4745D391812j53954q6236J93512J20350k30689m191J47815M0897J01946L372k5353
$$ 4391812 4237858 4151622 4345134 4465484 4234795 4230604 4378419 4419316 4521262 4524634 4499281
4734D499281J67798K74672J71055J06499Q0020J48055P4547N4743o683K44334
$$ 4499281 4667079 4941751 5112806 5219305 5299325 5447380 5521927 5576670 5569987 5814321
4724E814321P5676K31612J18152m7608L1349J23940j50041P3897O8867j80440
$$ 5814321 5889997 6121609 6239761 6192153 6223502 6347442 6197401 6271298 6340165 6159725
4714F159725j50728m7554j38125m9991n8748j8369J5435q389j24876j0016J2046
$$ 6159725 6008997 5961443 5823318 5773327 5714579 5696210 5711645 5703256 5578380 5568364 5580410
4703E580410p0483J65911j31618j02676O7592J51043j7087q1680K37419P9009
$$ 5580410 5509927 5675838 5544220 5441544 5509136 5660179 5643092 5561412 5798831 5877840
4693E877840K51647k3542j78965J86519L06150p5256R5495P0746r8057k972M961
$$ 5877840 6129487 6105945 5926980 6113499 6419649 6344393 6439888 6510634 6412577 6409605 6414566
4682F414566k50557r1420J04856p8423q5692o1600q0707k56816j03623q0257j23586
$$ 6414566 6164009 6072589 6177445 6099022 6013330 5951730 5871023 5614207 5510584 5430327 5306741
4671E306741l09170K5351J76087J93058m1632k73749n9163j06329j09419j6902
$$ 5306741 4997571 5022922 5199009 5392067 5350435 5076686 5017523 4911194 4801775 4784873
4661D784873J282n9609j31331K64752k5674j22501j35116l1902j04207k00883
$$ 4784873 4786155 4726546 4595215 4859967 4834293 4711792 4576676 4544774 4440567 4239684
4651D239684m8515j2641R6681o1990n1812n0809j4656J57772k984J1849j67576
$$ 4239684 4191169 4178528 4275209 4213219 4161407 4110598 4095942 4253714 4250730 4262579 4095003
4640D095003K29437J70819K729r9556k19719k5578K07842p8517M9225j13189n7254
$$ 4095003 4324440 4495259 4497988 4398432 4178713 4153135 4360977 4282460 4331685 4218496 4161242
4629D161242o5888R1968J16370J99477j2889j63900m0103k55315K04269M2030
$$ 4161242 4095354 4187322 4303692 4503169 4490280 4326380 4286277 4030962 4235231 4277261
4619D277261p8293J5443K17254k2627m4872j46722j38099P3274L7677J68773q2175
$$ 4277261 4198968 4214411 4431665 4409038 4364166 4217444 4079345 4152619 4190296 4359069 4276894
4608D276894j38857k7429Q4632J76999j57489j40772P0029O352l8205O2839j5434
$$ 4276894 4138037 4110608 4195240 4372239 4214750 4073978 4144007 4150359 4112154 4174993 4159559
4597D159559R3631L3799k107J55014n2543N3453j88372N5710J66167K6399N8935
$$ 4159559 4253190 4286989 4284882 4439896 4387353 4440806 4252434 4308144 4474311 4500710 4559645
4586D559645j12103J23777K7888j3351j74514L4856K87817j79221Q3544M9520
$$ 4559645 4447542 4571319 4599207 4585856 4411342 4446198 4734015 4554794 4638338 4687858
4576D687858Q9157J04843o5553P9863p1175K87229l7939k1023R3583J92623j53786
$$ 4687858 4777015 4881858 4816305 4896168 4824993 5112222 5074283 5053260 5146843 5339466 5185680
4565E185680O2269J87591l5763K24975L28497J4304L39712M01753j076J54437
$$ 5185680 5247949 5435540 5399777 5624752 5953249 5967553 6307265 6709018 6707942 6862379
4555F862379K54804J48918J32844P0785o4397K43414j49897p9017O6183r1669
$$ 6862379 7117183 7266101 7398945 7469730 7405333 7648747 7498850 7419833 7486016 7394347
4545G394347J44611l7115k94237j55495j670l09008L9558R7171k74917j9625j38301
$$ 7394347 7538958 7501843 7207606 7052111 7050441 6741433 6780991 6878162 6603245 6583620 6445319
4534F445319m1262P3122r0180O3529l1167J00341Q6516k24300k94634J90250j47505
$$ 6445319 6404057 6477179 6386999 6450528 6419361 6519702 6606218 6381918 6087284 6277534 6130029
4523F130029k5914R0451N2079R1239j7057L9062K62377K29998j6311k17703J1485
$$ 6130029 6104115 6194566 6246645 6337884 6320827 6359889 6622266 6852264 6835953 6618250 6629735
4512F629735K2944J34643j89225q7228J89391O1312J89817l5380R716J33333n9658
$$ 6629735 6652679 6787322 6598097 6510869 6700260 6761572 6951389 6916009 6925725 7059058 6999400
4501F999400k04453K6878j5381J62515M3485R5242m585L09777l07677r7000N3699
$$ 6999400 6794947 6821825 6806444 6968959 7012444 7107686 7103101 7412878 7105201 7008201 7061900
4490G061900J21874L8751j48070j3737p5549J18163q710n0414Q5637K301M9205
$$ 7061900 7183774 7222525 7074455 7060718 6985169 7103332 7094622 7044208 7129845 7132146 7181351
4479G181351m9367o6493J46914N4099j8575J63408M4296m9174J89348J48845j35017
$$ 7181351 7131984 7065491 7212405 7266504 7247929 7411337 7455633 7406459 7595807 7744652 7609635
4468G609635J00328J89917K91784j38249j43082N1638L0570K28469J52485k52586
$$ 7609635 7709963 7899880 8191664 8053415 7910333 7961971 7992541 8221010 8373495 8120909
4458H120909J81055J96414k38559P3320K29930J14369J26286J130K07328m454
$$ 8120909 8301964 8498378 8259819 8333139 8563069 8677438 8803724 8804854 9012182 9007728
4448I007728o773K10883L32188O4134k1296Q3448J77939K09463r7338J59878J71265
$$ 9007728 9000955 9211838 9544026 9608160 9586864 9670312 9848251 10057714 9960376 10120254 10291519
4437A0291519J83335K93484L07969o1741J46444J32925Q2388J36798J97920J8194
$$ 10291519 10474854 10768338 11076307 11014566 11161010 11293935 11376323 11513121 11711041 11729235
4427A1729235L99202J7377p781M1012n4511J86291K26249J30611N4930j03757
$$ 11729235 12128437 12145814 12138033 12179045 12124534 12310825 12537074 12667685 12722615 12618858
4417A2618858M5775L02511L0268p0688Q5105J63642P3757K79757J7400p7286K77027
$$ 12618858 12664633 12967144 12997412 12926724 13011829 13175471 13249228 13528985 13546385 13469099 13746126
4406A3746126J44781K23199R6911J03552Q1659q4118P1093M69602J43795J09704
$$ 13746126 13890907 14114106 14211017 14314569 14396228 14312110 14383203 14852805 14996600 15106304
4396A5106304n6527M194J6460L18625L67521J76641m7462l2202L33800J84802
$$ 15106304 15049777 15053971 15070431 15389056 15756577 15933218 15885756 15853554 16187354 16372156
4386A6372156J86672K26072J174J10276J88173N0548J51876K37596j10335P0321
$$ 16372156 16558828 16784900 16786074 16896350 17084523 17135071 17286947 17524543 17414208 17484529
4376A7484529L81217Q5933J73653J97185L91865P7621k7214K39588K40230M74161
$$ 17484529 17865746 17951679 18125332 18322517 18714382 18792003 18764789 19004377 19244607 19718768
4366A9718768J59848K62047J90969J88077M57527L27283K03898K33841K46778
$$ 19718768 19878616 20140663 20331632 20519709 20977236 21304519 21508417 21742258 21989036
4357B1989036K19585R1387L45860K48597K34446M74380K61719L20630L82905N65303
$$ 21989036 22208621 22300008 22645868 22894465 23128911 23603291 23865010 24185640 24568545 25133848
4347B5133848J28868K49444K07561N40452M38058K38227J63600K02158J56011
$$ 25133848 25262716 25512160 25719721 26260173 26698231 26936458 27100058 27302216 27458227
4338B7458227M63839N39134L75585K43372J18200L99848M26135L53993L31492
$$ 27458227 27922066 28461200 28836785 29080157 29198357 29598205 30024340 30378333 30709825
4329C0709825L54655M24905R7284P01419M93918N42008M45207N23413P11685Q31473
$$ 30709825 31064480 31489385 31586669 32288088 32782006 33324014 33769221 34292634 35004319 35835792
4319C5835792O48959M89037L00249N95867N02113O16523L05610N81373J010559
$$ 35835792 36484751 36973788 37274037 37869904 38372017 38988540 39294150 39875523 40886082
4310D0886082P50168N35793O57568J069208O46836R41205Q77530J062811Q91813
$$ 40886082 41636250 42172043 42829611 43898819 44545655 45486860 46364390 47427201 48319014
4301D8319014Q40984J094318J118726J012578J505140J766816J960833K062585
$$ 48319014 49159998 50254316 51373042 52385620 53890760 55657576 57618409 59680994
4293E9680994K568783L692584M753922M868924M665411M723053N464655N656140
$$ 59680994 62249777 65942361 70696283 75565207 80230618 84953671 90418326 96074466
4285I6074466O477868Q133791Q509527Q332291Q992402R911596J1498032J2981813
$$ 96074466 102552334 110686125 119195652 127527943 136520345 146431941 157929973 170911786
4277A70911786J5037106J7902464J9143122K4550070L1154173L4233328L5972060
$$ 170911786 185948892 203851356 222994478 247544548 278698721 312932049 348904109
4270C48904109L2520995K1535319K1427431K5583320K7784725K7369751J1725670
$$ 348904109 381425104 402960423 424387854 449971174 477755899 505125650 516851320
4263E16851320Q44711r136832j2358670k0504623l5098858l1553102k5840065
$$ 516851320 517696031 508559199 496200529 475695906 440597048 409043946 383203881
4256C83203881k6017281k4779231k4019294k2788552k0069231j9066450k1548992
$$ 383203881 357186600 332407369 308388075 285599523 265530292 246463842 224914850
4249B24914850k1887904j9740369j9033911j8450545j5528595j0983648p168753
$$ 224914850 203026946 183286577 164252666 145802121 130273526 119289878 112121125
4242A12121125m370154l319825k326697j456368k82285n8628O40351R47274J274990
$$ 112121125 107750971 104431146 102104449 100648081 100365796 100307168 100947519 101894793 103169783
4233A03169783J757982J955150K008156K217794K204596K262543K434273K107383
$$ 103169783 104927765 106882915 108891071 111108865 113313461 115576004 118010277 120117660
4225A20117660K177972K528143K463611J957748K207732K521299K437625K433659
$$ 120117660 122295632 124823775 127287386 129245134 131452866 133974165 136411790 138845449
4217A38845449K594336K307288K123742K278441K051116K253906J942865K201461
$$ 138845449 141439785 143747073 145870815 148149256 150200372 152454278 154397143 156598604
4209A56598604J809360J880534J749845J762525J966347J911989J568855J580037
$$ 156598604 158407964 160288498 162038343 163800868 165767215 167679204 169248059 170828096
4201A70828096J635783J698729J736488J661493J634107J416186J466438J394566
$$ 170828096 172463879 174162608 175899096 177560589 179194696 180610882 182077320 183471886
4193A83471886J377067J434757J435438J346604J238756J239643J047907J255860
$$ 183471886 184848953 186283710 187719148 189065752 190304508 191544151 192592058 193847918
4185A93847918J099177Q87634J084931O24712P60046J134004O73968P84977O88000
$$ 193847918 194947095 195834729 196919660 197544372 198304418 199438422 200112390 200897367 201585367
4176B01585367Q01444P51866Q05732J117310J056227J286341J259548J515060
$$ 201585367 202386811 203138677 203944409 205061719 206117946 207404287 208663835 210178895
4168B10178895J991533K065572K073016K555506K538203L454529L552008L511717
$$ 210178895 212170428 214236000 216309016 218864522 221402725 224857254 228409262 231920979
4160B31920979M599851M902881N188440N853451O341599O784575P411751Q127739
$$ 231920979 236520830 241423711 246612151 252465602 258807201 265591776 273003527 281131266
4152B81131266Q197129Q805503R024241R175763R346758R656090R513788R102553
$$ 281131266 289328395 298133898 307158139 316333902 325680660 335336750 344850538 353953091
4144C53953091Q617626Q398599P722295P246834O151072N263363M478276L314839
$$ 353953091 362570717 370969316 378691611 385938445 392089517 397352880 401831156 405145995
4136D05145995K530628J514961P82475m80768j593451k366369l268115m317109
$$ 405145995 407676623 409191584 409974059 409493291 407899840 405533471 402265356 397948247
4128C97948247n132311o109892o540461p561488q014320q790345r419430r747113
$$ 397948247 392815936 386706044 380165583 372604095 364589775 355799430 346380000 336632887
4120C36632887r946157j0472390j0492478j0503692j0841953j0805269j0687385
$$ 336632887 326686730 316214340 305721862 295218170 284376217 273570948 262883563
4113B62883563j0964599j0758484j0333719j0304665j0123213r912935r818893
$$ 262883563 251918964 241160480 230826761 220522096 210398883 200485948 190667055
4106A90667055r239009q818072q493098q203619p889954p608818p305340o706085
$$ 190667055 181428046 172609974 164116876 155913257 148023303 140414485 133109145 126403060
4098A26403060o467240o077247n821643n155087n425238m814321m582274m327605
$$ 126403060 119935820 113858573 108036930 102881843 97456605 92642284 88060010 83732405
4090H3732405l861475l644007l428854l312805l214367k763858k586760k679702
$$ 83732405 79870930 76226923 72798069 69485264 66270897 63507039 60920279 58240577
4082E8240577k181100k308369k115926j881783j661875j547603j731505j540323
$$ 58240577 56059477 53751108 51635182 49753399 48091524 46543921 44812416 43272093
4074D3272093j575686j157823j220563j357464j001505r63251j040036j111055
$$ 43272093 41696407 40538584 39318021 37960557 36959052 35995801 34955765 33844710
4066C3844710q18824q02566q38253o69736p08286o49312o40699n63976o41650
$$ 33844710 33025886 32223320 31385067 30715331 30007045 29357733 28717034 28153058 27511408
4057B7511408n80909o37773m40303l07642l46998l20204k13313l57556n59411
$$ 27511408 26930499 26292726 25852423 25544781 25197783 24877579 24664266 24306710 23747299
4048B3747299m96727k94407o9417j89205j81061m84745k33141j39346l67078k94389
$$ 23747299 23250572 22956165 22886748 22697543 22516482 22031737 21798596 21659250 21292172 20997783
4038B0997783l41476k85326m54201k27586n0762l96225k26342L3782j66745l00597
$$ 20997783 20656307 20370981 19916780 19689194 19638432 19242207 19015865 19049647 18882902 18582305
4028A8582305k30482k81190j07311r1621k70324r7359o7094j59555j80863l37271
$$ 18582305 18351823 18070633 17963322 17871701 17601377 17504018 17436924 17277369 17096506 16759235
4018A6759235r1859q6835k4061j45767l94426p8356j02812j76788k32607n6670
$$ 16759235 16667376 16580541 16556480 16410713 16016287 15937931 15835119 15658331 15425724 15369054
4008A5369054R4366l1064J8079n2768j98197j75604R2622J26501J2271j7306j45538
$$ 15369054 15463420 15432356 15450435 15397667 15199470 15023866 15116488 15242989 15255260 15237954 15092416
3997A5092416n7669K9174m5345p6107J9016j40532p4380P4281O0749j24711l9740
$$ 15092416 15034747 15063921 15018576 14942469 14961485 14820953 14746573 14820854 14881603 14756892 14717152
3986A4717152R6017K10857P6991K41607M99435J77751J15188M191K20535J27873
$$ 14717152 14813169 15024026 15101017 15342624 15842059 16019810 16134998 16139189 16359724 16487597
3976A6487597J99456j45195K37311L26180N636K4207K04667j30520L8472Q3853
$$ 16487597 16687053 16541858 16779169 17105349 17110985 17135192 17339859 17209339 17247811 17331664
3966A7331664k81185q3597K49503K09554J35918L750J27328j40690j0592J99196
$$ 17331664 17050479 16966882 17216385 17425939 17561857 17565607 17692935 17552245 17541653 17740849
3956A7740849n0155K06280P9650L90171J69616J07399J78468K31537k3400j29623
$$ 17740849 17690694 17896974 17976624 18366795 18536411 18643810 18822278 19053815 19030415 18900792
3946A8900792O5164K75004q3195l381K11586o709K3945l1411Q5764K3289N5535
$$ 18900792 18965956 19240960 19157765 19154384 19365970 19359261 19383206 19351795 19437559 19460848 19516383
3935A9516383J96725J99222r7469o4433L2021l1532P5800K4211Q9895j27996L9990
$$ 19516383 19713108 19912330 19814861 19750428 19782449 19750917 19826717 19850928 19940823 19812827 19852817
3924A9852817K83227K39559L0733J28834L14379J40079j49983K06208K26906K67566
$$ 19852817 20136044 20375603 20406336 20535170 20849549 20989628 20839645 21045853 21272759 21540325
3914B1540325J80023K41390K22155J00656O13678M71947K46635R1054M97645J14725
$$ 21540325 21720348 21961738 22183893 22284549 22898227 23370174 23616809 23707863 24205508 24320233
3904B4320233J78738K23754L06252O40713M39140L67787J75167K40908N16747
$$ 24320233 24498971 24722725 25028977 25669690 26108830 26476617 26651784 26892692 27409439
3895B7409439K50089L86362L11540M92973M74460K08716J70067L12378L24084
$$ 27409439 27659528 28045890 28357430 28850403 29324863 29533579 29703646 30016024 30340108
3886C0340108M36911M97222L21615M68776L83970N60223L51088L35536M09042
$$ 30340108 30777019 31274241 31595856 32064632 32448602 33008825 33359913 33695449 34104491
3877C4104491M77896N58719M60351N04511O32899N82971P22779L07630N79968
$$ 34104491 34582387 35141106 35601457 36105968 36738867 37321838 38044617 38352247 38932215
3868C8932215P76899P42246P81346O97700Q86620R35733Q80149Q20935R80233
$$ 38932215 39709114 40451360 41232706 41930406 42817026 43752759 44632908 45453843 46434076
3859D6434076P72454J006160J318108J196731J296201Q94635J322371J428942
$$ 46434076 47206530 48212690 49530798 50727529 52023730 52918365 54240736 55669678
3851E5669678J365638J234997J310465J213075J523052J585264J531881J381024
$$ 55669678 57035316 58270313 59580778 60793853 62316905 63902169 65434050 66815074
3843F6815074J547948J602023J504951J551775J497366J628289J824204J923557
$$ 66815074 68363022 69965045 71469996 73021771 74519137 76147426 77971630 79895187
3835G9895187J799178J981844K069429K180469K135576K460566K273438K453121
$$ 79895187 81694365 83676209 85745638 87926107 90061683 92522249 94795687 97248808
3827I7248808K887127L217950L186529L620923L642350L831818M250258M623874
$$ 97248808 100135935 103353885 106540414 110161337 113803687 117635505 121885763 126509637
3819A26509637N078430N295786N564321O308082O438479O673273P411177P598369
$$ 126509637 131588067 136883853 142448174 148756256 155194735 161868008 169279185 176877554
3811A76877554P971478Q349234Q711665Q941039R231493R350822R333269R499011
$$ 176877554 184849032 193198266 201909931 210850970 220082463 229433285 238766554 248265565
3803B48265565R610663R486324R049340R025490Q857362Q502622Q046966P594016
$$ 248265565 257876228 267362552 276411892 285437382 294294744 302797366 310844332 318438348
3795C18438348P311049O515707N688352N101415M395139L683570K896279J886988
$$ 318438348 325749397 332265104 337953456 343054871 347450010 351133580 354029859 355916847
3787C55916847Q80110k87542n94468j417353k413788k904846l764548m476731
$$ 355916847 356796957 356509415 355914947 354497594 352083806 349178960 345414412 340937681
3779C40937681n117345n635432o402714o615792o994035p201744p750428q252955
$$ 340937681 335820336 330184904 323782190 317166398 310172363 302970619 295220191 286967236
3771B86967236p951983q117476q401642q355314q209186q257024p879501p874600
$$ 286967236 279015253 270897777 262496135 254140821 245931635 237674611 229795110 221920510
3763B21920510p958313p652523p608770p217356o928524o819604o864734o793290
$$ 221920510 213962197 206309674 198700904 191483548 184555024 177735420 170870686 164077396
3755A64077396o495325o106574n875981n686244n642131n218065n159685n088402
$$ 164077396 157582071 151475497 145599516 139913272 134271141 129053076 123893391 118804989
3747A18804989m713723m803110m250536m258137m251694m045197l815281l683906
$$ 118804989 114091266 109288156 105037620 100779483 96527789 92482592 88667311 84983405
3739H4983405l372184l340880l389219l007062k509564k697566k709172k291606
$$ 84983405 81611221 78270341 74881122 71874060 69364496 66666930 63957758 61666152
3731F1666152k189504k155536j885266j950331j869084j718512j559515j389841
$$ 61666152 59476648 57321112 55435846 53485515 51616431 49897919 48338404 46948563
3723D6948563j293010j058731j437522j164849j140665j257362r11425q41463
$$ 46948563 45655553 44596822 43159300 41994451 40853786 39596424 38684999 37843536
3715C7843536p45165q25031j016345o18788q71259o04397q02012r82022m99074
$$ 37843536 37098371 36273340 35256995 34638207 33766948 33162551 32360539 31378517 30879443
3706C0879443n83040p69251q06950n44609o22997p61811l05582o01994o30394
$$ 30879443 30296403 29527152 28720202 28175593 27552596 26790785 26485203 25883209 25252815
3697B5252815o30917q11197m85764p99008l53257o73486o06514m06458p03951
$$ 25252815 24621898 23810701 23324937 22525929 22172672 21499186 20892672 20486214 19782263
3688A9782263l29521l19160n30507l79361k80835o74286n10669n79676l88843
$$ 19782263 19452742 19133582 18603075 18223714 17942879 17268593 16757924 16178248 15789405
3679A5789405k89068m04990j80992k99097l19393r4275l74434j96636l44242k06468
$$ 15789405 15500337 15095347 14914355 14615258 14295865 14201590 13827156 13630520 13286278 13079810
3669A3079810k00385m3916j25392l00184k45041j64244j92346m04602k0392K2254
$$ 13079810 12879425 12835509 12710117 12409933 12164892 12000648 11808302 11403700 11383308 11405562
3659A1405562j82745j19930r9126k05430k24523J3787L0196l91800K9706l9513
$$ 11405562 11222817 11102887 11003761 10798331 10573808 10587595 10617791 10225991 10255697 10216184
3649A0216184j61050j70058J2468j11836k11180k130M7961k70558r1718k5484
$$ 10216184 10055134 9885076 9897544 9785708 9574528 9572398 9620359 9349801 9258083 9232599
3639I232599r6540j82358k49150M5346m8170P1034p824k77547M2241j00376o9244
$$ 9232599 9136059 8953701 8704551 8749897 8701727 8772761 8764937 8487390 8529631 8429255 8360011
3628H360011j46264P6900l240r5770m0013j97142j86038N0809M9326j40181j02923
$$ 8360011 8213747 8290647 8287407 8191637 8151624 7954482 7768444 7819253 7868579 7728398 7625475
3617G625475j82180j59583K11932o5345m8017J95468K41474k4590j81560P4796
$$ 7625475 7443295 7283712 7495644 7430299 7382282 7577750 7819224 7794634 7613074 7687870
3607G687870k44880k6054r4430M5931N8276L238l0550k79210J18966R353m5393
$$ 7687870 7442990 7416936 7322506 7368437 7426713 7429951 7399401 7120191 7239157 7248510 7203117
3596G203117N4861J56129j94760L0110q317k3163J50322j33459l3289J53112j60370
$$ 7203117 7257978 7414107 7219347 7249457 7241140 7217977 7368299 7234840 7201551 7354663 7194293
3585G194293p711J78390j04859J22296J625r7296J38552L4562M6003j37675Q1906
$$ 7194293 7186582 7364972 7260113 7382409 7384034 7286738 7425290 7459852 7505855 7368180 7450086
3574G450086J36166o0131K53094j68142Q4778n6543P6478R824M7232J66373k40913
$$ 7450086 7586252 7526121 7779215 7611073 7695851 7639308 7715786 7725610 7772842 7939215 7698302
3563G698302R5101K6500K73180J5177q8632J39853Q2689J2137L9105Q114j43312
$$ 7698302 7793403 7819903 8093083 8108260 8019628 8159481 8242170 8254307 8293412 8301526 8158214
3552H158214R3350Q088K87661J43372M9289o4765J37555J10556J09874j4540J28199
$$ 8158214 8251564 8259652 8547313 8690685 8739974 8675209 8812764 8923320 9033194 9018654 9146853
3541I146853J54615J07761J91839Q7781n2844J52114J69601j43266J15481N74920
$$ 9146853 9301468 9409229 9601068 9688849 9636005 9788119 9957720 9814454 9929935 10504855
3531A0504855J14078r423M8670n5218K353R5676q877m3081J40980O0203J74004
$$ 10504855 10618933 10609510 10658180 10602962 10605315 10700991 10692114 10649033 10790013 10850216 11024220
3520A1024220K44544k0028J7591J61551K71440K88938K52330N5855J45680J86075
$$ 11024220 11268764 11248736 11266327 11427878 11699318 11988256 12240586 12296441 12442121 12628196
3510A2628196Q3584J18052L14653R4607L28883L2432k0462J46358J25022M1632
$$ 12628196 12711780 12829832 13144485 13239092 13567975 13600407 13579945 13726303 13851325 13892957
3500A3892957j2669J10803J425q3834m449r317Q837L31684K48549J16735j40770
$$ 13892957 13880288 13991091 13992516 13908682 13904233 13894916 13903753 14235437 14483986 14600721 14459951
3489A4459951k4674M79184J16612j32068L73436L56726N7010j58108k8775J93299
$$ 14459951 14435277 14914461 15031073 14899005 15272441 15629167 15686177 15528069 15499294 15692593
3479A5692593K78265J31602r1327P2853K03493L8955J61648q859Q545M0077J64141
$$ 15692593 15970858 16102460 16011133 16083986 16287479 16326434 16488082 16479223 16487768 16527845 16691986
3468A6691986J36102n8587K72475M60793J75934L59210K36633K72019L20886L63360
$$ 16691986 16828088 16769501 17041976 17502769 17678703 18037913 18274546 18546565 18867451 19230811
3458A9230811L65231L34261M97182N20413N12339P08778P40963O62222O30388
$$ 19230811 19596042 19930303 20427485 20947898 21460237 22169015 22909978 23572200 24202588
3449B4202588J021502P62120P70714J029103J133505J178671J332140J142616
$$ 24202588 25224090 25986210 26756924 27786027 28919532 30098203 31430343 32572959
3441C2572959J430245J371056J546923J608637J643934J723730J613639J293237
$$ 32572959 34003204 35374260 36921183 38529820 40173754 41897484 43511123 44804360
3433D4804360J370030J265243J143510M82486L93480J05211r7631m07591r18545
$$ 44804360 46174390 47439633 48583143 49065629 49459109 49564320 49466689 49059098 48140553
3424D8140553r77599j169483j164217j448682j349803j410405j408304j358479
$$ 48140553 47162954 45993471 44829254 43380572 42030769 40620364 39212060 37853581
3416C7853581j510236j399231j341412j484974j236526j179476j008527r72673
$$ 37853581 36343345 34944114 33602702 32117728 30881202 29701726 28693199 27720526
3408B7720526p75237o41250p44777n72759n41444m30761k95165m54519k31359
$$ 27720526 26945289 26304039 25559262 24986503 24445059 24014298 23719133 23264614 23033255
3399B3033255l60780l53812R337k43910k10442m98157l07815l55378m09177k56833
$$ 23033255 22672475 22318663 22328000 22084090 21873648 21375491 21067676 20712298 20303121 20046288
3389B0046288l88179k59014o24970m11615n59666n34964k33662j22595l92810
$$ 20046288 19658109 19399095 18774125 18362510 17802844 17267880 17034218 16911623 16518813
3380A6518813l85618l39546n18678m40671p7913o3568k35064l11492k31007k81697
$$ 16518813 16133195 15793649 15274971 14834300 14756387 14692819 14457755 14146263 13915256 13633559
3370A3633559k6405j17319O6827m0242j16475j16630k232j02880J31493j87632
$$ 13633559 13607154 13489835 13556662 13516420 13399945 13283315 13281083 13178203 13309696 13122064
3360A3122064l02892l04674J9274q0887k38172j06106m5298k25578j68905l14972
$$ 13122064 12819172 12514498 12533772 12452885 12214713 12108607 12063309 11837731 11668826 11353854
3350A1353854j98847k6477L9494r7767j25874j62767j70865L2128p328k1254n3221
$$ 11353854 11155007 11128530 11168024 11070257 10944383 10781616 10610751 10642879 10635551 10614297 10561076
3339A0561076m0018R4181k77961r5769M8501j461J25701J27723l20M6763K14511
$$ 10561076 10521058 10615239 10337278 10241509 10290010 10288549 10414250 10541973 10541653 10588416 10802927
3328A0802927l5404j23967J07457O3430j20766J54926j28423q1785m0181r5877
$$ 10802927 10767523 10643556 10751013 10814443 10693677 10848603 10720180 10638395 10598214 10502337
3318A0502337j73508K28321P0293n6018j11106J89280J200r0791n9021j7622k6395
$$ 10502337 10328829 10557150 10627443 10571425 10460319 10649599 10650799 10560008 10500987 10483365 10456970
3307A0456970J83637K96804l3599o2604J4293M7384J73902J97844L93050j05081
$$ 10456970 10640607 10937411 10903812 10841208 10855501 10902885 11076787 11274631 11667681 11562600
3297A1562600j83871p8861M73419J39354j62148K4626R4108K13080K42744n8723
$$ 11562600 11378729 11299868 11773287 11912641 11750493 11775119 11869227 12082307 12325051 12266328
3287A2266328J7895J22035K03673K72764J8037K2464J23060J48812O6511J21065
$$ 12266328 12284223 12406258 12609931 12882695 12900732 12923196 13046256 13195068 13261579 13382644
3277A3382644K76275J52787J67172K99726P9579K12188K49918N33279L01734K44061
$$ 13382644 13658919 13811706 13978878 14278604 14358183 14570371 14820289 15353568 15655302 15899363
3267A5899363K60326K67759M80171K16969K23287M21518N49579O34450P61689
$$ 15899363 16159689 16427448 16907619 17124588 17347875 17769393 18318972 18953422 19715111
3258A9715111P97623Q19750R16752J052540J415036J711837J354697J574364K110171
$$ 19715111 20512734 21332484 22249236 23301776 24716812 26428649 27783346 29357710 31467881
3249C1467881J825750K058515K823303K754602K769024L044459L400220L914290
$$ 31467881 33293631 35352146 38175449 40930051 43699075 46743534 50143754 54058044
3241E4058044M406378N222132N774209O370053P419924Q608763R711893J0329061
$$ 54058044 58464422 63686554 69460763 75830816 83250740 91859503 101571396 111900457
3233A11900457R563860Q261316P476325P802936Q144278P408683M946414K547592
$$ 111900457 121464317 129725633 137201958 145004894 153149172 160557855 165504269 168051861
3225A68051861N2073j981635m183491o220317o792331n964690n692638n394718
$$ 168051861 168103934 166122299 161938808 155718491 148926160 142961470 137268832 131874114
3217A31874114m941150m475962l508372l116061k694350j989847j252517k01011
$$ 131874114 126932964 122457002 118948630 115832569 113138219 111148372 109895855 109694844
3209A09694844J676155L178239M889775N739046N588410N065106N053929N300237
$$ 109694844 111370999 114549238 119439013 125178059 130766469 135831575 140885504 146185741
3201A46185741N365533M147022J836817j207273l280580n149723p286983q641193
$$ 146185741 151551274 155698296 157535113 156327840 153047260 147897537 140610554 131969361
3193A31969361q807620q464111q253962p892806p930403p310050o821988o929896
$$ 131969361 123161741 114697630 106443668 98550862 90620459 83310409 76488421 69558525
3185F9558525p275976o932617o632953o213773n765104n155442m191009k975147
$$ 69558525 62282549 55349932 48716979 42503206 36738102 31582660 27391651 24416504
3177B4416504k373521k292957j728223j217385j370113r15071o90560p87068n99422
$$ 24416504 22042983 19750026 18021803 16804418 15434305 14519234 13828674 13041606 12442184
3168A2442184n60744k93403k41798n52618k74514m2342j42177m05880m81778k75145
$$ 12442184 11881440 11588037 11346239 10793621 10519107 10476765 10334588 9928708 9446930 9171785
3158I171785k39364j06501j69635j22895k52361j39987M6407q8914j56016j09484
$$ 9171785 8932421 8825920 8656285 8533390 8281029 8141042 8187449 8098535 7942519 7833035
3148G833035j42562N937L7179j60757j56842j23600J40035O6093k71133j26769
$$ 7833035 7690473 7696410 7733589 7572832 7415990 7292390 7432425 7498518 7227385 7100616
3138G100616M69J32383J78074K07168m0444j37750P3207n5704J76177K55880J66512
$$ 7100616 7101085 7233468 7411542 7618710 7578266 7440516 7513723 7458019 7634196 7890076 8056588
3127H056588J05563K5313K14476J42734J01718J76971K44976Q78L36183J51601
$$ 8056588 8162151 8187464 8401940 8544674 8646392 8823363 9068339 9069217 9405400 9557001
3117I557001Q4897J80140j2822N2964K44475K7359Q717L20029J36468Q2811J92678
$$ 9557001 9641898 9822038 9809216 9862180 10106655 10134014 10142731 10462760 10599228 10682039 10874717
3106A0874717J06057J18620k8934J72100J69509M48102N97614K51497K18673K85251
$$ 10874717 10980774 11099394 11070460 11242560 11412069 11860171 12457785 12709282 12927955 13213206
3096A3213206M50422L44264L86289L04592K19116L80393M68959M67055J67341
$$ 13213206 13663628 14007892 14394181 14698773 14917889 15298282 15767241 16234296 16401637
3087A6401637l3316O60Q335J32638j02087r2511k00913p163q5080m5929j4943
$$ 16401637 16368321 16368981 16377316 16509954 16407867 16315356 16114443 16107280 16022200 15976271 15961328
3076A5961328J24359r1442j6299l999j10727L74390K07221j85248K68951K27216
$$ 15961328 16085687 15994245 15977946 15973947 15863220 16237610 16444831 16259583 16528534 16755750
3066A6755750p138K94763K29272p7721j707O6723j9625P6030K8253k11298l80999
$$ 16755750 16748612 17043375 17272647 17194926 17193219 17259942 17240317 17316347 17344600 17133302 16752303
3055A6752303m03239j60928j02804m64132n22375m33613k01917k95979k35833
$$ 16752303 16349064 16188136 16085332 15621200 15098825 14665212 14463295 14167316 13931483
3046A3931483j96495m44265k02463p4875j58134j69021m60369j59792o9060l43037
$$ 13931483 13734988 13290723 13088260 13013385 12855251 12686230 12225861 12066069 11997009 11653972
3036A1653972j73895j60438k23006m58162j63202l49536m93743l55108j52169
$$ 11653972 11480077 11319639 11096633 10638471 10475269 10125733 9631990 9276882 9124713
3027I124713l94878n82997l19981j6656k75419m93596k96035j86257j58330k09564
$$ 9124713 8729835 8146838 7826857 7810201 7534782 7041186 6745151 6558894 6400564 6191000
3017F191000k93532k74487r1801m32855j52094j36417r3064k82934O0486k91505
$$ 6191000 5897468 5622981 5531180 5098325 4946231 4809814 4716750 4433816 4494302 4202797
3007D202797j64573j34078k80886j64855m2706k15540j26495L1087J73139J19455
$$ 4202797 4038224 3904146 3623260 3458405 3415699 3200159 3073664 3104751 3277890 3397345
2997C397345l85202k76667k10194J07343J1715J2257j69343j0425p2120j08533
$$ 3397345 3012143 2735476 2525282 2632625 2644340 2656597 2487254 2476829 2404709 2296176
2987B296176j80298l6620J72463j50306q7071j3889J3916j24005j80525Q8377
$$ 2296176 2115878 2079258 2251721 2101415 2014344 2000455 2014371 1890366 1709841 1798218
2977A798218j22105K403J36302k01950J84642K3341n0415o0218o8074K3243J14031
$$ 1798218 1676113 1678516 1814818 1612868 1797510 1820851 1770436 1710218 1642144 1665387 1779418
2966A779418l2789l7994k6868J13208k39095q2804J38429l32330M2227J6105l2937
$$ 1779418 1746629 1708635 1681767 1794975 1555880 1473076 1611505 1279175 1321402 1337507 1304570
2955A304570J16153M5067N434N6745N6394m1385J09426J78506J09063k50729l0102
$$ 1304570 1420723 1465790 1471224 1527969 1584363 1542978 1652404 1830910 1939973 1689244 1659142
2944A659142J16807j35396J07372L5499q6011j14234J06143J16335J5977j89837
$$ 1659142 1775949 1640553 1747925 1783424 1697413 1583179 1689322 1805657 1821634 1631797
2934A631797j03542J59578k18569j70297K1419P8490p191N9723L9929j81063P0929
$$ 1631797 1528255 1687833 1469264 1298967 1320386 1398876 1391685 1451408 1491337 1310274 1381203
2923A381203k0628j09271m7356j68201N8138L50765j977K5396m6438j12935m5778
$$ 1381203 1360575 1251304 1203948 1035747 1093885 1444650 1442673 1468069 1421631 1308696 1262918
2912A262918L3709m338K26536q3645o6164j57393l7551l7639p0630j50891k00929
$$ 1262918 1296627 1292289 1518825 1435180 1369016 1211623 1174072 1136433 1065803 914912 713983
2901G13983J01633m1077r1535J26779j23597o791j60058Q6668k50219k2076K62837
$$ 713983 815616 774539 683004 809783 686186 679395 519337 606005 355786 333710 596547
2890E96547j72066J19705Q6483Q8078K0092n3745o8797n0796n1630q2618k4458
$$ 596547 424481 544186 630669 718747 738839 685094 616297 565501 513871 431253 406795
2879D06795q3020o6155P2114O450l9993Q3014J08428n8985n5841J67461O4074
$$ 406795 323775 257620 329734 336184 296191 379205 487633 428648 372807 540268 604342
2868F04342j41167j15183J31995l1120k3354Q0439J861m8175K679J25989j37077
$$ 604342 463175 347992 479987 448867 425513 505952 507813 459638 462317 588306 451229
2857D51229r1214j32695K20562p869j21383M0505M9159j53588J73117L66J49658
$$ 451229 360015 227320 447882 440013 318630 359135 408294 254706 427823 428189 577847
2846E77847j01205j23505K2199m9535M2331N7015j41035J76868M1841n4057J70451
$$ 577847 476642 353137 375336 325801 368132 425147 284112 460980 502821 448764 619215
2835F19215j36985j70572m9112p0449j06351L2485K9815M0546j7203O2347J24675
$$ 619215 482230 311658 262546 192097 85746 118231 148046 188592 171389 233736 358411
2824C58411j3089r0419O2725j25681j53107J52479R9617m6891q2393K44820j90844
$$ 358411 345322 254903 317628 191947 38840 191319 290936 244045 161652 406472 215628
2813B15628m6008m543L8208j67887N1239K45188q8997r6607Q2331J94005J865
$$ 215628 169620 165077 203285 35398 86637 331825 242828 146221 228552 422557 424422
2802D24422k4692m7967J7393k68372j42004J01705J20195L5639J84696N225j27127
$$ 424422 399730 351763 369156 100784 -41220 60485 180680 216319 401015 406240 279113
2791B79113k43398N0120J29215k6166J37167m6665j4688J23555o9765n1198K8940
$$ 279113 35715 85835 215050 188884 326051 279386 264698 388253 318488 267290 296230
2780B96230O422M826j25209j8816j32975K47592J29093j17309O7709j3354m6318
$$ 296230 302652 307478 182269 163453 30478 278070 407163 289854 357563 344209 297891
2769B97891m0062K99675l3330k05472j28350K39233R7982k5178j57651J45305
$$ 297891 257829 557504 524174 318702 190352 429585 527567 502389 344738 490043
2759D90043m2491j25165K2304j99225k7927k8176M7800j88265j00422L03830J74992
$$ 490043 447552 322387 344691 145466 117539 89363 137163 -51102 -151524 152306 327298
2748C27298r8194k91152J09442q7382m718j05753j1800J63959O706O0581M593
$$ 327298 229104 -62048 47394 -39988 -44706 -150459 -162259 1700 8406 68987 73580
2737G3580q1431J46338j8636P5537O0050j12246n4855j54608J13715O7665q0433
$$ 73580 -7851 138487 119851 195388 255438 143192 88337 -66271 47444 115109 34676
2726C4676n1260r4086J12300j6521r741K69844J06143k25360j35121J45124o0886
$$ 34676 -16584 -110670 1630 -14891 -24632 245212 351355 125995 -9126 135998 75112
2715G5112j4264N7867N1625j14271M1679M1884j56908L6528J38567j20444j55822
$$ 75112 60848 118715 170340 56069 97748 139632 -17276 19252 157819 37375 -118447
2704a18447m9997K47204p6333K25413J54277j83519j10542P0912J18568M0734
$$ -118447 -168444 78760 2427 227840 382117 198598 88056 158968 277536 318270
2694C18270l9617j65671L909j40231J49650n8852l37684Q6176J31072n8953J07093
$$ 318270 278653 112982 116891 -23340 126310 67458 -270226 -184050 -52978 -111931 -4838
2683d838K0924k8983K17746j39130q4572J55048j15799j0262p6972j25381n6866
$$ -4838 16086 -12897 204849 65719 -18853 136195 20396 10134 -66838 -192219 -249085
2672b49085K25967R7863k40738l2678o6690O3829J90720k6277j02805p8827N378
$$ -249085 -23118 74745 -165993 -198671 -265361 -201532 -10812 -37089 -139894 -218721 -213343
2661b13343R7793k4653j17925K39386J24155j75736k606m0120J72722k7193k44359
$$ -213343 -115550 -140203 -258128 -18742 105413 -70323 -72929 -113049 59673 32480 -211879
2650b11879J50714Q7746N2452j73206q5455J37998K2864j64055R1988N6755r8680
$$ -211879 -61165 26581 79033 -94173 -179628 -41630 -18766 -182821 -90833 -34078 -132758
2639a32758J06424q4430R5744N3049m2701p8977J75513j7078m5721k9319O8614
$$ -132758 -26334 -110764 -15020 38029 -4672 -83649 91864 74786 29065 -254 68360
2628F8360l0999m8883j31956J5303J25169J6644K7369J76372m1288j80138J3649
$$ 68360 37361 -11522 -143478 -128175 -3006 13638 41007 217379 176091 -4047 9602
2617I602j898r4612Q063K21764m0949k12268j84626q1127P7392J65770K25971
$$ 9602 7704 -86908 -78845 142919 101970 -110298 -294924 -376051 -298659 -132889 93082
2606I3082o5050r5540L822K1047M6877k16634Q73J78822p7556j34617J16930j19742
$$ 93082 28032 -67508 -63686 -42639 4238 -212396 -211523 -32701 -110257 -244874 -127944 -247686
2594b47686q3170J75611n98Q8999k8430J34200N0736p9556j3197Q3265j74738
$$ -247686 -330856 -155245 -155843 -66844 -95274 38926 89662 10106 -3091 80174 -94564
2583i4564j74291Q3561r0446J66052M4419N704j93751K3112J54347q6958J66717
$$ -94564 -268855 -185294 -275740 -109688 -65269 -59565 -253316 -230204 -75857 -162815 3902
2572C902J86265k7667j44884J35565j21412j19568R6012M1894n2712p2126L4630
$$ 3902 190167 162500 17616 153181 31769 -87799 8213 50107 -2605 -74731 -40101
2561d0101K9741M9602J50035n2534P4489j4584j6466J11148L52834M931j57543
$$ -40101 -10360 39242 189277 136743 211232 196648 180182 291330 644164 649095 491552
2550D91552k13085j63740P4884j28528k1641k3703K83734o1123j23273j90303
$$ 491552 278467 114727 189611 61083 39442 15739 299473 238350 115077 -75226
2540g5226j16571J00081K53903r2083L6403j19696m8017J27559j02729p4793K11456
$$ -75226 -191797 -91716 162187 70104 106507 -13189 -61206 66353 -36376 -111169 100287
2529A00287j62617J81328j07610j05617j45834P031q5483r0338J62299K6820l1215
$$ 100287 -62330 118998 11388 -94229 -240063 -233032 -318515 -408853 -246554 -219734 -250949
2518b50949J69842K24459J26248k44643l0104O9991N9082j04359j50551K2218
$$ -250949 -81107 143352 269600 24957 -5147 64844 123926 19567 -130984 -108766
2508a08766r3322J44939n5600j18480L90019l5418k70710j41689o7175K38944
$$ -108766 -202088 -57149 -112749 -231229 158790 123372 -147338 -289027 -356202 -117258
2498a17258J41877N6698k0402P6379J1765K18158P0201q0711l07898m5315k2615
$$ -117258 24619 81317 60915 137294 149059 367217 437418 356707 48809 3494 -19121
2487a9121r0361q2000J4128J21934M64j44899m0205L7383J73626N4242q46q766
$$ -19121 -109482 -191482 -177354 -55420 -54956 -199855 -240060 -202677 -29051 25191 24345 15579
2475A5579r1798m043K31800J691r477J62525j01145n4585R2092O3234p4513J6953
$$ 15579 -76219 -80262 151538 153229 143752 306277 205132 150547 242639 305873 231360 248313
2463B48313O3802j67882o2657j25173L49805r6731j95656j18488m7643O39K59261
$$ 248313 312115 144233 81576 -43597 306208 209477 13821 -104667 -152310 -151671 107590
2452A07590j44647j92844J03021J40976j7232n0199R9263P3865j11795N7810R5633
$$ 107590 -37057 -229901 -126880 14096 -3136 -53335 45928 119793 7998 65808 161441
2441A61441J48399J56576j96227J66465K1408k25590R318J0739m7421j43723M359
$$ 161441 309840 466416 270189 436654 458062 232472 241790 252529 205108 61385 65744
2430F5744j01052M6006J70454K47563k45742O6639L55966J29881k93587o0636
$$ 65744 -35308 10698 181152 428715 182973 249612 605578 735459 441872 381236
2420C81236K5033M5517J36891k45970L5171j49720j40262J05599J84691J73451
$$ 381236 406269 451786 588677 342707 377878 228158 87896 193495 378186 551637
2410E51637K63455k09636k70862j16130J16591J07811J2789j22757J15890o5542
$$ 551637 815092 605456 334594 218464 335055 442866 455655 332898 448788 383246
2400C83246o0252j7915n2352K48353J15751j48762O8685J7864J1754J03077q0760
$$ 383246 322994 305079 252727 501080 616831 468069 536754 554618 566372 669449 588689
2389E88689L2550P6362j66021J69699n4827r6361J0049J75489J0896k2653N0673
$$ 588689 621239 697601 531580 701279 646452 550091 560140 735629 746525 723872 774545
2378G74545O710n8354k16590j9534K8582m8282J52820J52010k1413M1538P2104
$$ 774545 781255 722901 506311 486777 515359 467077 619897 771907 750494 792032 864136
2367H64136J70283j24897j93785J70541O7463J23913j78858k0150J0076R3885
$$ 864136 1034419 909522 715737 886278 953741 1077654 898796 878646 888722 982607
2357I82607K05478q5285j25491k1055L42609K65288j99544j75595K71376k00559
$$ 982607 1188085 1102800 977309 956254 1298863 1564151 1364607 1189012 1460388 1259829
2347A259829j43803P3728J50504J44402Q4193M1290r4572J07840P8009J0108R2595
$$ 1259829 1116026 1189754 1340258 1484660 1568853 1610143 1515571 1623411 1701420 1711528 1804123
2336A804123J87509k22374J55956J29464J66082Q0453K24669j48456j22970K66552
$$ 1804123 1991632 1769258 1925214 2054678 2220760 2301213 2525882 2377426 2254456 2521008
2326B521008J35653K3124R6919L03993J22810P6563K65242L00770J43231M26387
$$ 2521008 2656661 2679785 2776704 3080697 3203507 3280070 3545312 3846082 3989313 4415700
2316D415700K94017L18412N27613N39307M96432M36395P70301Q98361N84183R18940
$$ 4415700 4709717 5028129 5555742 6095049 6591481 7027876 7798177 8696538 9280721 10199661
2306A0199661R20174J023481J108610J383851J434715J344870J743228K196770
$$ 10199661 11119835 12143316 13251926 14635777 16070492 17415362 19158590 21355360
2298B1355360K591883L333252L565628L512551L116219K299280K253280K642860
$$ 21355360 23947243 27280495 30846123 34358674 37474893 39774173 42027453 44670313
2290D4670313L166824K395056M91814k45410j148276j606241l106385m044948
$$ 44670313 47837137 50232193 50724007 50478597 49330321 47724080 44617695 40572747
2282D0572747k847932k852220k707447k531711k733149k612487k285723k069414
$$ 40572747 37724815 34872595 32165148 29633437 26900288 24287801 22002078 19932664
2274A9932664k354404k227379k121797k205666k094822j603562r92239r79675
$$ 19932664 17578260 15350881 13229084 11023418 8928596 7325034 6332795 5353120
2266E353120p47048p71267o47224l74743l16618k10701J6255j52382l91444j74437
$$ 5353120 4606072 3834805 3187581 2812838 2496220 2285519 2301774 2149392 1757948 1583511
2256A583511j74233r5467l0919j54004j27083j18089j19322k6175o1621o3862
$$ 1583511 1409278 1313811 1282892 1128888 1001805 883716 764394 738219 676598 612736
2246F12736O6830r6060j15724J83625N0017j62599k01721J15629j0306p8398r0169
$$ 612736 679566 583506 467782 651407 701424 538825 337104 452733 442427 364029 273860
2235B73860k10260K4678R8878J32002j23986k21953J31631p3841j18305J29608
$$ 273860 63600 88278 187156 319158 195172 -26781 104850 31009 -87296 42312
2225D2312L13140j79735K9078m0047O550J40213k51925O2098o102L2600K2282
$$ 42312 355452 175717 204795 164748 171298 311511 59586 121684 115582 148182 170464
2214A70464j79511r9276K41662J35049r7293k6895k68083N3077j3123L7263J50346
$$ 170464 -9047 -108323 133339 268388 171095 144200 -123883 -70806 -83929 -46666 103680
2203A03680l3585k0664j21546K27440j02842j40505r1720k08692K84127Q666m5147
$$ 103680 70095 49431 -72115 155325 52483 -88022 -179742 -388434 -104307 -95641 -140788
2192a40788k1310p5832M714J2132j19237J12355j82704J48390N4930k03740K98266
$$ -140788 -162098 -237930 -233216 -221084 -340321 -227966 -410670 -262280 -207350 -411090 -112824
2181a12824J04837K1290K5668J41917k21490M2529j7336K4408K1262M5870j20263
$$ -112824 -7987 13303 38971 180888 -40602 1927 -15409 8999 30261 76131 -44132
2170d4132j20051Q8323M8283j94807q4727L2823K24972K9119M2789L6701j30786
$$ -44132 -164183 -75860 -27577 -222384 -307111 -274288 -49316 -20197 22592 59293 -71493
2159g1493n8464M890N6307J47470N8048j84434J1660o4476j3335J09736k37408
$$ -71493 -129957 -125067 -68760 78710 136758 -47676 -36016 -100492 -113827 -4091 -241499
2148b41499p6162J69871p5616q4016R7155J768N1433n4791j14589k5036q3798
$$ -241499 -317661 -147790 -223406 -307422 -210267 -208499 -157066 -211857 -326446 -351482 -435280
2137d35280K06992Q2399j81898k3466M6265J19822k06047J43369Q140j59286J6777
$$ -435280 -228288 -145889 -327787 -351253 -304988 -185166 -391213 -247844 -239704 -398990 -382213
2126c82213l6659L5784J13833J56868K230j16995j52547J89885k17818N4113K09946
$$ -382213 -418872 -383088 -269255 -112387 -110157 -227152 -379699 -189814 -407632 -353519 -143573
2115a43573J41413r5729m4659L7873j38938j6853J89413q5767p3441O1236k1397
$$ -143573 -2160 -97889 -142548 -104675 -243613 -260466 -71053 -156820 -230261 -169025 -190422
2104a90422N4835N3287M8787J50485l8699l19742J00969N4q2730k7635k3422k5748
$$ -190422 -135587 -82300 -33513 116972 78273 -241469 -140500 -140446 -223176 -250811 -274233 -299981
2092b99981L9909k4184R5974J21703J37226k3367Q152M9083k7979p1245k85034
$$ -299981 -260072 -284256 -188282 -66579 70647 47280 55432 104515 76536 5291 -279743
2081b79743l0619Q7058P7136L1640Q1051q6600j23799J6665j65L24597n5774j23670
$$ -279743 -310362 -223304 -146168 -114528 -33477 -120077 -243876 -227211 -227376 97221 41447 -82223
2069h2223j16302m8939K14106r4384R414P1053M4657o5434m637o8586n6577K55050
$$ -82223 -198525 -247464 -33358 -127742 -118328 -47275 -2618 -68052 -72689 -141275 -197852 57198
2057E7198M4242r9811j28563n8851N1709j2735K5864R1977r5784m1473K13965
$$ 57198 101440 1629 -126934 -185785 -134076 -146811 -120947 -28970 -124754 -166227 47738
2046D7738j37732k12259k2597J01840Q3539k04700j27895J42705N450L6379J23907
$$ 47738 -89994 -302253 -324850 -223010 -139471 -344171 -472066 -329361 -323911 -287532 -163625
2035a63625P7232N2630J8732n7744J16759N1235j88621K17313M5542k6412J28494
$$ -163625 -86393 -33763 -15031 -72775 43984 95219 -93402 123911 169453 143041 271535
2024B71535o1684L9524J4862q8754n8401J29693M5590q1045n7841j30024R3255
$$ 271535 209851 249375 264237 175483 117082 246775 292365 211320 153479 23455 116710
2013A16710j84025j03560J43875J50202K9888n2658j44954r9131J54153j6764
$$ 116710 -67315 -170875 -27000 123202 153090 100432 -44522 -143653 10500 -6264
2003f264l9519p5818J24454q4544j5943o6739m4177J22616J53915k05884Q8259
$$ -6264 -45783 -121601 2853 -81691 -97634 -164373 -208550 -85934 67981 -137903 -49644
1992d9644J49800j56352p7535K61163k5066j099j13565o1623N8848p8088P8273
$$ -49644 100156 -56196 -133731 127432 102366 101267 -12298 -73921 -15073 -93161 -14888
1981a4888j0461O0713k92735K31059j05952o7198K13889n8540j30109P9148q5255
$$ -14888 -25349 35364 -257371 -26312 -132264 -199462 14427 -44113 -174222 -95074 -180329
1970a80329m1842J61180R7518n4729r2222m1621p7893J7188q5910J8347o0934
$$ -180329 -222171 -60991 36527 -18202 -110424 -152045 -229938 -212750 -298660 -280313 -341247
1959c41247P0052o9992R2379J35420P3251r3051j013j62389J60248K9210K3249
$$ -341247 -271195 -341187 -248808 -113388 -40137 -133188 -134201 -296590 -136342 -107132 -83883
1948h3883J44258q0580p5266k2927q7961j0482n6688M37K62028J41960j55010
$$ -83883 60375 -20205 -95471 -118398 -206359 -216841 -273529 -273092 -11064 130896 -24114
1937b4114j87219r0408O9755K976O6108J15394n3789j5751K53893k38248j03666
$$ -24114 -211333 -301741 -231986 -229010 -162902 -47508 -101297 -117048 136845 -101403 -205069
1926b05069J99975M1048M0621k73908n5109J61545J38709k29108l435J9044J92132
$$ -205069 -5094 35954 76575 -197333 -252442 -90897 47812 -181296 -184731 -165687 26445
1915B6445n8704k813J49337j40191j35683J06818J07995j23550l09948K18208
$$ 26445 -32259 -35072 114265 -25926 -161609 -54791 53204 -70346 -380294 -162086
1905a62086k9902O7172J5809R3990L8207O7876M0621K7626l72699K4456J43516
$$ -162086 -191988 -124816 -109007 -15017 23190 91066 131687 159313 -213386 -188930 -45414
1894d5414J79601p4493N4170j69706j80467k3809J64378n8699P7961l2979p2592
$$ -45414 134187 59694 113864 -55842 -236309 -260118 -95740 -154439 -76478 -109457 -182049
1883a82049J7863J21732K54305k97444l3730J50016M054j76761j02439Q0794J56421
$$ -182049 -164186 -42454 211851 -85593 -119323 30693 34747 -142014 -244453 -163659 -7238
1872g238l4738J5313j54770L00212l8832j14453n4428J27935M8335j27049O5238
$$ -7238 -41976 -26663 -181433 118779 79947 -34506 -88934 39001 87336 -39713 25525
1861B5525j00001k88991J58993K67261O8217M1700j7456k86359m9421k00823j6623
$$ 25525 -74476 -363467 -204474 62787 131004 172704 155248 -131111 -180532 -381355 -397978
1850c97978q8203J51041N3252j057J0297p082K04043L3063j26725r2865Q9086
$$ -397978 -486181 -335140 -281888 -282945 -272648 -279730 -75687 -42624 -169349 -262214 -173128
1839a73128J65851j8279j47766M6624J53448j36239q013m05p3553J29932n3387
$$ -173128 -7277 -25556 -173322 -126698 26750 -109489 -117502 -117907 -191460 -61528 -114915
1828a14915j50780r2445L5522K34519Q1749j13904L6348J8036N1869m6324r08
$$ -114915 -265695 -358140 -322618 -88099 -6350 -120254 -83906 -65870 -14001 -60325 -61233
1817f1233m518l5345J21373L5969k83438n6151J45416N3090O5515J7217J02987
$$ -61233 -65751 -101096 20277 56246 -227192 -283343 -137927 -84837 -19322 -2105 100882
1806A00882J34827j28034j14420o9228o6367J56721K60049k2048k36821k4178
$$ 100882 235709 107675 -6745 -75973 -142340 14381 274430 252382 15561 -8617
1796h617m8271o9814J25293J3711n4607J1822q5302q7633j35726r6182N6900J93179
$$ -8617 -56888 -126702 -1409 12302 -42305 -30483 -115785 -203418 -339144 -435326 -378426 -185247
1784a85247m374l8103j8790R5439P0142J61172j31983n4520m4264P3647O6752
$$ -185247 -189621 -227724 -246514 -151075 -80933 80239 -51744 -106264 -150528 -76881 -10129
1773a0129k30690j35963J23488K76375L7004p9252M8242j03615J5539O893j28665
$$ -10129 -240819 -376782 -253294 23081 60085 -19167 29075 -74540 -59001 -52108 -180773
1762a80773N3249M0984j75554N3145K6207J59432N5720k15859M7645R9334l3578
$$ -180773 -127524 -86540 -262094 -208949 -182742 -23310 32410 -183449 -135804 -36470 -70048
1751g0048q4417J98510j38005j11810O5383J02971k0757P437j28149l1563K06153
$$ -70048 -154465 44045 -93960 -205770 -140387 -37416 -58173 -50736 -178885 -210448 -4295
1740d295J48759j73427j7121K16085k71519k67276K53323K6963J9906l0144j87533
$$ -4295 144464 -28963 -46084 170001 -101518 -368794 -115471 -88508 -68602 -98746 -286279
1729b86279J59936J42308j33082o970N5756Q355j17311j84681l1830K39012r9198
$$ -286279 -126343 15965 -117117 -124087 -68331 -59976 -177287 -361968 -393798 -154786 -253984
1718b53984j24245N7677K22220O6336r1587Q5311J26050j14474n5310l890O4853
$$ -253984 -378229 -320552 -98332 -31996 -123583 -38272 87778 -26696 -82006 -85896 -21043
1707b1043n5953J12595j58521j22987Q0968j25462l4436J14217K14147j91360
$$ -21043 -76996 35599 -122922 -245909 -164941 -290403 -324839 -210622 3525 -187835
1697a87835j88419K11870L3749O99J13160O3988j1524j74645j03130J52714J88232
$$ -187835 -376254 -164384 -130635 -129936 -16776 47212 35688 -138957 -242087 -89373 98859
1686I8859j64984k19039L3652K88411R6463L1117q8810N6550j32968p7913K24147
$$ 98859 -66125 -285164 -251512 36899 133362 164479 75669 132219 -749 -78662 145485
1675A45485J05962k92695N8520P0364j90776m7378O4420M0263n866J07814n3079
$$ 145485 251447 -41248 17272 87636 -103140 -150518 -86098 -45835 -51701 56113 3034
1664C034r8837o2985K82555o0336k16963p3116M9436j4556p0826p7169K882M4003
$$ 3034 -95803 -158788 123767 63431 -153532 -226648 -177212 -191768 -262594 -339763 -336881 -292878
1652b92878J42060j52087k7181L36932j25605p6269m3418J39669j2277p3839R8328
$$ -292878 -150818 -302905 -330086 6846 -118759 -195028 -238446 -98777 -111054 -184893 -86565
1641h6565J99934j31776n5642j60134m0619R1445M9470m1222J2487K1668O0175
$$ -86565 113369 -18407 -74049 -234183 -274802 -183357 -133887 -175109 -162622 -140954 -80779
1630h0779N2717M0157K5526l7669Q5169j9751q4897P5223j47354j79641M4244
$$ -80779 -28062 12095 37621 -48 85121 65370 -19527 55696 -91658 -271299 -227055
1619b27055J37494R5250j53955k3459k05365J04516J17128O4670n6594l594k1564
$$ -227055 -89561 5689 -148266 -171725 -377090 -272574 -155446 -90776 -147370 -150964 -172528
1608a72528j20968o11N4916o5445Q2716J69136J89244r3098j65952j49993n0220
$$ -172528 -293496 -294107 -239191 -304636 -221920 -52784 136460 43362 -122590 -272583 -322803
1597c22803l2508J46038J3976K1105M0025O1887L4746p7782r0874j13474J01654
$$ -322803 -355311 -209273 -195297 -174192 -134167 -72280 -37534 -115316 -206190 -319664 -218010
1586b18010k515j8065Q1566K30398O9877j1406k58928J9334J21743K34929j49025
$$ -218010 -220525 -238590 -157024 73374 143251 131845 -127083 -107749 13994 248923 99898
1575I9898o8427O1521j44659J95117j05441L3085j43390j73208j7473J12589O5842
$$ 99898 31471 92992 -51667 143450 38009 71094 -72296 -245504 -262977 -150388 -84546
1564h4546k30504K32621M3457n1729j54337r313J56220K6514K8198P271j92554
$$ -84546 -315050 -82429 -38972 -90701 -245038 -254351 -98131 -71617 -43419 -36148 -228702
1553b28702J64207n1157J979o4515M7057J4022J28922j27484M9160L2689l3123
$$ -228702 -64495 -115652 -113673 -178188 -131131 -117109 11813 -115671 -66511 -33822 -66945
1542f6945O8767l553Q0347k6441J2363j64820n134K05848Q9769k06970j5693k11977
$$ -66945 1822 -1731 78616 52175 64538 -100282 -105416 100432 190201 -16769 -32462 -244439
1530b44439j0973J11899j31889k36281J84078K29643p1201J22623K00380l05957
$$ -244439 -255412 -143513 -275402 -511683 -327605 -97962 -169163 -46540 153840 -152117
1520a52117K1362J04103J66885o7557j95120n8274q7546R0352J62703K26295r6931
$$ -152117 -130755 -26652 140233 72676 -122444 -180718 -268264 -177912 -15209 211086 114155
1509A14155k0014j00474j29417M0969j3269N1209j44308n0572K07849L8346r3587
$$ 114155 94141 -6333 -135750 -94781 -108050 -56841 -201149 -251721 -43872 -5526 -99113
1498i9113N7630j06103J02453n033J41149M6765k51989l5651N0397J59294o1059
$$ -99113 -41483 -147586 -45133 -50166 90983 137748 -114241 -149892 -99495 59799 -1260
1487a260J3080n7616l9682k55220J49543P4359j80063l7167n5788J73919J51922
$$ -1260 11820 -45796 -85478 -340698 -191155 -116796 -296859 -334026 -389814 -215895 -63973
1476f3973q59k2541j81165R8510K45312k47311j21765J69785L7500j15095K5009
$$ -63973 -64832 -87373 -268538 -170028 75284 -172027 -293792 -124007 -86507 -201602 -176593
1465a76593j15100K07172K5816J10051l3109j22263k08746Q6183J26031J07320
$$ -176593 -291693 -84521 -58705 51346 18237 -104026 -312772 -226589 -100558 6762
1455F762N7992M5301K3552k26636p4202K7113n705J3921Q3399j85772J20527J84969
$$ 6762 64754 110055 133607 -93029 -167231 -140118 -145823 -131902 -48503 -234275 -113748 71221
1443G1221O1755Q1695j76520k03529j3667J75030J48332q3111K0885l9385k31849
$$ 71221 132976 214671 38151 -165378 -179045 -4015 144317 61206 82091 42706 -189143
1432a89143j7719J50658P1723M1878q9479l7671K8328j16507M0146k8247k73980
$$ -189143 -206862 -56204 15519 57397 -32082 -69753 -41425 -157932 -117786 -146033 -420013
1421d20013N2685K3685j4401L00484m9028q4180j78047k07315K63675K43440L351
$$ -420013 -367328 -343643 -358044 -57560 -106588 -190768 -368815 -576130 -312455 -69015 -65664
1410f5664j48444L267K09075k166m3278O4422j4219j75758N8883j47592R3609
$$ -65664 -214108 -210841 -1766 -3932 -47210 17212 2993 -172765 -113882 -261474 -167865
1399a67865Q8561j35402J34423q6082K31576j33084n6605o4593j03770M2326L2227
$$ -167865 -79304 -214706 -80283 -166365 65211 -67873 -124478 -189071 -292841 -250515 -218288
$$ [...]
##END NTUPLES=NMR SPECTRUM
##END=
