##TITLE=1H_CA-9453-2
 200.13Hz,DMSO-d6.
 8 sc
 
 29.4.2026
##JCAMPDX= 6.0         $$ Bruker NMR JCAMP-DX V2.0
##DATA TYPE= NMR SPECTRUM
##DATA CLASS= NTUPLES
##ORIGIN= UXNMR, Bruker Analytische Messtechnik GmbH
##OWNER= pz
$$ XWIN-NMR		Version 3.5
$$ Wed Apr 29 14:32:01 2026 Russian Standard Time (UT+4h)  she@DPX200
##.OBSERVE FREQUENCY= 200.1313
##.OBSERVE NUCLEUS= ^1H
##.ACQUISITION MODE= SIMULTANEOUS
##.ACQUISITION SCHEME= undefined
##.AVERAGES= 8
##.DIGITISER RES= 18
##SPECTROMETER/DATA SYSTEM= spect
##.PULSE SEQUENCE= zg30
##.SOLVENT NAME= CDCl3
##.SHIFT REFERENCE= (INTERNAL, CDCl3, 0, 15.5067)
##AUDIT TRAIL= $$ (NUMBER, WHEN, WHO, WHERE, WHAT)
$$ ##TITLE= Audit trail, XWIN-NMR		Version 3.5
$$ ##JCAMPDX= 5.01
$$ ##ORIGIN= Bruker BioSpin GmbH
$$ ##OWNER= she
$$ F:/spectra/data/she/nmr/H-C/1/pdata/1/auditp.txt
$$ ##AUDIT TRAIL=  $$ (NUMBER, WHEN, WHO, WHERE, WHAT)
(   1,<2026-04-29 14:30:27.00 +0400>,<she>,<DPX200>,
      <created by zg, POWCHK disabled, PULCHK disabled
       configuration hash MD5:
       00 E9 B6 7A A2 85 ED C7 34 08 36 98 17 FE 4E 26
       data hash MD5: 16K
       49 BE 62 E6 F7 6B 5E C5 DA 75 B4 B5 2E 53 B7 C1>)
(   2,<2026-04-29 14:30:41.14 +0400>,<she>,<DPX200>,
      <Start of raw data processing
       efp BC_mod = 2 LB = 0.25 FT_mod = 6 PKNL = 1 PHC0 = -4062.532 PHC1 = 16.99229 SI = 16K 
       data hash MD5: 16K
       4D D9 CC AD C4 AC 34 51 3B 3A D3 E7 84 ED A6 6D>)
(   3,<2026-04-29 14:31:01.84 +0400>,<she>,<DPX200>,
      <pk PHC0 = 85.73961 PHC1 = -3.4 
       data hash MD5: 16K
       75 93 99 8D 91 2C B3 D0 F2 5F 32 13 32 2B 7C 08>)
(   4,<2026-04-29 14:31:06.04 +0400>,<she>,<DPX200>,
      <abs ABSG = 5 
       data hash MD5: 16K
       C6 8A 25 F7 C2 15 F8 9B 6C A7 83 47 70 CB 91 AF>)
$$ ##END=
$$ 
$$ hash MD5
$$ A8 DE CB FA CD 74 1F 79 66 36 B5 3F 41 AD 3B 77
##$RELAX= 
##$RELAX= 
##$RELAX= 
##$RELAX= 
##$RELAX= 
##$RELAX= 
$$ Bruker specific parameters
$$ --------------------------
##$DU= <F:/spectra>
##$EXPNO= 1
##$NAME= <H-C>
##$PROCNO= 1
##$TYPE= <nmr>
##$USER= <she>
##$AMP= (0..31)
100 100 100 100 100 100 100 100 100 100 100 100 100 100 100 100 100 100 
100 100 100 100 100 100 100 100 100 100 100 100 100 100 
##$AQSEQ= 0
##$AQ_mod= 1
##$AUNM= <au_zg>
##$AUTOPOS= <>
##$BF1= 200.13
##$BF2= 200.13
##$BF3= 200.13
##$BF4= 200.13
##$BF5= 200.13
##$BF6= 200.13
##$BF7= 200.13
##$BF8= 200.13
##$BYTORDA= 1
##$CFDGTYP= 0
##$CFRGTYP= 5
##$CHEMSTR= <none>
##$CNST= (0..31)
1 1 145 1 1 1 1 1 1 1 1 1 1 1 1 1 1 1 1 1 1 1 1 1 1 1 1 1 1 1 1 1 
##$CPDPRG= <>
##$CPDPRG1= <>
##$CPDPRG2= <>
##$CPDPRG3= <>
##$CPDPRG4= <mlev>
##$CPDPRG5= <mlev>
##$CPDPRG6= <mlev>
##$CPDPRG7= <mlev>
##$CPDPRG8= <mlev>
##$CPDPRGB= <>
##$CPDPRGT= <>
##$D= (0..31)
0 0.7 0 0 0 0 0 0 0 0 0 0.03 0 0 0 0 0 0 0 0 0 0 0 0 0 0 0 0 0 0 0 0 
##$DATE= 1777458626
##$DBL= (0..7)
120 120 120 120 120 120 120 120 
##$DBP= (0..7)
150 150 150 150 150 150 150 150 
##$DBP07= 0
##$DBPNAM0= <>
##$DBPNAM1= <>
##$DBPNAM2= <>
##$DBPNAM3= <>
##$DBPNAM4= <>
$$ [...]
##$SUBNAM3= <"">
##$SUBNAM4= <"">
##$SUBNAM5= <"">
##$SUBNAM6= <"">
##$SUBNAM7= <"">
##$SUBNAM8= <"">
##$SUBNAM9= <"">
##$SW= 18.0517328524113
##$SWIBOX= (0..15)
0 0 2 0 0 0 0 0 0 0 0 0 0 0 0 0 
##$SW_h= 3612.71676300578
##$TD= 16384
##$TD0= 1
##$TE= 0
##$TE2= 300
##$TE3= 300
##$TEG= 300
##$TL= (0..7)
0 120 120 120 120 120 120 120 
##$TP= (0..7)
150 150 150 150 150 150 150 150 
##$TP07= 0
##$TPNAME0= <>
##$TPNAME1= <>
##$TPNAME2= <>
##$TPNAME3= <>
##$TPNAME4= <>
##$TPNAME5= <>
##$TPNAME6= <>
##$TPNAME7= <>
##$TPOAL= (0..7)
0.5 0.5 0.5 0.5 0.5 0.5 0.5 0.5 
##$TPOFFS= (0..7)
0 0 0 0 0 0 0 0 
##$TUNHIN= 0
##$TUNHOUT= 0
##$TUNXOUT= 0
##$USERA1= <user>
##$USERA2= <user>
##$USERA3= <user>
##$USERA4= <user>
##$USERA5= <user>
##$V9= 5
##$VALIST= <valist>
##$VCLIST= <CCCCCCCCCCCCCCC>
##$VD= 0
##$VDLIST= <DDDDDDDDDDDDDDD>
##$VPLIST= <PPPPPPPPPPPPPPP>
##$VTLIST= <TTTTTTTTTTTTTTT>
##$WBST= 1024
##$WBSW= 4
##$XGAIN= (0..3)
0 0 0 0 
##$XL= 0
##$YL= 0
##$YMAX_a= 107994
##$YMIN_a= -136481
##$ZGOPTNS= <>
##$ZL1= 120
##$ZL2= 120
##$ZL3= 120
##$ZL4= 120
##$ABSF1= 17.78914
##$ABSF2= -0.2627506
##$ABSG= 5
##$ABSL= 3
##$ALPHA= 0
##$AQORDER= 0
##$ASSFAC= 0
##$ASSFACI= 0
##$ASSFACX= 0
##$ASSWID= 0
##$AUNMP= <proc_1d>
##$AZFE= 0.1
##$AZFW= 0.1
##$BCFW= 0
##$BC_mod= 2
##$BYTORDP= 0
##$COROFFS= 0
##$CY= -3
##$DATMOD= 1
##$DC= 0
##$DFILT= <>
##$DTYPP= 0
##$F1P= 0
##$F2P= 0
##$FCOR= 1
##$FTSIZE= 16384
##$FT_mod= 6
##$GAMMA= 0
##$GB= 0
##$INTBC= 1
##$INTSCL= 3.241238e-09
##$ISEN= 128
##$LB= 0.25
##$LEV0= 0
##$LPBIN= 0
##$MAXI= 10000
##$MC2= 0
##$MEAN= 0
##$ME_mod= 0
##$MI= 1.114404
##$NCOEF= 0
##$NC_proc= -7
##$NLEV= 6
##$NOISF1= 3.799351
##$NOISF2= 2.8
##$NSP= 0
##$NTH_PI= 0
##$NZP= 0
##$OFFSET= 15.5067
##$PC= 1
##$PHC0= -3976.792
##$PHC1= 13.59229
##$PH_mod= 1
##$PKNL= yes
##$PPARMOD= 0
##$PSCAL= 0
##$PSIGN= 0
##$REVERSE= no
##$SF= 200.130003002566
##$SI= 16384
##$SIGF1= 3
##$SIGF2= 2
##$SINO= 0.751879
##$SIOLD= 32768
##$SREGLST= <19F.Aceton>
##$SSB= 0
##$STSI= 16384
##$STSR= 0
##$SW_p= 3612.71676300578
##$SYMM= 0
##$S_DEV= 0
##$TDeff= 16384
##$TDoff= 0
##$TI= <>
##$TILT= no
##$TM1= 0
##$TM2= 0
##$TOPLEV= 0
##$USERP1= <user>
##$USERP2= <user>
##$USERP3= <user>
##$USERP4= <user>
##$USERP5= <user>
##$WDW= 1
##$XDIM= 16384
##$YMAX_p= 488286124
##$YMIN_p= -199421
$$ End of Bruker specific parameters
$$ ---------------------------------
##NTUPLES= NMR SPECTRUM
##VAR_NAME=  FREQUENCY,     SPECTRUM/REAL,   SPECTRUM/IMAG
##SYMBOL=    X,             R,               I
##VAR_TYPE=  INDEPENDENT,   DEPENDENT,       DEPENDENT
##VAR_FORM=  AFFN,          ASDF,            ASDF
##VAR_DIM=   16384,         16384,           16384
##UNITS=     HZ,            ARBITRARY UNITS, ARBITRARY UNITS
##FACTOR=    0.220516191357247, 1,           1
##FIRST=     3103.35582991751, 0,            0
##LAST=      -509.360933088271, 0,           0
##MIN=       -509.360933088271, -199421,     0
##MAX=       3103.35582991751, 488286124,    0
$$ Real data points
##PAGE= N=1
##DATA TABLE= (X++(R..R)), XYDATA
$$ [...]
6320C2664m291k0943l77J8730J5460O857k291j1172n250J430k3298N813P76J6227
6306C0335m846Q95K0199o447j0621m0630L275L1595L947m981J4518m698J2732
6293D5273k4263J0183j8989n183K8854K4489r519r274J1389k0680o75l1786j641
6280a822L459K08R445N923L725j604J6299K9382K9406q920j8586K845k6861m559
6266C8340J749K119l1854j1745J8197J6578j434k4154J8652k355j0756K298J0538
6253B6173j4528m311K1719J0569m4760k4824J5606j2303J3092K0005J8815K1259
6241D6512J1345n1117j3045Q879K1342J5408k4705R80m2030J2868N230K7344J1477
6228C0488n0441J1643M30K7522L40n174q845l5267N0394M821k0873J8335O071
$$ plain form
6320 32664 28373 7430 7053 25783 41243 48100 45809 34637 29387 30817 7519 13332 14108 30335
6306 30335 25489 26384 46583 40136 29515 -11115 -7840 23755 27702 22721 37239 32541 45273
6293 45273 21010 31193 12204 7021 35875 60364 50845 41571 52960 32280 31605 -181 -1822
6280 -1822 1637 1845 11290 17213 20938 19334 35633 65015 94421 85501 66915 69760 42899 38340
6266 38340 40089 42208 10354 -1391 16806 33384 31950 7796 26448 24093 13337 15635 26173
6253 26173 11645 7334 29053 39622 -5138 -29962 -14356 -26659 -13567 6438 25253 46512
6241 46512 57857 6740 -6305 2574 23916 39324 14619 15599 -26431 -13563 -8333 19011 30488
6228 30488 -19953 -8310 -7880 19642 19982 14808 5963 -29304 21090 25911 5038 23373 29444
6215B9444J3249k9214j8216k796Q864J1185Q423o959j776L2232k3724j5330n087
6202B95j316K2604M253K0180n2039K361J1727K8240p294j3866J6651m649K0933
6189D8080j3730j1060j902j8945k5725K0702R205K5153j1537m027K2160j0327
6177B8047j3215r92R564n839P992M0034k0643k7725m063P685q878o090Q257O654
6163B0788J6400j3296K4738J9220J491j9722k2417L731J5935k9613L696J1625
6151C2576l9421j8307J1120k8176P979L604n571K543J056K9871K6024P813p907
6138B3204M960J0583N510j8429K269J3584n3803O319K37m116L1510j4116J2774
6125B0486q266L2957O366O519l4170k4268j8905K7474o082r788L6687R755L0791
$$ plain form
6215 29444 42693 13479 -4737 -7533 1331 12516 20939 13980 12204 44436 20712 5382 295
6202 295 -1021 21583 25836 46016 -6023 -3662 8065 36305 29011 15145 31796 27147 48080
6189 48080 34350 23290 21388 2443 -23282 -2580 6625 31778 20241 16214 38374 28047
6177 28047 14832 13840 23404 17565 25557 65591 44948 17223 13160 20845 11967 5877 14134 20788
6163 20788 37188 23892 48630 67850 69341 49619 27202 30933 46868 17255 20951 32576
6151 32576 -6845 -25152 -14032 -42208 -34229 -30625 -36196 -33653 -32597 -2726 23298 31111 23204
6138 23204 28164 38747 44257 25828 28097 41681 -12122 -5803 -5566 -9682 21828 7712 20486
6125 20486 12220 45177 51543 58062 23892 -376 -19281 8193 2111 -7677 29010 38765 69556
6112F9556l3643k1719j0560j912J1919M2347J7486K7198p953J7734j4063m1321
6100E5069P673K812M326l4573l7494M1914L2681j2776l0163k374R996j3197L0585
6087E4479m1195J4532K0763l0391R618j6413j8808K8140J6401j1951J544r3P8
6074B6704L8935J3953k2811l742m232K6539k345J778J0555k0022k1084k4419l5395
6061a5586J9842K4859j3729n493r326M348J1172K2661k5338N251k0150J8920j12
6048A7319j534J2989K7253j710l7407l0772j8634K0593M8626N887K586k1613q206
6035A5377O297j7945K5511K650r882k1737J8472K1495l1274k4335k1565L0892
6023f044L1800R297n08m0432l2136J4715L3473n0656J4158K4129l900J2009j1175
$$ plain form
6112 69556 35913 14194 3634 1722 13641 55988 73474 100672 92719 110453 96390 55069
6100 55069 62742 65554 69880 35307 -2187 39727 72408 59632 29469 27095 37091 23894 54479
6087 54479 13284 27816 48579 18188 27806 11393 -7415 20725 37126 25175 26719 26626 26704
6074 26704 65639 79592 56781 53039 48807 75346 73001 74779 85334 65312 44228 19809 -15586
6061 -15586 4256 29115 15386 9893 567 4915 16087 38748 13410 18661 -1489 17431 17319
6048 17319 15785 28774 56027 54317 16910 -13862 -32496 -11903 36723 42610 45196 23583 15377
6035 15377 21674 3729 29240 31890 22008 271 18743 40238 8964 -15371 -36936 -6044
6023 -6044 25756 35053 34545 -5887 -38023 -23308 10165 -40491 -26333 -2204 -6104 5905 -5270
6010e270l312M6023L877n7057K7279J5434L693o298r875k375J8495p040o532k4711
5996g669N415k3334p471m029J9486M4208m4236j326J3085j1424P781L5993j0965
5983A5514O960j1944J773n306L5052k2472m742N617O243L6380l190k3409N124
5970D1600p300M1769k6011J863m262j1006K6471j7070j2150J2851J8649K6456
5958I1860L302L01j4453j3053J822N978N5422L0375o144J4027M885K01k0328P132
5944A61327L3561M3022M6703m908M7491M3718M4290P4842R1091J39708K45556
5933I66401L52015M16464M71160M40512K78130J67223O7504j14838k47329l87283
5923B409959l81252l49201l33846k28503k22022j62047r9985m0930n6605o3842
$$ plain form
6010 -5270 -8582 37441 41318 -15739 11540 26974 30667 24369 14494 12119 30614 23574 17042 -7669
5996 -7669 -2254 -25588 -33059 -37088 -17602 26606 -17630 -18956 -5871 -17295 -9514 26479 15514
5983 15514 22474 10530 12303 6997 42049 19577 14835 20452 26695 63075 59885 36476 41600
5970 41600 34300 76069 50058 51921 47659 36653 63124 46054 33904 46755 65404 91860
5958 91860 95162 95463 81010 67957 69779 75757 131179 161554 155410 169437 174322 174523 154195 161327
5944 161327 194888 237910 284613 279705 327196 370914 415204 490046 581137 720845 966401
5933 966401 1318416 1734880 2206040 2646552 2924682 3091905 3159409 3044571 2797242 2409959
5923 2409959 2028707 1679506 1345660 1117157 895135 733088 633103 592173 535568 471726
5913D71726n5783m4987k8038n4646o1983l6537m241J5204l7612k8091J2684m8882
5901I8814k0070N0178K2946m574m1025j3394K4586r277k6495J8624k8982j5388
5889E5943J8517R405K891j7646j3440r152q368q570j2550J5180l490J0559K4373
5876F3652m701k203k8548J4124K3151r947N826j5195M350L51l949J4328m2286
5863A8953J5645L3655n0111L8390p364j1391n530k4427P89J1366q33J8515p96
5850C6861j8510R004Q624j0346r476L3467j5864J8712k1309j1395K5763Q995Q031
5837F2557L6483J344m2093P174J1830l0939j7194N922K6537r014o682j7842M239
5824C2322o75j2693K1525J7059l3348k7812L9805K0907K36J272R086qN789M987
$$ plain form
5913 471726 415943 370956 342918 288272 226289 189752 185511 200715 163103 135012 147696 98814
5901 98814 78744 128922 151868 147294 106269 92875 117461 108184 81689 100313 71331 55943
5889 55943 74460 83865 86756 69110 55670 46518 38150 29580 17030 32210 28720 39279 63652
5876 63652 58951 56748 28200 42324 65475 55528 61354 46159 50509 50860 46911 61239 18953
5863 18953 34598 68253 18142 56532 49168 37777 32247 7820 8609 19975 19142 37657 36861
5850 36861 18351 27355 35979 25633 16157 49624 33760 52472 31163 19768 45531 54526 62557
5837 62557 99040 100384 58291 65465 77295 46356 29162 35084 61621 52607 45925 28083 32322
5824 32322 31647 18954 40479 57538 24190 -3622 36183 57090 57326 58598 67684 67676 73465 78452
5810G8452K2578k218K678m3430j5169J9066j1466K9675J4092n8902K3255J2878
5798G1489L5374J2040l876l6681J2709p93j4526J6210o614M9724k4053k3936n713
5785H1354Q434r132k3325K4130P860j4153K8499K362l263K2331P582n704M7183
5772A74158j6520k3954K1333k209n643M9640J8194J1294K7216L9757P531J5089
5760C15886M085K2522R643J0598O7044P0718M0057P2523R0993R3631R5708J14859
5748A008267J59835K35983L44054N43544Q08731J192770J542212J379876Q09505
5739H024777N33908K99049k15120q40980j144235j152652j040942q63316o79064
5730B921425n16135l94983k48669k08473k18557j16993r7064j32717j21525q6701
$$ plain form
5810 78452 101030 98812 101490 58060 42891 61957 50491 80166 94258 35356 58611 71489
5798 71489 106863 118903 115027 78346 91055 90262 75736 91946 85332 135056 111003 87067 81354
5785 81354 89788 80656 57331 81461 89321 75168 103667 106029 102766 125097 132679 126975 174158
5772 174158 157638 133684 155017 152808 147165 196805 214999 226293 253509 293266 300797 315886
5760 315886 319971 342493 352136 362734 429778 500496 540553 613076 704069 797700 893408 1008267
5748 1008267 1168102 1404085 1748139 2291683 3100414 4293184 5835396 7215272 8024777
5739 8024777 8558685 8857734 8642614 7801634 6657399 5504747 4463805 3600489 2921425
5730 2921425 2405290 2010307 1761638 1553165 1334608 1217615 1120551 987834 866309 779608
5720G79608o4699q1208n8566m1004n3251l7871m7922k3065J4862k5870k7940l1353
5708C01721o919m4842M439l73J5252J4237j6273l5735N89n053J4948p514l7180
5695A97297J141Q4k608k446l8184K999k3180P532K4676j0013k2174j2427q196
5682A14501K1962M09n421R729p778m6129K0534M2231l1208j2231j0484J4023J5241
5669A25379j4675o313k9016r688l120j7051J5811L2143l7616O584j226j2893r840
5656C8479K2442m550j0235k6651J6562k889m2029J8790K0776J2607J52L1414k7896
5643D6972J3020K873j109O311q629R51j0925k0473J7559J1587n285o3255j0697
5630b1100L0830R555K8142j2594l3067K3710j8849q184m3801J0237M039J3920
$$ plain form
5720 779608 714909 633701 575135 534131 480880 443009 395087 372022 386884 361014 333074 301721
5708 301721 294802 249960 254399 254026 269278 283515 267242 231507 232096 227043 241991 234477 197297
5695 197297 198438 198522 195914 193468 155284 158283 135103 142635 167311 157298 135124 122697 114501
5682 114501 136463 136872 131451 141180 133402 87273 107807 150038 118830 106599 96115 110138 125379
5669 125379 110704 104391 75375 65687 62567 45516 61327 93470 55854 62438 61212 48319 38479
5656 38479 60921 56371 46136 19485 36047 33158 -8871 9919 30695 43302 43454 74868 46972
5643 46972 59992 62865 61756 68067 59438 60389 49464 28991 46550 58137 52852 -10403 -21100
5630 -21100 9730 19285 47427 34833 1766 25476 6627 -1557 -45358 -35121 -31082 -17162
5618a7162K4569J2938R853n1978J6165L0511l8464l830l723j6387J5162K5707
5606C361J2701J1598O050K63n937P283J3322k1718k4552m0085L093J9868l6662
5593e1415J2933N2543R278L581K3762N449n2281M903K5538n58J0507l4627r377
5580B36K9454L9002k0917k3329m990k1872j8081K713L5280n663K2768j0966l3503
5567i868P495J3806j2726j1619j0144L4797j8133l9447M5840j4525q018k0101
5555d2643j9336Q400P673K5218k0276K0157J1670k3386q905K3932k152j978M7569
5542B5943l9976K505j492R785O67l6350j2947J4065K3021j4388P520n105K9068
5529B316q612J1629N474L090k8394o630K4316l9041j1546L2565J2672j6511l992
$$ plain form
5618 -17162 7407 20345 30198 -21780 -5615 24896 -13568 -17398 -21121 -37508 -22346 3361
5606 3361 16062 27660 33710 33973 28036 35319 48641 26923 2371 -37714 -34621 -14753 -51415
5593 -51415 -38482 14061 23339 26920 50682 56131 3850 8753 34291 33733 44240 9613 236
5580 236 29690 68692 47775 24446 19456 -2416 -20497 -17784 17496 11833 34601 23635 -9868
5567 -9868 -2373 11433 -1293 -12912 -23056 11741 -6392 -45839 1 -14524 -22542 -42643
5555 -42643 -61979 -53579 -45906 -20688 -40964 -20807 -9137 -32523 -41428 -17496 -19648 -21626 25943
5542 25943 -14033 -11528 -13020 -3235 -2568 -38918 -51865 -37800 -14779 -29167 -21647 -26752 2316
5529 2316 -6296 5333 10807 13897 -14497 -21127 3189 -35852 -47398 -14833 -2161 -18672 -22664
5516b2664N2895m7181m8502L8499j2987p58K4250n751R186j223m663n82k4608
5503d4089K8778J3673P789j2410O815k1463l0435J5580M0040J8014l764K0213
5491C8741k4858l5807L8734K5383j6314q313J4253M3940n584l0023J7194L4274
5479I1620j1555K3850K3270j0142J186P127m7830k1217j4144l5747j3150j3290
5467b0022n628l263L5486j7895J4354m4679J3303K7958j4514L2171q740j8606
5455a0075k0204l0662J0717J613o088n330R910R235J187p129k538J9665J5601
5442a4098R584o806j8664l2035N484j0202L7453L2100j4128K538p376k2426j204
5429c9780K8017m138K808j1462N475J2701q976o67k2414q02K6621L1381j1035
$$ plain form
5516 -22664 30231 -16950 -65452 -26953 -39940 -40698 -16448 -22199 -13013 -14236 -18899 -19481 -44089
5503 -44089 -15311 -1638 6151 -6259 556 -20907 -51342 -35762 4278 22292 18528 38741
5491 38741 13883 -21924 16810 42193 25879 17566 31819 75759 70175 40152 57346 91620
5479 91620 80065 103915 127185 117043 118229 125356 77526 56309 42165 6418 -6732 -20022
5467 -20022 -25650 -28913 6573 -11322 3032 -41647 -28344 -386 -14900 17271 8531 -10075
5455 -10075 -30279 -60941 -50224 -48611 -54699 -60029 -50119 -40884 -39697 -46826 -49364 -29699 -14098
5442 -14098 -4514 -11320 -29984 -62019 -56535 -66737 -29284 2816 -11312 -8774 -16150 -38576 -39780
5429 -39780 -11763 -15901 -13093 -24555 -19080 -6379 -15355 -16022 -38436 -39238 -12617 18764 7729
5416G729k5934k4600L762J2789J6723R539k5886J8463Q064k383j0802j2065J5017
5403i584M763R159k8637K2645n648M820P856j701k3339j9240L2632M9845r796
5390C3775J2234r999j9473m617k1837j364J472M109K7877m2538k8379J8532M4858
5377A4650L165l6975J7565j6164m777K4520J171j0795J1239j3114n452q476j1224
5364c4667J1778K8531k0496Q539k2371J6494J3937r731Q674q211l1901R199M2790
5351A2565K919J1251j4398J0071k2750j3351j352m590J721j1437K071K6808o586
5338g058k9183K1092n671J9091J1818K3476l5148N20q374J3997j3919k4653J11
5325c3901K5958k91j6893n882j5404J7696J0084j786r942J1775J0934L222k4051
$$ plain form
5416 7729 -18205 -42805 -39043 -26254 -9531 8 -25878 -7415 649 -1734 -12536 -24601 -9584
5403 -9584 -4821 4338 -24299 -1654 -7302 -2482 5374 3673 -19666 -38906 -6274 43571 33775
5390 33775 46009 36010 16537 11920 -9917 -11281 -9809 -5700 22177 -20361 -48740 -30208 14650
5377 14650 17815 -19160 -1595 -17759 -22536 1984 3155 -7640 3599 -9515 -14967 -23443 -34667
5364 -34667 -22889 5642 -14854 -6315 -28686 -12192 1745 -7986 688 -7523 -39424 -30225 12565
5351 12565 15484 26735 12337 22408 -342 -13693 -15045 -19635 -17914 -29351 -27280 -472 -7058
5338 -7058 -36241 -15149 -20820 -1729 10089 33565 -1583 -1063 -9437 4560 -9359 -34012 -33901
5325 -33901 -7943 -8234 -25127 -31009 -46413 -28717 -18633 -20419 -30361 -18586 -7652 -4430 -28481
5312b8481j3286L9782J3065l0183L674r494K662O022J6771J2164R738K5721R704
5299E7859l4935j2072l0546K3130K2522k3325p735l659J8427k4884o485K575K5508
5286F380Q685j8989k4275R762K5495p763P26n515k4329j782q221J1343j1668J3518
5272b6633J2656j7667j8350p395K8832j1428R218j0268j31K0024j3665Q092L9446
5259A2731l0030j2802Q012K597K147J503J6264J2252k7556j6523J5906l1384l095
5246d9978M0150p804K758r616p714l1695J3548J8493l320j8196K4522K745q1L4232
5232H044j9172j6919m087j8096M6686j3393M874J5712m1754J7749p830J2767K3181
5219G762j0577r664K0742n5470K1604j1287k8518K5772m997J8606K6932n299l660
$$ plain form
5312 -28481 -41767 -1985 11080 -19103 -15429 -24923 -22261 -16239 532 12696 22434 48155 57859
5299 57859 22924 10852 -19694 3436 25958 2633 -5102 -8761 9666 -15218 -21703 -19128 6380
5286 6380 15065 -3924 -28199 -18437 7058 -705 21 -5494 -29823 -31605 -39826 -28483 -40151 -26633
5272 -26633 -13977 -31644 -49994 -57389 -28557 -39985 -30767 -41035 -41166 -21142 -34807 -26715 12731
5259 12731 -17299 -30101 -22089 -19492 -17345 -15842 422 12674 -14882 -31405 -15499 -46883 -49978
5246 -49978 -9828 -17632 -14874 -24490 -32204 -63899 -50351 -31858 -35178 -53374 -28852 -26107 -26188 8044
5232 8044 -11128 -28047 -32134 -50230 -3544 -16937 -12063 3649 -38105 -20356 -28186 -15419 7762
5219 7762 -2815 -12479 8263 -47207 -25603 -36890 -65408 -39636 -44633 -26027 905 -4394 -8054
5206h054j566l7712N621J2072j9818K0723j1042O521o752J3541O039p1022L3036
5193e8413l246K2128M58m0874J2618K9791n843j279J5559k6369j2374J2933K1906
5180c3005K235R70j6153K80J5818m110J1201n221K8244k9500l6149M4127J6613
5167d650J4963M475k2531k5878j5828J0757L2949l9167j2250J6962M1067j4017
5155a3148m0568r772L4080l492N827K675K1783j7925j690p770q702r798M194O6379
5141B2073l0468l5691k1258L0089K8715n300R754j5500j9883N878J0994L2306
5129A1709r322k031K73K5285J4026J3256j0631j8730J7172M623j0640M0024j9260
5116E5754o026M688K2145l975R96N3836J1700M2695j2863K2331K5984L063j039
$$ plain form
5206 -8054 -9620 -47332 -41711 -29639 -49457 -28734 -39776 -33255 -40007 -26466 -20427 -91449 -58413
5193 -58413 -61659 -39531 -39073 -79947 -67329 -37538 -43381 -44660 -29101 -55470 -67844 -54911 -33005
5180 -33005 -30770 -29800 -45953 -45673 -29855 -33965 -22764 -27985 259 -29241 -65390 -21263 -4650
5167 -4650 10313 14788 -7743 -33621 -49449 -38692 -5743 -44910 -57160 -40198 869 -13148
5155 -13148 -53716 -63488 -29408 -32900 -27073 -24398 -2615 -20540 -22230 -30000 -38702 -48500 -44306 22073
5141 22073 -8395 -44086 -65344 -35255 -6540 -11840 -2086 -17586 -37469 -31591 -20597 11709
5129 11709 2387 356 629 25914 39940 53196 42565 23835 41007 45630 34990 75014 55754
5116 55754 49728 54416 76561 72586 73582 127418 139118 181813 168950 191281 217265 220328 219289
5103B19289K5923J8432l8164k246j2882l5534N26J8906j6039k7027j6235j9810
5091A15139P035j3648Q305m0176R146l253k7818j8832k9699N729R737k1597j5694
5078a5626J255L256O727K1738J2318m620l8536q026k8430m026L7935L863K3316
5065A1144k6417J049J2294r494r790j4259j289K5390J4708K5884J615R604j9430
5052B1009l2859l827K1751m0168K6309R377j7037l7179K2084K1400j6722o204
5040c2066L146K5171K3738N656l9252q14J7696k3566k2574L0069K2060j982Q921
5027A6203l4183j2462J060j4450K3534n826n3972L7067J3083p249j3986Q216K5656
5014a7309P23J7161j0814R403m0338J7625K370J7082p483l656m005j3238K3807
$$ plain form
5103 219289 245212 263644 225480 223234 210352 174818 175344 194250 178211 151184 134949 115139
5091 115139 122174 108526 116831 76655 85801 82548 54730 35898 6199 11928 21665 68 -15626
5078 -15626 -14371 -11115 -4388 17350 29668 25048 -13488 -21514 -49944 -53970 -16035 -12172 11144
5065 11144 -15273 -14224 -1930 -11424 -21214 -35473 -36762 -11372 3336 29220 30835 40439 21009
5052 21009 -11850 -15677 6074 -34094 -7785 1592 -15445 -52624 -30540 -9140 -25862 -32066
5040 -32066 -28920 -3749 19989 25645 -13607 -14421 3275 -20291 -42865 -12796 9264 7282 16203
5027 16203 -17980 -30442 -29382 -43832 -20298 -26124 -80096 -43029 -29946 -37195 -51181 -42965 -17309
5014 -17309 -16586 575 -10239 -836 -41174 -23549 -21179 -4097 -11580 -15236 -19241 -32479 -8672
5001h672r006K5994J8927J1141L9793L1683O7721M6389R802N123J0912K6877j6446
4988B60238o9518k8196l9260j4157m8740l3172M398J7213k478P561l9561M414
4976A8742P595M98k9195j6987k328m723K7696j0473J0635q434l4115M649M3008
4963F568J4687j7275j217j7478l1356J1440k7476l920O527L2510J5931K0851j0555
4950g63L444m010J5094M329J0079k8270R509M5680J3448k4764j8168o096j6893
4937B619j0331J2445J0017k5059J6095K0200j6702j6637j9734j0821J8354J6195
4925c359J3508l7585l491P402J5071M740K2131k0716k1024J6724J619J1996j6680
4912i664O807k5389j020R684j7020j6389J4439K5551R405L8525K4166P310j0840
$$ plain form
5001 -8672 -17678 8316 27243 38384 78177 109860 177581 223970 233772 238895 249807 276684 260238
4988 260238 190720 162524 123264 109107 60367 27195 31593 48806 46328 53889 14328 18742
4976 18742 26337 26835 -2360 -19347 -21675 -26398 1298 -9175 1460 -6974 -41089 -36440 6568
4963 6568 21255 3980 2763 -14715 -46071 -34631 -62107 -66027 -59500 -26990 -11059 9792 -763
4950 -763 2681 -1329 13765 18094 28173 -97 9412 55092 68540 43776 25608 19512 2619
4937 2619 -7712 4733 14750 -10309 5786 25986 9284 -7353 -27087 -37908 -19554 -3359
4925 -3359 10149 -27436 -30927 -23525 -8454 -3714 18417 -2299 -23323 -6599 -4980 7016 -9664
4912 -9664 -2857 -28246 -29266 -19582 -36602 -52991 -38552 -13001 -3596 34929 59095 66405 55565
4899E5565m2626l7385N562J1902N8187j5607l1254l334J0566R412j0727P748j4788
4886C221N2663l511l3823Q672j2908m653o453k731p584J4740k77J9631L8110j6257
4872D8840j4690j8682q533J0155j3340L9227K5937j5430k3181J2572L9816J8739
4860A01430j0649o37M5946L3575L2046K0347M6544J6774K4885L3319k7603l576
4848C12401m5040J2095k4268k3917q922k15L7383o5564p557L5987P329R202J953
4835B40867K1744M2215n656M357k783L5714M1760M6699P2089N1839M0530P8049
4823F67424Q3102R2284J38361K80013L07320N39520Q99738J127289R65080N32527
4813E632658L82456K14335j61528n50248q02343q15093o90238n79893m49565l37470
$$ plain form
4899 55565 12939 -24446 -18884 -6982 51205 35598 4344 1010 11576 20988 10261 18009 3221
4886 3221 55884 52373 18550 27222 14314 9661 3208 477 -7107 7633 7356 26987 65097 48840
4872 48840 34150 15468 6935 17090 3750 42977 68914 53484 30303 42875 82691 101430
4860 101430 90781 90144 136090 169665 201711 222058 268602 285376 310261 343580 315977 312401
4848 312401 267361 279456 255188 231271 222349 222134 259517 193953 186396 222383 229712 238914 240867
4835 240867 262611 304826 299170 303527 300744 336458 378218 424917 497006 548845 589375 667424
4823 667424 750526 842810 981171 1261184 1568504 2108024 3007762 4135051 5100131 5632658
4813 5632658 6015114 6229449 6067921 5517673 4715330 3900237 3209999 2630106 2180541 1843071
4803A843071k63665j61872r3577r1064l3014j5242n1048m4691l3904o6698r2690
4792H95606j14873p6861n0472o4811q4771n9296k6341j8596Q61j3814o0553J890
4780C27969M12m420q371n800l8634p257J8823k7185l1004J9588j9886M445j3133
4767B15547p346r337j2592P826o095Q433K3000J1766l5226o721L5488L7640J1701
4754B74084L4093n455L5869L7896K0343J6476L8297L0584J4049O12j3939J388
4742D84297j2156j9436j4042l5926k4746j689N822m7550R496n270j3382J0876
4730C36294L0473M3038J3011M6162J6349J2838k2757K1838P238k5385j9168n3608
4718D06323m4406k3791l7430j2941l477l0756o264l6866m199J2885l8207L317
$$ plain form
4803 1843071 1579406 1417534 1323957 1232893 1199879 1184637 1133589 1088898 1054994 988296 895606
4792 895606 780733 703872 653400 588589 503818 444522 418181 399585 400446 386632 326079 327969
4780 327969 328381 323961 315590 309790 271156 263899 282722 255537 224533 244121 224235 228680 215547
4767 215547 208201 198864 186272 194098 188003 196436 219436 231202 195976 189255 224743 262383 274084
4754 274084 308177 302722 338591 376487 396830 413306 451603 482187 496236 496848 482909 484297
4742 484297 472141 452705 438663 402737 377991 376302 382124 334574 344070 338800 325418 336294
4730 336294 366767 409805 422816 468978 485327 498165 475408 497246 504484 479099 459931 406323
4718 406323 361917 338126 300696 287755 284278 253522 247258 210392 206193 219078 180871 184188
4706A84188j2596j4450p972K9696M32l7587K1962j2940k3332N4198j6364r912
4694A55323L101j4209l583L154L5166l8736J556j776K7391L0726L230N007k7866
4681A78484R760J1361l2007o374K1749J5291k2049j2704J4696k2969P080R312
4669A71630M586q382r006O0211k011K113K869p541Q676j6342j1614k1256M40J5567
4655A89940o426j4978m294N193K3205K9326j2640L2622K3024l9049J2805K0491
4643B59219j5426J71o485J8532J6073j903J9040L5872K6370M3614O3792M7445
4631E06314N7531Q1401J75977J60935J96241K05098J09308N8656N7694k9185j09724
4620A470246j18752j20687j20580p0866n9007K314M3448N5267Q0405J24253J43699
$$ plain form
4706 184188 171592 157142 149170 178866 179298 141711 163673 150733 127401 181599 165235 155323
4694 155323 158424 144215 140632 143786 178952 140216 141772 139996 167387 198113 201343 206350 178484
4681 178484 188244 199605 167598 161224 182973 198264 176215 163511 178207 155238 162318 171630
4669 171630 176216 167834 158828 219039 217028 219141 222010 214469 223145 206803 195189 173933 174373 189940
4655 189940 183514 168536 164242 169435 192640 221966 209326 241948 264972 225923 238728 259219
4643 259219 243793 243964 237479 256011 272084 270181 289221 325093 351463 395077 458869 506314
4631 506314 563845 645246 821223 982158 1178399 1383497 1492805 1551461 1609155 1579970 1470246
4620 1470246 1351494 1230807 1110227 1039361 980354 982668 1026116 1081383 1161788 1286041 1429740
4609A429740Q7255J48397J21506J37285J30616J15189J76658K18498K14479J78822
4599B958445J62851J83926J58827J17988J15393J19535J52874J12018O8115P4857
4589D224829j876p8273p0464o9200o7128o1918r1270j12354j00822j35224k05434
4578C230866j60917j91104j90010j43019j54284j62797j62313j25378j72822j47548
4568A620674j34539j10290j28817p2003l6759m8353k8963p2857m701r773J4093
4557I87712K3267k3881P58M3124L7927N7533L6232K9612L2262K9821J7077Q544
4545A279988J0982j5240n389J5269k832m3970n7971n1738M1238J6203j764J1904
4533A196680o734J4309O9793O6084P8775N4835R1556J44738J02361J27746Q0905
$$ plain form
4609 1429740 1516995 1665392 1786898 1924183 2054799 2169988 2346646 2565144 2779623 2958445
4599 2958445 3121296 3305222 3464049 3582037 3697430 3816965 3969839 4081857 4149972 4224829
4589 4224829 4222953 4144680 4074216 4005016 3937888 3875970 3784700 3672346 3571524 3436300 3230866
4578 3230866 3069949 2878845 2688835 2545816 2391532 2228735 2066422 1941044 1768222 1620674
4568 1620674 1486135 1375845 1247028 1175025 1138266 1089913 1060950 988093 983392 973619 987712
4557 987712 1010979 987098 987856 1030980 1068907 1126440 1162672 1192284 1224546 1254367 1271444 1279988
4545 1279988 1290970 1275730 1270341 1285610 1282778 1238808 1180837 1129099 1170337 1186540 1184776 1196680
4533 1196680 1189946 1204255 1274048 1340132 1418907 1473742 1565298 1710036 1812397 1940143 2021048
4522B021048L848p508j5960k5348n4928j00041r2455j16623o7873j7570r8321
4511A428269p4993n9962n6388l1897j901k5434l794k8975M693k3750o381K1256
4499A140743k4498n497M802l0202m1277j844n2215n6202p0271o6610q5695o6628
4487F44606k0632l1016o8548J3505j0078n2404k6097j3014j4848Q118k0704l1056
4475C77832J927j8445l8775q448k385P426P265J6242k3025m1151J4895Q152p704
4462B93806k3645J0225K8773j4299J2144J2294k934l9782P249N5887k2093m4158
4450B73467N644L2724p082l1769J5779L398r433j9723j0646l610J9543J4417l4472
4437B48237J2098Q949N301j0425o92K6171J283k2966k001J8639l4443p447K6975
$$ plain form
4522 2021048 2024896 2017388 2001428 1976080 1921152 1821111 1728656 1612033 1544160 1526590 1428269
4511 1428269 1353276 1293314 1236926 1205029 1203128 1177694 1173900 1144925 1149618 1125868 1119487 1140743
4499 1140743 1116245 1110748 1115550 1085348 1044071 1042227 990012 933810 863539 796929 711234 644606
4487 644606 623974 592958 524410 537915 527837 475433 449336 436322 421474 429592 408888 377832
4475 377832 379759 361314 322539 314091 311706 319132 326397 342639 319614 278463 293358 301510 293806
4462 293806 270161 280386 309159 294860 307004 319298 316364 276582 283831 339718 317625 273467
4450 273467 279111 311835 304753 272984 288763 292161 282728 263005 252359 248749 268292 282709 248237
4437 248237 260335 269284 274585 264160 263468 289639 290922 267956 265955 284594 250151 242704 269679
4424B69679L6536j8129j2997P652l6810P328M4788K7346l205M3649j0015k9478
4412C26344J0120L0952M0627k5342p79L4084o45j4671N7113p333p243J959l3502
4399D11684L7591K4248n007K0068K1318J5712j1064q727L3641r12K1939k4957
4387E35534K3139K0408Q785K1210K725J7726L0633P519j8316K9173L2560J0482
4375G21578j3789j0899P1242K8383J5067M163L7637L111M6983L9078M05J4875
4363I57834K2991K3315O4374K9264j9224Q611O3331L1566k6960N7578M8075P8912
4351A339667k0136L2642P1866L2929K8700K5371L3631L3098O4764J3704j4509
4340A641727P131J4414J4503O1749L2161j7700j248K5199J8612M068L1451M0476
$$ plain form
4424 269679 306215 288086 275089 282741 245931 253259 298047 325393 322188 365837 355822 326344
4412 326344 336464 367416 408043 382701 381922 416006 415361 400690 457803 450470 443227 445186 411684
4399 411684 449275 473523 468516 488584 509902 525614 514550 505823 539464 538552 560491 535534
4387 535534 558673 579081 587866 609076 611801 629527 660160 667679 649363 678536 711096 721578
4375 721578 707789 696890 768132 796515 811582 815745 853382 856493 903476 942554 942959 957834
4363 957834 980825 1004140 1068514 1097778 1078554 1087165 1150496 1182062 1155102 1212680 1260755 1339667
4351 1339667 1319531 1352173 1424039 1456968 1485668 1511039 1544670 1577768 1642532 1656236 1641727
4340 1641727 1648858 1663272 1677775 1739524 1771685 1753985 1752737 1777936 1796548 1800616 1832067 1872543
4328A872543J4504N6199Q7106P1188P9646M3352P0101J03411K7222Q2281J28516
4317B636069J38877J86229J62323J36380J53839J96542K45808K73414K14067K28468
4307D572016K34727K66188K68183K79846L09935L46233M44341N03475N58366O38422
4297H421732O87070O73658O29563N93789N50778N19433M13094M19601M58000N45674
4287A3912392O97924Q54456J040992J198746J321750J341360J257427J005107
4279B2630154Q07799O11278K97058J52263M6106O3811K12353M31208P24069R89838
4269B6965937J196899J257368J181378R50317N84897J95520k38250n70170q06439
4260C0717457q55229q08367o31809m07876j41747J26871K04152K51269R0607j44141
$$ plain form
4328 1872543 1887047 1943246 2030352 2101540 2181186 2224538 2294639 2398050 2425272 2507553 2636069
4317 2636069 2774946 2961175 3123498 3259878 3413717 3610259 3856067 4129481 4343548 4572016
4307 4572016 4806743 5072931 5341114 5620960 5930895 6277128 6721469 7224944 7783310 8421732
4297 8421732 9108802 9782460 10412023 11005812 11556590 12076023 12489117 12908718 13366718 13912392
4287 13912392 14610316 15464772 16505764 17704510 19026260 20367620 21625047 22630154
4279 22630154 23437953 24049231 24346289 24498552 24544658 24608469 24820822 25252030 25976099 26965937
4269 26965937 28162836 29420204 30601582 31551899 32136796 32332316 32094066 31523896 30717457
4260 30717457 29862228 29053861 28422052 28014176 27872429 27999300 28203452 28454721 28545328 28401187
4250B8401187m27304p75942j032143j267302j300569j336137j262685j033690
4242A9965415r38036p45872n85226n20730m94348m80834n85327o71030p32405
4233A4211607q42781q33776q59839q49784p20724o41424n84158m95446m54308
4224G929367l97768l58502l65408l35559l25858l15493l17783k92946l17097k91131
4214D611822j96260k13992j98120k06519j88029j59115j05408j29689j91291j08584
4204B914815p6766r1803j10685p3569j1798p6366j07226l5598o6493o3811n1366
4193B149334o6768o1800k3011q6609l4031k2576m8321p1040n9690m7112o8194
4182A560182n0650o415m0761l4105l9227l2922k1692m7232l5792J5220j8446n4556
$$ plain form
4250 28401187 27973883 27197941 26165798 24898496 23597927 22261790 20999105 19965415
4242 19965415 19027379 18281507 17696281 17175551 16681203 16200369 15615042 14944012 14211607
4233 14211607 13368826 12535050 11675211 10825427 10104703 9463279 8879121 8383675 7929367
4224 7929367 7531599 7173097 6807689 6472130 6146272 5830779 5512996 5220050 4902953 4611822
4214 4611822 4415562 4201570 4003450 3796931 3608902 3449787 3344379 3214690 3023399 2914815
4204 2914815 2838049 2746246 2635561 2561992 2550194 2473828 2366602 2331004 2264511 2200700 2149334
4193 2149334 2082566 2020766 1997755 1911146 1877115 1854539 1806218 1735178 1675488 1628376 1560182
4182 1560182 1509532 1503117 1462356 1428251 1389024 1356102 1334410 1287178 1251386 1266606 1248160 1193604
4170A193604j780j0628p708l4343K019L4731j7638l3262J3323k2260P398Q77K3237
4157A147570K2051n035P900L285o399l8901J7307j4681M5772k2326R99R064l6162
4144A130444p585k4970j5582K0435k7127J2118J480j1105P608j3658k980j3254
4132A055824r302n2779j6859k5063M907l7765k4334Q38j8734j3801j9279l8431
4120H05222j2194K547L5199j1247J510K4119O9064O2668L9070L2602L0591O1955
4108A141106O8802Q9804N5109Q5986R1395N8622R2818M4560J09350R1106O0165
4097A988823J4078K3882K0605j1673J1840j1427k0284o8094n8282o0432n3501
4086A775535q5135m0151P265m5985n5740m6497l4464k6649J5003k0610l2683J660
$$ plain form
4170 1193604 1191824 1181196 1173488 1139145 1141164 1175895 1158257 1124995 1138318 1116058 1123456 1124333 1147570
4157 1147570 1169621 1164586 1172486 1175771 1169372 1130471 1147778 1133097 1178869 1156543 1157542 1166606 1130444
4144 1130444 1122859 1097889 1082307 1102742 1075615 1087733 1089213 1078108 1085716 1072058 1069078 1055824
4132 1055824 1046522 993743 976884 951821 956728 918963 894629 895467 876733 862932 843653 805222
4120 805222 793028 795575 830774 819527 821037 845156 914220 976888 1015958 1048560 1079151 1141106
4108 1141106 1209908 1299712 1354821 1440807 1532202 1590824 1683642 1728202 1837552 1928658 1988823
4097 1988823 2002901 2026783 2047388 2035715 2047555 2036128 2015844 1947750 1889468 1829036 1775535
4086 1775535 1690400 1650249 1657514 1611529 1555789 1509292 1474828 1448179 1463182 1442572 1409889 1411549
4074A411549l286k7176M5032n418j548n224m0746K625J2735K3632J0937J9147
4062A442259K7359M5453J064O840K9276J3524K8820l27J9132L0693N6372M7772
4050A748237L3045N5704J8682N6131J19392J21343R3898J45518J00894O1384J04124
4039B658352R2538J1980j4406m3301k0057L453J5189L4847M1661M6931N0069L249
4027B880505L6210M6425J9954N0821N2617K8443N2876P7696O6608N4203P3102
4016C439460O4812Q5751Q2804R8153J09108Q5349J09213J57172J55216J58855
4006D545893K12880J85167K14071K04208K55067K63269K97119L37069L70910M51359
3996G337012M40087N26614O02894P09378P77284R39423J111998J294791J489354
$$ plain form
4074 1411549 1408263 1381087 1426119 1420701 1419153 1413929 1373183 1375808 1388543 1412175 1423112 1442259
4062 1442259 1469618 1515071 1516135 1522975 1552251 1565775 1594595 1594268 1613400 1644093 1700465 1748237
4050 1748237 1781282 1836986 1855668 1911799 2031191 2152534 2246432 2391950 2492844 2554228 2658352
4039 2658352 2750890 2762870 2748464 2705163 2685106 2688559 2703748 2738595 2780256 2827187 2877256 2880505
4027 2880505 2916715 2963140 2983094 3033915 3086532 3114975 3167851 3245547 3312155 3366358 3439460
4016 3439460 3504272 3590023 3672827 3770980 3880088 3965437 4074650 4231822 4387038 4545893
4006 4545893 4758773 4943940 5158011 5362219 5617286 5880555 6177674 6514743 6885653 7337012
3996 7337012 7777099 8303713 8906607 9615985 10393269 11332692 12444690 13739481 15228835
3987A5228835J733234K063896K418946K883592L343312L870492M395718M962156
3979D0900181N438109N706677N842009N740517N420302M803872L993911L124643
3971H0970221K127077J197309L97806j63451m40494n44531m52674j99858P1810
3962H2963215K36917L38695J55335k44836p64385j498110k323973l094378l835513
3953G1932967m447844m845792n088466n066002m905580m545704m157717l692510
3945C5183352l168228k738059k397286k148773j833450j639062j489386j339822
3937A8429286j150834j041585r42997p92904o37651n83750m75575l72132l62449
3928A2069409l38340k90573k37939k30343k10475j71217j42559j58603r0146j15012
$$ plain form
3987 15228835 16962069 19025965 21444911 24328503 27671815 31542307 35938025 40900181
3979 40900181 46338290 52044967 57886976 63627493 69047795 73851667 77845578 80970221
3971 80970221 83097298 84294607 84692413 84528962 84088468 83543937 83091263 82891405 82963215
3962 82963215 83200132 83538827 83694162 83449326 82684941 81186831 78862858 75768480 71932967
3953 71932967 67485123 62639331 57550865 52484863 47579283 43033579 38875862 35183352
3945 35183352 32015124 29277065 26879779 24731006 22897556 21258494 19769108 18429286
3937 18429286 17278452 16236867 15293870 14500966 13863315 13279565 12803990 12431858 12069409
3928 12069409 11731069 11440496 11202557 10972214 10761739 10590522 10447963 10289360 10199214 10084202
3918A0084202p7150n4527q3454j0745J8826K7481j2967q4974j18919q3153j68333
3907I436287k04067k15181k22520j98874j95582j18636q6837n8819j12803o3925
3897G959043n1697p2043l1386N715j7202M853N1475N6174K3334N4885J12303P9079
3885H174533R4599J15747J42803J46076J88455K04058J95495J91624K39664L40205
3875A0033259L06350L71407M32687M70311M34804N05777M60699M13490L82738
3866A3811522K77902J92408J47978L6667p0753j24043j49301k11034k25904k54314
3856A3431128k67602k13264k23455j45238j62321j21564p5227p1976q5481J0386
3846A2075386M1382R7846J67823K13327K31380L17238L93550M74499M98235N81884
$$ plain form
3918 10084202 10007052 9952525 9869071 9858326 9877152 9904633 9891666 9806692 9687773 9604620 9436287
3907 9436287 9232220 9017039 8794519 8595645 8400063 8281427 8194590 8135771 8022968 7959043
3897 7959043 7907346 7835303 7803917 7809632 7792430 7797283 7848758 7904932 7928266 7983151 8095454 8174533
3885 8174533 8269132 8384879 8527682 8673758 8862213 9066271 9261766 9453390 9693054 10033259
3875 10033259 10339609 10711016 11143703 11614014 12048818 12554595 13015294 13428784 13811522
3866 13811522 14089424 14281832 14429810 14466477 14395724 14271681 14122380 13911346 13685442 13431128
3856 13431128 13163526 12950262 12726807 12581569 12419248 12297684 12222457 12150481 12065000 12075386
3846 12075386 12116768 12214614 12382437 12595764 12827144 13144382 13537932 14012431 14510666 15092550
3836A5092550O95415P19938Q65278R99399J152031J269337J443317J719887J991026
3827B5948178K307747K749773L230970L836590M526432N424396O342158P398134
3819F1764378Q567979R923936J1338120J2746353J4195877J5526242J6630485
3812A50693370J7207759J7211293J6424573J4760306J2278208R057488N240204
3805B42873201J110748l144147p086145j0564860j3306446j5252572j6322416
3798A78307363j6644700j6273391j5339579j4086928j2673457j1176177r794305
3791H2318826q543346p426167o436384n590822m912294m273953l716775l188514
3783C8230571k864148k508376k140098j920980j647354j383738j222111j101860
$$ plain form
3836 15092550 15787965 16507903 17373181 18372580 19524611 20793948 22237265 23957152 25948178
3827 25948178 28255925 31005698 34236668 38073258 42599690 48024086 54366244 61764378
3819 61764378 70332357 80256293 91594413 104340766 118536643 134062885 150693370
3812 150693370 167901129 185112422 201536995 216297301 228575509 237632997 242873201
3805 242873201 243983949 240839802 233753657 223188797 209882351 194629779 178307363
3798 178307363 161662663 145389272 130049693 115962765 103289308 92113131 82318826
3791 82318826 73775480 66349313 59912929 54322107 49409813 45135860 41419085 38230571
3783 38230571 35366423 32858047 30717949 28796969 27149615 25765877 24543766 23441906
3775B3441906r61554q34693p18415o38793o14570n26439m56035m32777l69388
3766A7889242l03222k63754k18112j71037q5725m0594n559L0287J01542J14004
3756A7047072R4317J62655J01086P6861m4784r7797k08411l05572l93178m60750
3746A5971499n18774o26014o21268n80418o45909o14640n43153n19487m73070
3737A0828766m29249l75483l45920l26344k92950k64405k99227k38875j90730
3728H065583j72125j89100j39878j26501j23249p9779j01494m6117o4193l8602
3718F984545j0087l9001J3562o1928k7563K9452j0390j8200n767R054O3562L5498
3706F962737k5424M4542O9166N1643Q0887J1925L8064P2740L720k0241M2538p898
$$ plain form
3775 23441906 22480352 21645659 20927244 20288451 19673881 19147442 18691407 18258630 17889242
3766 17889242 17586020 17322266 17104154 16933117 16847392 16806798 16801239 16831526 16933068 17047072
3756 17047072 17141389 17304044 17405130 17481991 17437207 17339410 17130999 16825427 16432249 15971499
3746 15971499 15452725 14826711 14205443 13625025 12979116 12364476 11821323 11301836 10828766
3737 10828766 10399517 10024034 9678114 9351770 9058820 8794415 8495188 8256313 8065583
3728 8065583 7893458 7704358 7564480 7437979 7314730 7234951 7133457 7087340 7023147 6984545
3718 6984545 6974458 6935457 6949019 6887091 6859528 6888980 6878590 6860390 6854623 6863677 6927239 6962737
3706 6962737 6937313 6981855 7051021 7102664 7183551 7195476 7233540 7306280 7310000 7289759 7332297 7324399
3694G324399M5998P3687J0553N6550M9956M4268J37497J23435J26378J65576J75649
3683H333946K01048J39763J79120K02365J38675R5640J07257N8666O771j1192
3673I452059m6762n7631p3296r9299j47220j28433j23815r2189l7417n0994l7854
3662H557149k0716m4698o958j2180k4270n7049o1842q7581q6190j46717j37798
3651G871150j44014j71060j49798j79359j75689j79000j55990j52874j50623j13492
3641F299251o8513m2208k1048j7628J6225K0012N0602K5223O1258J14384Q4537
3630F522095J28092J67404J66662J54976K58977L02462L20626L59113M36244N13787
3620I330438O02521O95482Q10590R50508J069148J131021J180257J195868J182527
$$ plain form
3694 7324399 7370397 7444084 7454637 7511187 7561143 7605411 7742908 7866343 7992721 8158297 8333946
3683 8333946 8534994 8674757 8853877 9056242 9194917 9290557 9397814 9456480 9463251 9452059
3673 9452059 9405297 9347666 9274370 9175071 9027851 8899418 8775603 8683414 8645997 8595003 8557149
3662 8557149 8536433 8491735 8484777 8472597 8448327 8391278 8329436 8241855 8155665 8008948 7871150
3651 7871150 7727136 7556076 7406278 7226919 7051230 6872230 6716240 6563366 6412743 6299251
3641 6299251 6230738 6188530 6167482 6149854 6166079 6186091 6236693 6261916 6323174 6437558 6522095
3630 6522095 6650187 6817591 6984253 7139229 7398206 7700668 8021294 8380407 8816651 9330438
3620 9330438 9932959 10628441 11439031 12389539 13458687 14589708 15769965 16965833 18148360
3611A8148360J141680J037747J050837R08432Q14269P21309O40535N15771M43760
3602B5422700L43342K15448J34969N2108o0567j21714j77057k23724k80508l50511
3592B4954486l98229m71254n64094o43969p49975q50650r13901r80818q79248
3583A8502348q51682p95458o53648n44743m26833l01835j40674m4552N1929J89037
3573A4983889L02781L70864N38470O65003Q13566R39350J178098J492764J683840
3564B2968625K071298K431446K714722L041352L294886L475511L573097L575027
3556D7145964L449760L338591L198866K991519K735079K580636K346627K012907
3548F9799949J751923J514454J164144P42413M86699J55598j13484l84581n60903
$$ plain form
3611 18148360 19290040 20327787 21378624 22287056 23101325 23822634 24463169 24978940 25422700
3602 25422700 25766042 25981490 26116459 26168567 26108000 25986286 25809229 25585505 25304997 24954486
3592 24954486 24556257 24085003 23520909 22876940 22126965 21276315 20362414 19381596 18502348
3583 18502348 17650666 16855208 16201560 15656817 15229984 14928149 14787475 14742923 14794852 14983889
3573 14983889 15286670 15657534 16196004 16861007 17674573 18613923 19792021 21284785 22968625
3564 22968625 25039923 27471369 30186091 33227443 36522329 39997840 43570937 47145964
3556 47145964 50595724 53934315 57133181 60124700 62859779 65440415 67787042 69799949
3548 69799949 71551872 73066326 74230470 74972883 75459582 75615180 75501696 75117115 74556212
3539G4556212p25577r01889j020837j287418j559521j868091k166582k474920
3531F2551377k736279k922347l054299l045660k900028k741160k466348k165124
3523D0520132j719734j350590j046206o70264k94015L1075M34643P98491J105608
3514C7809140J520787J809588K151488K488643K737993K897983L000850L038999
3506E7455471K976905K836902K624675K312627J959648J614510J334318J023167
3498G4138223P41139M94628L62662K21776O8560m8673j63982l74214o47982r27909
3488G3864228j295770j735094k120529k459313k804207l065052l210840l368283
3480E3805140l350226l266137l045050k835862k609373k332056j952272j638100
$$ plain form
3539 74556212 73830635 72928746 71907909 70620491 69060970 67192879 65026297 62551377
3531 62551377 59815098 56892751 53838452 50792792 47892764 45151604 42685256 40520132
3523 40520132 38800398 37449808 36403602 35733338 35439323 35470398 35905041 36703532 37809140
3514 37809140 39329927 41139515 43291003 45779646 48517639 51415622 54416472 57455471
3506 57455471 60432376 63269278 65893953 68206580 70166228 71780738 73115056 74138223
3498 74138223 74879362 75373990 75736652 75958428 76026988 75978315 75814333 75440119 74792137 73864228
3488 73864228 72568458 70833364 68712835 66253522 63449315 60384263 57173423 53805140
3480 53805140 50454914 47188777 44143727 41307865 38698492 36366436 34414164 32776064
3472C2776064j393473j125450q25256n50982l00659j57830P170J63923K33063
3463B8826570K46023K16925K45646J88630J89719J86383J71566K43696L28332
3454C0843490M00549N07711O02113O18772P11780O88036O26721N73955M41456
3445C6014583L78575L00196K32553J88310J29531R1685J04208K5660N9570k0804
3435C7504067p5210j99429l84492m94785o24674q03246r15013j016233j122588
3426C1868397j261611j314118j377209j372878j387109j401519j325471j285022
3418B1143460j197095j100371r47378q14717p43802o82399n91639m93621m02398
3409A4170040l48643k56594j66456j15541m9346m8526K3814P8279P7815J14777
$$ plain form
3472 32776064 31382591 30257141 29431885 28880903 28580244 28422414 28429584 28593507 28826570
3463 28826570 29072593 29289518 29535164 29723794 29913513 30099896 30271462 30515158 30843490
3454 30843490 31244039 31751750 32353863 32972635 33684415 34372451 34999172 35573127 36014583
3445 36014583 36393158 36693354 36925907 37114217 37243748 37335433 37439641 37465301 37524871 37504067
3435 37504067 37428857 37229428 36844936 36350151 35725477 34922231 34007218 32990985 31868397
3426 31868397 30606786 29292668 27915459 26542581 25155472 23753953 22428482 21143460
3418 21143460 19946365 18845994 17898616 17083899 16340097 15657698 15066059 14572438 14170040
3409 14170040 13821397 13564803 13398347 13282806 13233460 13184934 13208748 13287027 13364842 13479619
3399A3479619J03095Q7118J24080J64922J93988J98000K59406L49867M44027N68803
3389A5972925P35309Q86773J079266J319491J606693J915158K299164K693419
3381B8508198K947466L170565L235863L180757L005564K862321K743882K649323
3373E2303939K579913K585913K473166K247492J916662J479383J105681P17885
3365F7410034M64772K85414L25648M14490N92806P89683R89738J124224J131470
3356G3528279J059138Q69984N27022O619n53308j168257j873210k493502l039856
3347F6862909l502750l874689m087395m161832m183153l980206l821306l517040
3339C5734538l201540k870691k605361k248142j974102j682182j467645j284074
$$ plain form
3399 13479619 13582714 13669832 13793912 13958834 14152822 14350822 14610228 14960095 15404122 15972925
3389 15972925 16708234 17595007 18674273 19993764 21600457 23515615 25814779 28508198
3381 28508198 31455664 34626229 37862092 41042849 44048413 46910734 49654616 52303939
3373 52303939 54883852 57469765 59942931 62190423 64107085 65586468 66692149 67410034
3365 67410034 67874806 68160220 68485868 68900358 69493164 70282847 71272585 72396809 73528279
3356 73528279 74587417 75457401 75984423 75991042 75437734 74269477 72396267 69902765 66862909
3347 66862909 63360159 59485470 55398075 51236243 47053090 43072884 39251578 35734538
3339 35734538 32532998 29662307 27056946 24808804 22834702 21152520 19684875 18400801
3331A8400801j148384j032931q48058q41632p46714o41869n92560n25430m09602
3322A1613621m15971l79196l28780l22065l05469k42718j97841k16606k18896
3313H986079j40594p2439n0163r430M6258O8227J16372J67024K79267L34740L98131
3302A0123472M17816M06969M60333M09962L89272K86213J94850J29950k4362j83298
3292A2611177k92315l55837m43197n27554o02393n77467n76211n59637n25636
3283H150930m57356m46923l99023l19394k39354j97673k48153j70630j57403j30182
3273E384839j18213r8571q7820r8702r0391j09101j11626o6791l3831j9993j5367
3262D534433l7067m5680n5691p2883o0750m7955o5565q7743m9331l8357n8669
$$ plain form
3331 18400801 17252417 16219486 15371428 14529796 13783082 13141213 12548653 12023223 11613621
3322 11613621 11197650 10818454 10489674 10167609 9862140 9619422 9421581 9204975 8986079
3313 8986079 8845485 8773046 8722883 8713453 8759711 8827938 8944310 9111334 9390601 9725341 10123472
3302 10123472 10541288 10948257 11408590 11818552 12207824 12494037 12688887 12818837 12794475 12611177
3292 12611177 12318862 11963025 11519828 10992274 10389881 9812414 9236203 8676566 8150930
3283 8150930 7693574 7246651 6847628 6528234 6288880 6091207 5843054 5672424 5515021 5384839
3273 5384839 5266626 5168055 5080235 4981533 4891142 4782041 4670415 4603624 4569793 4549800 4534433
3262 4534433 4497366 4451686 4395995 4323112 4262362 4214407 4148842 4061099 4011768 3973411 3914742
3251C914742p7811r4419l3300m7330r1253p4629o7923l0156l0489l0196m3882
3240C293354J538k8736R708m3353m1825J7265o753k7182K2383K6597j6658M9286
3228C255624L261M3151L0967N3464O1796M2211J8499K6141M7209K5223o041J5039
3216C616544K6526K9027L0538M6059N5562K1912N7796N4461R527j6254j1981Q387
3204C928104L5863L7585N3226K6804P2115O9892N8625Q0076L1771L8813j521j2578
3192D418775k6007J572j7927J4577N8491N6129J05159J16023J96655J87315K13189
3181E323951K34995K28705K10349K65858K96263K89096L12871K68258L40901L38644
3171H109891L17441K92648K88046K35831J80620J81908J92820K09746K41190L33961
$$ plain form
3251 3914742 3836931 3742512 3709212 3661882 3570629 3496000 3428077 3397921 3367432 3337236 3293354
3240 3293354 3294892 3266156 3275864 3232511 3190686 3207951 3201198 3174016 3196399 3222996 3206338 3255624
3228 3255624 3258885 3302036 3333003 3386467 3448263 3490474 3508973 3535114 3582323 3607546 3601505 3616544
3216 3616544 3643070 3672097 3702635 3748694 3804256 3826168 3883964 3938425 3947952 3931698 3919717 3928104
3204 3928104 3963967 4001552 4054778 4081582 4153697 4223589 4282214 4362290 4394061 4432874 4431353 4418775
3192 4418775 4392768 4394340 4376413 4390990 4449481 4505610 4610769 4726792 4923447 5110762 5323951
3181 5323951 5558946 5787651 5998000 6263858 6560121 6849217 7162088 7430346 7771247 8109891
3171 8109891 8427332 8719980 9008026 9243857 9424477 9606385 9799205 10008951 10250141 10584102
3161A0584102M45410N02258O42404P62261Q19290R33571J039057J051018R89918
3152A7769289R11228P92236O27538M57911L28041J75290J17048R5250J18455K08833
3142B1601119K51539L12588M65866N89552Q04773J067108J288950J577871J860826
3133B9820192K082691K176996K068803J789422J489178J097985P53718M71619
3125D1750604L29078L14452M07047P20445J160492J611018K029127K424200K687123
3116E3433586L071415L609319M289670N071740N923387P073586Q456892J0118034
3108A01047629J2317516J5382600J9626307K5624726L3487672M2574015N1012775
3101C01073240N5047882N1582820M1150873K7336594J2094715m703055k1461810
$$ plain form
3161 10584102 11029512 11531770 12174174 12936435 13755725 14689296 15728353 16779371 17769289
3152 17769289 18680517 19472753 20100291 20558202 20886243 21061533 21178581 21273831 21392286 21601119
3142 21601119 21852658 22165246 22631112 23220664 24025437 25092545 26381495 27959366 29820192
3133 29820192 31902883 34079879 36148682 37938104 39427282 40525267 41278985 41750604
3125 41750604 42079682 42394134 42801181 43521626 44682118 46293136 48322263 50746463 53433586
3116 53433586 56505001 60114320 64403990 69475730 75399117 82472703 90929595 101047629
3108 101047629 113365145 128747745 148374052 173998778 207486450 250060465 301073240
3101 301073240 356121122 407703942 448854815 476191409 488286124 483583069 462121259
3094D62121259l4805629m2616686m4798185m2662424l8167022l2642058k7177120
3087A99252135k2378346j8608584j5666080j3428847j1754057j0321316r087124
3080I8007781q069005p250592o489620n850912n328169m830196m414297l947864
3072E1827126l426330k970086k579072k163351j896113j704419j459325j361340
3064C4267090j273352j203072j095107j141867j107123j094692j015932r74956
3056B5360989r58347q62466q63416q12217q13067p59965o97610o93536o32846
3047A8267519n83502n60056n14240m89083m62638m08138l59974l09172k77029
3038A4303687k70124k50474k84908k72077k21305l16476l19526l31511l91094
$$ plain form
3094 462121259 427315630 384698944 339900759 297238335 259071313 226429255 199252135
3087 199252135 176873789 158265205 142599125 129170278 117416221 107094905 98007781
3080 98007781 89938776 82688184 76198564 70347652 65019483 60189287 55774990 51827126
3072 51827126 48400796 45430710 42851638 40688287 38792174 37087755 35628430 34267090
3064 34267090 32993738 31790666 30695559 29553692 28446569 27351877 26335945 25360989
3056 25360989 24402642 23540176 22676760 21864543 21051476 20291511 19593901 18900365 18267519
3047 18267519 17684017 17123961 16609721 16120638 15658000 15249862 14889888 14580716 14303687
3038 14303687 14033563 13783089 13498181 13226104 13004799 12688323 12368797 12037286 11646192
3029A1646192l98213m32400m04703l84784l36650l09087k74222k43504k33297
3020H629332j99126k30193j63086j06311r8656p7681n4130l4622j3313n3162l0970
3009G568082q010m4049j01189r1720j12435j18892j53647j85715j58341j56472
2999F437612j54134j65518j25922j37723j46643j01979r2281j22679j37257q6354
2989E167122j07852j20701q4945j18626j02061n2462l1837o0187j19173q5432
2979D283846n9364j11228j04731j12363o4617n7930p6519p7065m5382p0554o2156
2968C441937k7062l3523j9652l0940k0819K2029k5436n9472n1855l0595m995j6600
2956C143017n8829k5809m0091m6957K951j0415k5504r7271j29881q2130r6920
$$ plain form
3029 11646192 11247979 10815579 10410876 10026092 9689442 9380355 9106133 8862629 8629332
3020 8629332 8430206 8200013 8036927 7930616 7831960 7754279 7700149 7665527 7652214 7599052 7568082
3009 7568082 7560072 7516023 7414834 7323114 7210679 7091787 6938140 6752425 6594084 6437612
2999 6437612 6283478 6117960 5992038 5854315 5707672 5605693 5513412 5390733 5253476 5167122
2989 5167122 5059270 4938569 4853624 4734998 4632937 4580475 4548638 4488451 4369278 4283846
2979 4283846 4224482 4113254 4008523 3896160 3831543 3773613 3697094 3620029 3574647 3504093 3441937
2968 3441937 3414875 3381352 3361700 3330760 3309941 3331970 3306534 3247062 3195207 3164612 3159617 3143017
2956 3143017 3084188 3058379 3018288 2971331 2974282 2963867 2938363 2841092 2711211 2629081 2532161
2945B532161r6975p9589p7301q4709m1505o2223p8446j5824j8553l4956n6745
2934A885335l2587J7417n2336m003J5400k3115m9946p2730r3551j2075r3417m4662
2922A439730n1558o3140j6296j7210j6962j1588j023l397l3081l1115k7008l6350
2910A131002O348k0274q6759j6138M6569J3694J3223J6283N9645J7884K1716l3549
2898A169644K8321K9758k5046m678J6730n3404l4758l2895j6664k8027j0575J7025
2886A055431J5752r688K1488n815k4861j5542k4412l1300m4064j2591J3793k167
2874I36024j5096k5750O721O349l262j8872M983Q5k9062K5908P4382Q687K1267
2861I92364m405J3147J4824J4576l1580j4474P047j8902k4384K0599j7734k5236
$$ plain form
2945 2532161 2435186 2355597 2278296 2193587 2152082 2089859 2011413 1995589 1977036 1942080 1885335
2934 1885335 1852748 1870165 1817829 1813826 1829226 1806111 1756165 1683435 1589884 1577809 1484392 1439730
2922 1439730 1388172 1325032 1308736 1291526 1274564 1262976 1261953 1258556 1225475 1194360 1167352 1131002
2910 1131002 1137350 1117076 1030317 1014179 1060748 1074442 1087665 1103948 1163593 1181477 1203193 1169644
2898 1169644 1197965 1227723 1202677 1197999 1214729 1161325 1126567 1093672 1077008 1048981 1038406 1055431
2886 1055431 1071183 1061495 1082983 1077168 1052307 1036765 1012353 981053 936989 924398 938191 936024
2874 936024 920928 895178 901899 908248 904986 886114 891097 891182 862120 888028 962410 971097 992364
2861 992364 987959 1001106 1015930 1030506 998926 984452 991499 972597 948213 968812 951078 925842
2849I25842k1496k4645k8270o6106k5417J0307l66m2553k4503o172J9455j3518
2837G02558K4259M7175K1766k9373j1345p435M3430L6985K2751J7779N2317N9261
2825I80128O7829J11448J19498J03093J38312J78261K16981K37860K36450K15811
2815B605671J45671J31624M4561n5652r4991j68511k11142j45080q5662j52076
2805B014413j51510j11716j02920j09224r4540j14587n9102r0128p0374n8392
2795A051920o0449l4967L083O69K6405q964J5868L5715L8223L6643K269P342k9111
2782A084646j4748k8410j5259l1130J0907K706k2558m2408j9391j2294m9209n3610
2770H09242r309m3080n7404l2068j3786k005j2058p785k9938m2948O430L1324
$$ plain form
2849 925842 904346 879701 851431 785325 759908 770215 769849 727296 702793 696621 716076 702558
2837 702558 726817 773992 795758 766385 755040 747605 791035 828020 850771 868550 920867 980128
2825 980128 1047957 1159405 1278903 1381996 1520308 1698569 1915550 2153410 2389860 2605671
2815 2605671 2751342 2882966 2927527 2871875 2776884 2608373 2397231 2252151 2166489 2014413
2805 2014413 1862903 1751187 1648267 1539043 1444503 1329916 1270814 1180686 1110312 1051920
2795 1051920 991471 956504 959587 960256 986661 977697 993565 1029280 1067503 1104146 1106415 1113757 1084646
2782 1084646 1069898 1041488 1026229 995099 1006006 1008712 986154 943746 924355 912061 862852 809242
2770 809242 799933 756853 699449 667381 653595 651590 639532 631747 601809 558861 565291 596615
2758E96615J934K5434m5103k1553K2028J736J8474k1009k8363J8464k1389o47
2746E46621J2287J495j843J4004K1132L7120J6103j3446L3122Q516L8015J1799
2734G24925r552j2920j7616J5124J3080j1565l7260l4835k9099J4377K3715k1550
2722F16824o494l3415l3224l7462m3846k6043m7460n1343n2333j6235m1335l6127
2710A91507K1227K767o558o257K137K5594L1072K3655l822K6749M76k0701N229
2697B93075K0588P66J7006M965j3731j2908l0837l5036q545J5924n3178j8643
2685A79446o545K7329j2083o730j5227J09j2495O369j5415k1546N115J9718J4532
2672A62577r0o535j1859j5701O219p430j5179Q157j24O840k5627l1684K0572N3189
$$ plain form
2758 596615 598549 623983 578880 557327 579355 581091 599565 578556 550193 568657 547268 546621
2746 546621 558908 560403 558560 572564 593696 630816 646919 633473 666595 675111 713126 724925
2734 724925 715373 702453 684837 699961 713041 701476 664216 629381 600282 614659 638374 616824
2722 616824 610330 576915 543691 506229 462383 436340 388880 337537 285204 268969 227634 191507
2710 191507 212734 215501 208943 202686 204823 230417 261489 285144 281322 308071 308547 287846 293075
2697 293075 313663 314429 331435 336400 322669 309761 278924 243888 235343 251267 198089 179446
2685 179446 172901 200230 188147 181417 166190 166299 153804 160173 144758 123212 128327 148045 162577
2672 162577 162487 155952 144093 128392 134611 127181 112002 120159 120035 126875 101248 69564 90136 143325
2658A43325k266k2351K1793j1514J6925R322l2406Q715O6508L4261q819Q181o40
2645B31034L3736j3509O169J5800J7592j3502l6914k5214k9565j0344m300J4636
2633A85619k4070N356j2234k1277l0503j7171R630M924J406l7551L0062K9603
2621A23794j4640Q469K4888K779N351M5688l218m137K6222K460M8549l670J3073
2608B75608J0743l9254l1328J0098j2878K0903J2186J800P23j9779j4964R286
2596B23144l1751N681N743R078N854J9544q370J5574J1549l4975R781M0400K6744
2583B97996J9667K5363N3529L8200P573L479l2884K7343k5635k9441k5565l6899
2571C22726m2416J4700j4164j8833k975o209j3242l7620J1307k0908m2357j0573
$$ plain form
2658 143325 141059 118708 140501 128987 145912 155234 122828 131543 198051 232312 223493 231674 231034
2645 231034 264770 251261 257430 273230 290822 277320 240406 215192 185627 175283 170983 185619
2633 185619 161549 166905 154671 133394 102891 85720 95350 100274 101680 64129 94191 123794
2621 123794 109154 117623 142511 145290 150641 196329 193111 188974 215196 217656 266205 262535 275608
2608 275608 286351 247097 215769 225867 212989 233892 246078 247878 248601 228822 213858 223144
2596 223144 191393 197074 202817 211895 217749 237293 228923 244497 256046 221071 230852 271252 297996
2583 297996 317663 343026 396555 434755 442328 445807 412923 440266 414631 385190 359625 322726
2571 322726 280310 295010 280846 262013 259038 252829 239587 201967 213274 192366 150009 139436
2559A39436o1J5083J3904L4049l225R794L3877j0521j9742K2333J2136l7644k9149
2546A80270l64J9833l0444k6664j5988K098q826m2983J9410l0472p804J6677J2037
2533H6780J0266P560L0766k0184j0222n9880J1880M5591j7785l6261K0451M9083
2521A18045k6106J8496r83J1435J1666j9237o493l943K59n901j2531k610l4927
2508D7170k480M1405K240j4538N542J4220J9170J1497K979p831k8199P397L1622
2495A30194L649k4954j508K0491P966j0640K0664K3497L1860j1843L682N035k9809
2482A68284k5182J2856M8283M099o73l2536L0808L448r026P633O12J8664m3450
2469A83820J2652K0283j1704j080j1659l911n422k6664K1809K306o4698m6373
$$ plain form
2559 139436 139375 154458 168362 202411 199186 208980 242857 232336 212594 234927 247063 209419 180270
2546 180270 179906 199739 169295 142631 126643 128741 119915 76932 96342 65870 58066 74743 86780
2533 86780 97046 104606 135372 115188 104966 45086 56966 102557 84772 48511 68962 118045
2521 118045 91939 110435 109452 120887 132553 113316 106823 102880 103139 97238 84707 82097 47170
2508 47170 44690 86095 88335 73797 79339 93559 112729 124226 127205 119374 91175 98572 130194
2495 130194 133843 108889 107381 127872 135838 125198 145862 169359 201219 189376 193058 198093 168284
2482 168284 143102 155958 204241 208340 207667 175131 205939 209387 200361 207994 208606 227270 183820
2469 183820 196472 216755 205051 203971 192312 188401 182979 156315 178124 180430 115732 69359
2457F9359r794L6742n836q634J3662J1796k9444k3247L394N22J4489P998q143
2444G2864l8595K3860M9226j8451k3742K9357K0007J7689K6578J5486l271k9234
2432A41774K4493k9623l6209K34j6284m379K6228j7198n861L3612K1542k2903
2420A15426k7540K4495M1902K528O857o702k0937j9658J1570j3679k0910l1544
2408F1808k4153n843L829n820n0412J9984J0927J7502M1773N0035J1299N3165
2396A84094N2174N1691j410R047k457K7819K298O705K4780R2168j7249J5767k7472
2383D17955j0765n937k3023N00j3315l5883n3365n002k3607L0359j1535N732J5223
2370B87337L7134j0904J1398M1771K6239K0706J3353k5787p568P484K5121l9713
$$ plain form
2457 69359 59565 96307 90471 81837 95499 107295 77851 54604 57998 58520 73009 81007 72864
2444 72864 34269 58129 107355 88904 65162 94519 114526 132215 158793 174279 171008 141774
2432 141774 166267 136644 100435 100669 84385 80006 106234 89036 83175 116787 138329 115426
2420 115426 87886 112381 154283 156811 163668 156966 136029 116371 127941 114262 93352 61808
2408 61808 37655 31812 35641 29821 -20591 -607 10320 27822 69595 119630 130929 184094
2396 184094 236268 287959 286549 295596 293139 320958 323256 329961 354741 446909 429660 445427 417955
2383 417955 407190 401253 378230 378730 365415 329532 276167 271165 247558 277917 266382 272114 287337
2370 287337 324471 313567 324965 366736 392975 413681 427034 401247 393679 401163 426284 386571
2358C86571k0583K2115K1857j9344K2429O209j2173R789L7208J4193L7422L9144
2346E44837L8585M8305Q3071N7617J857J2462Q2577P8879O9917L2363O7078Q3547
2334A201095R9378J31120J43092J72317J85957K52060L06728K70552L19667K93740
2324C375706L05837L17858L81877M95735O47684R93706J487811K289503L753369
2315A4049086N617610O961100N463225K744070K102844R52690j439665l886302
2307C2564658m830852m868790m237929l328648k694795k075715j411662r77193
2299H139074p39984n87119n76241n11323m58892m79809m78215m26604m28140l62710
2289C090037k68185k35175k30431j47465j20781j04943r5292p7320o3663n7181
$$ plain form
2358 386571 365988 388103 409960 390616 413045 419254 407081 416870 454078 468271 505693 544837
2346 544837 583422 631727 714798 772415 774272 786734 869311 948190 1018107 1050470 1117548 1201095
2334 1201095 1300473 1431593 1574685 1747002 1932959 2185019 2491747 2762299 3081966 3375706
2324 3375706 3681543 3999401 4381278 4877013 5524697 6518403 8006214 10295717 14049086
2315 14049086 19666696 26627796 32091021 34835091 36937935 37890625 36450960 32564658
2307 32564658 27733806 22865016 18627087 15298439 12603644 10527929 9116267 8139074
2299 8139074 7399090 6811971 6235730 5724407 5265515 4785706 4307491 3880887 3452747 3090037
2289 3090037 2821852 2586677 2356246 2208781 2088000 1983057 1887765 1810445 1746782 1689601
2279A689601o0830m1351o4678o6416l7447N673m2638o7757o9664n4788l5077l381
2267A151247m1479k5897l6881o1253k7439m5636n3575M965l1071p5025n9203m111
2255F94642J3703k1662l3980R091K7374j4031L1672q842l7613K191j2946k7812
2243F21787k4583l8454n9465N075k6667l5341Q827o521J542K4779P343k1687j2143
2230D44492J905j4986q548j0115J5232k1556k9788l48r454R674J0059L7990m7365
2217C77192l905L4094j3231L431k8887q201k4717J310j9197K1015K3067k9521
2205C32450m0144O689J3808l4599M123J335J0678j6120K9114m464q656l7783k8006
2192B28425L5730l8821j297L877m943J8424l604k4044K437L9360k0628o057j0524
$$ plain form
2279 1689601 1628771 1587420 1522742 1456326 1418879 1424552 1381914 1314157 1244493 1189705 1154628 1151247
2267 1151247 1109768 1083871 1046990 985737 958298 912662 859087 864052 832981 757956 698753 694642
2255 694642 708345 686683 652703 661794 689168 675137 706809 697967 660354 662545 649599 621787
2243 621787 597204 558750 499285 504360 477693 442352 451179 444658 446200 470979 478322 456635 444492
2230 444492 446397 431411 422863 412748 427980 406424 376636 376288 366834 376508 386567 424557 377192
2217 377192 373287 407381 394150 397581 368694 360493 335776 337086 317889 338904 361971 332450
2205 332450 292306 298995 312803 278204 282327 283662 294340 278220 307334 302870 294214 256431 228425
2192 228425 264155 225334 224037 227914 222971 241395 237791 213747 216184 255544 234916 228859 218335
2179B18335L108K9537k9133j4765m780J0416j5812p742j3810j5737K2873J7707
2167B00197L178p128K048r890J3488N862k2320j4973p189j0940P406K6112k7413
2154A58438j3670j5346k3020M2486J1204k5091m4747q330J7788r25L8171j6915
2142A20043j7171n225k2479l0716k3720M0299J4498k2303j0536k1633L497M4012
2130F8566r954q302M440j6079J945o028m3790q968K5250J2589K8827k5292N523
2117B8727K4943k5573J494L0517L9733J401j9767j686J4255K7775n997k2966l255
2104H9601j5960J3669k3573J5417O764J1791j8085L5355k850r916r725r500L116
2091H6104n958k5646n1492K4113M0506n713L0469L285o0190m97J052L4629m544
$$ plain form
2179 218335 221443 250980 221847 207082 202302 212718 196906 189164 175354 159617 182490 200197
2167 200197 203375 196247 198295 188405 201893 207755 185435 170462 163273 152333 159739 185851 158438
2154 158438 144768 129422 106402 148888 160092 135001 90254 81924 99712 98787 136958 120043
2142 120043 102872 97647 75168 44452 20732 61031 75529 53226 42690 21057 24554 68566
2130 68566 58612 50310 54750 38671 40616 34588 -9202 -18170 7080 19669 48496 23204 28727
2117 28727 53670 28097 29591 60108 99841 101242 81475 79789 94044 121819 115822 92856 89601
2104 89601 73641 87310 63737 79154 85918 97709 79624 114979 112129 102213 92488 82988 86104
2091 86104 80146 54500 3008 27121 67627 61914 92383 95668 35478 34981 36033 70662 66118
2078F6118O650k2076J3370J9473l2768R792o187K0403p218k3456K7084J8724j3110
2065G6799l1482l83j6997k2581L7771J609q64J125k255J7906j7305Q655K6337
2052G8335Q032j2102M978m3281J3779R499K0200K0694J5212L9558P0391J9491
2040B44786m5167j7150k9033j4369K3299J1031n3066k5880o12l8311Q349J9175
2028H3052j6256J030P277J5226q844K7533j9186k1856K7017j3538j5863Q436J9828
2015I3856j1844m928k4592J4084j1697m7143M442J8376k755M54J1028J2972M640
2002E6893l921k7044M362j9628J5216K9474j866k0930J9690J3417l1603k3252
1990A0808J4577J0558L7003P925k4255j5467j9300J3763k4456l1964K8948P7937
$$ plain form
2078 66118 72768 50692 64062 83535 50767 60559 54372 74775 67557 44101 71185 89909 76799
2065 76799 45317 44934 27937 5356 43127 44736 43872 44997 42742 60648 43343 51998 78335
2052 78335 86367 74265 79243 35962 49741 59240 79440 100134 115346 154904 225295 244786
2040 244786 199619 182469 153436 139067 162366 173397 120331 94451 93839 55528 63877 83052
2028 83052 66796 67826 75103 90329 81485 109018 89832 67976 94993 81455 65592 74028 93856
2015 93856 82012 77084 52492 66576 54879 7736 12178 30554 27799 28253 39281 52253 56893
2002 56893 52972 25928 30290 10662 25878 55352 53486 32556 52246 65663 34060 10808
1990 10808 25385 35943 72946 80871 56616 41149 21849 35612 11156 -20808 8140 86077
1978H6077R661m8831o926R925l4396j6804K1827M8217k2081j9293j9545M9007
1966E6838k0520k9156J1394k418K0379k6578l8944M3156l101J5594J0683k7839
1954I488K1793p555k5202J4705M4140J34J2758k4216j2205j6928k4917L3294K2692
1941D7981j0707m498K5524n091r226l3796J2687p952L577K7204l6883l4093L4777
1928I504j9097P31j8954J0121M9949M29K5867J0423l0592m932j6485l608J7027
1915C0383k194K7211m9004N232J9149K6111K6750j40l3877j2398j5898L4685k0368
1902C5642K805J7287k9646R727J3819l1172k2152M3797j5125k330Q437K8886o558
1889E3417k5093M89l5997J5824j5191k304J7965k8079j4730J5613P552K6434J3188
$$ plain form
1978 86077 95738 46907 39981 49906 15510 -1294 20533 68750 46669 27376 7831 56838
1966 56838 36318 7162 18556 16138 36517 9939 -29005 14151 11050 26644 37327 9488
1954 9488 31281 23726 -1476 13229 57369 57503 70261 46045 33840 16912 -8005 25289 47981
1941 47981 37274 32776 58300 53209 43983 10187 22874 14922 18499 45703 8820 -25273 9504
1928 9504 -9593 -8862 -27816 -17695 32254 32683 58550 68973 38381 33449 16964 13356 30383
1915 30383 28189 55400 6396 11628 30777 56888 83638 83498 49621 37223 21325 56010 35642
1902 35642 38447 55734 26088 35815 49634 18462 -3690 40107 24982 22652 31089 59975 53417
1889 53417 28324 28813 -7184 8640 -6551 -8855 9110 -18969 -33699 -18086 -10534 15900 29088
1876B9088l5565J6751L1413p198l3255R893R323M925J9231P159k7354j8185K2338
1863B8564m1238J7074J222P492j8168j3003L4103M728N297N627j6093O357L1040
1850E3002l2787j2052J5394J3364j1148k1350J2676j557J9368J5487k6740L4670
1838E8327r593k137j7502P942j2451K1417O737j476K6692j308l1420l3327j8270
1825f369L3063n951J398l7641j5114M5941O508Q300r55k550k376m187O698o302
1811B0463N745l423m8288J8955j687N450J8602K4482L0337k6542n3955k4710J3919
1798b0652L0835j1909m364J7175q013k0078J1051J2486j3971m858K1617O705r349
1785F675k7799K9336p962M745O102J0226j0368j4763j7532p567J7568J695L0832
$$ plain form
1876 29088 -6477 10274 41687 34489 1234 11127 20450 25375 44606 51765 24411 6226 28564
1863 28564 -12674 4400 5622 13114 -5054 -18057 16046 20774 26071 31698 15605 21962 53002
1850 53002 20215 8163 23557 36921 25773 4423 17099 15542 34910 50397 23657 58327
1838 58327 48734 46597 29095 37037 24586 46003 52740 51264 77956 76648 45228 11901 -6369
1825 -6369 26694 20743 22141 -15500 -30614 15327 21835 30135 29180 26630 24254 20067 26765 20463
1811 20463 26208 22785 -25503 -6548 -8235 -2785 15817 40299 70636 44094 -9861 -34571 -20652
1798 -20652 10183 -1726 -6090 11085 3072 -17006 -5955 6531 -7440 -12298 9319 16024 6675
1785 6675 -21124 8212 250 4995 11097 21323 10955 -3808 -21340 -28907 -11339 -9644 21188
1772B1188l4556k9707M1432m6899J6472K1734J7298L9205k2303J3811k6103j4849
1760c277j4899J2000M0957J008j4251n4616K4268J3585O516r757L1102J9529l9526
1747A2639m2444j429J7446K7110J9429K4579K1970o823j0950k7059m61k5501J6288
1734B4794J5204p135p452J6588j2294J0750o966L4050J3483m0839M951O029L0551
1721H1714k8031k3134J3677l5376j2480M1303K931j4768n883r551j786k490K5940
1708C2066R683j8957n0686L1797L8126J9889l9309p628p622K442J3173Q713K0569
1695E2256K4641J1399l3176k4550l0061m0467K9129j3471N39l780j0774J3456
1683b4859J20p048M08M8003K292q744o006k9325J1032j5841p736M3789K1523Q953
$$ plain form
1772 21188 -13368 -43075 -1643 -48542 -32070 -10336 6962 46167 23864 37675 11572 -3277
1760 -3277 -18176 -6176 34781 35789 21538 -33078 -8810 4775 11291 1534 32636 52165 12639
1747 12639 -29805 -31234 -13788 13322 32751 57330 79300 72477 61527 34468 34007 8506 24794
1734 24794 39998 32863 25411 41999 29705 40455 33489 67539 81022 40183 45134 51163 81714
1721 81714 53683 30549 44226 8850 -3630 37673 40604 25836 19953 10402 8616 6126 32066
1708 32066 41749 22792 -27894 3903 42029 61918 22609 14981 7359 9801 22974 31687 52256
1695 52256 76897 88296 55120 30570 509 -39958 -10829 -24300 -23761 -27541 -38315 -24859
1683 -24859 -24739 -31787 -31379 16624 18916 10172 4166 -25159 -14127 -29968 -37704 6085 27608 36561
1669C6561Q774Q269k7452k2631K7975J5853j1375j1422M822R964j370p991K1529
1656E1506k91m383k1607l2164R971j0154K4145K7935R231j7850O585m3153k076
1643b305J2302J2332j9157n244L369m52L8566J1007l3159l007M483l7529J4914
1630c880J6433K227r791J244J9482k4230K9550J2655k0965k63q87n915J396N282
1616B2338k2087J2184J4909j1922L8353m232k1362k1671j0159N0142L124j9485
1604C0132J7575p853j881j0076P450O026l3032J0770j1350j1542r838J0048J3816
1591A0245j0152J4225L6531j4518l5767K3710l5429k2783J0374L8835k9333k1150
1579c5212N0009M1549j3754l6361j5683J6955r265j0923j4230l467K6578N982
$$ plain form
1669 36561 45335 53604 26152 3521 31496 47349 35974 24552 29374 39338 37968 29977 51506
1656 51506 51215 46832 25225 -6939 3032 -7122 17023 44958 54189 36339 42924 -229 -2305
1643 -2305 9997 22329 3172 -2072 1297 845 39411 50418 17259 14252 18735 -18794 -3880
1630 -3880 12553 14780 4989 6233 25715 1485 31035 43690 22725 22462 21575 15660 17056 22338
1616 22338 251 12435 27344 15422 53775 49543 28181 6510 -3649 46493 49617 30132
1604 30132 47707 39854 37973 27897 35347 41373 8341 19111 7761 -3781 -13619 -3571 10245
1591 10245 93 14318 50849 36331 564 24274 -11155 -33938 -23564 15271 -14062 -35212
1579 -35212 14797 56346 42592 6231 -9452 7503 -1762 -12685 -26915 -30382 -3804 2178
1567B178K4415m947l386n307J3894j2060o390K121L782Q835M2398j8519l805q783
1553C4426l2241J0237N218J6119J9333m487l7201r028N751j3967J091m1128K5038
1540b0839L0160j7873J1192k3538j2433J5993O505k566m11J1186j5113K8951K3172
1527C4386l4792m1405M037k916j1336j638L3772j319k2294N540n799K664P219
1514c3881J7757J3389q856L2242k7926k0272M5141m2706q8K6752k4480J6580J7491
1501A1143R206J9156j3507j5339J6506J5170j5015J1144Q501P318j7515m581l2414
1488b27M422K2217l12m2k9791k7064o022L2361N13J017K4810j4772N5198q491
1474E3817k7158j3294J4650k1480L1920J950o306k4414m5126k4771L3885L4615
$$ plain form
1567 2178 26593 21646 18260 12953 26847 14787 8397 10518 14300 23135 65533 47014 43209 34426
1553 34426 2185 12422 17640 33759 53092 48605 11404 2376 8127 -5840 -4749 -45877 -20839
1540 -20839 9321 -8552 2640 -20898 -33331 -17338 -10833 -13399 -13810 -2624 -17737 11214 34386
1527 34386 -406 -41811 -37774 -40690 -52026 -53664 -19892 -21211 -43505 -37965 -43764 -41100 -33881
1514 -33881 -16124 -2735 -11591 20651 -7275 -27547 17594 -25112 -25200 1552 -22928 -6348 11143
1501 11143 20349 39505 25998 10659 27165 42335 27320 38464 46965 54283 36768 32187 -227
1488 -227 4195 26412 26100 26058 -3733 -30797 -36819 -4458 -3945 -2928 21882 7110 62308 53817
1474 53817 26659 13365 28015 6535 38455 40405 34099 9685 -35441 -60212 -26327 8288
1462H288j8072J5697l019L898k6932J8625J273K8165K6466R718j664o056m2193
1449A4194k8808K690J1104J3556J066k7109Q491O063J4150K138k2832L4507l7387
1436h177j3441O4382P545J966q727k2267o353Q64L3086J6738l6816m063j1585
1423A3152j072j0692L2615N062j4707k7307J3454O649k1991l186O615j7133o698
1410b5239N8829p026l7974l799m084O530j665K0388j8404q947K3954J2930n1486
1397c5993k1537K2149L04l0892K4073L6651K21n0l5950J0721l7890J3903J5649
1384c8641O901J3114J7536O960j6931J1628L342j4783M013K0599K2354j8937J5766
1371C2921p229P930k8490j2217m064J601K6768J0673j7376L536J9525K5288n5166
$$ plain form
1462 8288 -9784 5913 2894 6792 -20140 -1515 -242 27923 54389 64107 62443 56387 14194
1449 14194 -14614 -11924 -820 12736 13802 -13307 -4816 1247 15397 17535 -5297 29210 -8177
1436 -8177 -21618 42764 50309 52275 43548 21281 14928 15792 48878 65616 28800 24737 13152
1423 13152 12080 1388 34003 39065 24358 -2949 10505 17154 -4837 -8023 -1408 -18541 -25239
1410 -25239 33590 26564 -11410 -15209 -19293 -12763 -14428 5960 -12444 -21391 2563 15493 -35993
1397 -35993 -57530 -35381 -35077 -65969 -41896 -5245 -5024 -5074 -41024 -30303 -68193 -54290 -38641
1384 -38641 -31740 -18626 -1090 5870 -11061 567 3909 -10874 -6861 13738 36092 17155 32921
1371 32921 25692 33622 5132 -7085 -11149 -9548 17220 27893 10517 14053 33578 58866 3700
1358C700j550M951j7239k5734Q501L8861L308j4693N908j0098k2578j4126j1819
1345e2608r133M0622M3055l125J7571l0933j9062J4452M6748l0702m3142J2035
1333a4222n006j8847J2194J4457J8377k4548J8204j0122p078J0413P712o036j612
1320f114L819M0525j2192j1952J5080Q835n2647j971J4616k626K7743K788k3640
1307B264k581J4672J5164J08k4428k3773J2896P013l0086K9939K2618j8591J0000
1294A5215J3328l498L2684j0384j4301k9003l1233k809J0733j316R362n22q874
1281b0618K4446j854m3233K9371L3229j3080j5424L3348K331j5784j925j7561
1269f754l2862j1788M3918J1888l5901L8557J8328k6313K6639j4704k5580n316
$$ plain form
1358 3700 2150 7101 -10138 -35872 -27371 11490 14798 105 6013 -4085 -26663 -40789 -52608
1345 -52608 -61741 -21119 21936 18811 36382 5449 -13613 839 47587 16885 -26257 -14222
1333 -14222 -19228 -38075 -25881 -11424 6953 -17595 609 -9513 -16591 -6178 1534 -4502 -6114
1320 -6114 -2295 38230 26038 14086 29166 38001 -14646 -16617 -2001 -4627 23116 25904 2264
1307 2264 -317 14355 29519 29627 5199 -18574 -5678 1335 -28751 1188 23806 5215 15215
1294 15215 28543 25045 57729 47345 33044 4041 -27192 -30001 -19268 -20584 -11222 -11744 -20618
1281 -20618 3828 1974 -41259 -11888 21341 8261 -7163 26185 28516 12732 10807 -6754
1269 -6754 -39616 -51404 -7486 4402 -31499 7058 25386 -927 25712 11008 -14572 -19888
1257a9888n986m570J9877M1087N042j8836k1092j9857J8315Q049j3433J1722j2110
1244a1680J964j9319J0874K2754J427L2914K2255l0598k6607K0672P486J0378
1232D2520j7815k5166K32l9847j0568J0228k0408r500N0627M2740j8646q991K9593
1219B4999j5666j8618Q601j3313K4794J4773k0014l2947L3377J859L748j519j6368
1206f294P218l0158p268N821N070L2149J3381l0276j6311M7395l1210j4385j6178
1193d1046J9109L6743L471r978J7158L89j7228m5808J7622K4166n310j2217k8382
1180d1311L1282Q862L2657l6116j1506j0492K594J7638l210K241O414K1866n977
1167A4942L964m5860J1804j2368J1896N5985l8298k6284Q820J8221k2908p34N860
$$ plain form
1257 -19888 -25874 -30444 -10567 30520 35562 16726 -4366 -24223 -5908 2141 -11292 430 -11680
1244 -11680 -9716 -29035 -18161 4593 6020 38934 61189 30591 3984 24656 32142 42520
1232 42520 24705 -461 -229 -40076 -50644 -40416 -60824 -70324 -19697 23043 4397 -4594 24999
1219 24999 9333 -9285 -684 -13997 10797 25570 5556 -27391 5986 7845 11593 10074 -6294
1206 -6294 924 -29234 -36502 -30681 -25611 6538 19919 -10357 -26668 20727 -10483 -24868 -41046
1193 -41046 -21937 14806 18277 8299 25457 25846 8618 -37190 -19568 4598 -712 -12929 -41311
1180 -41311 -10029 -1167 31490 -4626 -16132 -26624 -24030 -6392 -9602 -7361 -947 20919 14942
1167 14942 18906 -26954 -15150 -27518 -15622 40363 2065 -24219 -15399 2822 -20086 -20820 -14960
1154a4960J3276j4593L1503n061j8658k1096l76R364K8450k9229j0264J8303O038
1141g303P313J4541R998l4782k039j7475k110L5323J0616k4558K476l6101K9575
1128a4526j552k9361J4250K5136k1914l570J348J5004J0439k1730L2397j9604
1116a3683K5924K726j0407m2097J855L3264o488k1526Q067L5389j709k184p633
1103A498q414P934M048l0075Q138P665m430J0483K0078k1530q648O165j4485J8963
1089b610Q292j0240Q40o665k3568K1409P88k1623J3060J1431K6382j9960o750
1076i214K0144L4166k9374K1761K3054k7217j6184q079j1946k6416K1791o282
1064a3796p910j9530J8719L4256J3409J2332j0424o065k4680j6165o606K2433
$$ plain form
1154 -14960 -1684 -16277 15226 10165 -8493 -29589 -29965 -20601 7849 -21380 -31644 -13341 -7303
1141 -7303 10 14551 24549 -10233 -12272 -29747 -31857 3466 14082 -10476 -8000 -44101 -14526
1128 -14526 -16078 -45439 -31189 -6053 -27967 -31537 -30189 -15185 -4746 -26476 5921 -13683
1116 -13683 12241 14967 4560 -37537 -35682 -2418 -8906 -30432 -22365 13024 11315 9131 1498
1103 1498 -6916 1018 5066 -25009 -16871 -9206 -13636 -3153 16925 -4605 -13253 -7088 -21573 -2610
1089 -2610 5682 -4558 -3718 -10383 -33951 -12542 -11754 -33377 -20317 -8886 17496 -2464 -9214
1076 -9214 10930 45096 15722 37483 60537 33320 17136 9057 -2889 -29305 -7514 -13796
1064 -13796 -21706 -41236 -22517 11739 25148 37480 27056 20991 -3689 -19854 -26460 -4027
1052d027J4266o9178K016K9605J8405K3322Q65j3302J3079m5302J0014K0916J3746
1039A4425j8672l2921L2086P003j7879N828j9415Q091J0236L4802j9044j6530
1027a1990K1803q968K038j4664p043j2847j6076N790M4186j0839J4185n852k2245
1014b2522Q631J1660j5820K0064j4230l6831J0150L6712K093k23j6733N6774R100
1001D8825m8165j7045M0788Q333l1157J268j2726k0572q544K0497n598J8764K205
988c127l1537j0330O589K999o381L0683m529K6268K3973k1611m713M6315j3816
975D0783k3926N181j452j4341n636K3181k0758J118k3875J7325L0490j3681p027
962G382R929l090P124k383l7597j7097l4982R451Q281p565K9780K467N626R736
$$ plain form
1052 -4027 10239 -58939 -56923 -27318 -8913 14409 15274 1972 15051 -30251 -20237 679 14425
1039 14425 -4247 -37168 -5082 1921 -15958 -10130 -29545 -21454 -11218 23584 4540 -11990
1027 -11990 9813 845 2883 -11781 -18824 -31671 -47747 -41957 2229 -8610 5575 -277 -22522
1014 -22522 -13891 -2231 -18051 2013 -12217 -49048 -38898 -2186 -93 -316 -17049 39725 48825
1001 48825 660 -16385 24403 32736 1579 2847 -9879 -30451 -38995 -18498 -24096 -5332 -3127
988 -3127 -34664 -44994 -38405 -35406 -41787 -11104 -15633 10635 34608 12997 8284 54599 40783
975 40783 16857 22038 20586 6245 609 23790 3032 4150 -19725 -2400 28090 14409 7382
962 7382 17311 14221 21345 18962 -18635 -35732 -70714 -61263 -52982 -60547 -30767 -28300 -22674 -12938
948a2938l3346J3189Q615k857l47k274K9572l9021j5761L0896J0509R630q376
935a2509p652k5759J2559L5319j6292K3825k1353l6381J7765K1035P040R873j4028
922f558m64L03J651J2860r319k6428j037K2050R299M427J313p728j4984R874J539
907c202J9992j0767o0K1960R83K333l1870J284J0053n061j347K6183k1514k5666
893a6699k667J3756q171l610J2427J0695j3137l2473N0624L9858l0753L8478n1685
880F643L643n112k7209j5031J1121L0652k6621m367J067n466J0987k7212J226
867d5679L6441J1151m994n43k3421L375j909L027J4214j8900J9003k5238k147
854c5620L072L9037q887K1420J4521l3278o6725n953K7170Q080L9577R72P227
$$ plain form
948 -12938 -46284 -33095 -24480 -27337 -27684 -29958 -386 -39407 -55168 -24272 -13763 -4133 -12509
935 -12509 -20161 -45920 -33361 1958 -14334 9491 -11862 -48243 -30478 -9443 -2403 7470 -6558
922 -6558 -7022 -6719 -5068 7792 -1527 -27955 -28992 -6942 2357 6784 8097 369 -14615 -4741 -3202
907 -3202 16790 6023 5963 27923 28906 31239 -631 653 10706 5645 4298 30481 8967 -16699
893 -16699 -19366 -5610 -13781 -17391 -4964 5731 -7406 -39879 10745 50603 19850 58328 6643
880 6643 10286 5174 -22035 -37066 -25945 4707 -21914 -26281 -25214 -30680 -19693 -46905 -45679
867 -45679 -9238 1913 -3081 -3624 -27045 -23670 -25579 -22552 -8338 -27238 -8235 -33473 -35620
854 -35620 -32548 6489 -2398 19022 33543 265 -66460 -72413 -45243 -37163 2414 3386 10613
841A0613p99K895n6392J3283J7020k2348L0849k0420L4134J2323k2024j4510j5154
828c0530R38k530q109m700L1704J9120J3625j8154j2149k3254j4328L3559q835
815b3643j5275J6665K0680J5717j6397l8584L5299K7017r978j4116j007n141J6127
802G364l6302O48j3742K9546J9400m285L457J5878l9420K782M0481q259l8038
789b0490N085L1684J4893J60P686l2827k7776L7067M028J5830j4310K93j5608
776E715n785R38J28k3784L2293J1339q795N0345k9176j4790m6515J6547K879o315
762a4976O711p802n343Q346K8860m9872K2567J6503K00J3194J69j2729n899n551
748e622k6298O8497k2070j5477L5634k5531j5806j2511R661j2900R087J2932J7609
$$ plain form
841 10613 9814 12709 -43683 -30400 -13380 -35728 -4879 -25299 8835 21158 -866 -15376 -30530
828 -30530 -29592 -32122 -40231 -44931 -13227 5893 19518 1364 -10785 -34039 -48367 -14808 -23643
815 -23643 -38918 -22253 -1573 14144 -2253 -40837 -5538 21479 11501 -2615 -3622 -8763 7364
802 7364 -28938 -28290 -42032 -12486 6914 2629 6086 21964 -17456 -14674 25807 17548 -20490
789 -20490 -15405 16279 31172 31332 39018 6191 -21585 15482 19510 35340 21030 21323 5715
776 5715 -70 868 996 -22788 9505 20844 12049 62394 33218 18428 -28087 -11540 -8661 -14976
762 -14976 -8265 -16067 -21410 -13064 15796 -34076 -11509 4994 5194 18388 18557 5828 -71 -5622
748 -5622 -31920 36577 14507 -970 34664 9133 -6673 -19184 -9523 -22423 -13336 -404 17205
735A7205J3516n472k9950j0464l7778L6976L2283J2399j0650K6778k1609n5495
723c2261J6697K1336l0092L094P36j838k002O090J1166K7028j0304N163j6493
710a680O785L8293r606m2167j9389N450J8640j634K4818J610j2338l866l2584
697b7668r870K3778j8207n012J9712m0287K0975O453q695k551Q6252n5145N441
684d824K5356Q132J1010l7972N517J3924j8122J8206o92p068k2259j3175M4381
671B2414L068m5666J174K1115o5921J9462L0827L9064k2595K0187L7126o3253
659b998l1028n118k2905J7419J1406R174L8744J4753m1845J241j916m92O020L4177
645B6632q071l1606K7645Q257J472k6969k4339j1675J0410J2583K9058m9755O030
$$ plain form
735 17205 30721 25249 -4701 -15165 -52943 -15967 16316 28715 18065 44843 23234 -32261
723 -32261 -15564 5772 -24320 -21226 -20490 -22328 -24330 -18240 -7074 19954 9650 14813 -1680
710 -1680 5105 43398 33792 -8375 -27764 -22314 -3674 -5308 19510 21120 8782 4916 -27668
697 -27668 -37538 -13760 -31967 -36979 -17267 -57554 -36579 -30126 -38821 -41372 44880 -10265 -4824
684 -4824 20532 28664 39674 1702 7219 21143 3021 21227 20535 13467 -8792 -21967 22414
671 22414 25482 -20184 -19010 2105 -63816 -44354 -13527 25537 2942 23129 60255 -2998
659 -2998 -34026 -39144 -62049 -44630 -33224 -24050 14694 29447 -12398 -11157 -13073 -13565 -7545 26632
645 26632 18561 -13045 14600 22857 24329 -2640 -26979 -38654 -28244 -15661 13397 -36358 -30328
632c0328J4797M3137M372j4133k5208j1828j0117P110J8861J0306j3448k9190
620c5669K2539R454J7555K8872m425j2081j7741l6738K2628L115J277L259j4921
607a2876q494r23J5599J743l2297j190k038M5181J3273k230K1404o420j8505J5117
593B7344l4700p776k425j9265r673M229O72J2860K0143q037l61N873L0627l8575
579a9064Q431j2784R606l2186L4392O4234q649j8468p783k4505q252r240j4881
566c9149k788k545K1293Q631K0213l704l419J7831J9150j4329o972J9607J926
553C5745l3624l525l3884J4073j1742k128k686J5421L1491J1646p610L38K1812
540C5327k1125j3481k8141L4375l020k5430J2332l4761K3497M2715l0097l0922
$$ plain form
632 -30328 -15531 27606 31978 17845 -7363 -19191 -29308 -22198 -3337 6969 -6479 -35669
620 -35669 -13130 -3676 13879 42751 38326 26245 8504 -28234 -5606 -2491 -1214 2045 -12876
607 -12876 -21370 -22293 -6694 -4951 -37248 -38438 -40476 4705 17978 15748 37152 30732 12227 27344
593 27344 -7356 -15132 -17557 -36822 -46495 -42266 -41594 -28734 -8591 -16628 -16989 -11116 19511 -19064
579 -19064 -10633 -23417 -13811 -45997 -11605 52629 43980 25512 17729 -6776 -15028 -24268 -39149
566 -39149 -41937 -44482 -23189 -14558 5655 1951 -1468 16363 35513 21184 14212 33819 35745
553 35745 2121 -1404 -35288 -21215 -32957 -35085 -37771 -22350 9141 20787 13177 13515 35327
540 35327 14202 721 -27420 6955 3935 -21495 -9163 -43924 -20427 22288 -7809 -38731
528c8731J4699j072Q083J6067O949J4878k7376K0735J3418n261J4039j2441k0006
515C981l1397n431K6769j2089J3934n976j1691p962Q729N2400K8974k1887j3640
502B4714R921j7104k8937R229J466J231k2390J0805o095J0718Q650j1550k2456
489c1798J6294J5769n1538M9742J0562r23o573k4712j4822J7353K8829j7791q34
476a0442J7918P351j4751l4643J8956K3033J2281k9793j2407J8613j6321j5373
464c5578J9215J8871N048k0365k5819J4188J1973L1420k2511k3338J8831O079
452a986q871q701K5820l332q442k713M0842l2057o397M0560j1581n1476J4206
439a4128j1588L0011J3262m463L6802n0313Q687l5161L3611J3166k5895j755m5409
$$ plain form
528 -38731 -24032 -25104 -17021 -954 5995 20873 -6503 14232 27650 22389 36428 23987 3981
515 3981 -27416 -32847 -6078 -18167 -4233 -10209 -21900 -29862 -21133 31267 60241 38354 24714
502 24714 34635 17531 -11406 -2177 -711 520 -21870 -11065 -17160 -6442 2208 -9342 -31798
489 -31798 -15504 265 -51273 -1531 9031 8108 1535 -23177 -37999 -20646 8183 -9608 -10442
476 -10442 7476 14827 76 -34567 -15611 7422 19703 -10090 -22497 -3884 -20205 -35578
464 -35578 -16363 2508 7556 -12809 -38628 -24440 -12467 18953 -3558 -26896 -8065 -1986
452 -1986 -10857 -19558 6262 2930 -5512 -8225 32617 560 -5837 34723 23142 -28334 -14128
439 -14128 -25716 4295 17557 13094 49896 -417 8270 -26891 6720 19886 -6009 -7764 -53173
426e3173j4511K759K5523Q709K1905J4361P920k566j6865o554o591M667K3839
413I423k1631J2832J5480K548m975m838r212P778k7036P245k1130m7492M2860
400c8148K344J0974K01K7541Q452k5529J3719k7292K1501j6723j2620K0802k0255
387c5033j6215r018N7681J78r999j9763J5635K6644Q37j8423J9823R50k8267j5579
373c0549M9451j8389j664k2279j129o722N500K4461o2191N1923J3381j3952N532
360f627O523K5676j840n4088j5613L8643J1252l5274K6167O839O578Q74k0887
347a1777Q865N41m6125J307M5235m102R331m4289K0116j3145k2613k071K2864
334c5863J9475O562k8717K3258L1911j0792j5666k4687k2170J2655K5529j0042
$$ plain form
426 -53173 -67684 -64925 -39402 -30693 -8788 5573 13493 10927 -5938 -12492 -19083 -14416 9423
413 9423 -12208 624 16104 18652 13677 8839 -373 7405 -19631 -12386 -33516 -81008 -38148
400 -38148 -35804 -24830 -24629 2912 11364 -14165 -446 -27738 -6237 -22960 -35580 -14778 -35033
387 -35033 -51248 -60266 -2585 -2407 -12406 -32169 -16534 10110 10947 -7476 12347 13297 -14970 -30549
373 -30549 18902 513 -1151 -23430 -24559 -31281 -25781 -1320 -63511 -11588 1793 -12159 -6627
360 -6627 -104 25572 23732 -30356 -45969 -7326 3926 -31348 -5181 1658 8236 9110 -11777
347 -11777 -2912 -2371 -48496 -47189 -1954 -6056 3275 -41014 -20898 -34043 -56656 -58727 -35863
334 -35863 -16388 -9826 -38543 -15285 16626 5834 -9832 -34519 -56689 -44034 -18505 -28547
322b8547r37N1247J6998j7921r908k890j6526J2700k2817m606l0774K1657K0163
309a2161m3768L298J5844O001N435J5742j8309j0745L2388K2756K970k1533r135
296a1217K1104J8282k1658J0376k2758l8273N043k5575J5566L8124L2881m9665
284b7770l590K2872M0910o3689J8509P955J2658J3100k6563k8332Q289M888K8620
271G857m5053j7807o754O5637l988j8760N809j0717L0238j8256j8560N8922l7059
258h491j8298K5352k5566K662k5005M387J0407L0852k328k930L453j1170L694
245a2981k912j9031R211j9617K2347Q283J5436M2194j6861r837J7558l4515n48
232a273o42j7519L558p386l1745j3811J5847L5729K1766j0664J0762j9078j6517
$$ plain form
322 -28547 -29484 21763 38761 20840 10932 8042 -8484 4216 -18601 -23207 -53981 -32324 -12161
309 -12161 -55929 -52631 -36787 -30786 -25351 -9609 -27918 -38663 -6275 16481 19451 -2082 -11217
296 -11217 9887 28169 6511 16887 -5871 -44144 -39101 -64676 -49110 -10986 21895 -27770
284 -27770 -31360 -8488 32422 -31267 -12758 -4803 7855 20955 -5608 -33940 -25651 -20763 7857
271 7857 -37196 -55003 -61757 3880 -108 -18868 -13059 -23776 6462 -11794 -30354 28568 -8491
258 -8491 -26789 -1437 -27003 -24341 -49346 -44959 -34552 -3700 -6028 -8958 -5505 -16675 -12981
245 -12981 -15893 -34924 -25713 -45330 -22983 -14700 736 42930 26069 16232 33790 -725 -1273
232 -1273 -1915 -19434 -15876 -23262 -55007 -68818 -52971 -17242 4524 -6140 4622 -14456 -30973
219c0973l904q38L802l4251P858K1011K5970k6457M54M4642J5175L199j1824l7747
205b3883J7001j7466p635p639J0553J672l78R868J6820j0427k3574K0528k4411
192c8971o208K6346j661j0094j118J4294K5590k6139k1933O773K0109J5638j3200
179a0574Q64M672k3983j2080J5535K0648L5203r652n1074O258J2454Q187o622
166a0164k0777j2694L4979j7658L5526K2933m5177P951o279K7455k0161r875j686
153a5627q086K1362K063J3006n770m0083M201K4723k237r458j2382M86L0159m277
139a920l0934J18L4923j0674J141l991l523j3444O310l538J8929R188o176o106
125i697J210l294j2638o280K4561l1144k0560J9151j2910K6953o594L720J4678
$$ plain form
219 -30973 -34877 -35715 -31913 -66164 -58306 -37295 -11325 -37782 -37328 7314 22489 25688 13864 -23883
205 -23883 -6882 -24348 -31983 -39622 -29069 -27397 -27775 -17907 -1087 -11514 -35088 -14560 -38971
192 -38971 -45179 -18833 -20494 -30588 -31706 -17412 8178 -17961 -39894 -33121 -13012 2626 -10574
179 -10574 -9710 -5038 -29021 -41101 -25566 -4918 30285 20633 -30441 -24183 -11729 -3542 -10164
166 -10164 -30941 -43635 -8656 -26314 9212 32145 -13032 -5081 -11360 16095 -4066 -13941 -15627
153 -15627 -23713 -2351 -288 12718 6948 -33135 -28934 -4211 -6448 -15906 -28288 -27802 2357 -1920
139 -1920 -32854 -32736 2187 -8487 -7346 -11337 -14860 -28304 -21994 -25532 -6603 2585 -3591 -9697
125 -9697 -8487 -11781 -24419 -30699 -6138 -37282 -57842 -38691 -51601 -24648 -31242 -27522 -12844
112a2844j6304J622j8213j7985L4250j0830j811q543J5565M182J1834j8844J2010
99b5911L9861K337J2940o898k4888q800j826j5096N273J0038j483J0924p392J8090
85G169m81q527r16K44M344k1583k2362K035l7979P132M2406j0985k5994K8680
71c6817K011K2237J5089k6401o106Q758K0621p009j1882K5108l1697j475N0483
58B2920m3920J3706l575j5630J2923r040p695P146J0621J012q099K0276O322j6899
44i932l6332K0769K5055j3840J8909j8766n806m533P792K148l636k3899J0036
31c2035j427K6955K2889j4387j7512r869L621r411K0019r094j6927O252K9143
18a783j1554j5544K3066j7686Q977Q370l8883J2494N096n736N728R484q87p013
$$ plain form
112 -12844 -29148 -27526 -45739 -63724 -29474 -40304 -42115 -50658 -35093 -30911 -19077 -37921 -25911
99 -25911 13950 16287 29227 22329 -2559 -11359 -13185 -28281 -23008 -12970 -14453 -3529 -10921 7169
85 7169 6688 -1839 -2755 -2511 1833 -19750 -42112 -40077 -78056 -70924 -28518 -39503 -65497 -36817
71 -36817 -34806 -12569 2520 -23881 -29987 -21229 -608 -7617 -19499 5609 -26088 -27563 22920
58 22920 -21000 -7294 -10869 -26499 -13576 -22616 -30311 -23165 -12544 -11532 -19631 645 6967 -9932
44 -9932 -46264 -25495 -440 -14280 4629 -14137 -19943 -24476 -16684 -14536 -18172 -42071 -32035
31 -32035 -33462 -6507 16382 1995 -15517 -25386 -21765 -31176 -11157 -20251 -37178 -30926 -1783
18 -1783 -13337 -28881 -5815 -23501 -14524 -6154 -45037 -32543 -27447 -33183 -27455 -17971 -18858 -25871
4b5871J2620J0189j1595m138
0a8795
$$ plain form
4 -25871 -13251 -3062 -14657 -18795
0 -18795
$$ Imaginary data points
##PAGE= N=2
##DATA TABLE= (X++(I..I)), XYDATA
16383a228106N4042L199K8787J613l898n440K1730M0007j4186L4429J5986J1751
16371a040086L4077K5411J3757J6424L981O402K3234J7464J54J2437J8605J0177
16359h57963J3342Q527p122M8947K5988M979J9069J5218L3279J2310k1782k610
16347g07818J9675J9666K6718P298K1836L1663P4L92k456J1743J1351L5706J8291
16334e05861L3226K8616K521J2294j940M2632r550r993K2028M890K5192K8203
16322c27742K0235j497J7048M1459M122l0588j1833J5895K8863K5493L0470K0896
16310a67179N622K2823L8040j8754O791M2157k1290J9456J4253J2436Q241R950
16298b7454J7162n785L592L1221R849p662O183K9599K3653K5133k2891J2054M4316
$$ plain form
16383 -1228106 -1174064 -1170865 -1142078 -1140465 -1144363 -1149803 -1128073 -1088066 -1102252 -1067823 -1051837 -1040086
16371 -1040086 -1006009 -980598 -966841 -950417 -946436 -940034 -916800 -899336 -899182 -886745 -868140 -857963
16359 -857963 -844621 -836094 -843216 -794269 -768281 -763302 -744233 -729015 -695736 -683426 -705208 -707818
16347 -707818 -688143 -668477 -641759 -634461 -612625 -580962 -580888 -580496 -582952 -571209 -559858 -524152 -505861
16334 -505861 -472635 -444019 -441498 -429204 -431144 -388512 -398062 -408055 -386027 -381137 -355945 -327742
16322 -327742 -307507 -309004 -291956 -250497 -246375 -276963 -288796 -272901 -244038 -218545 -188075 -167179
16310 -167179 -161557 -138734 -100694 -119448 -112657 -70500 -91790 -72334 -58081 -45645 -37404 -27454
16298 -27454 -10292 -16077 -12485 18736 28585 20923 27106 56705 80358 105491 82600 94654 138970
16285A38970o446k209K2011J2657K415j199K4863m227J558K2613J4413L8319O70
16272B64408J1308k818J3643J7400l663J5494P999k153J7818K0307q403K2925
16260C74265p136J8573K7531J4100j8502L9357r023l1086J1691M0604K985K7913
16248D91272J1442m6300r03L1093L9470p456J6020J8290p724N071L4969j0738
16236E74506r38m015j1438J0903M758R669L1310R769L160K8990k331J2960K1698
16223F89001p819j5569J6147j4444J5237K7267n286j2599L7726K0605K0910o733
16211G64443K4532K2856k6277p748J999L2388m1715Q597O819J6487j260J0732
16199H11853J6628K708l8165P977L6644K4q097L4142O787J77l8162R831j473k325
$$ plain form
16285 138970 132524 130315 152326 164983 167398 166199 191062 186835 188393 211006 225419 263738 264408
16272 264408 275716 272898 286541 303941 300278 315772 323771 321618 339436 359743 351340 374265
16260 374265 367129 385702 413233 427333 408831 448188 439165 408079 419770 460374 463359 491272
16248 491272 502714 456414 455511 486604 526074 518618 534638 552928 545204 550275 585244 574506
16236 574506 573568 569553 558115 569018 573776 583445 614755 624524 627684 656674 654343 667303 689001
16223 689001 681182 665613 681760 667316 682553 709820 704534 691935 729661 750266 771176 764443
16211 764443 788975 811831 785554 777806 779805 812193 770478 779075 785894 802381 801121 811853
16199 811853 828481 831189 793024 801001 837645 837669 829572 863714 870501 870678 832516 842347 840874 838549
16185H38549l4460K7412M7844J905k71q67n528n920K1499R892r092o851J692K6106
16171I11910K1121J29J3338o053j4229L0617N661J5703l894l5260J0967J9184
16159I69194Q980L7158k2162n881L329M688N50m3742j7831J7523M6494J2297l146
16146A007451q57N21j864n577j2166K4816J221L9292k0139J5786j2027k4372K6538
16133A038623K0146k527J1831j9021j8717k0449l022k1091K2611L2554K5542k9065
16121A037415Q466j5484L4229K944j4371M2430j3679J5970l0578m318J4578J0976
16109A088578J0726j4028K281r462K4619j023n6857K3107l366Q888J5395j2514
16097A076344j2477J2979K6803k5103K5552m077l5799K7430L8984J5128k4171
$$ plain form
16185 838549 804089 831501 879345 881250 880979 880112 874584 868664 890163 900055 890963 884112 885804 911910
16171 911910 933031 933160 946498 940445 926216 956833 962494 978197 974303 939043 950010 969194
16159 969194 978174 1015332 993170 987289 990618 995306 995856 952114 934283 951806 998300 1010597 1007451
16146 1007451 1006594 1007115 1005251 999674 987508 1012324 1013545 1052837 1032698 1048484 1036457 1012085 1038623
16133 1038623 1058769 1056242 1068073 1049052 1030335 1009886 1006864 985773 1008384 1040938 1066480 1037415
16121 1037415 1045881 1030397 1064626 1067570 1053199 1095629 1081950 1097920 1067342 1063024 1077602 1088578
16109 1088578 1099304 1085276 1087557 1078095 1102714 1101691 1044834 1067941 1064575 1073463 1088858 1076344
16097 1076344 1063867 1076846 1103649 1078546 1104098 1100021 1064222 1091652 1130636 1145764 1121593
16086A121593j1854R20K2947J507m272k9907K1153j2879k6166k6660K5471L1096
16074A112949R610r777K644J053j4878Q959o311J0701m1902K5023j76J2328p921
16061A102302m317J2669L426r729M867k8354Q630J7129o905J4619k1008K5519
16049A118848R591K2460J2803k4252j8633k053m07M901K826Q663k7507L0896J0394
16036A148530p863J3049L5640J2720j6629j2859l6334l877P72k4897K5J3070M267
16023A125614l1046L1539M7575j0142j4881j7933M757Q647j8131r097R926m885
16011A121943K3253o820l4601P925R459o947M02j3950J287M0481r692l5245k166
15998A095329K3120O867j6461J8056j1671J2126P417j4904J5861j4991P312K0598
$$ plain form
16086 1121593 1109739 1110659 1133606 1135113 1130841 1100934 1122087 1109208 1083042 1056382 1081853 1112949
16074 1112949 1122559 1112782 1115426 1116479 1101601 1110560 1104249 1114950 1073048 1098071 1097895 1110223 1102302
16061 1102302 1097985 1110654 1114080 1104351 1109218 1080864 1089494 1106623 1099718 1114337 1093329 1118848
16049 1118848 1128439 1150899 1163702 1139450 1120817 1118764 1118357 1123258 1126084 1134747 1107240 1138136 1148530
16036 1148530 1140667 1153716 1189356 1202076 1185447 1172588 1136254 1132377 1133149 1108252 1108277 1121347 1125614
16023 1125614 1094568 1126107 1173682 1163540 1148659 1130726 1135483 1144130 1125999 1116902 1126828 1121943
16011 1121943 1145196 1138376 1103775 1111700 1121159 1114212 1114614 1100664 1101951 1142432 1132740 1097495 1095329
15998 1095329 1118449 1125316 1108855 1126911 1115240 1127366 1134783 1119879 1135740 1120749 1128061 1148659
15986A148659k2822l4989J1009K963P092K5183J0757k6661j0054J0979L973Q964
15974A135053q16j1257L218l2475K0497M1457j5856L1643j9012p366k3095r081
15962A112910L877q932L368L4779K1983J0350r467k1681J742k5001k1906J223
15950A103245K6899r960J6138L4376j4557k9614p136K4203K0261O550n817j644
$$ plain form
15986 1148659 1125837 1090848 1101857 1104820 1111912 1137095 1147852 1121191 1111137 1122116 1126089 1135053
15974 1135053 1134237 1122980 1126198 1093723 1114220 1155677 1139821 1171464 1152452 1145086 1121991 1112910
15962 1112910 1116787 1107855 1111223 1146002 1167985 1178335 1168868 1147187 1148929 1123928 1102022 1103245
15950 1103245 1130144 1120184 1136322 1170698 1156141 1126527 1119391 1143594 1163855 1170405 1164588 1162944
$$ [...]
##END NTUPLES=NMR SPECTRUM
##END=
